{
    "$schema": "https://schema.management.azure.com/schemas/2015-01-01/deploymentParameters.json#",
    "contentVersion": "1.0.0.0",
    "parameters": {
        "name": {
            "value": "ani-form-srv"
        },
        "location": {
            "value": "westeurope"
        },
        "sku": {
            "value": "F0"
        },
        "resourceGroupName": {
            "value": "ocrdocs"
        },
        "resourceGroupId": {
            "value": "/subscriptions/92794525-d120-4d9c-935b-461897e7971f/resourceGroups/ocrdocs"
        },
        "tagValues": {
            "value": {}
        },
        "vnet": {
            "value": {}
        },
        "ipRules": {
            "value": []
        },
        "virtualNetworkType": {
            "value": "None"
        },
        "identity": {
            "value": {
                "type": "None"
            }
        },
        "privateEndpoints": {
            "value": []
        },
        "isCommitmentPlanForDisconnectedContainerEnabled": {
            "value": false
        },
        "commitmentPlanForDisconnectedContainer": {
            "value": {
                "current": {},
                "hostingModel": "DisconnectedContainer",
                "planType": "CustomInvoice",
                "autoRenew": true
            }
        }
    }
}