{
    "$schema": "https://schema.management.azure.com/schemas/2015-01-01/deploymentParameters.json#",
    "contentVersion": "1.0.0.0",
    "parameters": {
        "name": {
            "value": "ani-cusvis-svc"
        },
        "location": {
            "value": "westeurope"
        },
        "trainingSku": {
            "value": "F0"
        },
        "predictionSku": {
            "value": "F0"
        },
        "resourceGroupId": {
            "value": "/subscriptions/92794525-d120-4d9c-935b-461897e7971f/resourceGroups/ocrdocs"
        },
        "resourceGroupName": {
            "value": "ocrdocs"
        },
        "tagValues": {
            "value": {}
        },
        "vnet": {
            "value": {}
        },
        "ipRules": {
            "value": []
        },
        "virtualNetworkType": {
            "value": "None"
        },
        "createOption": {
            "value": "Both"
        },
        "privateEndpoints": {
            "value": []
        }
    }
}