dumb_style_checker
samples/print.py:1: It seems that you have forgotten about a print statement. If this is intentional, disable this check by # dumb_style_checker:disable = print-statement
All checks passed!
✗
