{
    "name": "Ukrainian",
    "title": "Українська",
    "description": "Українська версія інтерфейса Foundry VTT",
    "version": "0.0.1",
    "minimumCoreVersion": "9.269",
    "compatibleCoreVersion": "9.269",
    "author": "",
    "coreTranslation": true,
    "languages": [
        {
            "lang": "uk",
            "name": "Українська",
            "path": "uk.json"
        }
    ],
    "url": "https://gitlab.com/roman.trofimenko91/fvtt_uk_UA",
    "manifest": "https://gitlab.com/roman.trofimenko91/fvtt_uk_UA/-/raw/main/uk-UA/module.json",
    "download": "https://gitlab.com/roman.trofimenko91/fvtt_uk_UA/-/raw/uk-UA.zip?job=build"
}
