<svg width="16" height="33" viewBox="0 0 16 33" fill="none" xmlns="http://www.w3.org/2000/svg">
<path d="M4.14373 17.5688C2.65514 17.5688 1.35977 17.5688 0 17.5688C0 15.7011 0 13.9138 0 11.9964C1.31445 11.9964 2.63367 11.9964 4.11987 11.9964C4.11987 10.6323 4.18667 9.3887 4.10795 8.15695C3.77874 2.93915 6.92292 0.142297 11.9565 0.00517289C13.29 -0.0302902 14.6259 0.125747 16 0.194309C16 1.94146 16 3.60349 16 5.39792C14.7857 5.39792 13.6526 5.37664 12.5195 5.40265C10.6253 5.44757 10.079 6.02207 10.0743 7.91107C10.0695 9.19956 10.0743 10.4881 10.0743 11.9208C12.1282 11.9208 14.1226 11.9208 15.9785 11.9208C15.9785 13.857 15.9785 15.6467 15.9785 17.5617C13.9436 17.5617 12.0686 17.5617 10.0957 17.5617C10.0957 22.7677 10.0957 27.846 10.0957 33C8.0823 33 6.16908 33 4.14135 33C4.14373 27.8886 4.14373 22.8126 4.14373 17.5688Z" fill="white"/>
</svg>
