<svg width="19" height="39" viewBox="0 0 19 39" fill="none" xmlns="http://www.w3.org/2000/svg">
<path d="M4.91995 20.762C3.1525 20.762 1.61449 20.762 0 20.762C0 18.5548 0 16.4426 0 14.1768C1.56067 14.1768 3.12701 14.1768 4.89162 14.1768C4.89162 12.5647 4.97093 11.0951 4.87746 9.63947C4.48658 3.47334 8.21974 0.168159 14.1962 0.00611306C15.7795 -0.0357954 17.3657 0.148602 18.9972 0.229625C18.9972 2.29431 18.9972 4.25842 18.9972 6.37899C17.5555 6.37899 16.21 6.35385 14.8646 6.38458C12.6157 6.43766 11.9671 7.11658 11.9614 9.3489C11.9557 10.8716 11.9614 12.3942 11.9614 14.0874C14.4001 14.0874 16.768 14.0874 18.9717 14.0874C18.9717 16.3756 18.9717 18.4905 18.9717 20.7536C16.5556 20.7536 14.3293 20.7536 11.9869 20.7536C11.9869 26.9057 11.9869 32.907 11.9869 38.9977C9.5963 38.9977 7.32469 38.9977 4.91711 38.9977C4.91995 32.9573 4.91995 26.9588 4.91995 20.762Z" fill="#ED2939"/>
</svg>
