<svg width="27" height="36" viewBox="0 0 27 36" fill="none" xmlns="http://www.w3.org/2000/svg">
<path d="M8.98509 12C7.26551 13.329 7.21148 15.1022 7.5786 16.9375C8.2143 20.1225 9.71138 22.8507 12.1827 24.9852C13.7513 26.3413 15.0084 26.5721 17.0299 25.9609C18.6653 28.7958 20.3117 31.6497 21.9534 34.4973C19.7666 36.2768 17.2445 36.4885 14.9146 35.0703C12.6261 33.6776 10.7444 31.8153 9.06138 29.754C5.25033 25.0903 2.34835 19.9267 0.76227 14.0867C0.369723 12.6414 0.0931921 11.1325 0.0153185 9.63945C-0.151554 6.50217 1.03562 4.75765 4.03455 3.41742C5.66513 6.2459 7.30048 9.08075 8.98509 12Z" fill="white"/>
<path d="M8.37951 0C8.6767 0.241941 9.09309 0.434539 9.28539 0.759249C10.8588 3.42378 12.4003 6.10901 13.9276 8.79901C14.2995 9.45321 14.1199 10.0119 13.4556 10.4194C12.7118 10.8746 11.9569 11.3123 11.1893 11.7262C10.4328 12.1321 9.8909 11.9809 9.45544 11.2343C7.9377 8.62711 6.42949 6.01669 4.93241 3.39832C4.4906 2.62474 4.65429 2.0374 5.40442 1.58376C6.10528 1.16036 6.81886 0.756066 7.53403 0.358136C7.76129 0.232391 8.01239 0.152805 8.37951 0Z" fill="white"/>
<path d="M21.3766 22.4479C21.5784 22.6119 21.99 22.8029 22.1808 23.1244C23.7414 25.7651 25.2671 28.4264 26.7864 31.0926C27.1837 31.7897 27.0264 32.3516 26.3319 32.783C25.5913 33.243 24.8332 33.6759 24.0688 34.0945C23.3616 34.4813 22.7863 34.3428 22.3826 33.652C20.8362 31.0034 19.3074 28.3437 17.7801 25.6823C17.4702 25.1427 17.4543 24.5395 17.9788 24.1797C18.8703 23.5717 19.8366 23.0719 20.7774 22.5403C20.8839 22.4798 21.0349 22.4973 21.3766 22.4479Z" fill="white"/>
</svg>
