<svg width="30" height="42" viewBox="0 0 30 42" fill="none" xmlns="http://www.w3.org/2000/svg">
<path d="M14.1739 42C13.8388 41.6959 13.4309 41.4352 13.1686 41.0803C9.32236 35.7652 5.76748 30.269 2.92648 24.3383C1.82651 22.0428 0.828518 19.6966 0.325881 17.1983C-0.708533 12.1293 0.741103 7.76276 4.36883 4.12759C6.78732 1.70172 9.76672 0.383793 13.1978 0.0651724C13.2779 0.057931 13.3507 0.0217241 13.4309 0C14.1448 0 14.8587 0 15.5798 0C16.3593 0.137586 17.146 0.238966 17.9255 0.412759C23.3379 1.60034 27.8471 6.40138 28.8087 11.8324C29.3332 14.8086 28.7722 17.611 27.7597 20.3772C26.2518 24.4903 24.1975 28.3283 21.8737 32.0286C19.9433 35.0917 17.8745 38.0752 15.8421 41.0731C15.5944 41.4352 15.1792 41.6959 14.8441 42C14.611 42 14.3924 42 14.1739 42ZM14.509 38.401C14.6037 38.2779 14.6838 38.191 14.7421 38.0897C16.7017 35.0555 18.7195 32.0648 20.6062 28.98C22.5731 25.7721 24.2922 22.4266 25.5087 18.8566C26.1644 16.9231 26.565 14.9607 26.2955 12.9041C25.2101 4.72862 16.1845 0.130345 8.86343 4.04069C4.29599 6.48103 1.84836 11.6152 2.87549 16.619C3.34171 18.8638 4.21586 20.971 5.19928 23.0348C7.75617 28.3934 10.9614 33.3683 14.356 38.2345C14.3997 38.2852 14.4434 38.3286 14.509 38.401Z" fill="white"/>
<path d="M21.1008 14.4464C21.1008 18.0526 18.136 20.9999 14.5155 20.9999C10.866 21.0071 7.90112 18.0599 7.90112 14.4319C7.90112 10.8112 10.8732 7.86399 14.5301 7.87847C18.1506 7.88571 21.1081 10.833 21.1008 14.4464ZM18.4638 14.4536C18.4784 12.3102 16.7082 10.5216 14.5592 10.4999C12.3739 10.4781 10.56 12.2233 10.5381 14.3812C10.5163 16.5681 12.2865 18.364 14.4791 18.3785C16.6645 18.3857 18.4492 16.6188 18.4638 14.4536Z" fill="white"/>
</svg>
