<svg width="16" height="78" viewBox="0 0 16 78" fill="none" xmlns="http://www.w3.org/2000/svg">
<path d="M7.29289 77.7071C7.68342 78.0976 8.31658 78.0976 8.70711 77.7071L15.0711 71.3431C15.4616 70.9526 15.4616 70.3195 15.0711 69.9289C14.6805 69.5384 14.0474 69.5384 13.6569 69.9289L8 75.5858L2.34315 69.9289C1.95262 69.5384 1.31946 69.5384 0.928932 69.9289C0.538408 70.3195 0.538408 70.9526 0.928932 71.3431L7.29289 77.7071ZM7 0L7 77H9L9 0L7 0Z" fill="#ED2939"/>
</svg>
