<svg width="31" height="31" viewBox="0 0 31 31" fill="none" xmlns="http://www.w3.org/2000/svg">
<path d="M23.6545 5.7103C22.6509 5.7103 21.8289 6.52358 21.8289 7.53586C21.8289 8.53949 22.6422 9.36143 23.6545 9.36143C24.6581 9.36143 25.48 8.54814 25.48 7.53586C25.48 6.52358 24.6581 5.7103 23.6545 5.7103ZM15.5476 8.04633C11.3254 8.04633 7.89059 11.4812 7.89059 15.7033C7.89059 19.9255 11.3254 23.3603 15.5476 23.3603C19.7697 23.3603 23.2046 19.9255 23.2046 15.7033C23.2046 11.4812 19.7697 8.04633 15.5476 8.04633ZM15.5476 20.6003C12.8395 20.6003 10.6419 18.4027 10.6419 15.6947C10.6419 12.9866 12.8395 10.789 15.5476 10.789C18.2556 10.789 20.4532 12.9866 20.4532 15.6947C20.4532 18.4027 18.2556 20.6003 15.5476 20.6003ZM31 9.33547C31 4.1789 26.8211 0 21.6645 0H9.33547C4.1789 0 0 4.1789 0 9.33547V21.6559C0 26.8211 4.1789 31 9.33547 31H21.6559C26.8124 31 30.9913 26.8211 30.9913 21.6645V9.33547H31ZM28.0756 21.6645C28.0756 25.2032 25.2032 28.0756 21.6645 28.0756H9.33547C5.79682 28.0756 2.92437 25.2032 2.92437 21.6645V9.33547C2.92437 5.79682 5.79682 2.92437 9.33547 2.92437H21.6559C25.1945 2.92437 28.067 5.79682 28.067 9.33547V21.6645H28.0756Z" fill="white"/>
</svg>
