::1 - - [11/Apr/2022:15:00:09 +0000] "GET /api/auth/register HTTP/1.1" 404 156 "-" "PostmanRuntime/7.29.0"
::1 - - [11/Apr/2022:15:02:50 +0000] "GET /api/me HTTP/1.1" 200 78 "-" "PostmanRuntime/7.29.0"
::1 - - [11/Apr/2022:15:08:01 +0000] "POST /api/posts HTTP/1.1" 200 36 "-" "PostmanRuntime/7.29.0"
::1 - - [11/Apr/2022:15:08:03 +0000] "POST /api/posts HTTP/1.1" 200 36 "-" "PostmanRuntime/7.29.0"
::1 - - [11/Apr/2022:15:08:05 +0000] "POST /api/posts HTTP/1.1" 200 36 "-" "PostmanRuntime/7.29.0"
::1 - - [11/Apr/2022:15:08:05 +0000] "POST /api/posts HTTP/1.1" 200 36 "-" "PostmanRuntime/7.29.0"
::1 - - [11/Apr/2022:15:08:06 +0000] "POST /api/posts HTTP/1.1" 200 36 "-" "PostmanRuntime/7.29.0"
::1 - - [11/Apr/2022:15:08:08 +0000] "GET /api/posts HTTP/1.1" 200 545 "-" "PostmanRuntime/7.29.0"
::1 - - [11/Apr/2022:15:08:21 +0000] "PATCH /api/posts/625444513ec1fd2ef80acb96 HTTP/1.1" 200 114 "-" "PostmanRuntime/7.29.0"
::1 - - [11/Apr/2022:15:08:22 +0000] "PATCH /api/posts/625444513ec1fd2ef80acb96 HTTP/1.1" 200 115 "-" "PostmanRuntime/7.29.0"
::1 - - [11/Apr/2022:15:08:22 +0000] "PATCH /api/posts/625444513ec1fd2ef80acb96 HTTP/1.1" 200 114 "-" "PostmanRuntime/7.29.0"
::1 - - [11/Apr/2022:15:08:27 +0000] "GET /api/posts HTTP/1.1" 200 544 "-" "PostmanRuntime/7.29.0"
::1 - - [11/Apr/2022:15:09:16 +0000] "DELETE /api/posts/625444513ec1fd2ef80acb96 HTTP/1.1" 200 59 "-" "PostmanRuntime/7.29.0"
::1 - - [11/Apr/2022:15:09:22 +0000] "GET /api/posts HTTP/1.1" 200 438 "-" "PostmanRuntime/7.29.0"
::1 - - [11/Apr/2022:15:10:02 +0000] "GET /api/me HTTP/1.1" 200 78 "-" "PostmanRuntime/7.29.0"
::1 - - [11/Apr/2022:15:10:05 +0000] "DELETE /api/me HTTP/1.1" 200 59 "-" "PostmanRuntime/7.29.0"
::1 - - [14/Apr/2022:14:45:48 +0000] "POST /api/posts HTTP/1.1" 200 41 "-" "PostmanRuntime/7.29.0"
::1 - - [14/Apr/2022:14:45:51 +0000] "POST /api/posts HTTP/1.1" 200 44 "-" "PostmanRuntime/7.29.0"
::1 - - [14/Apr/2022:14:46:02 +0000] "POST /api/posts HTTP/1.1" 200 54 "-" "PostmanRuntime/7.29.0"
::1 - - [14/Apr/2022:14:46:03 +0000] "POST /api/posts HTTP/1.1" 200 54 "-" "PostmanRuntime/7.29.0"
::1 - - [14/Apr/2022:14:46:05 +0000] "POST /api/posts HTTP/1.1" 200 56 "-" "PostmanRuntime/7.29.0"
::1 - - [14/Apr/2022:14:46:07 +0000] "GET /api/posts HTTP/1.1" 200 614 "-" "PostmanRuntime/7.29.0"
::1 - - [14/Apr/2022:14:50:29 +0000] "GET /api/posts HTTP/1.1" 200 615 "-" "PostmanRuntime/7.29.0"
::1 - - [14/Apr/2022:14:52:35 +0000] "GET /api/posts HTTP/1.1" 200 646 "-" "PostmanRuntime/7.29.0"
::1 - - [14/Apr/2022:14:52:50 +0000] "GET /api/posts?offset=2 HTTP/1.1" 200 419 "-" "PostmanRuntime/7.29.0"
::1 - - [14/Apr/2022:14:56:39 +0000] "GET /api/posts/ HTTP/1.1" 200 646 "-" "PostmanRuntime/7.29.0"
::1 - - [14/Apr/2022:14:57:26 +0000] "GET /api/posts/6258339f92c18621a880d8f4 HTTP/1.1" 200 123 "-" "PostmanRuntime/7.29.0"
::1 - - [14/Apr/2022:14:58:50 +0000] "GET /api/posts/6258339f92c18621a880d8f4 HTTP/1.1" 200 123 "-" "PostmanRuntime/7.29.0"
::1 - - [14/Apr/2022:14:58:56 +0000] "PATCH /api/posts/6258339f92c18621a880d8f4 HTTP/1.1" 200 140 "-" "PostmanRuntime/7.29.0"
::1 - - [14/Apr/2022:14:58:57 +0000] "PATCH /api/posts/6258339f92c18621a880d8f4 HTTP/1.1" 200 141 "-" "PostmanRuntime/7.29.0"
::1 - - [14/Apr/2022:14:58:58 +0000] "PATCH /api/posts/6258339f92c18621a880d8f4 HTTP/1.1" 200 140 "-" "PostmanRuntime/7.29.0"
::1 - - [14/Apr/2022:14:58:58 +0000] "PATCH /api/posts/6258339f92c18621a880d8f4 HTTP/1.1" 200 141 "-" "PostmanRuntime/7.29.0"
::1 - - [14/Apr/2022:14:59:37 +0000] "POST /api/posts HTTP/1.1" 200 37 "-" "PostmanRuntime/7.29.0"
::1 - - [14/Apr/2022:14:59:42 +0000] "GET /api/posts HTTP/1.1" 200 774 "-" "PostmanRuntime/7.29.0"
::1 - - [14/Apr/2022:14:59:51 +0000] "GET /api/posts/625836d9f49c0602006729a1 HTTP/1.1" 200 118 "-" "PostmanRuntime/7.29.0"
::1 - - [14/Apr/2022:14:59:55 +0000] "PATCH /api/posts/625836d9f49c0602006729a1 HTTP/1.1" 200 117 "-" "PostmanRuntime/7.29.0"
::1 - - [14/Apr/2022:15:01:16 +0000] "PATCH /api/posts/625836d9f49c0602006729a1 HTTP/1.1" 200 118 "-" "PostmanRuntime/7.29.0"
::1 - - [14/Apr/2022:15:01:17 +0000] "PATCH /api/posts/625836d9f49c0602006729a1 HTTP/1.1" 200 117 "-" "PostmanRuntime/7.29.0"
::1 - - [14/Apr/2022:15:01:17 +0000] "PATCH /api/posts/625836d9f49c0602006729a1 HTTP/1.1" 200 118 "-" "PostmanRuntime/7.29.0"
::1 - - [14/Apr/2022:15:01:20 +0000] "DELETE /api/posts/625836d9f49c0602006729a1 HTTP/1.1" 200 59 "-" "PostmanRuntime/7.29.0"
::1 - - [14/Apr/2022:15:01:58 +0000] "GET /api/posts/ HTTP/1.1" 200 664 "-" "PostmanRuntime/7.29.0"
::1 - - [14/Apr/2022:15:02:02 +0000] "DELETE /api/posts/6258339c92c18621a880d8f2 HTTP/1.1" 200 59 "-" "PostmanRuntime/7.29.0"
::1 - - [14/Apr/2022:15:02:10 +0000] "GET /api/posts/ HTTP/1.1" 200 43 "-" "PostmanRuntime/7.29.0"
::1 - - [14/Apr/2022:15:02:43 +0000] "GET /api/me HTTP/1.1" 200 72 "-" "PostmanRuntime/7.29.0"
::1 - - [14/Apr/2022:15:03:44 +0000] "GET /api/me HTTP/1.1" 200 68 "-" "PostmanRuntime/7.29.0"
::1 - - [14/Apr/2022:15:03:46 +0000] "GET /api/me HTTP/1.1" 200 68 "-" "PostmanRuntime/7.29.0"
::1 - - [14/Apr/2022:15:03:46 +0000] "GET /api/me HTTP/1.1" 200 68 "-" "PostmanRuntime/7.29.0"
::1 - - [14/Apr/2022:15:04:38 +0000] "DELETE /api/me HTTP/1.1" 200 59 "-" "PostmanRuntime/7.29.0"
::1 - - [14/Apr/2022:15:07:30 +0000] "GET /api/users/me HTTP/1.1" 404 151 "-" "PostmanRuntime/7.29.0"
::1 - - [14/Apr/2022:15:08:13 +0000] "GET /api/users/me HTTP/1.1" 404 151 "-" "PostmanRuntime/7.29.0"
::1 - - [14/Apr/2022:15:09:06 +0000] "GET /api/users/me HTTP/1.1" 200 63 "-" "PostmanRuntime/7.29.0"
::1 - - [14/Apr/2022:15:09:45 +0000] "POST /api/notes HTTP/1.1" 404 149 "-" "PostmanRuntime/7.29.0"
::1 - - [14/Apr/2022:15:10:22 +0000] "POST /api/notes HTTP/1.1" 200 36 "-" "PostmanRuntime/7.29.0"
::1 - - [14/Apr/2022:15:11:20 +0000] "POST /api/notes HTTP/1.1" 200 37 "-" "PostmanRuntime/7.29.0"
::1 - - [14/Apr/2022:15:11:50 +0000] "GET /api/notes HTTP/1.1" 200 260 "-" "PostmanRuntime/7.29.0"
::1 - - [14/Apr/2022:15:12:23 +0000] "GET /api/notes/6258395e9932fc2f146379af HTTP/1.1" 200 117 "-" "PostmanRuntime/7.29.0"
::1 - - [14/Apr/2022:15:12:35 +0000] "PATCH /api/notes/6258395e9932fc2f146379af HTTP/1.1" 200 116 "-" "PostmanRuntime/7.29.0"
::1 - - [14/Apr/2022:15:17:31 +0000] "PATCH /api/notes/6258395e9932fc2f146379af HTTP/1.1" 200 137 "-" "PostmanRuntime/7.29.0"
::1 - - [14/Apr/2022:15:17:33 +0000] "PATCH /api/notes/6258395e9932fc2f146379af HTTP/1.1" 200 136 "-" "PostmanRuntime/7.29.0"
::1 - - [14/Apr/2022:15:17:34 +0000] "PATCH /api/notes/6258395e9932fc2f146379af HTTP/1.1" 200 137 "-" "PostmanRuntime/7.29.0"
::1 - - [14/Apr/2022:15:17:35 +0000] "PATCH /api/notes/6258395e9932fc2f146379af HTTP/1.1" 200 136 "-" "PostmanRuntime/7.29.0"
::1 - - [14/Apr/2022:15:17:39 +0000] "GET /api/notes/6258395e9932fc2f146379af HTTP/1.1" 200 116 "-" "PostmanRuntime/7.29.0"
::1 - - [14/Apr/2022:15:17:44 +0000] "DELETE /api/notes/6258395e9932fc2f146379af HTTP/1.1" 200 59 "-" "PostmanRuntime/7.29.0"
::1 - - [14/Apr/2022:15:17:49 +0000] "GET /api/notes/ HTTP/1.1" 200 151 "-" "PostmanRuntime/7.29.0"
::1 - - [14/Apr/2022:15:18:05 +0000] "DELETE /api/notes/625839988b4e94096022493e HTTP/1.1" 200 59 "-" "PostmanRuntime/7.29.0"
::1 - - [14/Apr/2022:15:18:13 +0000] "GET /api/users/me HTTP/1.1" 200 63 "-" "PostmanRuntime/7.29.0"
::1 - - [15/Apr/2022:13:34:15 +0000] "GET /api/notes HTTP/1.1" 200 43 "-" "PostmanRuntime/7.29.0"
::1 - - [15/Apr/2022:13:34:39 +0000] "POST /api/notes HTTP/1.1" 200 37 "-" "PostmanRuntime/7.29.0"
::1 - - [15/Apr/2022:13:34:43 +0000] "POST /api/notes HTTP/1.1" 200 38 "-" "PostmanRuntime/7.29.0"
::1 - - [15/Apr/2022:13:34:45 +0000] "POST /api/notes HTTP/1.1" 200 39 "-" "PostmanRuntime/7.29.0"
::1 - - [15/Apr/2022:13:35:02 +0000] "GET /api/notes HTTP/1.1" 200 495 "-" "PostmanRuntime/7.29.0"
::1 - - [15/Apr/2022:13:39:11 +0000] "GET /api/notes/625974733eda9037707a30db HTTP/1.1" 200 159 "-" "PostmanRuntime/7.29.0"
::1 - - [15/Apr/2022:13:44:54 +0000] "POST /api/api/notes HTTP/1.1" 404 153 "-" "PostmanRuntime/7.29.0"
::1 - - [15/Apr/2022:13:45:01 +0000] "POST /api/notes HTTP/1.1" 200 37 "-" "PostmanRuntime/7.29.0"
::1 - - [15/Apr/2022:13:45:02 +0000] "POST /api/notes HTTP/1.1" 200 37 "-" "PostmanRuntime/7.29.0"
::1 - - [15/Apr/2022:13:45:03 +0000] "POST /api/notes HTTP/1.1" 200 37 "-" "PostmanRuntime/7.29.0"
::1 - - [15/Apr/2022:13:45:03 +0000] "POST /api/notes HTTP/1.1" 200 37 "-" "PostmanRuntime/7.29.0"
::1 - - [15/Apr/2022:13:45:04 +0000] "POST /api/notes HTTP/1.1" 200 37 "-" "PostmanRuntime/7.29.0"
::1 - - [15/Apr/2022:13:45:04 +0000] "POST /api/notes HTTP/1.1" 200 37 "-" "PostmanRuntime/7.29.0"
::1 - - [15/Apr/2022:13:45:06 +0000] "GET /api/notes HTTP/1.1" 200 966 "-" "PostmanRuntime/7.29.0"
::1 - - [15/Apr/2022:13:45:49 +0000] "POST /api/notes HTTP/1.1" 200 58 "-" "PostmanRuntime/7.29.0"
::1 - - [15/Apr/2022:13:45:52 +0000] "GET /api/notes HTTP/1.1" 200 1141 "-" "PostmanRuntime/7.29.0"
::1 - - [15/Apr/2022:13:46:22 +0000] "GET /api/notes/625976ddbe44fc0a6817e20b HTTP/1.1" 200 162 "-" "PostmanRuntime/7.29.0"
::1 - - [15/Apr/2022:13:46:27 +0000] "PATCH /api/notes/625976ddbe44fc0a6817e20b HTTP/1.1" 200 181 "-" "PostmanRuntime/7.29.0"
::1 - - [15/Apr/2022:13:47:34 +0000] "GET /api/notes/625976ddbe44fc0a6817e20b HTTP/1.1" 200 161 "-" "PostmanRuntime/7.29.0"
::1 - - [15/Apr/2022:13:47:39 +0000] "PATCH /api/notes/625976ddbe44fc0a6817e20b HTTP/1.1" 200 182 "-" "PostmanRuntime/7.29.0"
::1 - - [15/Apr/2022:13:47:41 +0000] "DELETE /api/notes/625976ddbe44fc0a6817e20b HTTP/1.1" 200 59 "-" "PostmanRuntime/7.29.0"
::1 - - [15/Apr/2022:13:48:12 +0000] "POST /api/notes/ HTTP/1.1" 200 58 "-" "PostmanRuntime/7.29.0"
::1 - - [15/Apr/2022:13:48:44 +0000] "GET /api/notes/ HTTP/1.1" 200 1162 "-" "PostmanRuntime/7.29.0"
::1 - - [15/Apr/2022:13:48:49 +0000] "GET /api/notes/625976debe44fc0a6817e20d HTTP/1.1" 200 162 "-" "PostmanRuntime/7.29.0"
::1 - - [15/Apr/2022:13:49:09 +0000] "PATCH /api/notes/625976debe44fc0a6817e20d HTTP/1.1" 200 181 "-" "PostmanRuntime/7.29.0"
::1 - - [15/Apr/2022:13:49:31 +0000] "DELETE /api/notes/625976debe44fc0a6817e20d HTTP/1.1" 200 59 "-" "PostmanRuntime/7.29.0"
::1 - - [15/Apr/2022:13:49:52 +0000] "GET /api/users/me HTTP/1.1" 200 63 "-" "PostmanRuntime/7.29.0"
::1 - - [15/Apr/2022:13:51:34 +0000] "GET /api/users/me HTTP/1.1" 200 104 "-" "PostmanRuntime/7.29.0"
::1 - - [15/Apr/2022:13:52:29 +0000] "GET /api/auth/register HTTP/1.1" 404 156 "-" "PostmanRuntime/7.29.0"
::1 - - [15/Apr/2022:13:58:54 +0000] "DELETE /api/notes/ HTTP/1.1" 404 152 "-" "PostmanRuntime/7.29.0"
::1 - - [15/Apr/2022:13:59:20 +0000] "DELETE /api/notes/ HTTP/1.1" 404 152 "-" "PostmanRuntime/7.29.0"
::1 - - [15/Apr/2022:13:59:34 +0000] "GET /api/notes/ HTTP/1.1" 200 1008 "-" "PostmanRuntime/7.29.0"
::1 - - [15/Apr/2022:13:59:38 +0000] "DELETE /api/notes/ HTTP/1.1" 404 152 "-" "PostmanRuntime/7.29.0"
::1 - - [15/Apr/2022:14:00:04 +0000] "PUT /api/notes/ HTTP/1.1" 404 149 "-" "PostmanRuntime/7.29.0"
