{
    "ver" : "1.3.0",
    "nam" : {
      "fn" : "Ткаченко",
      "fnt" : "TKACHENKO",
      "gn" : "Мар'яна",
      "gnt" : "MARYANNA"
    },
    "dob" : "1979-11-21",
    "v" : [ {
      "tg" : "840539006",
      "vp" : "1119349007",
      "mp" : "EU/1/20/1528",
      "ma" : "ORG-100030215",
      "dn" : 2,
      "sd" : 2,
      "dt" : "2021-06-18",
      "co" : "UA",
      "is" : "State Enterprise \"DIIA\"",
      "ci" : "URN:UVCI:01:UA:0E5566930619555B9E2520C4F3889304"
    } ]
}
