{
  "Identifier": "VR-UA-0002",
  "Type": "Acceptance",
  "Country": "UA",
  "Version": "1.0.0",
  "SchemaVersion": "1.0.0",
  "Engine": "CERTLOGIC",
  "EngineVersion": "0.7.5",
  "CertificateType": "Vaccination",
  "Description": [
    {
      "lang": "en",
      "desc": "Vaccination doses must be equal or greater than expected doses."
    },
    {
      "lang": "ua",
      "desc": "Кількість доз вакцини дорівнює або більше передбаченій протоколом щеплення."
    }
  ],
  "ValidFrom": "2021-08-03T00:00:00Z",
  "ValidTo": "2030-06-01T00:00:00Z",
  "AffectedFields": [
    "v.0",
    "v.0.dn",
    "v.0.sd"
  ],
  "Logic": {
    "if": [
      {
        "var": "payload.v.0"
      },
      {
        ">=": [
          {
            "var": "payload.v.0.dn"
          },
          {
            "var": "payload.v.0.sd"
          }
        ]
      },
      true
    ]
  }
}
