<svg width="90" height="15" viewBox="0 0 90 15" fill="none" xmlns="http://www.w3.org/2000/svg">
<path d="M0.66 0.919999H4.78C5.5 0.919999 6.16667 0.986666 6.78 1.12C7.40667 1.25333 7.94667 1.48 8.4 1.8C8.85333 2.12 9.20667 2.54 9.46 3.06C9.71333 3.56667 9.84 4.2 9.84 4.96C9.84 5.68 9.71333 6.30667 9.46 6.84C9.20667 7.37333 8.85333 7.82 8.4 8.18C7.96 8.52667 7.43333 8.78667 6.82 8.96C6.22 9.12 5.56667 9.2 4.86 9.2H2.98V14H0.66V0.919999ZM4.68 7.34C6.6 7.34 7.56 6.54667 7.56 4.96C7.56 4.13333 7.30667 3.56667 6.8 3.26C6.30667 2.94 5.57333 2.78 4.6 2.78H2.98V7.34H4.68ZM16.6206 7.04H18.4806C19.374 7.04 20.054 6.85333 20.5206 6.48C21.0006 6.10667 21.2406 5.54667 21.2406 4.8C21.2406 4.04 21.0006 3.51333 20.5206 3.22C20.054 2.92667 19.374 2.78 18.4806 2.78H16.6206V7.04ZM21.4406 14L18.6206 8.88H16.6206V14H14.3006V0.919999H18.7206C19.4006 0.919999 20.034 0.986666 20.6206 1.12C21.2073 1.25333 21.714 1.47333 22.1406 1.78C22.5673 2.07333 22.9006 2.46667 23.1406 2.96C23.394 3.45333 23.5206 4.06667 23.5206 4.8C23.5206 5.8 23.2806 6.60667 22.8006 7.22C22.334 7.83333 21.7073 8.27333 20.9206 8.54L24.0406 14H21.4406ZM33.2166 14.24C32.3632 14.24 31.5832 14.0867 30.8766 13.78C30.1699 13.46 29.5632 13.0067 29.0566 12.42C28.5499 11.82 28.1566 11.1 27.8766 10.26C27.5966 9.42 27.4566 8.46667 27.4566 7.4C27.4566 6.34667 27.5966 5.40667 27.8766 4.58C28.1566 3.74 28.5499 3.03333 29.0566 2.46C29.5632 1.88667 30.1699 1.44667 30.8766 1.14C31.5832 0.833333 32.3632 0.68 33.2166 0.68C34.0699 0.68 34.8499 0.833333 35.5566 1.14C36.2632 1.44667 36.8699 1.88667 37.3766 2.46C37.8966 3.03333 38.2966 3.74 38.5766 4.58C38.8566 5.40667 38.9966 6.34667 38.9966 7.4C38.9966 8.46667 38.8566 9.42 38.5766 10.26C38.2966 11.1 37.8966 11.82 37.3766 12.42C36.8699 13.0067 36.2632 13.46 35.5566 13.78C34.8499 14.0867 34.0699 14.24 33.2166 14.24ZM33.2166 12.22C33.7366 12.22 34.2032 12.1067 34.6166 11.88C35.0299 11.6533 35.3832 11.3333 35.6766 10.92C35.9699 10.4933 36.1966 9.98667 36.3566 9.4C36.5166 8.8 36.5966 8.13333 36.5966 7.4C36.5966 5.93333 36.2899 4.78667 35.6766 3.96C35.0766 3.12 34.2566 2.7 33.2166 2.7C32.1766 2.7 31.3499 3.12 30.7366 3.96C30.1366 4.78667 29.8366 5.93333 29.8366 7.4C29.8366 8.13333 29.9166 8.8 30.0766 9.4C30.2366 9.98667 30.4632 10.4933 30.7566 10.92C31.0499 11.3333 31.4032 11.6533 31.8166 11.88C32.2299 12.1067 32.6966 12.22 33.2166 12.22ZM45.3956 14.24C44.4756 14.24 43.6956 14.0533 43.0556 13.68C42.429 13.3067 41.909 12.7533 41.4956 12.02L43.0956 10.84C43.3623 11.32 43.669 11.6733 44.0156 11.9C44.3623 12.1133 44.7356 12.22 45.1356 12.22C45.749 12.22 46.209 12.0333 46.5156 11.66C46.8223 11.2867 46.9756 10.6333 46.9756 9.7V0.919999H49.2956V9.9C49.2956 10.5 49.2223 11.0667 49.0756 11.6C48.929 12.12 48.6956 12.58 48.3756 12.98C48.0556 13.3667 47.649 13.6733 47.1556 13.9C46.6623 14.1267 46.0756 14.24 45.3956 14.24ZM54.5584 0.919999H62.4384V2.88H56.8784V6.22H61.5784V8.18H56.8784V12.04H62.6384V14H54.5584V0.919999ZM72.5402 14.24C71.7135 14.24 70.9402 14.0933 70.2202 13.8C69.5002 13.5067 68.8735 13.0733 68.3402 12.5C67.8202 11.9267 67.4068 11.22 67.1002 10.38C66.7935 9.54 66.6402 8.58 66.6402 7.5C66.6402 6.43333 66.7935 5.48 67.1002 4.64C67.4202 3.78667 67.8468 3.06667 68.3802 2.48C68.9268 1.89333 69.5602 1.44667 70.2802 1.14C71.0135 0.833333 71.7935 0.68 72.6202 0.68C73.4468 0.68 74.1802 0.846666 74.8202 1.18C75.4602 1.51333 75.9868 1.9 76.4002 2.34L75.1602 3.84C74.8135 3.49333 74.4402 3.22 74.0402 3.02C73.6402 2.80667 73.1868 2.7 72.6802 2.7C72.1468 2.7 71.6535 2.81333 71.2002 3.04C70.7602 3.25333 70.3735 3.56667 70.0402 3.98C69.7202 4.38 69.4668 4.87333 69.2802 5.46C69.1068 6.04667 69.0202 6.70667 69.0202 7.44C69.0202 8.93333 69.3402 10.1067 69.9802 10.96C70.6335 11.8 71.5135 12.22 72.6202 12.22C73.2068 12.22 73.7268 12.1 74.1802 11.86C74.6335 11.6067 75.0468 11.28 75.4202 10.88L76.6602 12.34C76.1268 12.9533 75.5135 13.4267 74.8202 13.76C74.1402 14.08 73.3802 14.24 72.5402 14.24ZM83.1906 2.88H79.4106V0.919999H89.2906V2.88H85.5106V14H83.1906V2.88Z" fill="white"/>
</svg>
