[
    {
        "rain_probability": 18,
        "humidity": 54,
        "day": 1617080400000,
        "temperature": 24,
        "type": "sunny"
    },
    {
        "rain_probability": 33,
        "humidity": 57,
        "day": 1617166800000,
        "temperature": 23,
        "type": "rainy"
    },
    {
        "rain_probability": 89,
        "humidity": 73,
        "day": 1617253200000,
        "temperature": 16,
        "type": "rainy"
    },
    {
        "rain_probability": 38,
        "humidity": 52,
        "day": 1617339600000,
        "temperature": 23,
        "type": "sunny"
    },
    {
        "rain_probability": 4,
        "humidity": 48,
        "day": 1617426000000,
        "temperature": 22,
        "type": "cloudy"
    },
    {
        "rain_probability": 13,
        "humidity": 42,
        "day": 1617512400000,
        "temperature": 28,
        "type": "rainy"
    },
    {
        "rain_probability": 26,
        "humidity": 60,
        "day": 1617598800000,
        "temperature": 23,
        "type": "cloudy"
    },
    {
        "rain_probability": 77,
        "humidity": 64,
        "day": 1617685200000,
        "temperature": 17,
        "type": "rainy"
    },
    {
        "rain_probability": 27,
        "humidity": 58,
        "day": 1617771600000,
        "temperature": 30,
        "type": "sunny"
    },
    {
        "rain_probability": 10,
        "humidity": 50,
        "day": 1617858000000,
        "temperature": 25,
        "type": "rainy"
    },
    {
        "rain_probability": 94,
        "humidity": 85,
        "day": 1617944400000,
        "temperature": 23,
        "type": "sunny"
    },
    {
        "rain_probability": 45,
        "humidity": 45,
        "day": 1618030800000,
        "temperature": 20,
        "type": "sunny"
    },
    {
        "rain_probability": 42,
        "humidity": 54,
        "day": 1618117200000,
        "temperature": 23,
        "type": "sunny"
    },
    {
        "rain_probability": 71,
        "humidity": 78,
        "day": 1618203600000,
        "temperature": 20,
        "type": "sunny"
    }
]
