11829 3076
1502 12608
12306 11078
7577 5915
9609 839
4522 3269
7418 4998
3776 2000
6856 6469
2230 11689
940 7503
9071 930
8784 541
12148 8954
11648 4956
744 11010
1908 6909
13527 9382
5771 882
5273 11402
9536 6362
6168 11470
1994 605
6268 10905
11325 735
11958 5682
8101 9369
6062 3120
10238 10121
5472 10478
9214 10857
10819 3727
2542 7485
4808 1467
12102 5946
2799 541
5431 8568
6221 168
11008 1432
2771 3132
4003 1667
10511 2553
8953 12726
6739 5909
1579 5700
9172 11786
5323 2806
5480 4956
1414 5493
13236 2352
4471 13016
9847 275
1597 541
9305 1421
9275 4055
8076 1710
9738 981
10299 882
8538 11431
5908 3819
4392 13545
4368 3318
749 7438
6201 11652
7290 8951
8865 1704
1847 4027
2591 3055
10538 12025
10621 2516
6537 12098
2533 2520
6531 10056
8320 2085
11256 6972
8963 866
3354 10991
11119 10218
7476 3824
11862 3000
6329 10405
10434 10326
1880 6482
12209 5216
3810 2552
6613 3190
10135 8709
13084 12148
10937 2417
3483 1589
1644 11039
6611 6622
11736 4458
3670 4797
619 6798
9898 6622
1526 10833
10052 1589
7967 10141
1834 8474
9155 6728
7651 5065
7655 10762
11949 12878
4053 296
12927 12932
1295 7821
6063 4956
10352 254
13476 10905
9556 9665
8097 9108
9130 8099
10678 9737
3599 11230
7012 11230
3432 8688
9561 2282
138 12902
5142 13496
2045 6772
8421 11431
11278 5507
12819 11372
2359 7438
8192 398
12762 10141
8007 12118
9764 11819
4252 6079
7078 7392
730 11665
8016 6916
7233 4667
12084 541
4348 10406
1543 5700
3328 8538
6716 7141
5335 2064
4553 897
11338 11
8848 1426
10707 836
11910 1893
3825 8120
1484 10668
1012 6962
2246 2951
5985 2961
5348 12682
8035 183
9762 5589
5068 1001
6402 6160
3316 7972
4189 3768
9073 7094
6939 1002
12598 9068
6342 3559
9568 9642
12467 5205
3380 3974
725 10054
931 3127
5409 11414
6985 2988
3430 1816
10781 12408
7382 11263
10141 11895
10375 3986
12457 5975
1850 5151
4322 12789
11940 13129
11854 8755
6632 8016
8658 8604
13001 1603
8114 3038
508 11784
8751 8820
8717 12690
12704 6581
9941 11852
11441 13368
11131 10571
1690 4614
7181 5006
13073 1534
7585 6603
8688 5516
1146 5729
6808 12915
13059 12725
11312 2980
5478 835
9912 8392
10449 2041
10377 10566
6889 1640
11800 5350
5705 5507
3617 11903
8407 11520
4122 12326
7782 194
439 7687
9575 399
11212 10262
10819 12883
6155 11313
11519 7085
9451 4900
13050 604
5472 2019
4165 2537
11386 13227
1026 9118
12977 11378
3583 2375
2848 5705
21 3254
1111 5087
9299 11926
2424 2331
467 3955
8802 9156
4533 611
4384 13271
10512 7099
6930 2380
1880 4922
2080 8099
13499 12635
7432 11977
12806 4763
2256 13291
8233 2508
351 10742
12726 399
12508 8082
6392 5761
6700 3061
405 13231
668 13309
7539 6942
6288 6199
11667 7750
10797 2520
7933 4676
10583 8886
6879 4018
13366 9930
13455 4599
10417 4521
8336 8775
11874 2089
11687 12051
1928 10622
3529 7722
406 9550
12065 2759
116 6662
10614 536
11880 8406
3721 1522
10890 1601
8309 353
6003 8150
1476 6322
6044 6193
1114 5109
12528 4450
7030 13168
10639 4519
10077 10189
10249 11098
8588 1451
2208 7141
8785 1648
3382 9866
9723 9483
4182 7936
1530 7761
4133 9445
2619 13428
2841 2930
5497 9905
3797 4109
11970 8931
12594 1511
12723 2782
4912 8082
25 9522
8523 5068
3281 1161
10082 9058
2330 11158
2181 3371
515 839
11207 1170
1458 11116
405 10805
8876 6058
6426 4162
9247 5462
5805 2142
4356 478
6487 5905
11842 3358
8190 4960
8666 9755
10323 12742
11477 4656
8215 6524
6031 5283
4423 4500
2001 5589
3966 3387
10471 12136
4566 1579
3166 5808
10441 11961
11771 11414
3850 11431
11639 8654
11560 4597
5789 10257
9675 10474
7541 2199
363 5595
2630 3275
1814 8392
7278 2262
10335 3124
8963 6343
2397 1467
7423 7003
963 3315
10927 3549
7519 10184
3890 2136
5617 6017
13292 9324
6960 12916
11939 6053
428 3553
12856 12310
3292 7703
8468 8796
11931 9930
7929 10218
1175 8016
1067 817
3281 3258
8462 11389
7642 7195
11084 2433
11103 5771
10813 11372
11437 3917
5872 508
2055 7045
10659 6754
3838 7084
6015 5708
1538 7945
1801 660
9030 1001
10683 6585
11068 4130
11182 219
13520 4499
7238 9573
8330 7764
7875 10017
7626 6972
6816 8221
3955 541
10101 5105
6272 1886
9852 1829
2329 10017
13362 2030
6984 12223
4433 132
7466 2389
302 2155
8293 12556
9698 12623
5247 7889
11901 42
8717 12983
4103 845
1125 2735
1759 10732
11827 5314
470 10796
7139 8016
11466 608
3315 9064
1073 168
12927 4311
13332 591
2584 11389
2222 135
2787 5599
1921 8931
3009 536
3284 9122
7428 9354
6967 7997
8720 152
12716 3516
10466 7489
1343 9708
4420 1985
6224 8427
2299 1998
4165 7658
10647 7321
732 4652
7441 2835
7899 5563
3278 7882
4721 5665
2374 1431
10851 12542
12509 5151
3878 7342
3247 12534
3609 8780
12672 3814
1869 13136
10336 8654
7449 11966
8909 8931
5632 6193
5857 3770
2231 11277
5520 4295
4361 9103
11928 2520
8371 13140
6780 11901
9970 4499
5021 13139
12343 4130
1790 474
13143 8099
2677 11683
13228 5539
4110 7261
524 13174
11267 5048
8818 9866
10070 9887
11823 10689
13345 10218
7322 10481
11192 536
5143 10785
5312 8330
1748 6790
8172 361
2788 4130
8650 6697
5279 8636
10866 3955
10087 7003
12113 6755
6988 4611
8435 4327
2999 5073
7731 5657
12435 5406
5508 7001
7330 4404
2520 1312
300 8082
6743 4489
2710 13440
2438 4130
4142 3269
13503 1161
6844 1553
8084 2350
6336 6728
3461 13326
3783 9372
1581 3948
343 8931
5434 12885
9171 10732
6509 4227
10706 3571
547 6603
11632 1789
5640 10063
11613 3935
6320 449
9907 13547
1671 7576
5630 6520
5268 8369
7536 7753
6925 11870
863 12144
8262 9586
11797 4782
1297 8782
1297 13249
7796 6798
11663 551
11427 8427
11034 4808
6277 6622
25 8650
7005 5748
8059 6773
6784 4270
2286 483
7504 8148
6962 13425
2637 1323
7572 13531
7861 10710
12308 5368
1972 8610
8605 1817
7772 5682
13255 1379
3416 7101
3349 2607
11778 1533
1019 2053
13268 1852
6563 7021
2472 10571
2434 5111
2506 4392
4446 8762
5278 605
12813 8693
9844 6622
2169 572
4529 2688
428 11916
7996 3025
3596 9857
3301 11898
1322 10436
9661 10326
4135 3046
7998 11639
3593 2316
11232 10566
8761 9000
7136 5766
12229 119
2052 2498
7020 6193
11346 6778
12371 11665
7872 3427
10776 11614
224 6570
13102 6748
12569 2783
6777 5002
1809 1511
5319 1640
8325 11179
3758 8916
8726 1467
11764 8148
10875 5702
6786 7991
10559 3381
8786 12536
6618 5722
3588 2266
2736 6404
12495 13528
2441 8020
11323 9569
9979 12250
4778 4773
6658 11331
10105 10805
9207 2620
13153 5475
2490 8406
8654 5151
11671 11389
2577 6479
6577 12001
9346 9117
11087 11081
12069 8825
6310 4170
319 3263
13487 8088
3662 1499
8296 4668
8741 4657
11975 10352
3679 11121
10744 10447
9300 5857
2336 160
7623 2963
1926 1593
1665 5979
3849 6622
2779 12126
7562 3427
5112 296
1022 5942
10680 11993
4714 6622
7309 12043
3076 12167
7439 9214
2987 4845
5610 11936
7982 13002
12728 2960
5766 673
9999 11784
2090 4992
6912 9429
2083 8567
333 4554
11785 4774
626 10022
3141 5597
8952 8427
9190 4808
4586 10218
9526 7366
9369 8563
10493 1593
6900 12951
906 5169
9221 6622
10500 11190
656 3247
8788 2180
7385 9487
12624 1173
9796 8045
13360 9149
963 5794
4002 3827
5625 10329
30 12302
1789 1001
12496 10218
3682 12869
6000 2065
6103 174
3098 11897
7901 12149
9510 9930
10015 8058
1905 7087
6795 5261
7094 296
2569 9717
8267 9517
12435 1887
6413 3351
1748 7525
13004 12094
8782 1887
529 1001
11674 1170
9750 13227
10367 6298
5538 9384
11971 12647
12143 2749
5563 1910
9748 10136
2036 12789
3331 11961
6054 11938
861 5381
3667 5907
468 11689
13002 6078
1773 7977
8040 2389
11075 3133
12181 7444
10397 5442
8342 11409
6084 7945
13003 11130
2059 10103
1213 11835
8475 8733
2430 1658
2427 9522
2490 3050
3845 1887
11095 4227
6014 5613
920 3763
3402 10720
8904 11380
3413 3921
8757 2117
13257 9629
6826 8018
2068 10395
8508 8079
12726 6023
11341 11229
10142 4410
10026 4130
4828 1463
1797 12223
13052 6171
13394 1557
9054 8692
9177 9866
12864 1237
12116 6505
9701 7129
185 3894
6707 5480
4759 3651
6576 8654
8501 8751
9920 3928
13365 8857
147 5480
4653 10192
4648 5835
7159 7955
5424 1444
7942 12375
5552 146
13339 12377
11313 9866
9272 6662
3939 8987
10126 8831
13271 3827
10652 8392
2087 6187
5212 2406
10249 5663
12877 2617
6107 12939
272 6954
10148 2880
12272 2464
10346 554
7175 865
1767 8677
13093 3172
10686 6677
9687 11689
7788 3986
7260 4309
5685 8852
6958 3437
11362 10185
11699 7689
3177 3076
9388 9457
7317 1593
640 6446
13081 4008
12311 13374
11064 10571
11306 11467
6068 12922
4552 8369
5960 9868
3443 4137
3898 7489
4305 11089
8542 8831
4963 2856
10454 7003
7125 8660
8996 10169
2692 13186
11311 11374
7396 6572
9653 12174
13162 3040
10178 7821
11170 1112
4298 12751
7495 8831
4569 3517
1348 6834
5407 6695
3038 5224
13381 1048
12061 6543
10656 9031
1505 864
6343 11313
11041 1122
11482 4986
5292 7107
10751 13533
1081 2939
6449 3257
7570 8686
11043 12856
12386 12917
4932 3011
12990 7058
9594 930
3525 11
5245 1812
4676 8909
9867 1091
8272 7814
3971 10257
11229 4055
10485 11748
10546 6343
6295 11250
4943 7380
9712 9237
12257 219
1105 8572
7201 11239
5975 3443
10419 3667
4091 2101
487 7141
9056 5728
4126 1836
10415 10231
4447 6095
12954 8691
9555 9475
1285 2553
364 10178
243 1817
5686 7260
7360 1746
9139 10094
6184 8016
7645 12922
3212 5141
9494 9173
12144 11852
922 1601
908 1392
5120 399
5178 6451
7009 1892
13356 8108
9901 539
11793 5589
9752 10857
331 483
12641 6622
3920 11639
5966 9866
9043 1456
12219 11555
3273 9646
8267 6622
1700 882
3413 7324
13322 4392
3440 13220
1084 1850
11388 7266
5152 3923
6792 8610
1210 8792
4016 8475
1819 6000
7287 1001
10730 2190
4472 9930
8256 182
494 10218
1376 7651
10536 7438
2952 2010
273 9930
9814 10732
4935 5656
5818 11784
12298 7
5574 9761
4628 8610
3748 5757
2878 10426
10909 3972
13275 4137
1981 11305
3784 7770
2287 2031
3131 5023
10673 10662
3145 9623
7022 2466
13157 6343
12168 2380
2592 7625
5517 5037
4520 7358
4810 6298
11543 2227
11668 7710
6924 10458
3293 1012
8366 1684
3083 5350
1162 11083
12482 9858
7253 7469
9277 4019
4629 12646
6619 12256
12151 11121
863 1170
11883 12293
5810 5161
7521 9324
6397 2915
12414 12725
7758 7834
6502 839
9031 1540
4196 1601
8342 4864
11737 6139
7215 5041
9155 2318
3673 11143
5249 1849
8487 6543
4465 7293
5405 352
4232 7366
3685 7646
11544 11840
5341 4184
7965 7484
1618 12509
8681 11239
2185 2006
8935 3079
10449 4783
11393 9103
10180 6650
3379 13262
3892 4765
2741 5403
10333 11160
12673 5302
5377 11926
1150 3468
12455 12679
9300 12115
3295 4820
2453 1377
10380 7121
9170 3954
4433 460
10965 5894
6248 10257
860 4655
11713 7754
8789 1852
8783 11983
6590 9246
12441 7498
8540 11269
9418 146
11001 6765
816 13529
5550 5458
13452 4033
12931 10068
6423 1545
1164 10282
7741 1887
13438 5398
2707 4867
5777 10406
841 13482
256 3886
7172 5462
4936 4253
10196 9214
8284 4651
11485 4808
1155 3369
8678 9937
938 6462
8933 3352
9771 3277
3471 5356
2347 11861
4347 6193
12005 7772
4957 6086
13208 2201
3314 11191
4520 3955
1900 8924
10174 7504
9362 5979
10513 7003
4855 6755
11865 6916
4021 13414
8333 4912
1186 12176
11487 1593
7643 5705
3104 152
6414 11140
8853 11501
9613 6622
808 6425
13259 9331
13400 6015
11210 7579
7590 4109
8846 12731
8606 7613
9628 1456
8813 11877
9369 1746
2498 6603
11662 12638
12556 3419
10042 9322
4542 12396
11265 6461
2060 3076
12178 7148
8385 1601
92 8848
11025 96
5017 4651
4608 2553
13025 8021
6141 9642
11228 3948
3200 6193
8731 3564
5988 2455
7216 10518
7884 7687
2171 2201
262 6622
5370 10282
4682 1262
13218 3917
11813 3081
451 12846
6071 539
2038 6380
5677 4532
7802 7451
9904 660
10078 6918
1863 8588
8938 10367
12913 4499
3296 2515
8537 2048
3835 8161
11343 10821
12821 6622
3518 882
4383 155
642 1661
6667 12725
9774 12568
2426 2821
12604 9866
11021 219
4041 3780
6315 1387
8150 9341
11162 1172
6489 6779
11562 4646
12858 3048
8501 4541
8839 999
12880 7439
12897 2800
7965 2380
4371 11372
1451 9045
5492 6589
11264 1763
13212 7778
9524 11715
10690 5906
9580 4350
2917 8610
83 11098
11690 9689
3298 1607
2249 6895
12105 11084
9810 5939
9624 8499
6068 7595
644 6622
8980 649
1317 9667
5199 981
8435 6669
9852 8388
2021 5107
5710 12540
2031 6171
9475 4985
3631 10670
5921 8082
7756 7017
564 13227
11657 5589
10576 6199
11260 4359
2129 3487
2106 11414
10999 8916
4995 5214
12227 11689
7467 4008
5590 2755
7231 9177
6967 5699
38 11391
2650 5462
9284 11568
4925 7243
8116 7082
11136 6961
9430 6127
9681 10247
6578 12936
12518 3247
11197 9738
10754 11665
9039 2880
10079 3832
10144 9866
5075 5695
8814 10755
1936 12939
9017 10616
13262 12604
6747 6622
7803 3203
5598 6380
3258 340
7009 2957
12061 3740
3558 580
2990 8221
12575 5976
1201 9879
2212 12922
12876 1537
13282 11431
9503 2967
11914 11641
7349 4422
9810 12132
9589 390
4458 1814
934 1615
1881 7648
4467 8723
6094 3243
6361 6060
12956 684
11987 8148
6025 11474
11243 6271
1610 1033
13210 4990
702 3491
11317 3096
2801 5455
10076 9481
10406 5682
11680 11994
6926 9088
1212 4055
9162 10672
10406 10716
4121 4948
2283 5809
12497 9718
1886 7824
10033 241
7192 1048
10260 5815
3338 13533
5912 511
8861 4261
4772 5979
3369 6193
9603 5338
12516 2149
326 2027
9782 94
2809 10218
10971 3029
4358 6017
9851 3036
8820 12429
3284 1720
10732 3267
145 1012
615 5671
4166 11837
5203 8381
7426 10218
1854 950
5050 5926
8240 10857
5792 1975
11924 6172
13122 1001
6002 2793
11841 4317
7351 3955
473 3427
2136 10636
7486 6116
6133 4249
5385 953
11462 3179
13021 2495
6895 3465
8261 2364
45 11431
3548 13425
4310 12526
4927 8799
10374 4309
2113 8986
5958 4130
8919 6622
129 11642
3650 10196
9052 4642
7212 11111
3723 11923
5415 8636
9857 4914
8101 3504
10502 1363
7503 8685
6071 12369
1903 2963
13295 3126
12549 11016
7256 13057
9185 9294
7321 8388
6651 5404
9344 8427
292 2977
9447 3986
8255 13381
6161 460
9381 12244
1492 5092
928 32
5135 12450
11843 10962
1292 2227
5900 6193
5717 5023
10176 3039
5525 2335
2187 10283
6007 10218
10594 10001
7186 2520
11855 10909
10272 10639
10137 11765
13027 11158
6784 7438
408 6881
636 10918
2535 2085
12580 7101
5824 1136
2305 9166
4925 3637
2553 5905
8163 7003
11859 4725
3847 6622
7786 6477
378 3210
1352 8931
12443 10263
1097 12785
5081 1382
12777 3178
5304 9269
10545 6551
11312 301
6776 3297
3494 10056
2543 5840
4098 11995
3964 5031
4151 3602
10474 1511
10517 1919
1796 8042
2506 210
11087 3155
8676 2299
11968 4145
10664 6622
8903 1012
2296 6622
4168 4423
12956 489
12319 5210
3741 10202
1707 4658
6074 8120
9536 3540
3848 11201
9761 9671
192 9069
3684 11288
11545 1797
2590 10501
3459 2805
12335 9751
969 9382
6968 11191
1184 9824
3196 936
7223 8255
7411 10529
8339 3955
7195 2689
12449 10257
9708 1852
2216 4752
4169 6644
9620 10715
300 8412
9642 1125
4793 2799
1719 10696
1776 4991
12321 1495
9245 9228
11227 10087
2172 4956
2234 3623
8300 4808
3169 11933
4178 8964
10510 4508
1489 13461
2529 4542
9445 5682
6356 9324
8425 5979
598 3955
8174 9866
1427 6343
11133 1593
4713 2191
12170 2377
1731 5367
12802 8796
1265 1087
11706 128
374 1874
5365 3955
4478 11550
11906 9802
366 8995
9271 8805
10340 4804
3698 4309
2263 10494
4657 3267
5365 11786
1544 12040
7184 4322
9485 3497
9096 10755
3840 4334
11509 9102
7495 10271
199 5014
7647 12405
10773 5338
7514 7569
4733 1444
113 2834
4297 2206
9834 146
8910 146
5364 266
3803 13368
8662 10184
4530 10218
11336 1586
8434 6543
1772 12429
6678 6677
11498 6706
9230 3947
9706 384
10901 1741
11158 4055
4392 8016
13526 7003
322 11768
4273 3447
12527 4775
9726 1282
11543 925
1778 2588
11084 9963
9977 8283
2642 4871
6623 4359
13042 4499
5538 11976
9735 9713
12102 10406
1489 3269
13529 8204
11403 6741
11664 12646
12618 3356
10687 6771
3960 3079
11088 2472
13250 9824
13533 89
11561 10406
715 7196
9374 5386
10311 10218
3993 5002
11469 3437
8685 4408
6304 1169
11239 8681
13514 835
6294 6343
3900 6396
1663 981
12458 4068
2549 6034
4537 3427
8135 10571
6420 13529
8864 8474
2423 5166
6363 12331
968 1849
6354 4542
2319 5109
11528 3780
12187 7400
12230 4273
1112 1467
7427 7312
2289 11382
3369 7010
7936 487
2040 1133
9076 10905
6494 13522
10312 11852
4501 1769
1562 9690
6193 1210
12618 5346
2058 12885
5320 13474
10234 358
1387 2824
4488 4956
11726 844
375 138
9688 4922
4840 11044
8626 13125
5673 12620
6783 9679
5853 12159
5154 1826
12034 3251
6280 6233
2233 12983
11989 8077
680 3269
3345 4499
3624 3083
10046 12646
6798 11173
30 12822
755 4754
5003 10571
9409 3660
739 4007
4606 2224
2866 448
3363 1695
995 7215
2761 5515
6866 12880
1789 3697
5902 8011
4082 12258
11417 2407
1353 1210
11194 443
4403 4693
7682 11249
3801 10526
6642 3824
2389 12245
4068 1541
6763 10218
9322 12939
1324 2792
693 11704
8754 12207
3417 12998
3740 10613
12800 4956
10637 575
6973 10905
9606 12759
4991 11084
3136 6524
4566 10218
13388 2617
4197 12930
12079 8499
3510 3955
7212 641
11426 12652
1960 1432
9005 12749
160 1564
126 4392
13134 4168
6144 13003
5882 10760
2748 521
6912 5946
11643 11586
9518 5832
7754 2861
4105 11121
10204 11453
1199 10009
4093 1995
10035 6017
9142 1980
4761 2332
9992 6622
13495 8427
497 11454
11361 889
12460 11107
1821 1878
2287 7117
3833 10406
12600 2869
3778 1589
8082 3427
9551 800
11897 8771
2006 4019
5403 3521
6132 863
5857 10184
10282 11755
5326 8499
2342 2485
9241 7259
10221 6343
4924 11296
3802 1455
8139 4956
9736 1499
13125 6622
3675 6622
8639 4234
716 8796
7183 3805
6260 5068
9141 5728
3790 7780
6685 2558
4091 13539
1630 12561
7404 536
12477 6541
4325 3029
608 3894
4094 11689
13389 4269
1437 8082
2595 4598
3162 10627
7002 3269
3514 2553
6722 11103
6125 10813
890 7919
643 83
8153 9728
11038 11389
12705 9629
1080 10143
8251 9583
11093 4098
3535 5909
10016 9018
4661 8585
3610 4019
1565 9642
12455 9746
11539 5979
10924 9840
6183 8610
8669 8040
1329 3369
12361 4008
7655 11740
10849 11256
676 4850
1306 5753
8239 9283
8865 4894
3063 10805
6645 11561
1002 399
3963 12547
2851 449
3257 13202
4541 8180
7302 9516
12136 5386
11741 11120
6850 863
13133 5437
10666 10192
7807 6145
6861 4900
6622 4585
6423 11121
3860 7583
11383 6421
1892 7060
2229 8199
1413 6677
7184 2657
8775 6798
5403 5979
1073 9718
6538 13082
3765 12095
462 7003
12607 5640
13090 1979
9692 4048
8779 2085
1785 3827
7268 2535
10499 4549
9812 2292
12058 12802
12820 13228
1131 183
10112 1145
7210 773
6981 6343
7631 896
3403 1456
4519 7360
2459 5975
8815 12176
9527 12646
6410 9298
8059 4130
5023 6343
8444 4808
3231 10129
1466 6677
12010 1560
1494 10124
3518 6464
1742 10976
12104 641
4458 517
11729 12613
3390 3079
8784 1868
9615 3168
1156 5909
3012 3801
3126 1048
141 11798
3446 10259
7295 12536
8490 9930
12447 4845
11951 8392
1944 1122
3934 9948
8022 8487
10987 2691
13325 7898
4833 7360
12738 8487
5406 12802
1948 13129
9093 1511
7614 9324
10157 1640
7932 163
11109 12389
1284 8141
9441 9481
7461 7898
11036 5013
12005 192
9640 7003
10596 8992
10332 13482
11558 7196
12294 1593
1105 5397
10983 8298
6775 1893
5505 2805
11057 2653
6099 11552
7540 2856
3993 2069
11953 8522
12985 9197
12732 1676
5403 5971
1909 5451
7263 2617
3627 1231
5718 1530
7507 10074
10805 7261
11623 6622
7722 4318
9274 551
8182 3076
8989 11639
7476 1761
497 7550
10384 13168
4926 7226
7353 6343
12117 10857
12559 6604
12838 3083
5897 8304
9526 6492
11665 13039
8469 11431
7335 11731
10622 4548
7771 1824
8290 11033
10516 6481
12428 12885
11891 951
10283 10218
12562 4518
223 8265
10416 3662
8674 4542
239 6223
1061 2380
4584 10672
5875 5589
9196 3269
7539 2369
8233 4785
10864 6667
9255 9854
11472 12308
12986 10118
6951 969
7702 1852
8223 8259
424 865
499 10302
10292 7448
9392 11857
3776 4260
7736 5062
10775 12662
13440 13546
4155 642
1452 102
13352 6504
7326 12623
11771 9274
8923 2977
10021 9148
2486 4212
11517 6622
13105 4725
4761 6092
8485 12453
608 29
13367 13271
10679 5304
12704 12641
5999 9483
8079 11201
11616 9690
7923 2954
387 10135
6319 5682
12235 9857
7184 4279
11764 8533
392 218
4012 7003
12161 13510
6873 12760
4205 6725
4018 2553
12182 5350
1819 5979
11774 7606
8783 1544
3426 4665
4374 12930
3901 13440
466 8465
5543 4177
3560 8283
9187 9477
1239 487
1899 9238
1191 2888
2337 9269
7380 9963
9101 816
1593 5682
7041 12922
10012 7392
8718 1100
10037 8244
7611 8931
1742 11835
8615 5892
104 6758
5744 1893
8731 8530
10854 3716
5326 4136
8005 5682
9615 5732
4455 11171
11816 11414
595 7501
7924 13297
4303 4612
6051 4320
12791 9238
9460 4652
3397 1701
8927 12749
2575 5826
12011 9952
395 4651
11891 431
8599 482
9655 5817
10160 8260
9951 2085
13190 10785
1223 8495
6548 7646
3467 2299
10267 8576
6085 11940
10890 1626
13184 5216
535 10017
13359 9961
3400 2421
8230 2856
3991 6343
8402 8694
1845 4281
11567 3427
10362 6131
11981 3804
13193 11179
10022 3974
11534 72
1990 3518
1935 4834
8318 1849
10842 2034
8388 4309
3376 811
7861 3863
7226 7633
8132 9866
3053 7101
8550 12655
13108 8042
6806 12098
11915 3827
10948 6392
5458 1354
7110 3126
12900 3269
10824 6525
7280 6622
7842 2947
9531 10660
4769 2201
11130 4762
8236 11290
4448 11121
3786 12790
1790 10222
5877 3279
13033 8143
13226 8636
7858 9768
7349 1091
4605 3209
9814 740
8665 7697
12951 4492
12930 1363
2491 6212
7017 1701
5615 1126
863 11590
11225 5073
3888 9170
4476 7276
11374 6343
11486 11414
982 6343
317 10257
10575 10805
4821 5805
11342 3944
8406 275
10342 13425
2518 5633
7138 10218
11725 12856
4425 7752
1339 10807
13137 449
713 7048
8896 296
6807 7565
4938 10857
12679 10218
6340 2123
1696 4900
4629 2520
3330 4130
10987 11852
9405 1593
864 8079
7788 9914
12044 2500
12451 12856
12276 7425
8610 6754
7829 7352
1646 8018
12914 11835
5913 1012
12934 4458
8898 2452
7122 6041
12448 8610
11342 7914
11024 13061
6377 10571
1511 10474
10927 11953
6612 12279
5757 6333
8737 4974
10834 10037
3088 4917
10898 6125
8520 3269
11200 449
8069 4549
8297 4774
10758 12078
11878 10118
11215 1413
10361 1299
12941 12778
5858 3038
7920 12961
3664 12936
11898 5401
5227 4133
415 1761
8811 10991
9260 6541
3713 1979
6976 1761
8756 8758
7133 6063
12357 733
7200 7049
8078 7210
963 4245
12512 3076
582 7251
6408 12374
4439 9866
8950 7448
11741 8656
11511 15
9257 4500
1613 13213
9602 1541
10992 7365
2714 11389
10336 10099
9500 8476
9595 12209
2305 1137
7037 7429
5508 10991
11386 9335
11813 9411
5244 12802
6587 3789
2991 1184
9496 6677
4398 10732
3894 4170
2385 4130
5029 2915
9195 8042
7241 5807
5479 12103
8560 11984
12215 5942
5573 12662
12277 8515
2763 9679
12498 3247
10027 6622
356 8327
188 9866
10834 10218
637 4542
10746 11540
10977 9953
948 3576
4944 842
1042 2689
2162 296
3265 8000
2928 13228
11875 6193
8878 2805
13527 10793
5693 4392
11263 8427
8046 6044
7301 6916
3698 9875
2255 427
6238 13003
1362 1110
8479 1387
3332 4130
6929 12111
5424 12991
11065 2189
5116 8072
277 1084
6319 12516
1673 981
12109 10264
10613 1272
10142 6610
7841 5865
4694 12856
12635 4808
4492 12429
7780 4279
836 3714
10942 10021
4635 6199
10919 10197
13424 479
7369 3497
436 6193
3074 13058
7769 7489
12111 7472
6319 6662
12572 3061
6103 3023
6010 8221
12205 981
2983 3553
8967 2369
11342 9627
13196 4571
7081 6677
7481 9149
9116 9149
7366 8392
7459 10584
6226 9265
8672 8636
8925 13453
2157 1789
11518 10905
2544 8225
512 11317
5761 10805
7730 5906
7871 5927
9192 12660
8605 13061
2941 10218
8379 11476
11123 12223
9543 8382
2400 3661
13505 9343
4592 3830
13410 2520
10628 1156
1067 3029
12238 4183
3425 825
5295 6058
3164 6132
2614 12815
2563 1112
7645 9182
7849 11414
4731 8954
10901 6073
2326 7366
7473 958
3086 13474
12067 11378
1264 10218
9368 2939
13396 5657
3435 5969
5803 7293
9257 1030
6213 1480
5254 10857
6437 3613
11480 12455
10052 8423
6726 10255
3951 10452
4156 3883
2627 7571
4548 6344
3499 1495
9646 5656
10017 13414
10014 4369
5986 7293
175 8016
2395 855
12033 6206
12543 2553
7647 10221
6362 2963
4930 7440
8475 12332
5262 2485
646 859
12972 5589
6902 5868
1509 2284
5890 2636
8640 5909
7940 3567
12154 13106
204 7003
12891 4693
7948 6031
8175 930
8973 1272
13190 5924
1746 12759
884 3166
11531 12347
11144 10418
5334 6622
7039 6376
4422 143
12085 10616
7641 8534
8279 1741
6634 5559
7482 5682
3521 13217
11044 13311
3477 2818
1278 599
7219 10331
5073 5657
12110 6041
1675 3972
11052 9574
5088 12817
865 3081
7991 2916
8186 3929
6943 2011
4223 5663
4727 11437
941 4227
4952 12646
11595 3576
880 9905
1588 4881
3892 8795
8069 13068
7178 11179
7761 9226
454 5002
13111 6075
1150 7431
7581 6296
3340 1886
12439 3567
8991 10506
1710 12226
13171 8499
4128 6343
2676 12521
6117 10218
9519 11470
11625 10197
11254 3695
509 6403
5491 11817
8517 11141
2975 10056
4783 13228
11010 9007
121 8406
5457 4362
3438 10662
9518 8912
13456 10836
12218 6622
2168 3157
11928 11245
9969 8355
6137 5107
7095 11661
3420 7821
953 9053
11724 5503
6649 6174
12757 6573
7692 8514
2178 9828
8992 5026
5528 4709
12275 1992
7663 8042
5823 11556
11212 11768
1335 4130
7491 754
11797 4130
2712 2421
4181 10218
12358 12991
4929 10571
535 2978
2118 13136
4507 6585
7099 9892
275 5480
7876 2799
5771 7983
5584 2472
7695 2666
2728 2699
563 10202
12765 3381
2099 4626
4230 10458
7015 10856
10247 8016
10860 3263
6135 6987
3555 6241
10827 11469
7387 9868
489 7613
13509 7475
11951 5014
11140 7966
3658 6622
2207 6581
1005 7681
4434 12
7479 4891
12434 9219
5296 10320
5619 1467
8001 882
11028 1992
1544 6343
4527 8288
2176 4927
1424 12110
8612 464
10040 6916
13536 12907
4350 4019
12910 7745
2761 4236
7071 3172
3090 5979
9759 3612
5349 12429
12050 620
2140 882
5002 12447
9582 5523
10609 7652
10920 12671
12077 4108
12589 7454
10689 10530
10590 5540
11637 3161
10081 5996
4416 8304
6871 3025
2948 11555
11238 8764
6694 7445
4636 12429
13016 6492
1656 13039
10241 7003
5342 8259
1750 10055
9741 5068
113 12369
3889 5979
10827 6382
4313 3204
6857 12773
8806 3748
10340 10106
2085 444
5775 13464
1866 1593
11895 5695
3545 7469
354 7778
6713 4109
8375 8469
5942 1456
8192 1662
13417 4031
10423 5571
4069 8259
4606 7297
11237 10762
456 2687
6640 2958
783 11235
6739 392
7815 8082
1205 4579
5077 4130
1382 7702
12699 6625
7494 13394
9650 9158
4661 11121
4671 1218
3935 3821
9513 12005
1009 4109
10104 9919
5517 10662
2413 10060
9266 7898
1311 7917
1099 3823
213 6765
5436 10208
6701 2466
11572 6371
2270 2515
3005 8304
7210 9104
2814 1456
12051 8147
3856 10566
7474 10571
2420 2120
4654 7094
11634 3955
8980 839
2986 3979
3518 12117
14 8909
8791 1084
1609 4693
2332 8265
7107 7360
6087 577
3003 4322
9216 3638
3333 11910
8166 12856
1144 2417
9325 7366
8304 12802
4071 9708
5481 9872
12979 8016
6545 705
9069 9866
11409 8392
3373 4857
11253 2880
11746 3361
7884 5876
159 3974
4823 6804
10033 10755
139 4458
158 6603
11032 9069
5812 10755
812 1224
6341 9483
1730 13149
11495 4130
13054 11852
4800 13464
6039 4938
3622 4458
8991 5737
8785 6655
7530 4642
5140 6416
12904 9679
10979 1784
6920 3358
4481 6810
13196 6875
10558 10218
7079 10914
10709 4956
3595 6049
2595 6755
3851 11222
8760 1091
7438 11098
13071 4808
9456 13524
838 5948
1438 200
9602 6011
7063 10755
11101 4033
9494 13271
2861 12981
1934 1701
7237 7517
4051 7625
7080 13418
12228 6738
9280 11212
2508 3996
7348 11852
2701 1170
9591 1593
1008 4494
3728 11852
3341 6622
4750 582
431 3491
9046 7366
9334 10944
11711 13125
8098 12011
3085 3126
11406 3954
9449 344
11388 3763
10161 10732
11904 5556
8940 1091
1717 3126
5147 13117
12668 2814
9951 4577
2624 6987
10362 11109
9057 433
3144 8038
176 11555
9350 12881
260 11506
10257 7898
13395 10911
1415 11452
6284 882
1522 4130
10439 11378
1124 6622
8578 5979
9814 9484
1632 2245
6259 7937
9580 11852
10502 39
3968 1283
13065 9638
7715 9064
6549 9102
9303 3126
11986 1210
13435 3763
5240 11684
5084 4343
7797 5151
7393 13240
13228 5605
8336 10571
4611 10218
2434 11780
3705 10695
3913 7836
13168 2770
879 2490
11818 7261
11680 6645
9892 5513
4709 6840
9172 12305
2320 4417
370 10218
7885 6979
1009 1630
2973 541
3104 10452
8351 12521
7088 5304
3838 8842
2815 11228
12583 10805
6219 10406
2331 10446
6057 1743
7363 1137
6303 1343
6868 10755
11966 4126
4721 12540
1668 1163
12856 10485
6820 9711
1436 8028
1417 2253
51 1640
4017 8604
8761 6174
10850 10805
5505 6939
7364 1667
1126 8038
5762 5875
11316 1800
11135 1304
5045 9284
4270 10326
11270 9935
1692 11915
4303 7609
9040 4135
5204 8070
3545 8769
9988 10202
9759 5647
4975 1495
6904 7094
5319 5937
7035 7314
10384 549
7523 1999
5647 5682
3630 2148
10000 896
1662 10566
6316 4102
769 3138
2692 8842
10139 9214
6289 8517
11211 5654
9681 10520
1728 10096
8505 10082
3137 1164
3241 325
10572 3188
5416 7438
4794 13018
12648 6622
9706 6393
4087 9866
6642 10173
6627 3198
5064 13464
4333 8237
10571 8859
6248 12276
11258 3921
7892 13485
11656 8392
1444 2564
6266 6172
13528 13092
6322 10136
8092 10296
1200 8828
10456 5087
5545 9858
7447 4404
3417 4544
10537 10311
4415 5309
2585 9372
8653 6343
10242 13117
1143 12117
9124 7141
4403 8819
4083 8283
12687 8859
9457 3009
10772 3540
297 2910
11711 8935
8707 882
984 4208
1891 7138
776 12266
8860 8056
13074 3420
108 1210
7961 5879
11389 5151
12287 5142
2091 2375
9179 5487
9242 10506
6679 11914
9997 12182
4834 9990
9332 12725
7054 8654
2241 11450
11271 4729
4658 12815
1698 10436
367 1740
1733 8685
2994 94
12132 3439
3711 9959
91 7288
5307 8706
12882 4173
5014 11373
2689 9049
10964 10571
6676 8831
10855 9358
10010 10124
1476 11121
12789 7366
4545 4033
627 2864
8583 13318
5848 2375
12814 8349
5541 8359
13101 9362
9825 10449
10982 12641
8663 6539
4592 8502
6484 839
2559 5362
11143 8016
5740 5897
4450 9249
5230 7234
4382 7797
3669 12846
5391 12885
7797 3612
7935 7359
11718 4588
8028 12051
5018 3954
8541 9997
9543 9520
9293 3540
12402 3999
4365 2380
9821 4294
11343 11473
11482 12493
7312 11120
12230 10218
13162 5840
11252 13484
1286 3038
13472 7357
3841 11675
10496 11444
6439 6343
4489 12885
4684 7228
2193 2125
5351 6697
9839 2856
6778 5068
6677 10762
12159 3059
8671 6242
3848 9023
11569 8161
207 11061
1829 3974
12493 9355
347 11740
4098 4129
11290 3023
11360 9802
13390 6247
2625 2454
8941 969
1332 487
12452 12756
8075 6394
11566 10124
9474 3427
7901 8950
2870 5528
1715 6622
1538 7561
1157 2299
11935 6512
5947 10326
4268 9469
2606 5141
4243 1325
6996 436
4943 9708
13024 6849
4249 3954
3614 285
4266 12802
10296 6677
1641 10218
822 8096
10542 4309
12904 8621
7680 4019
5708 7821
278 3379
2957 10595
11180 12160
6244 6304
1354 12994
3274 3906
1001 5398
12434 92
4502 11276
8158 4498
11422 298
5804 13029
2891 13136
9851 201
2696 3567
8764 10535
2119 9681
12001 1231
9066 11466
11994 10257
9448 12098
11666 11738
5791 6677
7570 9879
1467 11229
12633 10615
4015 4809
1028 12471
3874 3745
13480 3714
12170 4658
4959 10957
12501 1001
4552 3024
9777 10602
3968 8832
11352 5389
8704 2641
12314 2201
10844 11399
7215 7318
7771 2485
10488 4692
9858 1881
8713 10922
2676 3435
10645 1586
7506 11824
1020 4227
3336 8302
7977 5846
456 6193
6928 3149
2186 4207
12195 3827
7232 10412
10760 7780
215 13442
6894 3727
8008 1511
7342 11205
6575 9132
790 2584
4521 3267
4058 12646
9631 2149
12922 2689
9685 5109
7573 10970
10862 3126
9636 483
4378 2930
8790 865
7777 8804
6588 4110
12469 5657
7873 12356
1524 11852
488 7003
8144 12639
4877 2377
12405 3954
9429 119
531 2171
7093 5551
7247 8937
8286 10218
11784 5367
8140 10662
745 6755
4414 11460
5680 2089
11599 4435
4985 11391
9375 3267
4265 3076
362 10218
10591 8939
4524 1173
10488 5757
10367 3553
2823 8495
13411 5582
2957 2917
11415 10647
41 1980
12859 11558
11420 9866
11938 7739
1659 12368
11871 10331
6083 10017
6558 13
11926 8847
1155 4515
8043 5757
2868 1601
5360 4148
6455 8727
2123 1937
3449 4493
4470 2498
12147 7010
3207 11852
8027 10406
672 3313
10212 2963
4270 4963
5443 3076
741 9138
8554 5470
5784 5159
3774 8610
7632 7527
9137 12855
2544 10033
297 4033
13018 12927
2025 13340
8871 3625
9396 11290
4988 11375
6954 296
5523 2217
12673 11015
13076 13267
6761 3394
11882 6552
12831 8499
3532 149
9397 7307
12240 6193
1315 12367
5390 4253
12250 6916
11456 8909
6378 564
96 6585
7090 4499
609 10283
3394 12497
1305 9507
5107 10732
4402 7572
6756 8132
4706 9324
5170 11593
1536 12172
12023 4657
10741 8779
9949 11835
3900 8805
12713 1231
1654 9264
8555 464
7277 9608
10171 4900
1775 7003
12729 13464
11574 8123
5013 399
4292 6581
10514 13168
3214 7710
7472 1467
10973 2515
9032 7953
0 9318
1387 7310
10162 3885
11948 1813
7345 5212
3553 2389
12505 12205
7515 10218
8211 6962
13534 2951
5891 4055
13488 7668
788 11852
4389 13236
11457 487
7024 6881
7279 6425
10328 8375
6912 11095
12497 2209
9890 6987
10733 1428
10920 1928
8329 192
7833 2299
10856 9149
1915 10991
9346 6600
4029 10660
13156 5162
6133 4900
9102 8427
9072 2201
10198 10141
9365 5905
7349 1332
3763 13091
12133 12088
9964 6041
3115 11178
1432 3389
7705 3849
1170 3025
12590 2188
4466 6962
13381 1497
9602 6336
12636 3480
7429 10672
2363 6804
12451 13202
9517 1746
1093 10980
3850 1559
8555 11113
99 2955
7658 2770
11059 374
11642 6043
7197 2120
12925 3928
10497 5491
10962 8690
11882 6304
3224 4990
4476 8961
13535 3091
12779 1688
11372 6887
4497 9580
8951 3766
8939 8221
11767 6677
11647 9866
10297 7060
7093 7261
5460 2085
3106 1444
2607 6622
11809 159
8170 1601
3268 10138
6834 3845
13479 8236
1090 12429
9130 5759
292 13373
13049 657
7037 6755
7202 3803
12958 12725
12537 6604
8241 7199
9756 5979
6822 8280
9666 9866
7059 7003
12809 881
1192 10227
2273 10218
3909 2154
10281 9064
1569 6625
2857 13551
823 7727
10199 10218
7091 8639
5934 10762
2241 874
5548 6622
8250 8192
2387 1252
10632 3247
1394 936
11616 9117
9618 12051
11793 12921
10832 9950
7274 5309
13504 13268
5353 10596
9938 6193
7972 9945
3982 3763
6577 1084
1138 2423
4114 8427
1087 12310
9548 1640
2924 8449
9846 5086
3383 10429
11380 3126
210 2154
1077 6380
9382 4974
7579 1998
7693 3845
9292 3928
9676 354
5656 5141
5089 4864
7852 8419
7531 1629
12945 11501
3962 7822
8454 8332
451 12922
10546 9264
7512 1538
5266 8499
2874 6978
7582 3263
898 3076
8807 4416
3231 9400
7811 3553
4053 4292
448 8524
2536 2553
9332 184
5967 12310
9326 13037
9440 11243
3613 1001
13499 7658
8499 9963
10516 1456
709 3230
5196 6735
8949 12955
6215 1493
13501 9624
5517 12116
5181 4405
5545 1003
6666 10520
11184 11389
5265 1297
10170 1817
9491 9091
983 1467
12194 4416
2451 2213
1073 13228
3485 191
9539 7493
3766 1111
2856 4974
7336 9949
1190 9551
13356 12245
8221 11120
8466 11709
11919 6343
21 9910
10585 11464
8756 11041
8168 1985
2303 7852
5723 5704
787 2101
11435 5025
13216 12207
6265 9324
2824 1161
11724 6275
11252 13323
8006 1060
7999 12936
4304 12930
7625 8572
12415 6963
8582 3422
689 11034
3505 2048
1872 3061
6086 10720
8118 773
12440 12648
4686 9177
4106 1091
6435 5393
3480 5386
12579 7937
6392 8046
9528 8041
388 3038
6304 7939
2098 8801
7821 3763
10141 168
10077 11164
5955 2143
8827 8568
9705 4019
9159 1157
1279 8082
11099 958
1567 8487
12272 11217
8455 13268
5732 9259
13365 4991
9222 381
9361 5338
5053 4863
8326 5523
8989 3222
12169 13267
10865 7726
11610 5186
3254 7003
5738 6109
5517 302
10145 9914
211 2464
6013 12421
1456 12815
8891 2362
4815 6293
119 865
12835 8579
951 6174
13032 1231
5079 13400
7324 785
12223 7366
2374 1761
12390 9866
4236 2227
8271 12305
3411 7965
10650 2737
490 980
11630 11835
3806 3038
2443 1112
4380 6193
1631 2214
10256 9432
6851 3763
11404 7327
13210 11777
6838 13357
12837 7444
6453 11213
1603 11034
5389 11966
12255 11422
11194 11139
6202 228
9523 6603
11927 10662
12330 3780
9720 1333
6513 12715
1674 11312
7867 5299
6963 12789
12997 915
5048 11835
9411 8373
53 2938
417 449
7325 10711
11029 7945
10408 6765
12155 3379
10668 2990
11505 9811
554 2954
8206 5025
9513 11689
6638 13117
6054 2738
11403 149
4818 13131
4412 2515
7709 11194
8759 1189
675 6622
10565 3159
7906 11285
12710 12825
12121 7806
438 2485
7601 3177
4641 701
10202 5243
3323 7898
10364 10566
8846 4008
583 6565
9436 778
6817 9176
10794 9309
10735 7206
2869 9138
9341 12369
7328 1091
10218 7745
6494 8375
5495 561
7411 7002
10465 13473
140 9023
6447 10486
8770 5350
1807 12799
8841 12112
4422 11121
7569 6677
505 12166
1888 10367
1303 10604
6802 494
3450 10755
13362 2835
12534 5705
407 1456
5129 559
9082 12223
3533 3544
1395 11980
7790 10618
6384 2048
3039 3408
10618 4554
1751 6798
3223 3762
2359 6836
7626 4285
12286 10051
11007 6622
12312 9884
7207 4109
9077 10218
9201 9532
6008 2967
13497 1485
10841 530
9987 9481
159 10467
11888 2273
6075 11290
4932 8018
7175 8736
1590 5090
11347 10184
5941 1729
8354 9777
6741 816
367 5462
6623 8568
7211 219
9054 11652
1308 6041
1174 3556
4376 13057
3119 13216
3620 10908
8569 1205
11641 3039
11806 6189
12463 9427
8191 3789
478 7977
2712 8188
9495 12133
4330 8303
2093 2835
7182 7347
9081 5916
9533 5531
10359 9834
12451 7399
5201 5179
3722 377
9650 3867
3606 4098
622 7811
5489 6622
1978 2553
11588 10283
11504 9888
2559 10794
4753 11063
6548 84
9944 1394
3253 8388
873 1852
5150 7675
13405 6622
7708 10486
3972 6350
5152 959
8470 3540
5298 7101
1081 11126
5973 2681
5500 3856
10821 8050
1381 3871
9996 1644
12349 1333
7705 9789
8504 1069
10852 9708
11070 10192
10051 10118
11711 13325
783 5527
10147 10107
1868 644
11525 11805
8505 6622
8419 11179
4048 7053
3039 11431
855 3827
2981 11733
13398 9562
6464 8190
6543 2689
6169 275
13086 3040
11532 1541
6911 10218
3202 6073
6182 5757
3175 2491
13248 6380
3839 5398
12097 11829
7874 4227
9998 5451
11001 11316
592 10980
12028 12450
2343 3379
9253 11082
334 10707
1826 9866
419 1456
11425 967
12339 6991
10435 1670
6413 3763
325 2217
4438 9948
6683 11049
9022 10391
1630 6154
5654 9866
11780 10247
2859 6376
12633 8825
7389 7700
8963 7595
10738 6233
5219 13201
6657 9945
7469 3527
10400 13477
1908 3358
7084 1102
6261 9769
4925 11389
8589 4902
2697 7279
11297 6928
5174 2553
12632 7739
12841 4929
3577 1972
7980 11964
10853 1586
10103 7849
9458 1672
1886 3600
9914 10853
3873 5338
2971 1161
12322 11794
6099 7112
7281 4604
3351 8899
8647 5742
7564 9471
6893 8042
11467 13384
12040 6193
2166 8161
4553 5582
4596 3567
2003 3251
4283 5996
6609 6710
5371 2801
3312 1731
6119 6223
4804 10347
5883 13071
4214 532
644 1655
7127 2154
4027 8354
8103 1557
107 1012
8485 1733
2421 8553
3840 13234
10929 11652
2027 6987
6725 12859
12554 8392
6497 10819
12400 4499
12346 11577
2885 1444
2493 8561
1236 5997
4986 13259
12774 7921
9502 12671
10214 5926
3071 3567
11 10326
13153 1701
11049 5657
2098 2011
245 10857
7602 7596
5531 11035
2854 9026
11874 12504
7699 2101
2137 7997
5464 8610
4034 452
13404 5590
4741 2754
12976 1201
11090 541
1154 5722
132 8980
12299 3071
2504 11785
2573 4500
289 8688
3120 4620
12256 541
949 869
5834 12994
3739 8665
2641 4164
7349 11015
899 1225
5952 7713
11117 5123
4132 11473
3591 5262
9930 4860
8099 7448
12965 4232
8610 10056
12526 10805
6621 6799
7432 134
5665 344
10960 3813
4624 9945
12384 2165
10433 9620
818 1103
4474 3005
13026 7003
444 3954
7448 6622
2137 3269
9796 9981
5007 7010
4604 5195
625 10927
4582 4245
10569 7937
9209 8168
2052 12936
6767 295
9055 6585
13010 13459
12234 4808
6624 10755
10916 8831
9550 7283
3303 1646
1462 9069
3127 8753
2224 6524
5702 2012
11666 7965
6603 3780
7674 11235
6762 10303
6499 10561
8029 13177
12310 6622
6888 2696
9246 11389
948 5013
1374 460
3173 4459
8298 5979
6472 9866
8927 10421
9204 13024
4254 13482
5617 8489
7740 9790
1206 6446
7850 12939
198 10887
6683 9400
6564 13160
8321 5109
2494 11639
11210 6769
11783 483
6607 9761
1931 11380
5164 6343
10660 11414
8053 13373
10355 9177
6766 8018
2518 1825
5951 9475
5483 1741
1303 8201
460 2166
2619 11852
11996 10124
10986 2198
13178 7313
13111 6371
6769 5462
5607 2417
2655 9069
6710 9269
3515 882
1823 13099
7204 8390
5904 2607
8978 2951
3223 8137
10499 10566
4995 460
2126 2954
4431 5260
9234 8016
3315 1329
3951 6011
355 10836
12377 1962
5285 3379
6452 3155
7960 8950
391 9986
5668 5682
3155 12994
5439 10518
12012 13415
12561 6460
6580 36
3780 9866
9370 6497
6128 8120
4911 11220
4327 10218
2254 11389
8609 9209
3549 9924
11353 12660
5096 7886
163 7366
1763 6178
9553 10506
4986 6622
2515 12856
6536 6828
10230 10830
1410 11267
10411 1593
10956 9689
4781 10218
10222 3061
7072 13173
9086 3188
10887 889
3869 2271
7920 7366
1844 1312
2832 11524
13515 12936
9156 10218
9622 7937
3597 2854
3042 6017
7269 406
3362 11200
10383 6242
4076 1395
12101 2380
10852 5899
9334 3518
11414 3379
1839 6810
9163 1848
9168 6400
12728 7218
8187 4499
3004 13496
10447 10218
9697 5073
5435 6239
565 6139
11367 6625
10843 3692
3578 5695
12026 7768
11446 6138
10966 8392
8754 1244
6281 2593
6848 8414
8241 11391
8903 5638
10647 1688
1578 5906
4051 7123
3812 3250
2266 2245
9300 11810
9919 10436
12371 3375
8326 9056
1870 4938
10131 7261
10683 3508
5057 13434
7323 2254
660 2067
2445 9732
7491 10707
1863 12690
4256 6600
8431 11555
1064 3188
1036 10786
3814 11399
6937 3632
2615 4960
9018 1155
699 9529
12971 6987
11600 13227
378 10857
13278 12591
11699 11935
6040 7515
7410 7017
4866 652
5291 639
2900 12223
9271 9761
1061 7626
11464 496
228 8392
11955 219
9388 10518
2164 7448
5571 8950
2679 100
2209 10771
12865 146
12610 364
12437 6024
9703 9551
589 9113
5031 6031
3375 8180
7559 1667
8208 6343
3134 8091
13070 11235
7375 13366
3044 7101
2110 3379
7126 6622
10734 13061
687 13271
10338 2537
3921 3567
4383 1739
4830 8304
2560 11143
9689 13425
1694 12226
12510 13040
4056 8427
689 7073
1204 13262
3910 1667
2805 3157
5137 13305
5818 2772
8480 1001
9723 6223
4188 11135
7604 5728
7606 7104
4286 5267
2321 355
8682 340
9595 1001
4125 6168
12223 5596
10601 10991
11152 2726
6321 5023
3921 4366
9758 10124
11112 3906
10282 5006
2753 9097
9841 8475
6327 6378
6136 12671
10755 10218
8360 9446
1312 5909
9654 13122
2239 7293
6785 6622
9363 9289
1852 3294
12233 443
2301 11518
420 2527
2018 13329
2409 4656
8967 11613
2065 839
6189 11374
9207 8724
6387 8654
7451 4658
10250 12707
4017 13149
2402 4309
3604 10218
639 5840
1955 1456
12398 3855
8808 10184
12876 915
6052 8824
10984 13425
8984 4549
8806 789
10460 4867
2440 9642
5381 9866
1579 5462
3885 11158
3435 1003
12196 12713
9166 2736
9157 3970
4838 10887
6631 1593
9120 5250
6875 1315
10986 5699
2089 4087
2968 13082
1923 8124
2146 6191
9773 1
8141 13082
6950 2968
7589 13466
9770 2511
12271 1167
8948 10218
588 452
9018 6095
7212 5775
5140 6916
9307 9197
13099 12944
9315 3358
4277 9269
2549 10994
11617 2799
9805 11689
11282 3590
8484 6580
5361 12725
3569 5480
2322 1646
2965 4645
10974 9130
5779 11471
11462 11861
11676 121
7607 4269
5276 12930
6353 1817
728 13136
4306 12815
12792 7368
13251 13425
5783 89
2724 6871
8493 6970
10604 10663
4868 1590
10082 7030
9107 478
8266 10218
2000 6622
6832 1593
4449 10566
5144 10257
5413 7010
8931 6193
13124 10026
3266 6622
4086 1165
3634 12805
100 13440
9335 462
5473 5151
4061 1384
9135 2846
10847 7017
12094 8530
5839 11
8250 2894
8273 3714
11076 3355
13032 4871
4514 3247
1763 9880
12671 9629
5935 6415
6925 7476
4623 2856
13091 11487
154 3061
1718 8016
4196 4879
12983 9238
7081 11750
2928 5382
6263 6604
1136 11852
1172 11098
2188 1445
11083 5006
6161 3395
10973 8026
434 7974
2019 1615
5382 9582
10246 6392
9572 10013
4056 5445
704 6182
332 13440
4679 9530
10 3404
12906 2164
6941 11409
4595 12668
11130 566
10502 263
2434 8143
3108 7908
10229 2737
4599 10602
11454 10058
3362 1378
7279 11420
11812 12891
11731 4900
11553 4287
2101 10262
3038 3714
7587 4392
3374 4250
4668 12930
7203 10406
6444 10239
375 472
4906 7198
6150 1399
11209 12090
11213 3126
10318 6702
12085 12051
1372 1701
12801 8160
2598 3364
7880 1467
3247 8079
4598 755
4249 9948
4250 8950
5793 13018
3942 7360
12692 10689
11807 5006
2612 5139
7926 2553
13258 2892
7189 1556
1785 3447
2629 4087
1953 8552
445 1746
5901 4176
12039 4095
5740 4129
1016 10114
9794 8610
9169 9102
2117 12671
12796 3731
9376 536
12749 10326
4202 5386
254 4033
10790 8161
3170 7360
3086 4418
1210 3076
6622 9732
10885 6132
4233 9903
7160 6544
5218 10760
13340 1887
6543 12630
12122 8319
12918 183
4276 12802
9041 6622
4944 2101
12379 845
2435 5728
5704 5403
13258 11689
8441 10329
12712 4260
2949 8169
2622 78
11614 457
7820 4869
9367 2438
4089 4499
1847 4227
8000 8793
11893 6041
3256 8931
6215 8791
10183 3061
5036 8333
11322 7081
12878 12117
9215 9903
5360 587
7846 10202
7148 822
117 2856
3074 10090
1766 10566
8747 8099
10396 6343
13075 1174
1563 6207
11850 8610
1200 487
1680 7129
9054 1470
2128 6622
11730 9866
1559 7003
6717 9753
3456 534
12620 4269
4058 6882
8200 6622
8188 4885
7546 2706
418 3438
11828 13452
5471 483
8961 2448
4542 11835
904 4890
9190 7766
6171 10559
7215 13234
548 2188
614 4134
8336 755
4867 4658
3476 5321
6534 981
9285 5068
9907 12450
4233 7261
12621 9887
12267 10682
10529 1817
1315 13052
2142 11501
12828 6622
3705 11743
7346 12816
9209 11395
5039 6962
344 7141
8005 10736
7647 13248
6162 10423
5842 2412
7719 862
9560 5141
1887 3038
8465 4145
2729 500
2517 6622
5646 11809
11142 16
10146 3424
1781 11657
8407 1559
12547 4831
9092 2101
7392 1443
5918 12159
8619 5565
8735 5561
8371 1317
1515 13029
3951 2284
3924 6524
12476 12449
955 11966
2642 12829
12772 1790
9826 12124
6989 12275
3804 7034
2950 12170
2667 4725
7924 8380
4900 11414
2150 6806
8761 93
10745 12129
11412 8961
3298 4849
4337 6622
4459 5335
9350 2485
12736 12305
3981 12802
12490 9971
5920 3955
8771 5682
9421 10857
13289 7272
8264 9108
3291 9453
12928 2036
11439 4130
4256 788
4548 6304
1094 6525
2280 11807
12649 5611
3964 6622
8185 2219
2707 7367
992 8390
13453 7366
7632 13168
8870 4900
8167 197
9869 6078
1417 4309
6726 6622
10577 1236
8545 5988
2757 7196
12176 9322
5236 1601
8568 1992
10762 4471
12517 5761
8572 296
4252 12331
1575 5757
8699 10571
8026 6898
12588 6681
1173 11389
5474 11313
10714 11091
12320 2101
11133 11875
3389 13496
2237 10406
8265 1055
3706 3553
11446 13013
10664 10566
3963 4130
3147 11551
4987 8474
12427 487
8335 8931
12070 12691
2841 9708
5826 6119
10543 2954
11718 1591
2288 5499
221 10106
6206 7919
2576 2472
7579 1164
10008 10017
12455 7366
7749 7567
1563 6622
9799 1887
298 118
10186 13480
7938 10218
8305 4732
281 298
1984 4392
10822 7293
10500 12930
4184 8494
7177 6543
3045 2219
11905 6581
9780 8427
10737 7266
13425 6962
11768 9866
4112 930
5835 2944
4097 12299
6979 8323
5288 4658
5816 2954
12539 4577
6846 1893
12160 6028
1034 460
7581 13486
12385 13295
12659 10354
3757 2898
9828 11352
11745 7745
1123 12825
1029 9963
11814 4437
10012 5997
8048 13467
2104 12223
11235 4472
53 2438
4111 2916
13069 12815
7939 4577
372 12773
3587 3844
10259 6524
5810 5657
7182 7654
3358 6622
6099 11784
1878 7448
5868 8873
9453 2226
6578 5948
9940 11373
8001 12677
12815 6392
13099 13418
9217 5239
12618 3840
11417 4108
5141 6193
2875 12588
8728 9918
9500 7658
10715 3305
9751 9133
6291 8011
2741 4404
13092 4055
5350 8016
13489 5297
365 7625
8923 6442
5547 10202
363 9279
583 13149
3830 11335
5511 10218
2433 8746
3456 1817
8933 3167
9358 12098
11394 4230
5579 4564
12068 15
679 969
8812 10401
12062 5347
9725 3299
2158 8610
12179 1205
1969 9173
2430 2299
1379 4500
10879 3803
3434 8883
8124 10218
6163 8787
5094 4135
10390 7821
9625 10755
5488 98
575 6622
7226 9099
604 1269
4370 6270
907 8126
2464 2725
8374 12209
8828 6697
11086 3441
3364 10257
2099 10218
3243 6622
7976 30
10646 11659
6717 10991
5293 4233
5426 8358
7419 6872
8876 3955
4033 1800
3506 3241
889 487
5200 10575
8089 1562
5619 5126
11229 9661
1911 9981
2330 11003
5145 11322
2024 6352
8727 3763
3836 10283
3965 9214
618 11835
2966 6380
4382 4177
9779 1893
12235 4034
4154 8361
12827 6159
13298 6193
4669 794
9267 3569
8377 738
7836 7091
5784 8487
4864 11201
8669 7646
116 2341
9747 7010
2215 724
1416 13248
4707 12540
9815 11326
8961 6304
7564 9783
8838 9242
7383 5175
3386 6622
325 8127
7369 8687
5634 4285
3669 5304
3496 5657
3487 4808
5479 13327
7220 639
8606 662
7943 4954
6171 5477
8465 9014
10788 13228
8918 275
1523 9945
7724 3062
6805 8851
12172 12757
8127 10283
8835 6192
3232 1915
2608 6622
9355 5773
13274 2691
5432 10762
5470 2520
4523 1768
3240 12731
11875 13041
12968 128
12391 2401
8528 6622
11477 10113
2720 10260
9754 13267
10848 10827
9604 13301
10317 11291
5136 10106
5414 11681
8829 4033
3128 3636
280 1892
10702 3321
6264 6017
12832 3549
11829 3347
1226 9218
7386 10813
8756 5079
4115 13262
8311 8411
10937 12325
11125 12725
17 8631
769 12905
7377 9790
2290 6603
7624 1499
6899 9209
5936 1589
161 2856
5546 1646
6255 3039
2141 12008
8142 8263
22 11805
5669 10764
7254 12450
229 3370
10221 9815
11025 9149
6031 6524
8932 2813
6899 1550
1560 8517
2034 6622
6646 11394
11519 13453
11128 13168
12814 13271
4548 12936
12443 3061
8991 7712
5609 5391
8863 10921
4195 839
6421 23
3161 13255
11003 764
2501 9866
10353 9857
2089 1701
892 5589
8983 13120
1150 12936
4012 654
13273 93
5754 8338
9875 13329
11597 5151
2161 8168
13431 12725
4842 12923
8847 10662
7159 2101
5719 13129
12081 7149
13192 11158
11866 6745
12499 11110
10974 11689
2747 7285
13075 11389
4270 10283
11812 1480
9441 13333
2814 3552
4042 5186
10012 7207
9741 1660
8390 10412
11790 11179
2804 11239
1961 7788
6952 6755
2291 12930
5025 8016
185 8634
4446 605
501 3720
10368 4144
5280 3948
5776 2762
10456 13018
8851 6622
7824 11121
5980 5109
12663 1706
3712 12871
4861 7023
6178 7261
9734 9400
4706 11889
660 4500
11867 8157
2136 9946
10850 10241
13482 9708
5590 7688
13141 2296
838 9536
912 1910
11937 6515
10974 9940
6927 10518
11802 6825
1403 4115
1188 10412
2464 1331
3894 8304
6892 7148
2453 7912
1726 9908
13484 960
6288 9010
11344 5219
6743 10351
11900 10184
8589 1800
7976 13228
3104 7933
10744 1231
8089 4808
8705 12994
13056 12725
5559 6295
4278 1476
2689 6916
12851 2750
8818 9433
5859 1843
12024 3319
1175 4613
11277 3447
4151 483
12536 9866
1073 3003
8461 5192
5066 12449
3373 11121
4162 3954
10910 3548
1209 8851
10430 2770
8151 6132
2092 4319
998 13168
5379 12855
8372 9942
1199 11689
5976 12922
7958 10878
12129 508
10316 10421
13273 9481
3592 11543
11500 13491
371 11251
12614 7293
10559 7017
4675 10191
8476 7312
2476 2584
7777 1615
12660 3025
650 2380
11590 3446
12336 10970
12541 3883
118 7366
2867 1161
6811 11281
1222 6506
7695 12979
6368 10124
10669 10230
6434 13500
6270 9335
4055 3294
706 684
6395 1298
10412 6544
280 4098
3606 12252
582 6098
6939 1307
9482 11538
12108 2835
13135 3468
12728 1387
6051 8015
10550 11091
3114 12936
3543 10136
6568 9216
3255 4117
8746 4070
3811 10412
4115 4701
778 6479
8500 7438
2774 4392
5559 10565
905 6278
13324 2245
6420 12732
1958 11457
8995 11451
10763 5171
7906 10316
5826 7447
2032 4500
8593 8610
2250 9963
2179 3570
4468 5589
5747 4271
2029 1732
2518 10761
4475 2175
1096 5909
5106 2380
4008 1255
11653 13024
9681 1414
6681 11462
11927 6554
5251 7554
2364 9866
9642 5421
3954 2856
4528 3376
11111 1052
13538 2915
5687 5386
12260 6199
12115 5856
2002 1746
4139 6622
11936 6779
7809 6622
4232 410
6240 13143
12600 11081
4689 1979
1803 5215
1395 4374
6556 5200
7026 737
9904 11903
12968 9945
6150 11602
2162 1126
536 7710
11174 11073
1873 11712
1032 6603
12512 2111
6445 3247
6804 8972
11354 9866
8604 9337
2739 5142
10981 2380
6519 9053
1516 6622
3632 9680
51 7570
9091 4393
4495 7965
7149 2954
1796 7013
9758 12872
2586 11038
4860 7003
4418 562
12567 11389
3697 10660
5333 9732
5193 7701
7869 13495
1630 3216
4425 9808
1338 5338
13177 12802
4598 12802
9732 9866
5010 2682
3915 10780
4910 9446
13522 2380
13394 759
3911 7576
779 12414
7990 12937
2688 4813
2777 7299
5639 8959
8499 553
3607 10365
9565 8598
4819 8102
4747 8993
5532 11689
3986 12239
1172 780
9900 11036
3546 6934
5060 11810
8141 11370
9670 4897
2500 9346
7324 3180
13206 7536
12039 7002
10329 8699
10243 11538
6086 6641
10485 6603
3814 6938
3936 360
2652 10241
4933 10783
4454 8221
12564 8221
6291 5006
7661 2868
8377 3955
5996 5270
10856 2701
10599 7006
9557 2430
11226 6095
9454 11462
6701 9125
6969 3269
8259 9117
2442 7710
9916 11352
5790 10342
7810 10833
9238 2805
11581 10566
5988 8756
13241 6697
10195 3957
7097 8831
3880 8859
12254 11970
3445 8392
1509 4454
4981 9866
13185 5886
6596 5480
6100 11785
283 2308
8936 6193
8569 3126
794 1399
2509 8568
7918 3379
10843 10457
6887 10449
12320 6751
6554 6942
3740 2891
6938 5101
8712 2553
10657 6697
1105 12521
947 1670
8066 4309
1825 2770
1974 12725
8108 11689
13331 1500
2447 10518
1548 7293
8073 11292
9918 12855
8844 11112
13180 10762
7795 10742
10114 13464
10468 8961
12519 4930
1331 1915
7622 4808
5002 3855
12447 1281
6199 3294
10441 2209
6908 1925
962 10843
4351 8796
6115 10672
11742 7779
465 6854
13364 2101
1995 11784
11698 1387
4401 865
13299 4215
10728 12831
13219 6658
1414 3531
9639 6392
7793 10506
12192 10193
9080 8610
2225 7989
5257 6549
1217 10826
10408 11545
13266 7429
11952 4843
9932 5031
10628 278
422 2085
1566 8062
9590 7571
11746 7067
7853 9289
5316 9815
11640 9360
1203 6041
3199 36
9259 10371
965 8553
1790 2515
12725 5815
386 1343
11185 7722
732 219
7586 6088
7119 8427
10945 8808
8379 9096
3070 1012
4988 3461
2492 12445
4307 6681
6888 9309
13523 2206
6292 11864
5629 10660
5783 9779
10173 10219
2562 10610
8769 1577
12203 12773
11062 2896
4623 12726
5945 7158
14 9640
3856 8388
12932 4108
12089 10250
2005 4130
7402 5699
11781 5068
10683 10104
4280 10672
2527 2380
4888 9628
5376 8173
2453 12449
9361 4758
1557 10575
9796 2755
1422 882
8762 9132
8644 12802
11141 8961
6098 1887
13057 8634
11304 9177
4611 4314
11839 7625
10234 6916
13167 11201
9843 10218
1417 10029
1256 3761
7409 9516
1633 7366
3061 11501
4362 2787
8133 4970
10207 2472
744 6771
12422 1667
10503 6622
7871 10755
1197 12414
7567 9886
11776 4774
12050 8844
7367 12863
2474 8478
9954 11555
8516 7297
6220 6622
10753 864
7974 10506
4900 12315
1799 7067
12126 7456
1235 10056
6080 7821
4898 8209
6791 8796
8240 9316
10703 8638
6149 6946
11688 1371
7523 6677
11601 2799
6645 12429
4386 8042
90 10757
4920 8723
2029 13125
4278 12925
369 7366
1428 7898
4762 5523
9402 12695
4433 8498
10512 3789
2351 5073
11372 8625
7854 7436
9718 9930
2076 11462
10515 8147
6480 9640
11218 12737
9024 6622
12121 12136
5287 6681
9881 12506
10108 1874
4077 1577
3824 3379
3278 12579
4486 10202
808 1474
12872 2047
249 5980
13106 7562
8003 3805
7532 5571
12125 1893
9388 7576
10863 11191
12497 969
7437 3485
7210 13168
9175 2201
7193 8692
3061 11226
7701 3955
13205 13408
4203 1767
4976 8831
3021 11414
7909 6303
11040 10468
8394 11121
12593 2317
9290 8374
885 13271
1104 1079
3579 7778
7920 948
12486 5917
3057 9864
7037 4995
4603 6622
9666 3843
12750 12280
5628 11064
5698 12525
8957 10202
10676 3185
2540 7141
12146 7360
5189 2607
12234 788
3836 5003
10506 11784
10663 275
8551 7201
11385 3917
9028 12457
2398 12808
11819 13347
214 8950
7694 6168
7465 10017
712 6622
11741 12323
813 11581
4771 3482
8497 3653
1015 10654
1936 6360
454 12975
4662 1012
8837 1927
9439 13394
7533 5705
874 7410
2536 491
12881 6376
714 8975
2416 1085
3296 11285
7603 8978
3333 4505
4502 296
3994 2175
5337 2851
4760 9782
4807 6083
6909 5997
6552 11909
1154 6193
13176 3038
12374 5350
11535 2472
6804 4127
4575 10762
7761 4591
6971 8528
9512 7445
7621 13482
8582 5903
5566 13271
13528 1233
4598 3648
10996 2052
9686 11217
13088 1444
10421 5023
9679 541
12347 8082
256 8259
8375 4232
2970 10082
10963 2429
8543 12247
536 1354
8552 7049
7923 1475
4381 10436
12696 4348
2777 8137
10898 6525
346 1393
8837 10218
4593 1800
614 1667
10625 4431
10432 8487
2343 4776
1387 12802
12621 2520
8831 2856
1280 2349
13307 6622
12426 11454
7668 10316
10953 10141
6625 3770
12492 6473
376 1893
835 3152
4328 13307
10941 7141
6454 12021
6161 9343
11081 3144
8451 5815
5557 9410
722 9866
8838 12381
6495 8380
13332 5023
3322 8161
6042 865
12841 7329
12432 8136
8739 10119
7125 3993
9227 5289
7811 12441
9550 5906
9146 1939
2595 6649
6144 4273
5500 9302
8574 217
1095 12895
5676 9860
12613 12130
13223 10218
6521 6586
7234 12828
4063 4368
1142 2334
7064 1403
4834 1850
11414 6088
13338 11493
9437 2419
7550 1752
5422 13482
8368 7149
8450 4083
11451 2553
753 12051
12491 8588
2269 6343
5213 9761
8752 13129
7646 6250
2976 7856
13445 8215
7764 9460
5266 8795
5549 9067
1108 4628
24 6343
11355 1012
2382 3553
4183 567
2664 3379
6894 6881
5678 7004
6691 11431
12813 8568
6585 8469
9533 9324
9908 9866
6318 5610
730 4017
6892 9475
593 6622
11506 12856
7714 6333
9030 12053
3232 9168
13181 5002
8613 10805
2640 5915
9201 3560
10291 11288
9653 6859
9844 10577
7501 3954
8282 5089
7964 12408
8045 2906
5045 3269
8941 11368
7087 10092
11098 6403
8972 1001
5909 6343
2116 10426
1086 2797
3434 11414
8702 8714
6851 1235
9552 4594
11747 9265
7751 6355
1400 9067
10501 839
2652 4035
4408 8231
5076 13271
9975 5142
8762 12894
9715 12681
12624 6862
7098 7804
4406 3954
541 2819
9522 5213
4404 6614
398 7003
950 8406
11913 4089
8232 2951
19 2048
3206 6989
8392 9382
3577 9550
6170 5733
13404 339
5295 9677
5828 9773
10261 12640
12782 8406
4792 8931
4295 4864
8243 5864
11628 613
7919 1755
5480 477
302 11844
1192 5571
9407 9968
1421 575
6728 1651
8149 9361
3953 399
10356 9102
11778 4547
12616 1511
37 5102
7859 6838
12735 12429
2818 1091
3237 6108
4595 13440
6221 2988
585 8082
8276 12133
5798 9857
9895 12429
3928 12429
2451 6351
11050 12660
12592 3885
10682 12759
5494 11784
3394 9101
9936 981
4411 11239
2250 8884
1729 9202
10589 8127
122 10421
11399 3955
10266 10326
5047 9346
6749 3827
6226 3950
8619 11373
9511 6360
13447 2284
2538 6753
5865 1063
3809 11406
4379 8859
2860 11239
9356 11380
13510 11420
10874 2901
13488 1243
2612 3883
8624 5589
10198 1787
605 12738
2488 7710
10409 11389
2378 6461
2072 6881
4799 8502
7074 5915
12965 9458
1458 1055
4937 8359
9090 1091
4201 7375
8666 2250
9571 2563
7475 4860
8158 12715
4757 10892
13537 8654
3076 12855
6964 11689
3533 309
12728 8154
9334 6350
7140 8379
11792 11179
311 4959
2539 7821
1667 6622
4155 6193
9659 7625
9082 9498
6081 8206
12323 5107
11273 107
7239 8158
2954 7727
7018 2380
7398 6193
3656 5141
12014 7366
2823 3846
9847 889
1282 8398
793 5421
11183 3013
2154 1467
2301 9708
7130 2607
9911 4757
10379 5360
5444 2644
901 5757
1295 2684
11404 7292
2905 8288
5914 1834
4898 11869
2195 561
6067 8610
295 2868
1654 6571
3571 9618
12645 11784
3198 10762
2696 12998
11742 9643
3582 13425
9131 4785
9217 11117
3944 9516
10530 11852
7870 10506
4413 6153
1759 8940
5823 1201
4494 1231
9245 3954
13429 6810
8550 7215
5217 2358
5694 10017
6101 13398
5004 5270
11395 12922
1403 6756
1342 8620
8317 4785
1414 8259
3759 7239
4915 6415
12297 6895
7161 563
5677 11431
6472 3566
5864 7710
7855 12802
1998 2380
877 6728
8418 11784
13313 10218
3735 10258
11220 2881
13195 3699
13545 11032
4488 12519
12021 5728
5487 7489
10252 3511
2240 1980
8411 4086
1486 3917
12872 5302
1291 5875
11598 4900
11753 8082
3884 7727
8330 9007
9790 9575
2047 7067
10539 9868
7959 1893
3778 1010
11567 1917
1874 11635
2911 9309
241 1680
9332 2671
9042 4171
10006 2509
330 8221
12319 10218
9759 1298
4331 12209
13354 4392
12006 2951
9780 7203
5338 12434
9465 13228
7215 3666
3407 2350
2733 3928
13323 3144
6263 3305
5679 1701
13503 3024
2044 8392
11576 2057
1532 4444
13460 11273
7478 9940
11915 12378
2558 12981
5790 275
9515 10035
9507 13117
2164 798
1376 10141
474 5479
12533 7562
3902 7034
4039 9382
13191 3072
12793 3267
2713 11639
3270 9814
5286 2600
4038 12974
8333 9771
6106 12802
3390 8153
4359 6193
4092 7261
11488 6223
12765 4028
12033 11623
6296 3346
8315 9170
1231 6622
2800 1146
3414 8461
13251 4347
12115 12397
2280 5572
12988 12894
12592 5681
4461 4588
11584 11219
1368 839
6970 9761
11715 9530
5856 620
12302 5372
10942 2299
7319 8343
3623 10805
7461 4431
7469 3606
1669 9866
8759 11274
10733 7460
5688 3925
3091 1511
7956 6543
12545 10789
6673 10413
7281 9149
1549 2273
5935 3843
5158 4831
2354 11855
2735 11205
4799 11713
12022 7031
12733 13079
3970 13271
7973 4222
12994 803
12728 9253
13114 12013
1205 6755
7616 9751
3356 2699
10500 1746
2803 1982
1082 11501
11372 7558
12545 8831
12855 13228
1037 11942
11638 3826
3617 963
6304 9269
9583 12855
2618 4658
9248 1558
9929 863
2993 10948
1556 11852
5007 8286
10986 1909
5206 13262
2479 10838
8120 5142
7886 1231
6058 503
13015 3466
9217 6185
2632 706
1971 70
5494 8087
1398 1559
10981 8966
12926 1990
4007 9938
12916 11832
9982 10367
7275 4775
8734 10571
290 10218
7744 3595
10473 9681
3248 6751
2037 1122
5886 11984
6404 12936
12627 11390
7820 4227
1808 9283
5883 11404
9881 10405
4820 8226
3806 165
1910 4828
3355 9866
8465 2451
3050 8931
13390 3763
1406 7745
12507 42
81 9365
8168 6677
3805 4472
5286 11182
7707 4714
12664 8102
9446 10218
8711 11026
3464 11835
7946 31
9945 3896
4425 13467
4268 2299
8984 8427
12837 12994
10761 462
2215 7580
9318 487
992 8313
6883 4657
2591 5275
7044 12179
4101 2334
10612 6461
53 4674
7154 9908
12403 4238
3687 3780
9239 3928
1577 1852
12009 11145
10597 4368
5623 3269
5030 7094
4267 2380
5569 146
6898 9763
12662 13262
427 10202
8078 11414
7697 8643
8336 5365
6380 8051
6745 2951
5630 7355
7117 6199
7223 1357
11326 9686
3447 2466
12779 1559
608 6295
11853 2963
9689 170
5563 4831
2754 4900
12381 6858
11373 9708
8513 7037
3899 3458
10514 3247
634 11239
2765 10672
8171 3928
12812 9027
8343 169
6931 9065
3419 11063
127 1818
12971 13144
12231 8568
9602 5730
6095 6017
8791 8757
945 684
9578 13326
5607 12003
13466 1974
2516 8502
10870 8222
6156 1746
4168 5905
8440 10262
9055 4551
2073 2085
7655 13106
3304 2607
4451 344
4853 296
10769 8082
10626 3986
1754 9498
3117 331
9595 9814
8871 6793
1238 12783
11140 3061
9063 11414
3629 13209
440 364
2719 11770
6109 4396
5614 7710
4645 13125
1582 1843
1118 5915
2737 219
7330 3036
3478 1869
7102 2924
4664 10484
13379 9854
11408 3795
2458 11414
2846 1502
10845 5941
9818 7489
2850 8831
271 1508
9580 9589
524 7048
13375 7727
4760 10533
13544 1122
10875 1589
6208 3928
4238 4499
8068 12951
5966 4959
9395 5894
9605 8421
4512 11032
8985 11835
7749 8427
3127 5462
7113 7625
8167 2689
9450 2805
6548 3482
13309 5809
2599 270
3093 3996
1349 11200
3668 1456
4861 12789
11993 2380
9829 9516
5599 8537
1965 5421
9313 12133
9691 598
6545 7628
10286 4831
7078 8327
576 1382
6851 2022
2564 12403
820 12536
12340 8427
12421 10335
13036 1817
8549 436
4495 10649
4376 8016
557 4053
3594 8427
5701 12803
7157 11373
4191 75
6032 4956
2633 7821
8759 575
106 10412
11476 9866
9522 3768
972 11639
13409 4833
11744 5943
7363 3686
1168 8134
4123 4472
1599 2284
2728 1701
2167 5068
5805 9177
4107 5979
7503 11667
10717 4162
9412 1210
8990 1441
2296 10140
4362 5321
5892 5842
4697 6098
2623 5101
384 3269
5660 10406
3576 864
5503 6866
4404 3702
10554 1435
1457 2954
11827 4785
8856 760
11242 11179
3548 4279
8585 7927
13049 9481
4275 7923
9978 1297
3395 5507
1454 5909
11710 2318
175 6327
3769 7606
2084 6604
5121 12725
9792 9866
13333 11777
12957 275
11854 2246
9892 6721
3206 9483
7592 6616
1300 4645
9690 8017
7312 12679
6170 3567
6684 4735
1298 11405
2192 3955
4188 11473
10362 8685
5996 1307
164 6622
12689 1905
1786 8079
4900 9704
4940 4852
169 2101
10690 5815
9801 1755
10328 8406
4141 2201
6515 1297
6898 2856
2951 13425
6720 6174
4802 1231
2982 9542
8220 3471
13225 236
12530 10139
4814 1302
495 8791
1069 132
951 9733
12737 9616
11999 12681
3892 9708
342 5101
6816 9211
8953 6981
2893 6223
1391 11239
7836 11389
8438 7361
379 3061
12337 13227
5551 115
911 9669
12770 5875
4998 12176
7785 4528
1905 8959
9107 7703
8979 3840
8297 13373
10042 13539
4732 5909
10341 3101
5143 12133
1468 2948
1919 11121
9019 8528
3357 756
5166 1210
8546 6041
11523 10565
406 11852
11726 825
1228 9324
9516 11746
5144 615
6143 12834
12080 478
10960 13447
2825 917
12612 11784
13276 1589
6352 2073
1252 1437
12980 7625
5235 8406
11121 3358
10902 3749
9407 8243
10921 8042
3775 9857
9673 9483
8229 9666
11814 8106
11520 9049
5751 13535
8825 7194
12525 4831
4354 3023
8584 2404
10799 2233
2480 1112
7711 10421
8111 4617
6224 13223
4362 13369
483 7017
13377 8831
1322 12113
12278 4693
9180 10358
6604 13429
9301 9910
6238 12246
6274 9114
5392 5891
13447 6581
8677 4130
7561 1870
5646 2358
9993 1456
1468 11473
10227 4864
3103 10348
1170 8534
9065 10760
7119 566
10857 5402
8367 12833
4137 7655
13513 13279
11572 9346
10425 10320
8057 6916
7417 8831
2114 7261
13338 7003
10831 8016
2801 10506
7358 11368
5405 10218
10216 1852
3550 4269
5573 10822
818 639
1654 6425
2834 1718
695 1148
9060 7945
5977 13312
3213 296
542 3345
8306 3
7265 9286
7116 3029
3022 10192
12010 10501
3700 2263
10048 1172
4596 1344
2530 9065
9524 6810
10199 9400
10951 9582
9919 1117
5011 3871
9476 13515
5365 12653
8494 11
8417 4227
859 6582
12720 8470
9914 6554
10389 6174
12548 9538
7893 1601
4283 11671
10295 11852
800 1586
9541 4269
1545 11230
8073 4109
5497 5359
5055 3668
4913 1887
7101 487
1396 4464
5552 11305
2522 13264
13358 5013
8527 2089
8030 2951
1939 9234
1647 8124
5474 3773
7149 2802
305 6223
551 13024
10055 7
12248 8259
8756 5750
1373 1887
10407 5915
2698 3805
7046 927
3705 5523
5396 12874
5932 7937
3538 5909
4812 12773
8595 11819
4490 7195
5878 1499
8080 7625
6277 6345
11189 6583
11624 1887
6295 2744
3817 11945
12011 3005
4894 1112
3884 2452
4753 5338
11027 8203
5396 6916
1635 1325
227 4406
3681 3144
10651 10466
1728 7454
8394 13074
7210 9262
6648 8148
3196 7745
8369 11784
5292 8406
5216 7700
490 13528
584 8482
11443 950
3784 9961
7007 3734
5344 2553
6030 3038
9579 12429
12670 9064
10298 11431
2227 3955
10287 1312
9844 12948
3616 3002
10206 10124
6660 8700
9016 12369
6249 5464
5639 7366
394 205
3222 2518
10140 779
11712 9053
8887 7416
3051 5032
9202 8355
1133 12796
133 5350
12419 8283
3154 8102
128 3132
7500 6516
3278 7595
13303 6316
10553 2482
1830 11352
2466 6755
1913 9855
10309 3950
4871 1333
779 11686
1930 5166
3751 8401
11442 12751
2899 1746
1382 11389
9381 1817
9760 6336
342 4388
12790 7366
10184 12681
37 9866
1455 8989
1011 10460
10641 455
3508 2085
5173 7366
2641 6798
3738 5437
7916 1804
392 4130
6371 11225
13265 3100
7644 5213
7182 1333
11014 1837
1854 5946
1862 6341
12898 2856
13540 8654
7660 8707
13256 10849
3759 7965
2070 2938
1909 5311
7266 6622
3795 7637
2764 3540
1724 7141
7162 4219
1216 10367
486 9238
8020 12563
2545 11049
477 4808
7865 12983
7297 9295
12753 10426
3839 1227
11585 10218
3158 12939
1549 4844
8585 2458
7457 12289
10723 4135
8362 2154
6309 1444
1638 8950
10428 10503
12645 78
3400 4651
12946 3986
4618 1979
10767 10406
4134 8931
9215 10691
8528 13268
3260 5788
2687 6167
8119 3567
3303 4295
7678 6098
9237 3763
3082 3944
2777 3210
3484 9761
1484 12012
222 8244
9524 6675
1793 6495
7009 4542
9949 456
4453 10218
11411 9708
8941 5876
6701 6156
4152 12671
8996 10622
4822 219
7873 2805
2803 5613
12656 13130
5671 9279
5049 11004
3102 8327
11051 12671
8409 3263
6396 3954
12650 9197
11671 922
3941 11032
7148 13230
1292 2890
5363 6755
1304 2464
6642 11288
11987 908
13351 6132
2916 6916
8427 1210
2926 1526
2090 8082
11430 3061
6878 4496
12154 9757
9639 3321
10681 3247
12673 12671
5770 4927
8769 10
13186 10927
700 10729
6684 7100
8013 6017
8824 2142
6789 6880
1193 3803
3741 3515
6510 11810
2349 10257
3750 7149
11607 12641
10557 1719
5894 13456
5028 9868
11162 2835
8716 9177
9508 7293
9274 2515
12768 6178
11212 1495
8117 3518
4800 1243
6055 10426
2670 5979
3620 3815
918 9117
1474 13248
2263 4531
13357 9156
1223 1043
11939 6392
13411 4527
10218 2818
11445 6811
13022 1589
4045 7053
13221 11179
8746 1495
3037 5909
548 5763
9482 2259
8892 10149
4085 8945
3121 11518
10132 3611
12087 6622
5092 2868
4617 1504
8859 11691
11943 12414
8685 8016
2806 5022
8100 2856
8483 2006
13211 7013
11308 11389
9522 10406
11873 9266
1652 11852
4255 4368
10436 10432
6821 6755
2746 6622
1683 12985
11255 9629
7884 4008
5107 6864
12737 5068
8554 8300
8773 7141
5421 9085
4293 12671
9086 13253
11013 3800
11497 4033
5104 1958
9954 924
412 10634
3075 10771
8426 10011
4684 1979
6838 6098
5215 2520
2406 10991
9422 7433
10856 10262
13265 5398
13464 10668
366 2721
12886 12856
7354 12909
7103 8060
11979 4732
8961 7762
3763 620
8369 3795
13008 1593
1035 3955
12307 7366
9105 7438
10217 4130
8102 6208
7367 12671
3083 12465
1689 3433
597 7003
5955 12906
9745 4455
2572 2101
1518 3773
11767 4155
5162 2963
2369 7198
2566 11854
10268 9353
9705 2800
2508 8354
1551 11425
6731 10945
10262 9945
12786 2856
11632 11451
4239 5109
11758 12802
1860 2392
9914 717
1491 3518
13062 3965
12459 11851
9048 3379
9122 6916
3971 1527
10090 7399
10533 4162
6042 9660
11914 2035
12062 1210
7381 7003
1884 10257
2167 6468
4689 10592
3485 11270
5071 1761
12269 11555
3279 7075
10969 5480
11092 13082
3299 4008
5840 2553
3311 2916
13485 6622
4553 1691
1036 4917
6093 9156
1345 9542
4790 6571
9285 11024
3718 9156
11739 8979
11801 10536
9171 6614
10782 6335
10856 11074
3905 1000
2907 2219
9581 7238
3260 3529
9545 1782
12622 6196
6864 7421
3912 2345
8601 5509
9616 3954
6609 3954
4693 2835
9353 1934
11770 10566
2695 4892
2734 8217
3501 11033
9258 9708
9542 9582
12933 10375
600 6622
1253 10702
7753 6680
1269 958
8252 7094
5080 13082
9256 2101
556 8610
8405 11005
6762 1456
4544 3761
12584 12681
13115 1636
109 2175
662 1796
4343 1499
11658 9481
4621 6499
10769 9029
6682 3803
10869 8079
1495 7448
559 9979
9410 11804
11310 9353
12280 677
2084 12903
8561 6622
8660 684
13516 4519
1574 7261
10484 12773
8823 7553
11372 8887
12217 2515
13079 13061
9610 5338
3925 8791
9959 5290
3202 6199
12991 8380
6522 8462
980 2515
5217 13427
4688 4911
5063 5852
1099 6218
3171 8148
8820 2368
12184 3984
7975 8265
2422 9520
5217 331
149 8079
1469 8475
11272 42
12707 779
1800 10575
3202 4526
13207 3371
12493 3944
6861 11699
8305 9365
1279 1814
8743 2089
10510 13464
13220 12036
13532 11229
6158 620
11155 5747
13116 3829
11839 3493
7103 11309
9277 6865
8318 12953
42 9158
4199 10197
12964 8538
6901 11420
2290 7275
5534 2620
8494 2070
6885 8965
11256 6516
1910 4360
1670 11541
13131 9516
384 5739
11573 6622
4966 4227
2484 11788
7218 10760
7324 8042
6785 6633
8237 2262
3307 4449
1198 13129
11173 3508
11417 4109
5417 11594
4280 9455
12521 11016
13064 12185
11892 1649
4967 9622
5682 6215
7768 3551
574 2006
5348 3263
457 6622
7600 3928
11726 13019
294 2607
2807 6360
12429 12936
5609 6040
9565 11235
6498 11689
4775 1099
5273 2569
5373 7937
3283 13149
12185 6941
6369 10774
12037 1456
6535 377
9254 10846
10311 9782
6570 9483
6955 10218
9759 307
10582 1234
8739 9516
7510 10421
5647 4855
5279 2128
4501 8099
11832 6227
12467 7571
13302 610
4405 2515
5650 8038
2536 6536
9870 11389
4399 1035
791 9866
7903 8341
9664 1856
653 2835
5128 7219
5796 1424
12860 2804
3501 2443
1946 9366
5303 12575
3197 8879
5422 9886
8334 10660
5531 6432
12989 9945
13458 2237
9928 9708
6854 5164
8834 8931
4805 11665
8481 6413
10373 12304
990 11154
4809 7571
13258 2132
13515 10044
2286 9565
12917 10506
13327 7522
11415 12815
1679 11308
3227 13129
11066 11194
12258 8018
2995 2227
1423 9309
1386 9149
2694 5389
11248 6132
896 149
10218 13296
7770 12986
9276 8380
66 9481
5851 981
7541 12693
11607 8859
2049 6622
2523 10218
2482 12885
1024 10084
12367 9505
7049 6622
12812 2744
1795 10218
7724 9627
12296 8434
13200 11352
3712 3660
10691 10707
9820 3871
603 449
2430 12226
2740 10026
1748 2101
13013 11227
11098 1640
3008 6755
11901 7149
9560 6121
7137 10518
3130 6343
6913 6930
11282 4544
6367 1319
5001 6343
122 9935
181 9666
5754 8392
6815 5169
9819 7261
533 11191
2763 6462
12096 10218
6511 6193
6990 1756
9844 4200
7010 7017
13045 3120
4955 2506
2832 13131
683 1969
7596 6604
6658 608
464 882
8350 436
1666 2553
7436 1001
9881 6253
10674 8016
9183 6798
5123 5318
6207 2520
2532 7548
5838 3644
9652 296
12452 5044
8204 2335
12251 10642
5889 5225
8312 6987
7967 9344
4134 5362
1970 1112
1796 3459
5025 7381
5461 1649
10064 4368
2177 9645
9513 788
7198 12429
482 6474
4910 13482
5936 4404
2671 8102
4633 11185
6369 2463
8650 11289
9317 7625
10368 5399
4312 943
1149 13503
3732 803
2630 2007
11112 8324
1678 10486
12389 4263
12694 1978
4143 10326
4439 10764
11786 13426
1102 9544
2927 5196
10813 6622
3607 6923
11274 6755
10073 6405
11122 8270
9566 10218
7747 12051
5172 6562
12409 882
3844 1449
11604 4656
12712 11730
11449 8840
7335 3917
7317 11650
3296 6389
11349 8016
9193 10218
6324 11256
984 5523
7710 119
9109 9144
1640 9127
9993 5330
8358 10566
7814 6171
11455 2074
3749 9064
6366 12894
8784 13421
10624 4517
9426 6220
9101 12894
9603 11699
3674 846
2408 9209
3430 12098
8646 9970
4957 9265
8745 2936
8055 3285
9023 7945
5731 6959
3377 10517
4930 377
4076 4542
7014 9269
8506 2046
9562 9866
5067 8761
3011 897
10939 6392
9061 5337
8564 11098
10518 7898
9620 1456
9570 9582
11819 4112
7763 1001
1251 10830
13146 5350
10070 9868
9331 6622
3939 1430
4257 1705
2436 9778
4774 5905
882 3230
13062 12140
10658 11271
11185 1593
5355 3541
9500 292
12091 5654
10280 1850
13039 7293
5182 13336
13404 8037
10719 9485
9600 9398
11552 3723
4226 12450
13083 10218
1218 5969
10140 9642
6185 12088
8354 3955
5564 1499
13343 10755
4228 9309
10017 13098
3640 4889
9425 1164
13466 7538
10989 2568
12454 1001
4370 5337
3417 2967
523 11338
6755 9069
3572 12856
3986 11389
525 9067
11214 1638
4009 2201
11294 8411
11788 4133
6480 5954
13287 219
13466 10067
4445 9023
1589 10622
2858 6622
8534 5553
6919 8791
3589 3978
11734 12885
5384 7010
6690 7094
157 9324
6017 12256
9899 12936
7196 1701
8431 11253
12456 12681
10751 12660
10531 5920
5473 3610
10715 6193
3033 6380
9396 12690
929 13003
7869 12560
7286 8475
5780 8786
6614 2277
13085 10257
12935 146
11152 163
4205 5192
9501 1281
2790 1876
9788 12556
12308 11689
13273 9562
9466 2375
11108 3323
10607 10992
10555 3371
13136 8950
620 3203
13280 5068
8309 2589
205 522
6987 2856
3608 9761
6625 1456
13423 11074
1729 12415
2632 8313
3064 6622
10668 12414
8164 7958
5627 1316
13166 368
1334 9879
7237 8885
2225 11192
10504 3815
8793 2018
7044 8294
4481 5248
10793 9436
7617 1697
10524 8148
6598 5277
9891 4519
7026 6220
9302 3753
933 882
7786 11068
8965 12823
10193 9238
6865 13098
7563 12214
4459 10924
9867 8834
3913 12713
6634 7515
972 245
5928 357
10204 11462
3187 6992
10443 6184
12481 1495
7712 9023
11838 10991
5700 12725
5901 692
8780 13482
10479 7312
927 536
9518 12447
1056 1761
7363 439
8449 7480
3968 6763
2153 10106
4608 10232
1302 5857
13228 5265
7783 11465
10763 1387
927 929
12297 2689
12449 780
7092 2872
13072 7312
3534 7625
219 612
13317 7625
6196 10506
1765 10760
12039 13376
1103 11625
11178 9177
624 13054
12012 572
4735 707
3666 12430
3857 3974
947 6888
13394 11525
12187 10762
6377 9405
10191 11689
781 7312
4170 11352
11434 10762
6281 2085
5605 39
10091 12493
671 1297
10004 11668
8158 9991
1073 234
9433 7949
485 5151
11582 404
10057 4124
7017 6275
13221 5884
3832 3442
1750 2267
12467 4375
2289 1601
263 8931
7579 11844
9261 7394
6107 9702
10956 7003
6612 1630
11086 13353
6962 6192
4397 9708
2129 3655
2368 11835
2082 2472
619 3286
9672 1001
2794 10474
10146 11389
12688 4308
1011 11462
3827 13271
7256 10106
9857 4055
5104 8531
9963 11970
5366 1658
12137 12455
7073 10218
11852 1817
9222 4008
11207 12671
12915 9214
13044 7003
7613 12310
11069 1499
228 3839
3392 7101
9031 2284
4778 2237
1298 2209
6116 1264
3757 10762
5510 6319
8571 4282
5491 4248
5328 10323
7740 915
1536 6697
6642 6987
12577 1850
5507 3623
3246 7010
8594 11431
8648 12347
4736 8283
514 11867
2723 849
1842 12026
9675 3361
9605 6005
5010 12922
11043 5620
1776 11694
139 4719
6149 331
10158 5166
9273 2735
630 1887
