Division,WeightClassKg,Place,Name,Team,BodyweightKg,Best3SquatKg,Best3BenchKg,Best3DeadliftKg,TotalKg,Equipment,Event,Sex,BirthDate
Boys,51.71,1,Fabian Solis,Edinburg Idea College Prep,50.62,217.72,147.42,195.04,560.19,Unlimited,SBD,M,
Boys,51.71,2,Siah Moss,Hebbronville,50.98,165.56,83.91,172.37,421.84,Unlimited,SBD,M,
Boys,51.71,3,Victor Madrigal,San Diego,49.99,158.76,90.72,154.22,403.7,Unlimited,SBD,M,
Boys,51.71,4,Alex Martinez,Taft,51.35,149.69,88.45,161.03,399.16,Unlimited,SBD,M,
Boys,51.71,5,Juan Rodriguez,Santa Rosa,50.98,154.22,86.18,147.42,387.82,Unlimited,SBD,M,
Boys,51.71,6,James Martinez,Corpus Christi London,50.26,142.88,92.99,149.69,385.55,Unlimited,SBD,M,
Boys,51.71,7,Lionel Sanchez,Rio Hondo,50.98,142.88,95.25,147.42,385.55,Unlimited,SBD,M,
Boys,51.71,8,Robert Garcia,Crystal City,51.62,142.88,92.99,149.69,385.55,Unlimited,SBD,M,
Boys,51.71,9,Jaden Araujo,Lytle,51.62,147.42,74.84,149.69,371.95,Unlimited,SBD,M,
Boys,51.71,10,Oscar Ramos,Natalia,50.44,147.42,77.11,138.35,362.87,Unlimited,SBD,M,
Boys,51.71,DQ,Eduardo Lopez,Natalia,50.98,142.88,,,,Unlimited,SBD,M,
Boys,51.71,DQ,Anthony Guerra,Dilley,51.17,154.22,,,,Unlimited,SBD,M,
Boys,55.79,1,Erik Mendoza,San Antonio Cole,55.43,183.7,115.67,208.65,508.02,Unlimited,SBD,M,
Boys,55.79,2,Joey Rincones,Edinburg Idea College Prep,55.25,197.31,111.13,192.78,501.22,Unlimited,SBD,M,
Boys,55.79,3,Adrian Lopez,Natalia,53.89,170.1,108.86,210.92,489.88,Unlimited,SBD,M,
Boys,55.79,4,Jose Cruz,San Diego,54.88,165.56,131.54,190.51,487.61,Unlimited,SBD,M,
Boys,55.79,5,Daniel Trevino,San Diego,55.52,174.63,142.88,165.56,483.08,Unlimited,SBD,M,
Boys,55.79,6,Julian Betancourt,Lyford,54.61,165.56,113.4,181.44,460.4,Unlimited,SBD,M,
Boys,55.79,7,Hudson Hunter,Corpus Christi London,55.61,167.83,104.33,174.63,446.79,Unlimited,SBD,M,
Boys,55.79,8,Ayden Benavidez,Corpus Christi London,55.07,165.56,111.13,165.56,442.25,Unlimited,SBD,M,
Boys,55.79,9,Michael Muniz,Goliad,55.16,170.1,95.25,174.63,439.98,Unlimited,SBD,M,
Boys,55.79,10,Jason Vasquez,Corpus Christi London,53.89,158.76,120.2,151.95,430.91,Unlimited,SBD,M,
Boys,55.79,11,Jeriah Cisneros,Odem,55.43,165.56,97.52,167.83,430.91,Unlimited,SBD,M,
Boys,55.79,12,Noah Blevins,Goliad,55.16,165.56,90.72,151.95,408.23,Unlimited,SBD,M,
Boys,59.87,1,Chris Medrano,Dilley,58.15,231.33,145.15,199.58,576.06,Unlimited,SBD,M,
Boys,59.87,2,Sergio Leal,Taft,59.06,217.72,147.42,195.04,560.19,Unlimited,SBD,M,
Boys,59.87,3,Austin Molina,Odem,58.97,197.31,106.59,226.8,530.7,Unlimited,SBD,M,
Boys,59.87,4,Diego Cruz,Santa Rosa,59.24,208.65,131.54,185.97,526.17,Unlimited,SBD,M,
Boys,59.87,5,Adrian Zavala,Crystal City,59.06,192.78,113.4,199.58,505.76,Unlimited,SBD,M,
Boys,59.87,6,Romulo Torres,San Diego,59.6,199.58,99.79,192.78,492.15,Unlimited,SBD,M,
Boys,59.87,7,Austin Wesselski,Corpus Christi London,58.51,167.83,133.81,183.7,485.34,Unlimited,SBD,M,
Boys,59.87,8,Adrian Gutierrez,Crystal City,59.78,190.51,115.67,163.29,469.47,Unlimited,SBD,M,
Boys,59.87,9,Luis Lopez,Hebbronville,58.6,190.51,106.59,170.1,467.2,Unlimited,SBD,M,
Boys,59.87,10,Albert Razo,Lyford,59.78,165.56,115.67,158.76,439.98,Unlimited,SBD,M,
Boys,59.87,NS,Ryan Bailey,Karnes City,,,,,,Unlimited,SBD,M,
Boys,59.87,NS,Esteban Ramirez,Hebbronville,,,,,,Unlimited,SBD,M,
Boys,67.13,1,Ethan Moreno,Lyford,66.5,249.48,172.37,258.55,680.39,Unlimited,SBD,M,
Boys,67.13,2,Rick De Luna,Lyford,65.59,233.6,154.22,219.99,607.81,Unlimited,SBD,M,
Boys,67.13,3,Luke Estrada,Lytle,65.68,229.06,131.54,244.94,605.55,Unlimited,SBD,M,
Boys,67.13,4,Zak Chapa,Corpus Christi London,66.41,231.33,147.42,213.19,591.94,Unlimited,SBD,M,
Boys,67.13,5,Joseph Benavides,Corpus Christi London,65.86,208.65,145.15,222.26,576.06,Unlimited,SBD,M,
Boys,67.13,6,Easton Nguyen,Corpus Christi London,66.5,222.26,136.08,217.72,576.06,Unlimited,SBD,M,
Boys,67.13,7,Marco Benavidez,Cotulla,65.41,219.99,147.42,206.38,573.79,Unlimited,SBD,M,
Boys,67.13,8,Aaron Sanchez,Crystal City,65.95,217.72,120.2,226.8,564.72,Unlimited,SBD,M,
Boys,67.13,9,Giovanni Pacheco,Edinburg Idea College Prep,65.5,217.72,142.88,192.78,553.38,Unlimited,SBD,M,
Boys,67.13,10,Gavin Perez,Rio Hondo,66.32,226.8,120.2,206.38,553.38,Unlimited,SBD,M,
Boys,67.13,11,Henry Anderson,Lyford,65.32,215.46,127.01,201.85,544.31,Unlimited,SBD,M,
Boys,67.13,12,Carlos Medrano,Santa Rosa,66.13,208.65,136.08,199.58,544.31,Unlimited,SBD,M,
Boys,74.84,1,GianCarlo Mirabal,Corpus Christi London,73.21,258.55,197.31,244.94,700.8,Unlimited,SBD,M,
Boys,74.84,2,Jake Le,Corpus Christi London,73.75,265.35,174.63,240.4,680.39,Unlimited,SBD,M,
Boys,74.84,3,Jonavyn Gonzalez,Dilley,73.39,276.69,174.63,226.8,678.12,Unlimited,SBD,M,
Boys,74.84,4,Jayden Ibarra,Poteet,73.03,267.62,140.61,226.8,635.03,Unlimited,SBD,M,
Boys,74.84,5,Aaron Acosta,Mathis,72.67,238.14,158.76,235.87,632.76,Unlimited,SBD,M,
Boys,74.84,6,Andrew Garza,Falfurrias,71.85,226.8,142.88,238.14,607.81,Unlimited,SBD,M,
Boys,74.84,7,Jesus Partida,Cotulla,71.58,226.8,156.49,215.46,598.74,Unlimited,SBD,M,
Boys,74.84,8,Jared Rodriguez,San Diego,73.75,235.87,142.88,215.46,594.21,Unlimited,SBD,M,
Boys,74.84,9,Itzac Cruz,Odem,71.58,204.12,149.69,215.46,569.26,Unlimited,SBD,M,
Boys,74.84,10,Jaiden Maldonado,Crystal City,72.03,215.46,124.74,206.38,546.58,Unlimited,SBD,M,
Boys,74.84,11,Duke Bernal,Mathis,73.21,226.8,136.08,183.7,546.58,Unlimited,SBD,M,
Boys,74.84,DQ,Joseph Villarreal,Monte Alto,72.39,226.8,151.95,,,Unlimited,SBD,M,
Boys,74.84,DQ,Daniel Moncada,Cotulla,72.94,,,,,Unlimited,SBD,M,
Boys,82.1,1,Joseph Hernandez,Jourdanton,80.56,274.42,170.1,242.67,687.19,Unlimited,SBD,M,
Boys,82.1,2,Ayden Garcia,Santa Gertrudis Academy,80.92,265.35,158.76,254.01,678.12,Unlimited,SBD,M,
Boys,82.1,3,John Garcia,Corpus Christi London,79.74,233.6,170.1,238.14,641.83,Unlimited,SBD,M,
Boys,82.1,4,Aiden Rubalcaba,Lyford,80.01,256.28,140.61,226.8,623.69,Unlimited,SBD,M,
Boys,82.1,5,Juan Flores,Santa Rosa,80.92,247.21,149.69,224.53,621.42,Unlimited,SBD,M,
Boys,82.1,6,Joseph Luna,Crystal City,79.65,244.94,151.95,215.46,612.35,Unlimited,SBD,M,
Boys,82.1,7,Chad Rozypal,Corpus Christi London,80.56,235.87,147.42,229.06,612.35,Unlimited,SBD,M,
Boys,82.1,8,Alfredo Gomez,Taft,80.65,219.99,165.56,226.8,612.35,Unlimited,SBD,M,
Boys,82.1,9,Josh Valdez,Goliad,79.83,226.8,149.69,197.31,573.79,Unlimited,SBD,M,
Boys,82.1,10,Aaron Ochoa,Rio Hondo,79.2,217.72,142.88,201.85,562.45,Unlimited,SBD,M,
Boys,82.1,DQ,Eric Sanchez,Crystal City,79.29,,,,,Unlimited,SBD,M,
Boys,82.1,NS,Giovanni Hernandez,Crystal City,,,,,,Unlimited,SBD,M,
Boys,89.81,1,Gerardo Gonzalez,Cotulla,88.18,310.71,215.46,256.28,782.45,Unlimited,SBD,M,
Boys,89.81,2,Mario Diaz,Lytle,89.54,294.84,185.97,288.03,768.84,Unlimited,SBD,M,
Boys,89.81,3,Matthew Jarzombeck,Poth,88.54,238.14,161.03,267.62,666.78,Unlimited,SBD,M,
Boys,89.81,4,Gavin Neville,Poth,87.45,249.48,183.7,229.06,662.24,Unlimited,SBD,M,
Boys,89.81,5,Marcello Nieto,Taft,88.81,256.28,183.7,219.99,659.98,Unlimited,SBD,M,
Boys,89.81,6,Nathan Mendoza,Crystal City,88.99,247.21,151.95,249.48,648.64,Unlimited,SBD,M,
Boys,89.81,7,Joel Villafuerte,Edinburg Idea College Prep,87.72,267.62,138.35,235.87,641.83,Unlimited,SBD,M,
Boys,89.81,8,Damion Trevino,Mathis,85.37,235.87,172.37,229.06,637.3,Unlimited,SBD,M,
Boys,89.81,9,Samuel Lopez,San Antonio Cole,86.55,224.53,142.88,249.48,616.89,Unlimited,SBD,M,
Boys,89.81,10,Langston Strable,Universal City Randolph,87.82,233.6,163.29,213.19,610.08,Unlimited,SBD,M,
Boys,89.81,11,Chase Howell,San Antonio Cole,88.18,219.99,133.81,226.8,580.6,Unlimited,SBD,M,
Boys,89.81,DQ,Jason Ramirez,Odem,87.45,233.6,,,,Unlimited,SBD,M,
Boys,89.81,DQ,Jevin Gonzalez,Cotulla,89.09,226.8,,,,Unlimited,SBD,M,
Boys,99.79,1,Donald Neal Parks,Jourdanton,94.26,283.5,170.1,256.28,709.87,Unlimited,SBD,M,
Boys,99.79,2,Andrew Rendon,Corpus Christi London,91.26,256.28,188.24,254.01,698.53,Unlimited,SBD,M,
Boys,99.79,3,Xavier Tijerina,Jourdanton,97.7,265.35,161.03,251.74,678.12,Unlimited,SBD,M,
Boys,99.79,4,Alex Castro,Lyford,97.25,249.48,172.37,235.87,657.71,Unlimited,SBD,M,
Boys,99.79,5,Luis Buentello,Natalia,97.43,265.35,142.88,224.53,632.76,Unlimited,SBD,M,
Boys,99.79,6,Frank Tovar,Monte Alto,98.43,240.4,142.88,233.6,616.89,Unlimited,SBD,M,
Boys,99.79,7,Wilfred Chapa,Poth,94.98,238.14,156.49,217.72,612.35,Unlimited,SBD,M,
Boys,99.79,8,Alec Arguijo,Poteet,95.89,226.8,131.54,249.48,607.81,Unlimited,SBD,M,
Boys,99.79,9,Jallen Medina,George West,93.08,249.48,158.76,192.78,601.01,Unlimited,SBD,M,
Boys,99.79,10,Seth Dunn,Poteet,94.44,219.99,138.35,204.12,562.45,Unlimited,SBD,M,
Boys,99.79,11,Noe Leos,Rio Hondo,97.89,204.12,145.15,201.85,551.11,Unlimited,SBD,M,
Boys,99.79,DQ,Tony Tamez,Hebbronville,90.99,217.72,136.08,,,Unlimited,SBD,M,
Boys,109.77,1,Dominic Romero,San Diego,109.04,306.17,183.7,272.16,762.04,Unlimited,SBD,M,
Boys,109.77,2,Jordan De La Rosa,Santa Gertrudis Academy,108.41,303.91,192.78,256.28,752.96,Unlimited,SBD,M,
Boys,109.77,3,Leo Herrera,Hebbronville,101.15,258.55,181.44,285.76,725.75,Unlimited,SBD,M,
Boys,109.77,4,Adahir Ruiz,Poth,106.41,263.08,185.97,231.33,680.39,Unlimited,SBD,M,
Boys,109.77,5,Miguel Suarez,Dilley,108.95,267.62,183.7,192.78,644.1,Unlimited,SBD,M,
Boys,109.77,6,Everett Adams,Hondo,101.42,249.48,147.42,226.8,623.69,Unlimited,SBD,M,
Boys,109.77,7,Alexis Salinas #1,Edinburg Idea College Prep,105.6,244.94,131.54,235.87,612.35,Unlimited,SBD,M,
Boys,109.77,8,Jesse Perez,Lyford,103.24,238.14,147.42,204.12,589.67,Unlimited,SBD,M,
Boys,109.77,DQ,Jose Alaniz,Hebbronville,108.23,,,,,Unlimited,SBD,M,
Boys,109.77,DQ,Devin Hernandez,Crystal City,105.51,,,,,Unlimited,SBD,M,
Boys,109.77,DQ,Eduardo Medina,Odem,101.15,,,,,Unlimited,SBD,M,
Boys,109.77,DQ,Marcel Molina,San Diego,102.69,,,,,Unlimited,SBD,M,
Boys,124.74,1,Danilo Lugo,Jourdanton,112.85,349.27,249.48,308.44,907.18,Unlimited,SBD,M,
Boys,124.74,2,Julian Moreno,Santa Rosa,121.65,283.5,204.12,294.84,782.45,Unlimited,SBD,M,
Boys,124.74,3,Ariel Alvarado,San Diego,117.3,317.51,183.7,215.46,716.68,Unlimited,SBD,M,
Boys,124.74,4,Taulepeti Valai,Universal City Randolph,119.02,290.3,204.12,222.26,716.68,Unlimited,SBD,M,
Boys,124.74,5,Daniel Weidner,Poth,121.38,285.76,165.56,251.74,703.07,Unlimited,SBD,M,
Boys,124.74,6,Ray Hernandez,South San Antonio West,112.85,249.48,158.76,213.19,621.42,Unlimited,SBD,M,
Boys,124.74,7,Jake Gonzalez,Lyford,114.76,235.87,140.61,238.14,614.62,Unlimited,SBD,M,
Boys,124.74,8,Isaac Tello,Somerset Brooks Academy,117.12,244.94,142.88,219.99,607.81,Unlimited,SBD,M,
Boys,124.74,DQ,Wes Harris,Universal City Randolph,113.58,231.33,,,,Unlimited,SBD,M,
Boys,124.74,DQ,Nathan Bain,Corpus Christi London,112.85,233.6,,,,Unlimited,SBD,M,
Boys,124.74,DQ,Jonathan Eguia,Dilley,120.56,272.16,,,,Unlimited,SBD,M,
Boys,124.74,DQ,Jaime Vela,Lyford,115.67,,,,,Unlimited,SBD,M,
Boys,124.74,DQ,Alfredo Garza,Rio Hondo,110.95,,,,,Unlimited,SBD,M,
Boys,139.71,1,Robert Sanchez,Cotulla,124.96,353.8,240.4,263.08,857.29,Unlimited,SBD,M,
Boys,139.71,2,Victor Moreno,Cotulla,137.35,272.16,210.92,265.35,748.43,Unlimited,SBD,M,
Boys,139.71,3,Adren Flores,Hebbronville,125.92,288.03,206.38,231.33,725.75,Unlimited,SBD,M,
Boys,139.71,4,Jonathan Carreon,Crystal City,131.54,249.48,210.92,219.99,680.39,Unlimited,SBD,M,
Boys,139.71,5,Fernando Arce,Rio Hondo,131.72,285.76,127.01,213.19,625.96,Unlimited,SBD,M,
Boys,139.71,6,Pedro Lopez,Karnes City,135.99,247.21,113.4,226.8,587.4,Unlimited,SBD,M,
Boys,139.71,7,Wyatt Smith,George West,131.18,233.6,142.88,183.7,560.19,Unlimited,SBD,M,
Boys,139.71,8,Leopaldo Guerra,Santa Gertrudis Academy,136.8,195.04,136.08,190.51,521.63,Unlimited,SBD,M,
Boys,139.71,DQ,David Castaneda,Rio Hondo,132.63,249.48,,,,Unlimited,SBD,M,
Boys,139.71,DQ,Eleazar Reyes,Edinburg Idea College Prep,139.16,,,,,Unlimited,SBD,M,
Boys,139.71,DQ,Raul Molina,Dilley,132.18,,,,,Unlimited,SBD,M,
Boys,139.71,NS,Jj Trevino,San Diego,,,,,,Unlimited,SBD,M,
Boys,139.71,DQ,Gerardo Rios,Santa Rosa,131.54,,,,,Unlimited,SBD,M,
Boys,139.71+,1,Nelson Quintero,Edinburg Idea College Prep,153.22,331.12,210.92,276.69,818.73,Unlimited,SBD,M,
Boys,139.71+,2,Israel Moncada,Crystal City,141.52,326.59,231.33,240.4,798.32,Unlimited,SBD,M,
Boys,139.71+,3,Juan Villegas,Rio Hondo,155.49,272.16,176.9,258.55,707.6,Unlimited,SBD,M,
Boys,139.71+,4,Damian Trejo,Lyford,162.39,290.3,145.15,272.16,707.6,Unlimited,SBD,M,
Boys,139.71+,5,Adrian Betancourt,Rio Hondo,142.52,260.82,163.29,219.99,644.1,Unlimited,SBD,M,
Boys,139.71+,6,Miguel Chavarria,Rio Hondo,146.24,235.87,142.88,244.94,623.69,Unlimited,SBD,M,
Boys,139.71+,7,Michael Canchola,Aransas Pass,142.34,238.14,167.83,185.97,591.94,Unlimited,SBD,M,
Boys,139.71+,8,Kevin Garner,Aransas Pass,167.74,229.06,149.69,167.83,546.58,Unlimited,SBD,M,
Boys,139.71+,9,Lupito Vela,Goliad,141.88,158.76,129.27,158.76,446.79,Unlimited,SBD,M,
Boys,139.71+,10,Seay Clark,Karnes City,149.23,147.42,74.84,158.76,381.02,Unlimited,SBD,M,
Boys,139.71+,DQ,Cooper Molitor,Hondo,159.85,,,,,Unlimited,SBD,M,
Boys,139.71+,DQ,Eric Rodriguez,Dilley,140.25,,,,,Unlimited,SBD,M,
