Division,WeightClassKg,Place,Name,Team,BodyweightKg,Best3SquatKg,Best3BenchKg,Best3DeadliftKg,TotalKg,Equipment,Event,Sex
Boys,55.79,1,Jesse Ramirez #2,San Angelo Lake View,51.8,136.08,86.18,158.76,381.02,Single-ply,SBD,M
Boys,51.71,2,Chris Rodriguez,Iraan,49.9,140.61,86.18,131.54,358.34,Single-ply,SBD,M
Boys,55.79,3,Gabe Garcia,Midland,51.94,131.54,72.57,151.95,356.07,Single-ply,SBD,M
Boys,51.71,4,Edward Hernandez,Eldorado,50.35,145.15,68.04,129.27,342.46,Single-ply,SBD,M
Boys,51.71,5,Gunnar McNeill,San Angelo Grape Creek,50.89,124.74,61.23,113.4,299.37,Single-ply,SBD,M
Boys,51.71,6,Daniel Valenzuela,Pecos,50.8,117.93,54.43,115.67,288.03,Single-ply,SBD,M
Boys,51.71,7,Nathaniel Martinez,Loraine,50.89,104.33,61.23,113.4,278.96,Single-ply,SBD,M
Boys,51.71,8,Marco Sandate,San Angelo Lake View,48.08,102.06,52.16,111.13,265.35,Single-ply,SBD,M
Boys,55.79,9,Jose Hernandez #2,Midland Greenwood,51.8,99.79,52.16,113.4,265.35,Single-ply,SBD,M
Boys,51.71,10,Van Phan,Alpine,48.53,95.25,56.7,111.13,263.08,Single-ply,SBD,M
Boys,51.71,11,Kobe Roberson,Big Lake Reagan County,51.26,124.74,47.63,83.91,256.28,Single-ply,SBD,M
Boys,51.71,12,Brandon Gilmore,Alpine,51.26,88.45,49.9,99.79,238.14,Single-ply,SBD,M
Boys,51.71,DQ,David Valdez,Eden,51.71,,,,,Single-ply,SBD,M
Boys,51.71,DQ,Zack Martin,Midland Greenwood,51.71,,,,,Single-ply,SBD,M
Boys,51.71,DQ,Eric Garcia,Sonora,51.71,,,,,Single-ply,SBD,M
Boys,55.79,1,Ryan Hurst,San Angelo Grape Creek,55.34,156.49,65.77,154.22,376.48,Single-ply,SBD,M
Boys,55.79,2,Tomas Vega,Alpine,52.62,140.61,74.84,154.22,369.68,Single-ply,SBD,M
Boys,59.87,3,Nick Ybarra,Pecos,55.88,140.61,77.11,131.54,349.27,Single-ply,SBD,M
Boys,59.87,4,Mario Manquero,Garden City,55.88,131.54,77.11,138.35,347,Single-ply,SBD,M
Boys,55.79,5,Esteban Garcia,Sonora,53.98,124.74,86.18,131.54,342.46,Single-ply,SBD,M
Boys,55.79,6,Joseph Campos,Midland,54.34,124.74,61.23,136.08,322.05,Single-ply,SBD,M
Boys,59.87,7,Brandon Kinnard,Hawley,55.97,120.2,61.23,117.93,299.37,Single-ply,SBD,M
Boys,55.79,8,Billy Avila,Big Lake Reagan County,54.43,111.13,58.97,117.93,288.03,Single-ply,SBD,M
Boys,55.79,9,Lorenzo Garcia,San Angelo Lake View,53.52,99.79,56.7,129.27,285.76,Single-ply,SBD,M
Boys,55.79,10,Jacob Schults,San Angelo Grape Creek,52.44,102.06,49.9,111.13,263.08,Single-ply,SBD,M
Boys,55.79,11,Taylor White,San Angelo Grape Creek,54.98,99.79,56.7,102.06,258.55,Single-ply,SBD,M
Boys,55.79,DQ,Zach Hernandez,Big Spring,55.79,,,,,Single-ply,SBD,M
Boys,55.79,DQ,Jacob Rizo,Colorado City Colorado,55.79,,,,,Single-ply,SBD,M
Boys,55.79,DQ,Stephen Seely,San Angelo Lake View,55.79,,,,,Single-ply,SBD,M
Boys,59.87,1,Austin Martinez,Mertzon Irion County,59.87,195.04,99.79,167.83,462.66,Single-ply,SBD,M
Boys,59.87,2,Michael Vargas,Ozona,58.06,161.03,74.84,156.49,392.36,Single-ply,SBD,M
Boys,59.87,3,Alfredo Gonzalez,Seminole,58.42,147.42,86.18,151.95,385.55,Single-ply,SBD,M
Boys,59.87,4,Brandon Mireles,San Angelo Lake View,59.87,147.42,72.57,151.95,371.95,Single-ply,SBD,M
Boys,59.87,5,Justin Workman,Pecos,57.79,131.54,81.65,149.69,362.87,Single-ply,SBD,M
Boys,59.87,6,Tyler Pacheco,San Angelo Lake View,58.79,140.61,72.57,142.88,356.07,Single-ply,SBD,M
Boys,59.87,7,Julio Dominguez,San Angelo Lake View,59.51,108.86,79.38,167.83,356.07,Single-ply,SBD,M
Boys,59.87,8,Victor Muro,San Angelo Lake View,59.78,117.93,83.91,151.95,353.8,Single-ply,SBD,M
Boys,59.87,9,Julian Uranga,Coahoma,59.87,129.27,77.11,147.42,353.8,Single-ply,SBD,M
Boys,59.87,10,Rodrigo Saldania,San Angelo Grape Creek,59.69,129.27,70.31,151.95,351.53,Single-ply,SBD,M
Boys,59.87,11,Mitchell Newcomer,Alpine,57.52,136.08,70.31,136.08,342.46,Single-ply,SBD,M
Boys,59.87,12,Bailey Espinosa,Eldorado,56.7,129.27,63.5,131.54,324.32,Single-ply,SBD,M
Boys,59.87,13,Anthony Moreno,San Angelo Lake View,57.61,97.52,63.5,133.81,294.84,Single-ply,SBD,M
Boys,59.87,DQ,Luke Humble,Coahoma,59.87,,,,,Single-ply,SBD,M
Boys,59.87,DQ,Bryce DeVore,Hawley,59.87,,,,,Single-ply,SBD,M
Boys,59.87,DQ,Luis Marquez,Big Lake Reagan County,59.87,,,,,Single-ply,SBD,M
Boys,67.13,1,Brett DeVore,Hawley,66.59,226.8,113.4,226.8,566.99,Single-ply,SBD,M
Boys,67.13,2,Cesar Chavez,Midland,66.5,174.63,88.45,195.04,458.13,Single-ply,SBD,M
Boys,67.13,3,Robert Clanton,Midland Greenwood,66.95,172.37,92.99,183.7,449.06,Single-ply,SBD,M
Boys,74.84,4,Daniel Perez,McCamey,67.31,179.17,86.18,183.7,449.06,Single-ply,SBD,M
Boys,67.13,5,Trey Cave,Midland Greenwood,64.5,165.56,102.06,165.56,433.18,Single-ply,SBD,M
Boys,67.13,6,Hunter Sykes,San Angelo Lake View,65.95,163.29,97.52,167.83,428.64,Single-ply,SBD,M
Boys,67.13,7,Martin Zambrano,Big Spring,65.77,163.29,97.52,163.29,424.11,Single-ply,SBD,M
Boys,67.13,8,Lazaro Herrera,Ballinger,61.96,151.95,90.72,163.29,405.97,Single-ply,SBD,M
Boys,67.13,9,Dario Alvarez,Pecos,66.22,151.95,86.18,161.03,399.16,Single-ply,SBD,M
Boys,67.13,10,Greg McIntyre,Eden,64.41,131.54,95.25,163.29,390.09,Single-ply,SBD,M
Boys,67.13,11,Aaron Castillo,Rankin,66.32,136.08,99.79,147.42,383.29,Single-ply,SBD,M
Boys,67.13,12,Jaden Hatley,Seminole,61.14,151.95,72.57,147.42,371.95,Single-ply,SBD,M
Boys,67.13,13,Jimmy Miller,Alpine,60.24,133.81,77.11,145.15,356.07,Single-ply,SBD,M
Boys,67.13,14,Lane Storie,Rankin,62.32,136.08,79.38,136.08,351.53,Single-ply,SBD,M
Boys,67.13,15,Marc Cantu,Alpine,60.51,113.4,56.7,145.15,315.25,Single-ply,SBD,M
Boys,67.13,16,Mathew Hartunian,Alpine,65.77,99.79,68.04,127.01,294.84,Single-ply,SBD,M
Boys,67.13,DQ,Taylor Robertson,Big Spring,66.41,136.08,70.31,,,Single-ply,SBD,M
Boys,67.13,DQ,Luis Rangel,Ballinger,67.13,,,,,Single-ply,SBD,M
Boys,67.13,DQ,Jeremy Curtis,Mertzon Irion County,67.13,,,,,Single-ply,SBD,M
Boys,67.13,DQ,Caleb Saldavar,San Angelo Grape Creek,67.13,,,,,Single-ply,SBD,M
Boys,67.13,DQ,Nathan Burrage,Sonora,67.13,,,,,Single-ply,SBD,M
Boys,74.84,1,Jorge Castillo,Rankin,74.57,204.12,151.95,226.8,582.87,Single-ply,SBD,M
Boys,74.84,2,Justin Coker,Coahoma,69.76,197.31,122.47,208.65,528.44,Single-ply,SBD,M
Boys,82.1,3,Blaze Wooten,Midland,75.02,195.04,104.33,217.72,517.1,Single-ply,SBD,M
Boys,74.84,4,Jesus Ramirez,Midland,74.21,183.7,108.86,185.97,478.54,Single-ply,SBD,M
Boys,74.84,5,Luis Juarez,Midland,74.39,170.1,97.52,192.78,460.4,Single-ply,SBD,M
Boys,82.1,6,Stetson Hilger,Midland Greenwood,75.02,158.76,120.2,167.83,446.79,Single-ply,SBD,M
Boys,74.84,7,Preston Lopez,Sonora,73.03,147.42,136.08,156.49,439.98,Single-ply,SBD,M
Boys,74.84,8,Angel Moreno,San Angelo Lake View,73.12,167.83,104.33,163.29,435.45,Single-ply,SBD,M
Boys,74.84,9,Aaron Castillo,Pecos,71.67,167.83,90.72,172.37,430.91,Single-ply,SBD,M
Boys,74.84,10,Cody Huelsberg,Alpine,71.67,170.1,95.25,165.56,430.91,Single-ply,SBD,M
Boys,74.84,11,Robert Thomas,Alpine,74.66,136.08,102.06,181.44,419.57,Single-ply,SBD,M
Boys,74.84,12,Ramon Juarez,Seminole,67.59,158.76,88.45,156.49,403.7,Single-ply,SBD,M
Boys,74.84,13,Oscar Hernandez #4,Pecos,71.67,149.69,90.72,142.88,383.29,Single-ply,SBD,M
Boys,74.84,14,Devon Hoelscher,Ballinger,70.31,151.95,81.65,147.42,381.02,Single-ply,SBD,M
Boys,74.84,15,Philip Rader,Mertzon Irion County,73.48,120.2,65.77,142.88,328.85,Single-ply,SBD,M
Boys,74.84,DQ,Donavon Rodriguez,Pecos,74.84,,,,,Single-ply,SBD,M
Boys,74.84,DQ,Ricky Rushenburge,San Angelo Grape Creek,67.68,,68.04,,,Single-ply,SBD,M
Boys,74.84,DQ,Christian Salas,Rocksprings,74.84,,,,,Single-ply,SBD,M
Boys,74.84,DQ,Micheal Gutierrez,Rocksprings,74.84,,,,,Single-ply,SBD,M
Boys,74.84,DQ,Fernando Saucedo,Big Lake Reagan County,74.84,,,,,Single-ply,SBD,M
Boys,74.84,DQ,Mark Martinez,Mertzon Irion County,74.84,,,,,Single-ply,SBD,M
Boys,74.84,DQ,Jj Casarez,McCamey,74.84,,,,,Single-ply,SBD,M
Boys,74.84,DQ,Micheal Chavez,Sonora,74.84,,,,,Single-ply,SBD,M
Boys,74.84,DQ,Erasmo Esquivel,Sonora,74.84,,,,,Single-ply,SBD,M
Boys,82.1,1,Cole Barton #3,Midland Greenwood,80.2,240.4,142.88,215.46,598.74,Single-ply,SBD,M
Boys,82.1,2,Efrain Vasquez,Midland,81.65,238.14,129.27,219.99,587.4,Single-ply,SBD,M
Boys,82.1,3,Peyton Rodriguez,Coahoma,79.74,199.58,129.27,199.58,528.44,Single-ply,SBD,M
Boys,82.1,4,Levi Irby,Hawley,81.83,204.12,113.4,204.12,521.63,Single-ply,SBD,M
Boys,89.81,5,Justin Thornton,Pecos,82.19,188.24,122.47,206.38,517.1,Single-ply,SBD,M
Boys,89.81,6,Conrad Duran,San Angelo Lake View,82.28,188.24,117.93,190.51,496.68,Single-ply,SBD,M
Boys,82.1,7,Jesse Daniels,Ballinger,79.56,181.44,113.4,195.04,489.88,Single-ply,SBD,M
Boys,82.1,8,Ryan Thomas,Rankin,81.56,188.24,111.13,183.7,483.08,Single-ply,SBD,M
Boys,82.1,9,Adam Moncibais,Snyder,80.74,181.44,113.4,172.37,467.2,Single-ply,SBD,M
Boys,82.1,10,Dallas Escovedo,Alpine,76.2,149.69,122.47,172.37,444.52,Single-ply,SBD,M
Boys,89.81,11,Taylor Edwards,Seminole,82.28,165.56,95.25,154.22,415.04,Single-ply,SBD,M
Boys,82.1,12,Trenton Gardner,Big Lake Reagan County,76.66,174.63,79.38,154.22,408.23,Single-ply,SBD,M
Boys,82.1,13,Adrian Revell,San Angelo Grape Creek,76.38,147.42,90.72,154.22,392.36,Single-ply,SBD,M
Boys,82.1,DQ,Efren Rodriguez,San Angelo Grape Creek,81.01,156.49,99.79,,,Single-ply,SBD,M
Boys,82.1,DQ,Andrew Navarette,Pecos,82.1,,,,,Single-ply,SBD,M
Boys,82.1,DQ,Rojelio Valenzuela,Midland,82.1,,,,,Single-ply,SBD,M
Boys,82.1,DQ,Dylan Ortega,Mertzon Irion County,82.1,,,,,Single-ply,SBD,M
Boys,82.1,DQ,Jimmy Cruz,Coahoma,82.1,,,,,Single-ply,SBD,M
Boys,82.1,DQ,Rodarte Marcos,San Angelo Grape Creek,82.1,,,,,Single-ply,SBD,M
Boys,89.81,1,Ramiro Reyes,Colorado City Colorado,88.27,240.4,158.76,247.21,646.37,Single-ply,SBD,M
Boys,89.81,2,Marquise Clater,Midland,88.45,260.82,136.08,224.53,621.42,Single-ply,SBD,M
Boys,89.81,3,Miguel Lopez #5,Big Lake Reagan County,88.91,192.78,92.99,238.14,523.9,Single-ply,SBD,M
Boys,89.81,4,Jorge Gayton,Sonora,86.73,204.12,122.47,183.7,510.29,Single-ply,SBD,M
Boys,89.81,5,Josh Klingel,Hawley,87.63,226.8,102.06,158.76,487.61,Single-ply,SBD,M
Boys,89.81,6,Austin Sellers,Hawley,87.09,181.44,120.2,181.44,483.08,Single-ply,SBD,M
Boys,89.81,7,Kyle Treadwell,Pecos,87.54,154.22,97.52,172.37,424.11,Single-ply,SBD,M
Boys,89.81,8,Nick Ramirez,San Angelo Lake View,87.36,154.22,99.79,154.22,408.23,Single-ply,SBD,M
Boys,89.81,DQ,Joedward Gomez,Pecos,83.01,204.12,,,,Single-ply,SBD,M
Boys,89.81,DQ,Johnathan Passaron,Midland,89.81,,,,,Single-ply,SBD,M
Boys,89.81,DQ,Johnathon Paredes,Sonora,89.81,,,,,Single-ply,SBD,M
Boys,99.79,1,Gerald Williams,San Angelo Grape Creek,98.7,260.82,127.01,240.4,628.23,Single-ply,SBD,M
Boys,99.79,2,Aaron Allen #2,San Angelo Lake View,99.25,240.4,122.47,251.74,614.62,Single-ply,SBD,M
Boys,109.77,3,Shaquille Walters,Midland Greenwood,99.88,217.72,124.74,213.19,555.65,Single-ply,SBD,M
Boys,99.79,4,Anthony Rubio,Midland,92.99,183.7,113.4,217.72,514.83,Single-ply,SBD,M
Boys,99.79,5,Roman Romero,Snyder,96.62,192.78,124.74,185.97,503.49,Single-ply,SBD,M
Boys,99.79,6,Chris Garza #4,Snyder,90.72,174.63,124.74,176.9,476.27,Single-ply,SBD,M
Boys,99.79,7,Esteban Gallegos,Ballinger,93.35,165.56,108.86,158.76,433.18,Single-ply,SBD,M
Boys,99.79,8,Alex Urias,Midland,90.26,156.49,102.06,172.37,430.91,Single-ply,SBD,M
Boys,99.79,9,Auggie Woodruff,Ballinger,91.44,181.44,108.86,136.08,426.38,Single-ply,SBD,M
Boys,99.79,10,Eddie Fuentes,Pecos,95.71,161.03,90.72,172.37,424.11,Single-ply,SBD,M
Boys,99.79,11,Jordan Dyck,Seminole,98.16,154.22,111.13,149.69,415.04,Single-ply,SBD,M
Boys,99.79,12,Andrew Johnson #8,Seminole,94.71,149.69,72.57,151.95,374.21,Single-ply,SBD,M
Boys,99.79,13,Leslie Belaire,Pecos,99.34,129.27,95.25,122.47,347,Single-ply,SBD,M
Boys,99.79,14,Preston Rodriguez,Eldorado,97.34,113.4,70.31,113.4,297.1,Single-ply,SBD,M
Boys,99.79,DQ,Riley Woodruff,Ballinger,94.62,192.78,104.33,,,Single-ply,SBD,M
Boys,99.79,DQ,Anthony McCarson,San Angelo Grape Creek,98.07,174.63,97.52,,,Single-ply,SBD,M
Boys,99.79,DQ,Kyle Patlan,Sonora,99.79,,,,,Single-ply,SBD,M
Boys,99.79,DQ,Diamond Bailey,Big Spring,99.79,,,,,Single-ply,SBD,M
Boys,99.79,DQ,Brandon McIntyre #2,Eden,99.79,,,,,Single-ply,SBD,M
Boys,99.79,DQ,Lionel Sanchez,Midland,99.79,,,,,Single-ply,SBD,M
Boys,99.79,DQ,Austin Davidson,Mertzon Irion County,99.79,,,,,Single-ply,SBD,M
Boys,124.74,1,George Vela,Eden,110,247.21,124.74,226.8,598.74,Single-ply,SBD,M
Boys,109.77,2,Coy Carney,San Angelo Grape Creek,102.15,188.24,122.47,208.65,519.36,Single-ply,SBD,M
Boys,109.77,3,Angel Aguilera,Big Lake Reagan County,108.86,226.8,111.13,174.63,512.56,Single-ply,SBD,M
Boys,109.77,4,Osbauldo Castaneda,Sonora,103.69,204.12,122.47,176.9,503.49,Single-ply,SBD,M
Boys,109.77,5,Richard Woods,Pecos,100.97,183.7,115.67,199.58,498.95,Single-ply,SBD,M
Boys,109.77,6,Anastacio Rodriguez,Pecos,107.5,183.7,124.74,170.1,478.54,Single-ply,SBD,M
Boys,109.77,7,Jaime Melendez,Pecos,100.61,174.63,113.4,179.17,467.2,Single-ply,SBD,M
Boys,109.77,8,Davorian Marion,Midland,106.68,195.04,92.99,156.49,444.52,Single-ply,SBD,M
Boys,109.77,9,Rudy Brito,Coahoma,103.42,190.51,79.38,167.83,437.72,Single-ply,SBD,M
Boys,109.77,10,Brandon Lujan,Seminole,109.32,213.19,108.86,,322.05,Single-ply,SB,M
Boys,109.77,DQ,Jose Gallegos,Ballinger,101.15,149.69,120.2,,,Single-ply,SB,M
Boys,109.77,DQ,Brandon Vasquez,Ballinger,109.77,,,,,Single-ply,SB,M
Boys,109.77,DQ,Jacob Anderson,Crane,109.77,,,,,Single-ply,SB,M
Boys,109.77,DQ,Derek Means,Crane,109.77,,,,,Single-ply,SB,M
Boys,109.77,DQ,Chris Vargas,Midland,109.77,,,,,Single-ply,SB,M
Boys,109.77,DQ,Rendon Chris,Sonora,109.77,,,,,Single-ply,SB,M
Boys,124.74,1,Fabian Gutierrez,Colorado City Colorado,123.56,256.28,147.42,240.4,644.1,Single-ply,SBD,M
Boys,124.74,2,Devon Davis-Locke,Big Spring,121.47,254.01,163.29,219.99,637.3,Single-ply,SBD,M
Boys,124.74,3,Ricky Ciuba,Mertzon Irion County,115.3,249.48,149.69,231.33,630.49,Single-ply,SBD,M
Boys,124.74,4,Tanner Holt,San Angelo Grape Creek,122.47,226.8,154.22,244.94,625.96,Single-ply,SBD,M
Boys,124.74,5,Michael Molina,McCamey,113.22,272.16,136.08,206.38,614.62,Single-ply,SBD,M
Boys,124.74,6,Dustin Fontana,Coahoma,111.13,213.19,136.08,215.46,564.72,Single-ply,SBD,M
Boys,124.74,7,Cagen Chaney,Iraan,118.12,231.33,120.2,213.19,564.72,Single-ply,SBD,M
Boys,124.74,8,Eric Villegas,Midland,113.76,235.87,106.59,217.72,560.19,Single-ply,SBD,M
Boys,124.74,9,Jacob Wylie,Big Spring,116.48,226.8,136.08,185.97,548.85,Single-ply,SBD,M
Boys,124.74,10,James Martinez #4,Midland,124.74,226.8,115.67,204.12,546.58,Single-ply,SBD,M
Boys,124.74,11,Caleb Wrinkle,Rankin,116.75,197.31,104.33,219.99,521.63,Single-ply,SBD,M
Boys,124.74,12,Grant Canis,Midland,118.84,219.99,97.52,197.31,514.83,Single-ply,SBD,M
Boys,124.74,13,Quade Huckaba,Midland,124.74,204.12,106.59,199.58,510.29,Single-ply,SBD,M
Boys,124.74,14,John Paul Galan,Eldorado,112.94,199.58,102.06,163.29,464.93,Single-ply,SBD,M
Boys,124.74,15,David Mejia,Coahoma,119.48,188.24,90.72,181.44,460.4,Single-ply,SBD,M
Boys,124.74,16,Isaiah Natividad,Pecos,116.21,185.97,106.59,158.76,451.32,Single-ply,SBD,M
Boys,124.74,DQ,Cj Casas,Snyder,115.21,226.8,,,,Single-ply,SBD,M
Boys,124.74,DQ,Xavier Spurlock,Rocksprings,124.74,,,,,Single-ply,SBD,M
Boys,124.74,DQ,Chris Nunez,Big Spring,124.74,,,,,Single-ply,SBD,M
Boys,124.74+,1,Brayden Newcomb,Hawley,127.82,294.84,142.88,249.48,687.19,Single-ply,SBD,M
Boys,124.74+,2,Sawyer Roberts,Big Spring,176.9,244.94,136.08,249.48,630.49,Single-ply,SBD,M
Boys,124.74+,3,Cristian Venegas,Crane,134.08,249.48,161.03,201.85,612.35,Single-ply,SBD,M
Boys,124.74+,4,John Espinosa,Eldorado,152.41,254.01,151.95,190.51,596.47,Single-ply,SBD,M
Boys,124.74+,5,Tyler Ramos,Pecos,141.52,258.55,115.67,199.58,573.79,Single-ply,SBD,M
Boys,124.74+,6,Emmitt Spurlock,Rocksprings,125.92,219.99,140.61,204.12,564.72,Single-ply,SBD,M
Boys,124.74+,7,Nicolas Franco,Pecos,139.71,217.72,133.81,188.24,539.77,Single-ply,SBD,M
Boys,124.74+,8,James Marroquin,San Angelo Lake View,139.25,206.38,120.2,199.58,526.17,Single-ply,SBD,M
Boys,124.74+,9,Mike Villareal,Coahoma,180.08,242.67,95.25,176.9,514.83,Single-ply,SBD,M
Boys,124.74+,10,Damien Venegas,McCamey,127.46,167.83,92.99,161.03,421.84,Single-ply,SBD,M
Boys,124.74+,DQ,Antonio Flores,Big Lake Reagan County,128.82,192.78,,,,Single-ply,SBD,M
Boys,124.74+,DQ,Louis Rodriguez,Pecos,129.27,,,,,Single-ply,SBD,M
