Division,WeightClassKg,Place,Name,Team,BodyweightKg,Best3SquatKg,Best3BenchKg,Best3DeadliftKg,TotalKg,Equipment,Event,Sex,BirthDate
Boys,51.71,1,Braylon Porrel,Carrollton Ranchview,51.57,133.81,83.91,154.22,371.95,Unlimited,SBD,M,
Boys,51.71,2,David Lopez,Coppell,51.26,129.27,74.84,163.29,367.41,Unlimited,SBD,M,
Boys,59.87,1,Tyler Robinson,Dallas Hillcrest,59.42,129.27,81.65,179.17,390.09,Unlimited,SBD,M,
Boys,59.87,2,Sammy Parada,Coppell,59.42,129.27,72.57,161.03,362.87,Unlimited,SBD,M,
Boys,67.13,1,Raymond Jackson,Carrollton Creekview,66.68,174.63,113.4,183.7,471.74,Unlimited,SBD,M,
Boys,67.13,2,David Benagh,Carrollton Creekview,66.22,172.37,108.86,176.9,458.13,Unlimited,SBD,M,
Boys,74.84,1,Cay Golden,Coppell,74.39,233.6,127.01,254.01,614.62,Unlimited,SBD,M,
Boys,74.84,2,Jaedan Lester,Carrollton Ranchview,72.57,181.44,117.93,206.38,505.76,Unlimited,SBD,M,
Boys,74.84,3,Hooman Setayesh,Carrollton Ranchview,72.57,179.17,111.13,206.38,496.68,Unlimited,SBD,M,
Boys,82.1,1,Dre Richardson,Carrollton Creekview,81.65,213.19,142.88,192.78,548.85,Unlimited,SBD,M,
Boys,82.1,2,Mason Eldridge,Carrollton Ranchview,79.83,174.63,92.99,174.63,442.25,Unlimited,SBD,M,
Boys,89.81,1,Julian Fitzgerald,Coppell,89.36,231.33,161.03,235.87,628.23,Unlimited,SBD,M,
Boys,89.81,2,DaMarcus Cannon,Carrollton Creekview,88.45,229.06,142.88,229.06,601.01,Unlimited,SBD,M,
Boys,99.79,1,Garvey Frederic,Coppell,98.88,272.16,158.76,233.6,664.51,Unlimited,SBD,M,
Boys,99.79,2,Chris Searcy,Coppell,98.43,215.46,142.88,219.99,578.33,Unlimited,SBD,M,
Boys,99.79,3,Uche Odimegwu,Coppell,98.88,181.44,129.27,197.31,508.02,Unlimited,SBD,M,
Boys,109.77,1,Destin Deans,Carrollton Creekview,108.86,210.92,158.76,249.48,619.15,Unlimited,SBD,M,
Boys,109.77,2,Jacob Reyes,Coppell,108.86,238.14,124.74,238.14,601.01,Unlimited,SBD,M,
Boys,109.77,3,Blake Isbell,Coppell,108.86,215.46,142.88,231.33,589.67,Unlimited,SBD,M,
Boys,139.71,1,Chris Williams,Carrollton Ranchview,128,242.67,154.22,242.67,639.57,Unlimited,SBD,M,
Boys,139.71,2,Travis Chinamhora,Carrollton Creekview,139.25,244.94,176.9,204.12,625.96,Unlimited,SBD,M,
Boys,139.71,3,Khalil Johnson,Carrollton Ranchview,131.54,215.46,145.15,190.51,551.11,Unlimited,SBD,M,
Boys,139.71,4,Matthew Phillips,Carrollton Creekview,139.25,181.44,122.47,201.85,505.76,Unlimited,SBD,M,
Boys,139.71+,1,Jordan Stafford,Coppell,141.52,226.8,145.15,197.31,569.26,Unlimited,SBD,M,
Boys,139.71+,2,Jaxon Ary,Carrollton Creekview,140.61,215.46,142.88,199.58,557.92,Unlimited,SBD,M,
Boys,139.71+,3,Adrian Gonzales,Carrollton Ranchview,156.94,167.83,90.72,199.58,458.13,Unlimited,SBD,M,
