\relax 
\providecommand\hyper@newdestlabel[2]{}
\providecommand\HyperFirstAtBeginDocument{\AtBeginDocument}
\HyperFirstAtBeginDocument{\ifx\hyper@anchor\@undefined
\global\let\oldcontentsline\contentsline
\gdef\contentsline#1#2#3#4{\oldcontentsline{#1}{#2}{#3}}
\global\let\oldnewlabel\newlabel
\gdef\newlabel#1#2{\newlabelxx{#1}#2}
\gdef\newlabelxx#1#2#3#4#5#6{\oldnewlabel{#1}{{#2}{#3}}}
\AtEndDocument{\ifx\hyper@anchor\@undefined
\let\contentsline\oldcontentsline
\let\newlabel\oldnewlabel
\fi}
\fi}
\global\let\hyper@last\relax 
\gdef\HyperFirstAtBeginDocument#1{#1}
\providecommand\HyField@AuxAddToFields[1]{}
\providecommand\HyField@AuxAddToCoFields[2]{}
\citation{stachenfeld2017hippocampus}
\citation{andersen2006hippocampus}
\citation{o1978hippocampus}
\citation{andersen2006hippocampus}
\providecommand \oddpage@label [2]{}
\@writefile{toc}{\contentsline {title}{Investigation of the successor representation for neuro-computational models of the hippocampus\unskip {}}{1}{chapter.1}\protected@file@percent }
\@writefile{toc}{\authcount {2}}
\@writefile{toc}{\contentsline {author}{ Romain Ferrand  \and Julien Vitay  }{1}{chapter.1}\protected@file@percent }
\@writefile{toc}{\contentsline {section}{Introduction}{1}{section*.2}\protected@file@percent }
\citation{hafting2005microstructure}
\citation{fyhn2007hippocampal}
\citation{POUCET201751}
\citation{POUCET201751}
\citation{carr2011hippocampal}
\citation{carr2011hippocampal}
\citation{carr2011hippocampal}
\citation{stachenfeld2017hippocampus}
\citation{stachenfeld2017hippocampus}
\citation{dayan1993improving}
\@writefile{toc}{\contentsline {subsection}{Place-cells and place-fields}{2}{section*.3}\protected@file@percent }
\@writefile{toc}{\contentsline {subsection}{Place-cells and the goal encoding problem}{2}{section*.4}\protected@file@percent }
\@writefile{toc}{\contentsline {subsection}{Predictive hippocampus and successor representation}{2}{section*.6}\protected@file@percent }
\citation{sutton2011reinforcement}
\@writefile{lof}{\contentsline {figure}{\numberline {1}{\ignorespaces From \cite  {carr2011hippocampal} experienced place-cells are re-activated in sequence during forward and backward replay\relax }}{3}{figure.caption.5}\protected@file@percent }
\providecommand*\caption@xref[2]{\@setref\relax\@undefined{#1}}
\newlabel{fig:replay_hippo}{{1}{3}{From \cite {carr2011hippocampal} experienced place-cells are re-activated in sequence during forward and backward replay\relax }{figure.caption.5}{}}
\@writefile{toc}{\contentsline {subsection}{Successor representation and limitations}{3}{section*.7}\protected@file@percent }
\@writefile{toc}{\contentsline {section}{\numberline {1}Reinforcement learning introduction}{3}{section.1.1}\protected@file@percent }
\newlabel{RL}{{1}{3}{Reinforcement learning introduction}{section.1.1}{}}
\@writefile{toc}{\contentsline {subsection}{\numberline {1.1}Markov decision process}{4}{subsection.1.1.1}\protected@file@percent }
\@writefile{toc}{\contentsline {subsubsection}{Finite Markov decision process}{4}{section*.8}\protected@file@percent }
\@writefile{lof}{\contentsline {figure}{\numberline {2}{\ignorespaces Markov decision process\relax }}{4}{figure.caption.9}\protected@file@percent }
\newlabel{fig:MDP}{{2}{4}{Markov decision process\relax }{figure.caption.9}{}}
\@writefile{toc}{\contentsline {subsubsection}{Optimal control problem}{5}{section*.10}\protected@file@percent }
\@writefile{toc}{\contentsline {subsubsection}{State-value and action-value functions}{5}{section*.11}\protected@file@percent }
\citation{mnih2015human}
\citation{glimcher2011understanding}
\@writefile{toc}{\contentsline {subsection}{\numberline {1.2}Approximation of states}{6}{subsection.1.1.2}\protected@file@percent }
\@writefile{toc}{\contentsline {subsection}{\numberline {1.3}Solving methods for MDPs}{6}{subsection.1.1.3}\protected@file@percent }
\@writefile{toc}{\contentsline {subsubsection}{Temporal difference learning}{6}{section*.12}\protected@file@percent }
\citation{khamassi2005actor}
\citation{mnih2016asynchronous}
\citation{sutton2011reinforcement}
\citation{sutton2011reinforcement}
\@writefile{toc}{\contentsline {subsubsection}{Actor-Critic methods}{7}{section*.13}\protected@file@percent }
\@writefile{toc}{\contentsline {paragraph}{Policy gradient methods}{7}{section*.14}\protected@file@percent }
\citation{aarts2000habits}
\citation{doll2012ubiquity}
\citation{miller2019habits}
\citation{dayan1993improving}
\citation{gershman2012successor}
\citation{momennejad2012human}
\citation{stachenfeld2017hippocampus}
\citation{russek2017predictive}
\citation{gershman2018successor}
\@writefile{toc}{\contentsline {subsubsection}{Model-based methods}{8}{section*.15}\protected@file@percent }
\@writefile{toc}{\contentsline {section}{\numberline {2}Successor representation}{8}{section.1.2}\protected@file@percent }
\newlabel{SR}{{2}{8}{Successor representation}{section.1.2}{}}
\@writefile{toc}{\contentsline {subsection}{\numberline {2.1}Motivation}{8}{subsection.1.2.1}\protected@file@percent }
\@writefile{toc}{\contentsline {subsection}{\numberline {2.2}Formalization}{8}{subsection.1.2.2}\protected@file@percent }
\citation{russek2017predictive}
\citation{gershman2012successor}
\citation{Momennejad449470}
\citation{Momennejad449470}
\citation{shankar2013optimally}
\citation{post1930generalized}
\@writefile{toc}{\contentsline {subsection}{\numberline {2.3}Successor representation using features}{10}{subsection.1.2.3}\protected@file@percent }
\@writefile{toc}{\contentsline {subsection}{\numberline {2.4}Multi-scale SR}{10}{subsection.1.2.4}\protected@file@percent }
\@writefile{toc}{\contentsline {subsubsection}{Laplace transform}{10}{section*.16}\protected@file@percent }
\citation{stachenfeld2017hippocampus}
\citation{russek2017predictive}
\citation{Momennejad449470}
\@writefile{toc}{\contentsline {subsubsection}{SR-TD distance learning}{11}{section*.17}\protected@file@percent }
\@writefile{toc}{\contentsline {section}{\numberline {3}Results}{11}{section.1.3}\protected@file@percent }
\newlabel{results}{{3}{11}{Results}{section.1.3}{}}
\citation{russek2017predictive}
\citation{russek2017predictive}
\citation{russek2017predictive}
\@writefile{toc}{\contentsline {subsection}{\numberline {3.1}SR-TD distance}{12}{subsection.1.3.1}\protected@file@percent }
\@writefile{toc}{\contentsline {subsection}{\numberline {3.2}SR-TD distance and transition probability function}{12}{subsection.1.3.2}\protected@file@percent }
\@writefile{toc}{\contentsline {subsubsection}{Previous work}{12}{section*.18}\protected@file@percent }
\@writefile{toc}{\contentsline {subsubsection}{Actor-critic results}{12}{section*.19}\protected@file@percent }
\citation{russek2017predictive}
\@writefile{lof}{\contentsline {figure}{\numberline {3}{\ignorespaces Step to reward by episodes of Detour maze (Fig. \ref  {maze:detour}) from the following experiment \(10,000\) steps of random walk from \(S\), added reward of value \(10\) at \(R\), \(20\) episodes from \(S\) to \(R\), added wall at \(B\), \(20\) other episodes from \(S\) to \(R\).\relax }}{13}{figure.caption.20}\protected@file@percent }
\newlabel{fig:detour}{{3}{13}{Step to reward by episodes of Detour maze (Fig. \ref {maze:detour}) from the following experiment \(10,000\) steps of random walk from \(S\), added reward of value \(10\) at \(R\), \(20\) episodes from \(S\) to \(R\), added wall at \(B\), \(20\) other episodes from \(S\) to \(R\).\relax }{figure.caption.20}{}}
\@writefile{toc}{\contentsline {subsection}{\numberline {3.3}SR-TD distance and reward function}{13}{subsection.1.3.3}\protected@file@percent }
\@writefile{toc}{\contentsline {subsubsection}{Previous work}{13}{section*.21}\protected@file@percent }
\@writefile{toc}{\contentsline {subsubsection}{Actor-critic results}{13}{section*.22}\protected@file@percent }
\citation{stachenfeld2017hippocampus}
\citation{stachenfeld2017hippocampus}
\citation{jakel2009does}
\citation{scikit-learn}
\@writefile{toc}{\contentsline {subsection}{\numberline {3.4}SR-TD distance and clustering}{14}{subsection.1.3.4}\protected@file@percent }
\@writefile{toc}{\contentsline {subsubsection}{Previous work}{14}{section*.23}\protected@file@percent }
\@writefile{toc}{\contentsline {subsubsection}{Maze with three rooms with SR-TD distance}{14}{section*.24}\protected@file@percent }
\citation{russek2017predictive}
\@writefile{lof}{\contentsline {figure}{\numberline {4}{\ignorespaces Clustering from maze \ref  {maze:3_rooms} for mean-shift (\(q=0.2\)) algorithm on \(D\) matrix rows following \(10,000\) random walk steps since \(S\)\relax }}{15}{figure.caption.25}\protected@file@percent }
\newlabel{fig:3_rooms}{{4}{15}{Clustering from maze \ref {maze:3_rooms} for mean-shift (\(q=0.2\)) algorithm on \(D\) matrix rows following \(10,000\) random walk steps since \(S\)\relax }{figure.caption.25}{}}
\@writefile{toc}{\contentsline {subsubsection}{Maze with five rooms with SR-TD distance}{15}{section*.26}\protected@file@percent }
\@writefile{toc}{\contentsline {subsubsection}{Maze with Russek's latent maze}{15}{section*.28}\protected@file@percent }
\@writefile{toc}{\contentsline {subsection}{\numberline {3.5}SR-TD distance and goal-directed behavior}{15}{subsection.1.3.5}\protected@file@percent }
\@writefile{lof}{\contentsline {figure}{\numberline {5}{\ignorespaces Clustering from maze \ref  {maze:5_rooms} for mean-shift (\(q=0.2\)) algorithm on \(D\) matrix rows following \(10,000\) random walk steps since \(S\)\relax }}{16}{figure.caption.27}\protected@file@percent }
\newlabel{fig:5_rooms}{{5}{16}{Clustering from maze \ref {maze:5_rooms} for mean-shift (\(q=0.2\)) algorithm on \(D\) matrix rows following \(10,000\) random walk steps since \(S\)\relax }{figure.caption.27}{}}
\@writefile{lof}{\contentsline {figure}{\numberline {6}{\ignorespaces Clustering from maze \ref  {maze:latent} for mean-shift (\(q=0.2\)) algorithm on \(D\) matrix rows following \(10,000\) random walk steps since \(S\)\relax }}{16}{figure.caption.29}\protected@file@percent }
\newlabel{fig:latent}{{6}{16}{Clustering from maze \ref {maze:latent} for mean-shift (\(q=0.2\)) algorithm on \(D\) matrix rows following \(10,000\) random walk steps since \(S\)\relax }{figure.caption.29}{}}
\citation{sarel2017vectorial}
\citation{gauthier2018dedicated}
\citation{qasim2018neurons}
\@writefile{toc}{\contentsline {subsection}{\numberline {3.6}One goal experiment}{17}{subsection.1.3.6}\protected@file@percent }
\@writefile{lof}{\contentsline {figure}{\numberline {7}{\ignorespaces Step to goal by episode of relearn maze (Fig. \ref  {maze:latent}) from the follow experiment: fix \(w\) as one-hot \(R1\) encoded vector, \(10,000\) step of random walk, record \(20\) episodes from \(S\) to \(R1\)\relax }}{17}{figure.caption.30}\protected@file@percent }
\newlabel{fig:one_goal}{{7}{17}{Step to goal by episode of relearn maze (Fig. \ref {maze:latent}) from the follow experiment: fix \(w\) as one-hot \(R1\) encoded vector, \(10,000\) step of random walk, record \(20\) episodes from \(S\) to \(R1\)\relax }{figure.caption.30}{}}
\@writefile{toc}{\contentsline {subsection}{\numberline {3.7}Two goals experiment}{17}{subsection.1.3.7}\protected@file@percent }
\@writefile{lof}{\contentsline {figure}{\numberline {8}{\ignorespaces Step to goal by episode of relearn maze (Fig. \ref  {maze:latent}) from the follow experiment: fix \(w\) as one-hot \(R1\) encoded vector, \(10,000\) step of random walk, record \(20\) episodes from \(S\) to \(R1\), fix \(w\) as one-hot \(R2\) encoded vector, record \(20\) episodes from \(S\) to \(R2\)\relax }}{18}{figure.caption.31}\protected@file@percent }
\newlabel{fig:two_goal}{{8}{18}{Step to goal by episode of relearn maze (Fig. \ref {maze:latent}) from the follow experiment: fix \(w\) as one-hot \(R1\) encoded vector, \(10,000\) step of random walk, record \(20\) episodes from \(S\) to \(R1\), fix \(w\) as one-hot \(R2\) encoded vector, record \(20\) episodes from \(S\) to \(R2\)\relax }{figure.caption.31}{}}
\@writefile{toc}{\contentsline {section}{\numberline {4}Discussion}{18}{section.1.4}\protected@file@percent }
\newlabel{discussion}{{4}{18}{Discussion}{section.1.4}{}}
\citation{crosby2019animal}
\citation{gonner2017predictive}
\bibstyle{splncs04}
\bibdata{../bib/papers}
\bibcite{aarts2000habits}{1}
\bibcite{andersen2006hippocampus}{2}
\bibcite{bonet2007speed}{3}
\bibcite{carr2011hippocampal}{4}
\bibcite{crosby2019animal}{5}
\bibcite{dayan1993improving}{6}
\bibcite{doll2012ubiquity}{7}
\bibcite{fyhn2007hippocampal}{8}
\bibcite{gauthier2018dedicated}{9}
\bibcite{gershman2018successor}{10}
\bibcite{gershman2012successor}{11}
\bibcite{glimcher2011understanding}{12}
\bibcite{gonner2017predictive}{13}
\bibcite{hafting2005microstructure}{14}
\bibcite{jakel2009does}{15}
\bibcite{khamassi2005actor}{16}
\bibcite{miller2019habits}{17}
\bibcite{mnih2016asynchronous}{18}
\bibcite{mnih2015human}{19}
\bibcite{momennejad2012human}{20}
\bibcite{Momennejad449470}{21}
\bibcite{o1978hippocampus}{22}
\bibcite{scikit-learn}{23}
\bibcite{post1930generalized}{24}
\bibcite{POUCET201751}{25}
\bibcite{qasim2018neurons}{26}
\bibcite{russek2017predictive}{27}
\bibcite{sarel2017vectorial}{28}
\bibcite{shankar2013optimally}{29}
\bibcite{stachenfeld2017hippocampus}{30}
\bibcite{sutton2011reinforcement}{31}
\@writefile{toc}{\contentsline {section}{\numberline {A}Maze layouts}{22}{section.A.1}\protected@file@percent }
\@writefile{toc}{\contentsline {subsection}{\numberline {A.1}linear mazes}{22}{subsection.A.1.1}\protected@file@percent }
\newlabel{maze:linear}{{A.1}{22}{linear mazes}{subsection.A.1.1}{}}
\@writefile{toc}{\contentsline {subsection}{\numberline {A.2}Detour maze}{22}{subsection.A.1.2}\protected@file@percent }
\newlabel{maze:detour}{{A.2}{22}{Detour maze}{subsection.A.1.2}{}}
\@writefile{toc}{\contentsline {subsection}{\numberline {A.3}Relearn maze}{22}{subsection.A.1.3}\protected@file@percent }
\newlabel{maze:relearn}{{A.3}{22}{Relearn maze}{subsection.A.1.3}{}}
\@writefile{toc}{\contentsline {subsection}{\numberline {A.4}Three rooms maze}{23}{subsection.A.1.4}\protected@file@percent }
\newlabel{maze:3_rooms}{{A.4}{23}{Three rooms maze}{subsection.A.1.4}{}}
\@writefile{toc}{\contentsline {subsection}{\numberline {A.5}Five Rooms maze}{23}{subsection.A.1.5}\protected@file@percent }
\newlabel{maze:5_rooms}{{A.5}{23}{Five Rooms maze}{subsection.A.1.5}{}}
\@writefile{toc}{\contentsline {subsection}{\numberline {A.6}Russek's latent maze}{24}{subsection.A.1.6}\protected@file@percent }
\newlabel{maze:latent}{{A.6}{24}{Russek's latent maze}{subsection.A.1.6}{}}
\@writefile{toc}{\contentsline {section}{\numberline {B}Solving methods for MDPs}{24}{section.A.2}\protected@file@percent }
\newlabel{sol_methods}{{B}{24}{Solving methods for MDPs}{section.A.2}{}}
\@writefile{toc}{\contentsline {subsection}{\numberline {B.1}Dynamic programming}{24}{subsection.A.2.1}\protected@file@percent }
\@writefile{toc}{\contentsline {subsubsection}{Optimal value and action-value functions}{24}{section*.33}\protected@file@percent }
\citation{sutton2011reinforcement}
\citation{bonet2007speed}
\@writefile{toc}{\contentsline {subsubsection}{Value iteration}{25}{section*.34}\protected@file@percent }
\citation{sutton2011reinforcement}
\citation{sutton2011reinforcement}
\@writefile{loa}{\contentsline {algocf}{\numberline {1}{\ignorespaces Value iteration\relax }}{26}{algocf.1}\protected@file@percent }
\newlabel{alg:DP}{{1}{26}{Value iteration}{algocf.1}{}}
\@writefile{toc}{\contentsline {subsection}{\numberline {B.2}Monte Carlo methods}{26}{subsection.A.2.2}\protected@file@percent }
\citation{sutton2011reinforcement}
\@writefile{toc}{\contentsline {subsection}{\numberline {B.3}Q learning algorithms}{27}{subsection.A.2.3}\protected@file@percent }
\newlabel{alg:q_learning}{{2}{27}{Q learning algorithms}{algocfline.2}{}}
\@writefile{loa}{\contentsline {algocf}{\numberline {2}{\ignorespaces Q-learning\relax }}{27}{algocf.2}\protected@file@percent }
\newlabel{alg:q_learning_approx}{{3}{27}{Q learning algorithms}{algocfline.3}{}}
\@writefile{loa}{\contentsline {algocf}{\numberline {3}{\ignorespaces Q-learning with function approximation\relax }}{27}{algocf.3}\protected@file@percent }
\@writefile{toc}{\contentsline {subsection}{\numberline {B.4}Actor critic algorithms}{28}{subsection.A.2.4}\protected@file@percent }
\newlabel{alg:AC}{{4}{28}{Actor critic algorithms}{algocfline.4}{}}
\@writefile{loa}{\contentsline {algocf}{\numberline {4}{\ignorespaces Actor critic algorithm from \cite  {sutton2011reinforcement}\relax }}{28}{algocf.4}\protected@file@percent }
\@writefile{toc}{\contentsline {subsection}{\numberline {B.5}SR-TD distance algorithm}{28}{subsection.A.2.5}\protected@file@percent }
\newlabel{alg:AC_SR-TD_distance}{{5}{29}{SR-TD distance algorithm}{algocfline.5}{}}
\@writefile{loa}{\contentsline {algocf}{\numberline {5}{\ignorespaces Actor critic SR-TD distance algorithm\relax }}{29}{algocf.5}\protected@file@percent }
\newlabel{alg:compute}{{6}{30}{SR-TD distance algorithm}{algocfline.6}{}}
\@writefile{loa}{\contentsline {algocf}{\numberline {6}{\ignorespaces Compute-distance procedure\relax }}{30}{algocf.6}\protected@file@percent }
\newlabel{fig:linear_1}{{9a}{31}{Subfigure 1 9a}{subfigure.9.1}{}}
\newlabel{sub@fig:linear_1}{{(a)}{a}{Subfigure 1 9a\relax }{subfigure.9.1}{}}
\newlabel{fig:linear_2}{{9b}{31}{Subfigure 1 9b}{subfigure.9.2}{}}
\newlabel{sub@fig:linear_2}{{(b)}{b}{Subfigure 1 9b\relax }{subfigure.9.2}{}}
\newlabel{fig:linear_3}{{9c}{31}{Subfigure 1 9c}{subfigure.9.3}{}}
\newlabel{sub@fig:linear_3}{{(c)}{c}{Subfigure 1 9c\relax }{subfigure.9.3}{}}
\newlabel{fig:linear_4}{{9d}{31}{Subfigure 1 9d}{subfigure.9.4}{}}
\newlabel{sub@fig:linear_4}{{(d)}{d}{Subfigure 1 9d\relax }{subfigure.9.4}{}}
\newlabel{fig:linear_5}{{9e}{31}{Subfigure 1 9e}{subfigure.9.5}{}}
\newlabel{sub@fig:linear_5}{{(e)}{e}{Subfigure 1 9e\relax }{subfigure.9.5}{}}
\newlabel{fig:linear_6}{{9f}{31}{Subfigure 1 9f}{subfigure.9.6}{}}
\newlabel{sub@fig:linear_6}{{(f)}{f}{Subfigure 1 9f\relax }{subfigure.9.6}{}}
\newlabel{fig:linear_7}{{9g}{31}{Subfigure 1 9g}{subfigure.9.7}{}}
\newlabel{sub@fig:linear_7}{{(g)}{g}{Subfigure 1 9g\relax }{subfigure.9.7}{}}
\newlabel{fig:linear_8}{{9h}{31}{Subfigure 1 9h}{subfigure.9.8}{}}
\newlabel{sub@fig:linear_8}{{(h)}{h}{Subfigure 1 9h\relax }{subfigure.9.8}{}}
\@writefile{lof}{\contentsline {figure}{\numberline {9}{\ignorespaces SR-multi scale and inverse Laplacian results from a \(8\) cases linear maze explored by \(10,000\) random steps\relax }}{31}{figure.caption.37}\protected@file@percent }
\newlabel{fig:linear_maze}{{9}{31}{SR-multi scale and inverse Laplacian results from a \(8\) cases linear maze explored by \(10,000\) random steps\relax }{figure.caption.37}{}}
\@writefile{lof}{\contentsline {subfigure}{\numberline{(a)}{\ignorespaces {Distance vector of the first cell}}}{31}{subfigure.9.1}\protected@file@percent }
\@writefile{lof}{\contentsline {subfigure}{\numberline{(b)}{\ignorespaces {Distance vector of the second cell}}}{31}{subfigure.9.2}\protected@file@percent }
\@writefile{lof}{\contentsline {subfigure}{\numberline{(c)}{\ignorespaces {Distance vector of the third cell}}}{31}{subfigure.9.3}\protected@file@percent }
\@writefile{lof}{\contentsline {subfigure}{\numberline{(d)}{\ignorespaces {Distance vector of the fourth cell}}}{31}{subfigure.9.4}\protected@file@percent }
\@writefile{lof}{\contentsline {subfigure}{\numberline{(e)}{\ignorespaces {Distance vector of the fifth cell}}}{31}{subfigure.9.5}\protected@file@percent }
\@writefile{lof}{\contentsline {subfigure}{\numberline{(f)}{\ignorespaces {Distance vector of the sixth cell}}}{31}{subfigure.9.6}\protected@file@percent }
\@writefile{lof}{\contentsline {subfigure}{\numberline{(g)}{\ignorespaces {Distance vector of the seventh cell}}}{31}{subfigure.9.7}\protected@file@percent }
\@writefile{lof}{\contentsline {subfigure}{\numberline{(h)}{\ignorespaces {Distance vector of the eighth cell}}}{31}{subfigure.9.8}\protected@file@percent }
\newlabel{fig:wall_SR}{{10a}{32}{Subfigure 1 10a}{subfigure.10.1}{}}
\newlabel{sub@fig:wall_SR}{{(a)}{a}{Subfigure 1 10a\relax }{subfigure.10.1}{}}
\newlabel{fig:wall_SR_distance}{{10b}{32}{Subfigure 1 10b}{subfigure.10.2}{}}
\newlabel{sub@fig:wall_SR_distance}{{(b)}{b}{Subfigure 1 10b\relax }{subfigure.10.2}{}}
\@writefile{lof}{\contentsline {figure}{\numberline {10}{\ignorespaces \(M(16,:)\) and \(D(16,:)\) vectors of the maze (\ref  {maze:detour}) resulting from last \(50\) iteration of the following experiment: \(10,000\) steps of random walk from \(S\), reward of value \(10\) added at \(R\), \(20\) episodes to reward (from \(S\) to \(R\)), wall added at \(B\). \(50\) times sampling of a one-step transition at the left of \(B\).\relax }}{32}{figure.caption.38}\protected@file@percent }
\newlabel{fig:wall_sampling}{{10}{32}{\(M(16,:)\) and \(D(16,:)\) vectors of the maze (\ref {maze:detour}) resulting from last \(50\) iteration of the following experiment: \(10,000\) steps of random walk from \(S\), reward of value \(10\) added at \(R\), \(20\) episodes to reward (from \(S\) to \(R\)), wall added at \(B\). \(50\) times sampling of a one-step transition at the left of \(B\).\relax }{figure.caption.38}{}}
\@writefile{lof}{\contentsline {subfigure}{\numberline{(a)}{\ignorespaces {SR vector \(M(16,:)\)}}}{32}{subfigure.10.1}\protected@file@percent }
\@writefile{lof}{\contentsline {subfigure}{\numberline{(b)}{\ignorespaces {Distance vector \(D(16,:)\)}}}{32}{subfigure.10.2}\protected@file@percent }
\newlabel{fig:reward_SR}{{11a}{33}{Subfigure 1 11a}{subfigure.11.1}{}}
\newlabel{sub@fig:reward_SR}{{(a)}{a}{Subfigure 1 11a\relax }{subfigure.11.1}{}}
\newlabel{fig:reward_SR_distance}{{11b}{33}{Subfigure 1 11b}{subfigure.11.2}{}}
\newlabel{sub@fig:reward_SR_distance}{{(b)}{b}{Subfigure 1 11b\relax }{subfigure.11.2}{}}
\@writefile{lof}{\contentsline {figure}{\numberline {11}{\ignorespaces Step to reward by episodes of relearn maze (Fig. \ref  {maze:relearn}) from the following experiment: \(10,000\) steps of random walk from \(S\), added reward of value \(10\) at \(R1\), sampled \(R1\) reward \(30\) times, \(20\) episodes from \(S\) to \(R1\), added reward of value \(100\) at \(R2\), sampled \(R2\) \(30\) times, \(20\) episodes from \(S\) to \(R1\) or \(R2\). Blue dots result from taking the best possible reward and vice versa for orange ones.\relax }}{33}{figure.caption.39}\protected@file@percent }
\newlabel{fig:relearn}{{11}{33}{Step to reward by episodes of relearn maze (Fig. \ref {maze:relearn}) from the following experiment: \(10,000\) steps of random walk from \(S\), added reward of value \(10\) at \(R1\), sampled \(R1\) reward \(30\) times, \(20\) episodes from \(S\) to \(R1\), added reward of value \(100\) at \(R2\), sampled \(R2\) \(30\) times, \(20\) episodes from \(S\) to \(R1\) or \(R2\). Blue dots result from taking the best possible reward and vice versa for orange ones.\relax }{figure.caption.39}{}}
\@writefile{lof}{\contentsline {subfigure}{\numberline{(a)}{\ignorespaces {SR-TD}}}{33}{subfigure.11.1}\protected@file@percent }
\@writefile{lof}{\contentsline {subfigure}{\numberline{(b)}{\ignorespaces {SR-TD distance}}}{33}{subfigure.11.2}\protected@file@percent }
\newlabel{fig:latent_10}{{12a}{34}{Subfigure 1 12a}{subfigure.12.1}{}}
\newlabel{sub@fig:latent_10}{{(a)}{a}{Subfigure 1 12a\relax }{subfigure.12.1}{}}
\newlabel{fig:latent_15}{{12b}{34}{Subfigure 1 12b}{subfigure.12.2}{}}
\newlabel{sub@fig:latent_15}{{(b)}{b}{Subfigure 1 12b\relax }{subfigure.12.2}{}}
\newlabel{fig:latent_20}{{12c}{34}{Subfigure 1 12c}{subfigure.12.3}{}}
\newlabel{sub@fig:latent_20}{{(c)}{c}{Subfigure 1 12c\relax }{subfigure.12.3}{}}
\newlabel{fig:latent_25}{{12d}{34}{Subfigure 1 12d}{subfigure.12.4}{}}
\newlabel{sub@fig:latent_25}{{(d)}{d}{Subfigure 1 12d\relax }{subfigure.12.4}{}}
\newlabel{fig:latent_30}{{12e}{34}{Subfigure 1 12e}{subfigure.12.5}{}}
\newlabel{sub@fig:latent_30}{{(e)}{e}{Subfigure 1 12e\relax }{subfigure.12.5}{}}
\newlabel{fig:latent_35}{{12f}{34}{Subfigure 1 12f}{subfigure.12.6}{}}
\newlabel{sub@fig:latent_35}{{(f)}{f}{Subfigure 1 12f\relax }{subfigure.12.6}{}}
\newlabel{fig:latent_40}{{12g}{34}{Subfigure 1 12g}{subfigure.12.7}{}}
\newlabel{sub@fig:latent_40}{{(g)}{g}{Subfigure 1 12g\relax }{subfigure.12.7}{}}
\@writefile{lof}{\contentsline {figure}{\numberline {12}{\ignorespaces Hierarchical clustering from maze \ref  {maze:latent} for mean-shift algorithm on \(D\) matrix rows following \(10,000\) random walk steps since \(S\).\relax }}{34}{figure.caption.40}\protected@file@percent }
\newlabel{fig:H_clustering}{{12}{34}{Hierarchical clustering from maze \ref {maze:latent} for mean-shift algorithm on \(D\) matrix rows following \(10,000\) random walk steps since \(S\).\relax }{figure.caption.40}{}}
\@writefile{lof}{\contentsline {subfigure}{\numberline{(a)}{\ignorespaces {\(q = 0.10\)}}}{34}{subfigure.12.1}\protected@file@percent }
\@writefile{lof}{\contentsline {subfigure}{\numberline{(b)}{\ignorespaces {\(q = 0.15\)}}}{34}{subfigure.12.2}\protected@file@percent }
\@writefile{lof}{\contentsline {subfigure}{\numberline{(c)}{\ignorespaces {\(q = 0.20\)}}}{34}{subfigure.12.3}\protected@file@percent }
\@writefile{lof}{\contentsline {subfigure}{\numberline{(d)}{\ignorespaces {\(q = 0.25\)}}}{34}{subfigure.12.4}\protected@file@percent }
\@writefile{lof}{\contentsline {subfigure}{\numberline{(e)}{\ignorespaces {\(q = 0.30\)}}}{34}{subfigure.12.5}\protected@file@percent }
\@writefile{lof}{\contentsline {subfigure}{\numberline{(f)}{\ignorespaces {\(q = 0.35\)}}}{34}{subfigure.12.6}\protected@file@percent }
\@writefile{lof}{\contentsline {subfigure}{\numberline{(g)}{\ignorespaces {\(q = 0.4\)}}}{34}{subfigure.12.7}\protected@file@percent }
