{
  "simulation_data": {
    "simulation_name": "simple_maze",
        "method_type": {
            "name": "AC_SR-TD_distance",
            "initial_parameters": {
                "nu": 0.1,
                "mu" : 0.1,
                "sigma" : 0.1,
                "alpha_sr": 0.1,
                "lambda_sr": 0.1,
                "reward_pos": [3, 6],
                "start_pos": [[3, 3]]
            }
        },
        "maze": {
            "path": "mazes/simple_maze.txt",
            "width": 7,
            "height": 7
        },
        "exp_events": [
            {"sample_model": {
                "samples": 1,
                "max_step": 50000,
                "initial_pos": [[3, 3]]
            }
            },
            {"reward_change":
                {
                    "cell_pos": [3, 6],
                    "value": 10
                }
            },
            {"run_phase": {
                "samples": 50,
                "max_step": 1,
                "initial_pos": [[3, 6]]
            }
            },
            {"run_phase": {
                "samples": 1000,
                "max_step": -1,
                "initial_pos": [[3, 3]]
            }
            }
        ],
        "animated": false,
        "seed": null
    }
}