\relax 
\providecommand\hyper@newdestlabel[2]{}
\providecommand\HyperFirstAtBeginDocument{\AtBeginDocument}
\HyperFirstAtBeginDocument{\ifx\hyper@anchor\@undefined
\global\let\oldcontentsline\contentsline
\gdef\contentsline#1#2#3#4{\oldcontentsline{#1}{#2}{#3}}
\global\let\oldnewlabel\newlabel
\gdef\newlabel#1#2{\newlabelxx{#1}#2}
\gdef\newlabelxx#1#2#3#4#5#6{\oldnewlabel{#1}{{#2}{#3}}}
\AtEndDocument{\ifx\hyper@anchor\@undefined
\let\contentsline\oldcontentsline
\let\newlabel\oldnewlabel
\fi}
\fi}
\global\let\hyper@last\relax 
\gdef\HyperFirstAtBeginDocument#1{#1}
\providecommand\HyField@AuxAddToFields[1]{}
\providecommand\HyField@AuxAddToCoFields[2]{}
\babel@aux{english}{}
\@writefile{nav}{\headcommand {\slideentry {0}{0}{1}{1/1}{}{0}}}
\@writefile{nav}{\headcommand {\beamer@framepages {1}{1}}}
\@writefile{nav}{\headcommand {\slideentry {0}{0}{2}{2/2}{}{0}}}
\@writefile{nav}{\headcommand {\beamer@framepages {2}{2}}}
\@writefile{toc}{\beamer@sectionintoc {1}{The hippocampus}{3}{0}{1}}
\@writefile{nav}{\headcommand {\beamer@sectionpages {1}{2}}}
\@writefile{nav}{\headcommand {\beamer@subsectionpages {1}{2}}}
\@writefile{nav}{\headcommand {\sectionentry {1}{The hippocampus}{3}{The hippocampus}{0}}}
\@writefile{nav}{\headcommand {\slideentry {1}{0}{1}{3/3}{}{0}}}
\@writefile{nav}{\headcommand {\beamer@framepages {3}{3}}}
\@writefile{toc}{\beamer@subsectionintoc {1}{1}{Cognitive context}{4}{0}{1}}
\@writefile{nav}{\headcommand {\beamer@subsectionpages {3}{3}}}
\@writefile{nav}{\headcommand {\beamer@subsectionentry {0}{1}{1}{4}{Cognitive context}}}
\providecommand*\caption@xref[2]{\@setref\relax\@undefined{#1}}
\newlabel{fig:sub1}{{1a}{4}{Subfigure 1a}{Doc-Start}{}}
\@writefile{snm}{\beamer@slide {fig:sub1}{4}}
\newlabel{sub@fig:sub1}{{(a)}{a}{Subfigure 1a\relax }{Doc-Start}{}}
\newlabel{fig:sub2}{{1b}{4}{Subfigure 1b}{Doc-Start}{}}
\@writefile{snm}{\beamer@slide {fig:sub2}{4}}
\newlabel{sub@fig:sub2}{{(b)}{b}{Subfigure 1b\relax }{Doc-Start}{}}
\@writefile{nav}{\headcommand {\slideentry {1}{1}{1}{4/4}{Cognitive context}{0}}}
\@writefile{nav}{\headcommand {\beamer@framepages {4}{4}}}
\@writefile{nav}{\headcommand {\slideentry {1}{1}{2}{5/6}{Cognitive context}{0}}}
\@writefile{nav}{\headcommand {\beamer@framepages {5}{6}}}
\@writefile{toc}{\beamer@subsectionintoc {1}{2}{The cognitive map theory}{7}{0}{1}}
\@writefile{nav}{\headcommand {\beamer@subsectionpages {4}{6}}}
\@writefile{nav}{\headcommand {\beamer@subsectionentry {0}{1}{2}{7}{The cognitive map theory}}}
\newlabel{fig:cog_maps}{{1c}{7}{Subfigure 1c}{Doc-Start}{}}
\@writefile{snm}{\beamer@slide {fig:cog_maps}{7}}
\newlabel{sub@fig:cog_maps}{{(c)}{c}{Subfigure 1c\relax }{Doc-Start}{}}
\newlabel{fig:anim_rat}{{1d}{7}{Subfigure 1d}{Doc-Start}{}}
\@writefile{snm}{\beamer@slide {fig:anim_rat}{7}}
\newlabel{sub@fig:anim_rat}{{(d)}{d}{Subfigure 1d\relax }{Doc-Start}{}}
\@writefile{nav}{\headcommand {\slideentry {1}{2}{1}{7/7}{The cognitive map theory}{0}}}
\@writefile{nav}{\headcommand {\beamer@framepages {7}{7}}}
\@writefile{toc}{\beamer@subsectionintoc {1}{3}{The predictive map theory}{8}{0}{1}}
\@writefile{nav}{\headcommand {\beamer@subsectionpages {7}{7}}}
\@writefile{nav}{\headcommand {\beamer@subsectionentry {0}{1}{3}{8}{The predictive map theory}}}
\newlabel{fig:replay}{{\caption@xref {fig:replay}{ on input line 124}}{8}{The predictive map theory}{Doc-Start}{}}
\@writefile{snm}{\beamer@slide {fig:replay}{8}}
\@writefile{nav}{\headcommand {\slideentry {1}{3}{1}{8/8}{The predictive map theory}{0}}}
\@writefile{nav}{\headcommand {\beamer@framepages {8}{8}}}
\@writefile{toc}{\beamer@sectionintoc {2}{Neurobiologically compatible Reinforcement learning}{9}{0}{2}}
\@writefile{nav}{\headcommand {\beamer@sectionpages {3}{8}}}
\@writefile{nav}{\headcommand {\beamer@subsectionpages {8}{8}}}
\@writefile{nav}{\headcommand {\sectionentry {2}{Neurobiologically compatible Reinforcement learning}{9}{Neurobiologically compatible Reinforcement learning}{0}}}
\@writefile{nav}{\headcommand {\slideentry {2}{0}{1}{9/9}{}{0}}}
\@writefile{nav}{\headcommand {\beamer@framepages {9}{9}}}
\@writefile{toc}{\beamer@subsectionintoc {2}{1}{General definition of RL}{10}{0}{2}}
\@writefile{nav}{\headcommand {\beamer@subsectionpages {9}{9}}}
\@writefile{nav}{\headcommand {\beamer@subsectionentry {0}{2}{1}{10}{General definition of RL}}}
\newlabel{fig:replay}{{\caption@xref {fig:replay}{ on input line 140}}{10}{General definition of RL}{Doc-Start}{}}
\@writefile{snm}{\beamer@slide {fig:replay}{10}}
\@writefile{nav}{\headcommand {\slideentry {2}{1}{1}{10/10}{General definition of RL}{0}}}
\@writefile{nav}{\headcommand {\beamer@framepages {10}{10}}}
\@writefile{nav}{\headcommand {\slideentry {2}{1}{2}{11/11}{General definition of RL}{0}}}
\@writefile{nav}{\headcommand {\beamer@framepages {11}{11}}}
\@writefile{toc}{\beamer@subsectionintoc {2}{2}{Actor-critic learning}{12}{0}{2}}
\@writefile{nav}{\headcommand {\beamer@subsectionpages {10}{11}}}
\@writefile{nav}{\headcommand {\beamer@subsectionentry {0}{2}{2}{12}{Actor-critic learning}}}
\newlabel{fig:AC}{{\caption@xref {fig:AC}{ on input line 162}}{12}{Actor-critic learning}{Doc-Start}{}}
\@writefile{snm}{\beamer@slide {fig:AC}{12}}
\@writefile{nav}{\headcommand {\slideentry {2}{2}{1}{12/12}{Actor-critic learning}{0}}}
\@writefile{nav}{\headcommand {\beamer@framepages {12}{12}}}
\@writefile{nav}{\headcommand {\slideentry {2}{2}{2}{13/13}{Actor-critic learning}{0}}}
\@writefile{nav}{\headcommand {\beamer@framepages {13}{13}}}
\@writefile{toc}{\beamer@subsectionintoc {2}{3}{The successor representation}{14}{0}{2}}
\@writefile{nav}{\headcommand {\beamer@subsectionpages {12}{13}}}
\@writefile{nav}{\headcommand {\beamer@subsectionentry {0}{2}{3}{14}{The successor representation}}}
\@writefile{nav}{\headcommand {\slideentry {2}{3}{1}{14/14}{The successor representation}{0}}}
\@writefile{nav}{\headcommand {\beamer@framepages {14}{14}}}
\@writefile{nav}{\headcommand {\slideentry {2}{3}{2}{15/15}{The successor representation}{0}}}
\@writefile{nav}{\headcommand {\beamer@framepages {15}{15}}}
\@writefile{toc}{\beamer@subsectionintoc {2}{4}{Multi-time scale SR}{16}{0}{2}}
\@writefile{nav}{\headcommand {\beamer@subsectionpages {14}{15}}}
\@writefile{nav}{\headcommand {\beamer@subsectionentry {0}{2}{4}{16}{Multi-time scale SR}}}
\@writefile{nav}{\headcommand {\slideentry {2}{4}{1}{16/16}{Multi-time scale SR}{0}}}
\@writefile{nav}{\headcommand {\beamer@framepages {16}{16}}}
\@writefile{nav}{\headcommand {\slideentry {2}{4}{2}{17/17}{Multi-time scale SR}{0}}}
\@writefile{nav}{\headcommand {\beamer@framepages {17}{17}}}
\@writefile{nav}{\headcommand {\slideentry {2}{4}{3}{18/18}{Multi-time scale SR}{0}}}
\@writefile{nav}{\headcommand {\beamer@framepages {18}{18}}}
\@writefile{toc}{\beamer@sectionintoc {3}{Contribution}{19}{0}{3}}
\@writefile{nav}{\headcommand {\beamer@sectionpages {9}{18}}}
\@writefile{nav}{\headcommand {\beamer@subsectionpages {16}{18}}}
\@writefile{nav}{\headcommand {\sectionentry {3}{Contribution}{19}{Contribution}{0}}}
\@writefile{nav}{\headcommand {\slideentry {3}{0}{1}{19/19}{}{0}}}
\@writefile{nav}{\headcommand {\beamer@framepages {19}{19}}}
\@writefile{toc}{\beamer@subsectionintoc {3}{1}{Learning with distance information}{20}{0}{3}}
\@writefile{nav}{\headcommand {\beamer@subsectionpages {19}{19}}}
\@writefile{nav}{\headcommand {\beamer@subsectionentry {0}{3}{1}{20}{Learning with distance information}}}
\@writefile{nav}{\headcommand {\slideentry {3}{1}{1}{20/20}{Learning with distance information}{0}}}
\@writefile{nav}{\headcommand {\beamer@framepages {20}{20}}}
\@writefile{toc}{\beamer@subsectionintoc {3}{2}{Food retrieval modelling}{21}{0}{3}}
\@writefile{nav}{\headcommand {\beamer@subsectionpages {20}{20}}}
\@writefile{nav}{\headcommand {\beamer@subsectionentry {0}{3}{2}{21}{Food retrieval modelling}}}
\@writefile{nav}{\headcommand {\slideentry {3}{2}{1}{21/21}{Food retrieval modelling}{0}}}
\@writefile{nav}{\headcommand {\beamer@framepages {21}{21}}}
\@writefile{nav}{\headcommand {\slideentry {3}{2}{2}{22/22}{Food retrieval modelling}{0}}}
\@writefile{nav}{\headcommand {\beamer@framepages {22}{22}}}
\newlabel{fig:replay}{{\caption@xref {fig:replay}{ on input line 308}}{23}{Food retrieval modelling}{Doc-Start}{}}
\@writefile{snm}{\beamer@slide {fig:replay}{23}}
\@writefile{nav}{\headcommand {\slideentry {3}{2}{3}{23/23}{Food retrieval modelling}{0}}}
\@writefile{nav}{\headcommand {\beamer@framepages {23}{23}}}
\@writefile{nav}{\headcommand {\slideentry {3}{2}{4}{24/24}{Food retrieval modelling}{0}}}
\@writefile{nav}{\headcommand {\beamer@framepages {24}{24}}}
\newlabel{fig:relearn_SR_TD}{{1e}{25}{Subfigure 1e}{Doc-Start}{}}
\@writefile{snm}{\beamer@slide {fig:relearn_SR_TD}{25}}
\newlabel{sub@fig:relearn_SR_TD}{{(e)}{e}{Subfigure 1e\relax }{Doc-Start}{}}
\newlabel{fig:relearn_distance}{{1f}{25}{Subfigure 1f}{Doc-Start}{}}
\@writefile{snm}{\beamer@slide {fig:relearn_distance}{25}}
\newlabel{sub@fig:relearn_distance}{{(f)}{f}{Subfigure 1f\relax }{Doc-Start}{}}
\@writefile{nav}{\headcommand {\slideentry {3}{2}{5}{25/25}{Food retrieval modelling}{0}}}
\@writefile{nav}{\headcommand {\beamer@framepages {25}{25}}}
\@writefile{toc}{\beamer@subsectionintoc {3}{3}{Goal-directed behaviour modelling}{26}{0}{3}}
\@writefile{nav}{\headcommand {\beamer@subsectionpages {21}{25}}}
\@writefile{nav}{\headcommand {\beamer@subsectionentry {0}{3}{3}{26}{Goal-directed behaviour modelling}}}
\@writefile{nav}{\headcommand {\slideentry {3}{3}{1}{26/26}{Goal-directed behaviour modelling}{0}}}
\@writefile{nav}{\headcommand {\beamer@framepages {26}{26}}}
\@writefile{nav}{\headcommand {\slideentry {3}{3}{2}{27/27}{Goal-directed behaviour modelling}{0}}}
\@writefile{nav}{\headcommand {\beamer@framepages {27}{27}}}
\newlabel{fig:replay}{{\caption@xref {fig:replay}{ on input line 382}}{28}{Goal-directed behaviour modelling}{Doc-Start}{}}
\@writefile{snm}{\beamer@slide {fig:replay}{28}}
\@writefile{nav}{\headcommand {\slideentry {3}{3}{3}{28/28}{Goal-directed behaviour modelling}{0}}}
\@writefile{nav}{\headcommand {\beamer@framepages {28}{28}}}
\@writefile{toc}{\beamer@subsectionintoc {3}{4}{Clustering for sub-goal discovery}{29}{0}{3}}
\@writefile{nav}{\headcommand {\beamer@subsectionpages {26}{28}}}
\@writefile{nav}{\headcommand {\beamer@subsectionentry {0}{3}{4}{29}{Clustering for sub-goal discovery}}}
\@writefile{nav}{\headcommand {\slideentry {3}{4}{1}{29/29}{Clustering for sub-goal discovery}{0}}}
\@writefile{nav}{\headcommand {\beamer@framepages {29}{29}}}
\newlabel{fig:three_protocol}{{1g}{30}{Subfigure 1g}{Doc-Start}{}}
\@writefile{snm}{\beamer@slide {fig:three_protocol}{30}}
\newlabel{sub@fig:three_protocol}{{(g)}{g}{Subfigure 1g\relax }{Doc-Start}{}}
\newlabel{fig:three_results}{{1h}{30}{Subfigure 1h}{Doc-Start}{}}
\@writefile{snm}{\beamer@slide {fig:three_results}{30}}
\newlabel{sub@fig:three_results}{{(h)}{h}{Subfigure 1h\relax }{Doc-Start}{}}
\@writefile{nav}{\headcommand {\slideentry {3}{4}{2}{30/30}{Clustering for sub-goal discovery}{0}}}
\@writefile{nav}{\headcommand {\beamer@framepages {30}{30}}}
\newlabel{fig:russek_protocol}{{1i}{31}{Subfigure 1i}{Doc-Start}{}}
\@writefile{snm}{\beamer@slide {fig:russek_protocol}{31}}
\newlabel{sub@fig:russek_protocol}{{(i)}{i}{Subfigure 1i\relax }{Doc-Start}{}}
\newlabel{fig:russek_results}{{1j}{31}{Subfigure 1j}{Doc-Start}{}}
\@writefile{snm}{\beamer@slide {fig:russek_results}{31}}
\newlabel{sub@fig:russek_results}{{(j)}{j}{Subfigure 1j\relax }{Doc-Start}{}}
\@writefile{nav}{\headcommand {\slideentry {3}{4}{3}{31/31}{Clustering for sub-goal discovery}{0}}}
\@writefile{nav}{\headcommand {\beamer@framepages {31}{31}}}
\newlabel{fig:latent_10}{{1k}{32}{Subfigure 1k}{Doc-Start}{}}
\@writefile{snm}{\beamer@slide {fig:latent_10}{32}}
\newlabel{sub@fig:latent_10}{{(k)}{k}{Subfigure 1k\relax }{Doc-Start}{}}
\newlabel{fig:latent_15}{{1l}{32}{Subfigure 1l}{Doc-Start}{}}
\@writefile{snm}{\beamer@slide {fig:latent_15}{32}}
\newlabel{sub@fig:latent_15}{{(l)}{l}{Subfigure 1l\relax }{Doc-Start}{}}
\newlabel{fig:latent_20}{{1m}{32}{Subfigure 1m}{Doc-Start}{}}
\@writefile{snm}{\beamer@slide {fig:latent_20}{32}}
\newlabel{sub@fig:latent_20}{{(m)}{m}{Subfigure 1m\relax }{Doc-Start}{}}
\newlabel{fig:latent_25}{{1n}{32}{Subfigure 1n}{Doc-Start}{}}
\@writefile{snm}{\beamer@slide {fig:latent_25}{32}}
\newlabel{sub@fig:latent_25}{{(n)}{n}{Subfigure 1n\relax }{Doc-Start}{}}
\newlabel{fig:H_clustering}{{\caption@xref {fig:H_clustering}{ on input line 419}}{32}{Clustering for sub-goal discovery}{Doc-Start}{}}
\@writefile{snm}{\beamer@slide {fig:H_clustering}{32}}
\@writefile{nav}{\headcommand {\slideentry {3}{4}{4}{32/32}{Clustering for sub-goal discovery}{0}}}
\@writefile{nav}{\headcommand {\beamer@framepages {32}{32}}}
\newlabel{fig:latent_30}{{1o}{33}{Subfigure 1o}{Doc-Start}{}}
\@writefile{snm}{\beamer@slide {fig:latent_30}{33}}
\newlabel{sub@fig:latent_30}{{(o)}{o}{Subfigure 1o\relax }{Doc-Start}{}}
\newlabel{fig:latent_35}{{1p}{33}{Subfigure 1p}{Doc-Start}{}}
\@writefile{snm}{\beamer@slide {fig:latent_35}{33}}
\newlabel{sub@fig:latent_35}{{(p)}{p}{Subfigure 1p\relax }{Doc-Start}{}}
\newlabel{fig:latent_40}{{1q}{33}{Subfigure 1q}{Doc-Start}{}}
\@writefile{snm}{\beamer@slide {fig:latent_40}{33}}
\newlabel{sub@fig:latent_40}{{(q)}{q}{Subfigure 1q\relax }{Doc-Start}{}}
\@writefile{nav}{\headcommand {\slideentry {3}{4}{5}{33/33}{Clustering for sub-goal discovery}{0}}}
\@writefile{nav}{\headcommand {\beamer@framepages {33}{33}}}
\@writefile{toc}{\beamer@sectionintoc {4}{Discussion}{34}{0}{4}}
\@writefile{nav}{\headcommand {\beamer@sectionpages {19}{33}}}
\@writefile{nav}{\headcommand {\beamer@subsectionpages {29}{33}}}
\@writefile{nav}{\headcommand {\sectionentry {4}{Discussion}{34}{Discussion}{0}}}
\@writefile{nav}{\headcommand {\slideentry {4}{0}{1}{34/34}{}{0}}}
\@writefile{nav}{\headcommand {\beamer@framepages {34}{34}}}
\@writefile{nav}{\headcommand {\slideentry {4}{0}{2}{35/36}{}{0}}}
\@writefile{nav}{\headcommand {\beamer@framepages {35}{36}}}
\@writefile{nav}{\headcommand {\slideentry {4}{0}{3}{37/38}{}{0}}}
\@writefile{nav}{\headcommand {\beamer@framepages {37}{38}}}
\@writefile{nav}{\headcommand {\slideentry {4}{0}{4}{39/39}{}{0}}}
\@writefile{nav}{\headcommand {\beamer@framepages {39}{39}}}
\@writefile{nav}{\headcommand {\beamer@partpages {1}{39}}}
\@writefile{nav}{\headcommand {\beamer@subsectionpages {34}{39}}}
\@writefile{nav}{\headcommand {\beamer@sectionpages {34}{39}}}
\@writefile{nav}{\headcommand {\beamer@documentpages {39}}}
\@writefile{nav}{\headcommand {\gdef \inserttotalframenumber {36}}}
