\relax 
\providecommand\hyper@newdestlabel[2]{}
\providecommand\HyperFirstAtBeginDocument{\AtBeginDocument}
\HyperFirstAtBeginDocument{\ifx\hyper@anchor\@undefined
\global\let\oldcontentsline\contentsline
\gdef\contentsline#1#2#3#4{\oldcontentsline{#1}{#2}{#3}}
\global\let\oldnewlabel\newlabel
\gdef\newlabel#1#2{\newlabelxx{#1}#2}
\gdef\newlabelxx#1#2#3#4#5#6{\oldnewlabel{#1}{{#2}{#3}}}
\AtEndDocument{\ifx\hyper@anchor\@undefined
\let\contentsline\oldcontentsline
\let\newlabel\oldnewlabel
\fi}
\fi}
\global\let\hyper@last\relax 
\gdef\HyperFirstAtBeginDocument#1{#1}
\providecommand\HyField@AuxAddToFields[1]{}
\providecommand\HyField@AuxAddToCoFields[2]{}
\citation{stachenfeld2017hippocampus}
\citation{andersen2006hippocampus}
\citation{o1978hippocampus}
\citation{andersen2006hippocampus}
\providecommand \oddpage@label [2]{}
\@writefile{toc}{\contentsline {title}{Investigation of the successor representation for neuro-computational models of the hippocampus\unskip {}}{1}{chapter.1}\protected@file@percent }
\@writefile{toc}{\authcount {2}}
\@writefile{toc}{\contentsline {author}{ Romain Ferrand  \and Julien Vitay  }{1}{chapter.1}\protected@file@percent }
\@writefile{toc}{\contentsline {section}{Introduction}{1}{section*.2}\protected@file@percent }
\citation{hafting2005microstructure}
\citation{fyhn2007hippocampal}
\citation{POUCET201751}
\citation{POUCET201751}
\citation{stachenfeld2017hippocampus}
\citation{dayan1993improving}
\@writefile{toc}{\contentsline {subsection}{Place-cells and place-fields}{2}{section*.3}\protected@file@percent }
\@writefile{toc}{\contentsline {subsection}{Place-cells and the goal encoding problem}{2}{section*.4}\protected@file@percent }
\@writefile{toc}{\contentsline {subsection}{Predictive hippocampus and successor representation}{2}{section*.5}\protected@file@percent }
\citation{sutton2011reinforcement}
\@writefile{toc}{\contentsline {subsection}{Successor representation and limitations}{3}{section*.6}\protected@file@percent }
\@writefile{toc}{\contentsline {section}{\numberline {1}Reinforcement learning introduction}{3}{section.1.1}\protected@file@percent }
\newlabel{RL}{{1}{3}{Reinforcement learning introduction}{section.1.1}{}}
\@writefile{toc}{\contentsline {subsection}{\numberline {1.1}Markov decision process}{3}{subsection.1.1.1}\protected@file@percent }
\@writefile{toc}{\contentsline {subsubsection}{Finite Markov decision process}{3}{section*.7}\protected@file@percent }
\@writefile{toc}{\contentsline {subsubsection}{Optimal control problem}{4}{section*.8}\protected@file@percent }
\@writefile{toc}{\contentsline {subsubsection}{State-value and action-value functions}{4}{section*.9}\protected@file@percent }
\@writefile{toc}{\contentsline {subsubsection}{Optimal value and action-value functions}{5}{section*.10}\protected@file@percent }
\citation{mnih2015human}
\@writefile{toc}{\contentsline {subsection}{\numberline {1.2}Approximation of states}{6}{subsection.1.1.2}\protected@file@percent }
\@writefile{toc}{\contentsline {subsection}{\numberline {1.3}Solving methods for MDPs}{6}{subsection.1.1.3}\protected@file@percent }
\citation{sutton2011reinforcement}
\citation{bonet2007speed}
\citation{sutton2011reinforcement}
\citation{sutton2011reinforcement}
\citation{glimcher2011understanding}
\@writefile{toc}{\contentsline {subsubsection}{Dynamic programming and value iteration}{7}{section*.11}\protected@file@percent }
\@writefile{toc}{\contentsline {subsubsection}{Monte Carlo methods}{7}{section*.12}\protected@file@percent }
\@writefile{toc}{\contentsline {subsubsection}{Temporal difference learning}{7}{section*.13}\protected@file@percent }
\citation{khamassi2005actor}
\citation{mnih2016asynchronous}
\citation{sutton2011reinforcement}
\@writefile{toc}{\contentsline {subsubsection}{Actor-Critic methods}{8}{section*.14}\protected@file@percent }
\@writefile{toc}{\contentsline {paragraph}{Policy gradient methods}{8}{section*.15}\protected@file@percent }
\citation{sutton2011reinforcement}
\citation{aarts2000habits}
\citation{doll2012ubiquity}
\citation{miller2019habits}
\citation{dayan1993improving}
\citation{gershman2012successor}
\citation{momennejad2012human}
\citation{stachenfeld2017hippocampus}
\citation{russek2017predictive}
\citation{gershman2018successor}
\@writefile{toc}{\contentsline {subsubsection}{Model based method}{9}{section*.16}\protected@file@percent }
\@writefile{toc}{\contentsline {section}{\numberline {2}Successor representation}{9}{section.1.2}\protected@file@percent }
\newlabel{SR}{{2}{9}{Successor representation}{section.1.2}{}}
\@writefile{toc}{\contentsline {subsection}{\numberline {2.1}Motivation}{9}{subsection.1.2.1}\protected@file@percent }
\citation{russek2017predictive}
\@writefile{toc}{\contentsline {subsection}{\numberline {2.2}Formalization}{10}{subsection.1.2.2}\protected@file@percent }
\citation{gershman2012successor}
\citation{Momennejad449470}
\@writefile{toc}{\contentsline {subsection}{\numberline {2.3}Successor representation using features}{11}{subsection.1.2.3}\protected@file@percent }
\@writefile{toc}{\contentsline {subsection}{\numberline {2.4}Multi-scale SR}{11}{subsection.1.2.4}\protected@file@percent }
\@writefile{toc}{\contentsline {subsubsection}{Laplace transform}{11}{section*.17}\protected@file@percent }
\citation{Momennejad449470}
\citation{shankar2013optimally}
\citation{post1930generalized}
\citation{stachenfeld2017hippocampus}
\citation{russek2017predictive}
\citation{Momennejad449470}
\@writefile{toc}{\contentsline {subsubsection}{SR-TD distance learning}{12}{section*.18}\protected@file@percent }
\@writefile{toc}{\contentsline {section}{\numberline {3}Results}{12}{section.1.3}\protected@file@percent }
\newlabel{results}{{3}{12}{Results}{section.1.3}{}}
\citation{russek2017predictive}
\citation{russek2017predictive}
\citation{russek2017predictive}
\@writefile{toc}{\contentsline {subsection}{\numberline {3.1}SR-TD distance}{13}{subsection.1.3.1}\protected@file@percent }
\@writefile{toc}{\contentsline {subsection}{\numberline {3.2}SR-TD distance and transition probability function}{13}{subsection.1.3.2}\protected@file@percent }
\@writefile{toc}{\contentsline {subsubsection}{Previous works}{13}{section*.19}\protected@file@percent }
\citation{russek2017predictive}
\@writefile{toc}{\contentsline {subsubsection}{Actor-critic results}{14}{section*.20}\protected@file@percent }
\@writefile{toc}{\contentsline {subsection}{\numberline {3.3}SR-TD distance and reward function}{14}{subsection.1.3.3}\protected@file@percent }
\@writefile{toc}{\contentsline {subsubsection}{Previous works}{14}{section*.21}\protected@file@percent }
\@writefile{toc}{\contentsline {subsubsection}{Actor-critic results}{14}{section*.22}\protected@file@percent }
\@writefile{toc}{\contentsline {subsection}{\numberline {3.4}SR-TD distance and clustering}{14}{subsection.1.3.4}\protected@file@percent }
\@writefile{toc}{\contentsline {subsubsection}{Previous works}{14}{section*.23}\protected@file@percent }
\citation{stachenfeld2017hippocampus}
\citation{stachenfeld2017hippocampus}
\citation{jakel2009does}
\citation{scikit-learn}
\citation{russek2017predictive}
\@writefile{toc}{\contentsline {subsubsection}{Maze with three rooms with SR-TD distance}{15}{section*.24}\protected@file@percent }
\@writefile{toc}{\contentsline {subsubsection}{Maze with five rooms with SR-TD distance}{15}{section*.25}\protected@file@percent }
\@writefile{toc}{\contentsline {subsubsection}{Maze with russek's latent maze}{15}{section*.26}\protected@file@percent }
\@writefile{toc}{\contentsline {subsection}{\numberline {3.5}SR-TD distance and goal-directed behavior}{16}{subsection.1.3.5}\protected@file@percent }
\@writefile{toc}{\contentsline {subsection}{\numberline {3.6}One goal experiment}{16}{subsection.1.3.6}\protected@file@percent }
\@writefile{toc}{\contentsline {subsection}{\numberline {3.7}Two goals experiment}{16}{subsection.1.3.7}\protected@file@percent }
\citation{crosby2019animal}
\@writefile{toc}{\contentsline {section}{\numberline {4}Discussion}{17}{section.1.4}\protected@file@percent }
\newlabel{discussion}{{4}{17}{Discussion}{section.1.4}{}}
\citation{gonner2017predictive}
\@writefile{toc}{\contentsline {section}{\numberline {A}Maze layouts}{18}{section.A.1}\protected@file@percent }
\@writefile{toc}{\contentsline {subsection}{\numberline {A.1}linear mazes}{18}{subsection.A.1.1}\protected@file@percent }
\newlabel{maze:linear}{{A.1}{18}{linear mazes}{subsection.A.1.1}{}}
\@writefile{toc}{\contentsline {subsection}{\numberline {A.2}Detour maze}{18}{subsection.A.1.2}\protected@file@percent }
\newlabel{maze:detour}{{A.2}{18}{Detour maze}{subsection.A.1.2}{}}
\@writefile{toc}{\contentsline {subsection}{\numberline {A.3}Relearn maze}{18}{subsection.A.1.3}\protected@file@percent }
\newlabel{maze:relearn}{{A.3}{18}{Relearn maze}{subsection.A.1.3}{}}
\@writefile{toc}{\contentsline {subsection}{\numberline {A.4}Three rooms maze}{19}{subsection.A.1.4}\protected@file@percent }
\newlabel{maze:3_rooms}{{A.4}{19}{Three rooms maze}{subsection.A.1.4}{}}
\@writefile{toc}{\contentsline {subsection}{\numberline {A.5}Five Rooms maze}{19}{subsection.A.1.5}\protected@file@percent }
\newlabel{maze:5_rooms}{{A.5}{19}{Five Rooms maze}{subsection.A.1.5}{}}
\@writefile{toc}{\contentsline {subsection}{\numberline {A.6}Russek's latent maze}{19}{subsection.A.1.6}\protected@file@percent }
\newlabel{maze:latent}{{A.6}{19}{Russek's latent maze}{subsection.A.1.6}{}}
\@writefile{toc}{\contentsline {section}{\numberline {B}Solving methods for MDPs}{21}{section.A.2}\protected@file@percent }
\@writefile{toc}{\contentsline {subsection}{\numberline {B.1}Dynamic programming}{21}{subsection.A.2.1}\protected@file@percent }
\@writefile{loa}{\contentsline {algocf}{\numberline {1}{\ignorespaces Value iteration}}{21}{algocf.1}\protected@file@percent }
\newlabel{alg:DP}{{1}{21}{Dynamic programming}{algocf.1}{}}
\citation{sutton2011reinforcement}
\@writefile{toc}{\contentsline {subsection}{\numberline {B.2}Q learning algorithms}{22}{subsection.A.2.2}\protected@file@percent }
\newlabel{alg:q_learning}{{2}{22}{Q learning algorithms}{algocfline.2}{}}
\@writefile{loa}{\contentsline {algocf}{\numberline {2}{\ignorespaces Q-learning}}{22}{algocf.2}\protected@file@percent }
\newlabel{alg:q_learning_approx}{{3}{22}{Q learning algorithms}{algocfline.3}{}}
\@writefile{loa}{\contentsline {algocf}{\numberline {3}{\ignorespaces Q-learning with function approximation}}{22}{algocf.3}\protected@file@percent }
\bibstyle{splncs04}
\bibdata{../bib/papers}
\bibcite{aarts2000habits}{1}
\bibcite{andersen2006hippocampus}{2}
\bibcite{bonet2007speed}{3}
\bibcite{crosby2019animal}{4}
\bibcite{dayan1993improving}{5}
\bibcite{doll2012ubiquity}{6}
\bibcite{fyhn2007hippocampal}{7}
\bibcite{gershman2018successor}{8}
\bibcite{gershman2012successor}{9}
\@writefile{toc}{\contentsline {subsection}{\numberline {B.3}Actor critic algorithms}{23}{subsection.A.2.3}\protected@file@percent }
\newlabel{alg:AC}{{4}{23}{Actor critic algorithms}{algocfline.4}{}}
\@writefile{loa}{\contentsline {algocf}{\numberline {4}{\ignorespaces Actor critic algorithm from \cite  {sutton2011reinforcement}}}{23}{algocf.4}\protected@file@percent }
\@writefile{lof}{\contentsline {figure}{\numberline {1}{\ignorespaces Markov decision process}}{24}{figure.A.1}\protected@file@percent }
\newlabel{fig:MDP}{{1}{24}{Markov decision process}{figure.A.1}{}}
\@writefile{lof}{\contentsline {figure}{\numberline {2}{\ignorespaces Linear maze with eight states, here only state one and two are show}}{24}{figure.A.2}\protected@file@percent }
\newlabel{fig:linear_maze}{{2}{24}{Linear maze with eight states, here only state one and two are show}{figure.A.2}{}}
\@writefile{lof}{\contentsline {figure}{\numberline {3}{\ignorespaces Discounted probability change while sampling a new wall}}{25}{figure.A.3}\protected@file@percent }
\newlabel{fig:wall_SR}{{3}{25}{Discounted probability change while sampling a new wall}{figure.A.3}{}}
\@writefile{lof}{\contentsline {figure}{\numberline {4}{\ignorespaces Discounted probability change while sampling a new wall}}{26}{figure.A.4}\protected@file@percent }
\newlabel{fig:wall_SR_distance}{{4}{26}{Discounted probability change while sampling a new wall}{figure.A.4}{}}
\@writefile{lof}{\contentsline {figure}{\numberline {5}{\ignorespaces Change in transition probability function with SR-TD method}}{27}{figure.A.5}\protected@file@percent }
\newlabel{fig:trans_SR}{{5}{27}{Change in transition probability function with SR-TD method}{figure.A.5}{}}
\@writefile{lof}{\contentsline {figure}{\numberline {6}{\ignorespaces Change in transition probability function with SR-TD distance method}}{27}{figure.A.6}\protected@file@percent }
\newlabel{fig:trans_SR_distance}{{6}{27}{Change in transition probability function with SR-TD distance method}{figure.A.6}{}}
\@writefile{lof}{\contentsline {figure}{\numberline {7}{\ignorespaces Change in reward function with SR-TD method}}{28}{figure.A.7}\protected@file@percent }
\newlabel{fig:reward_SR}{{7}{28}{Change in reward function with SR-TD method}{figure.A.7}{}}
\@writefile{lof}{\contentsline {figure}{\numberline {8}{\ignorespaces Change in reward function with SR-TD distance method}}{28}{figure.A.8}\protected@file@percent }
\newlabel{fig:reward_SR_distance}{{8}{28}{Change in reward function with SR-TD distance method}{figure.A.8}{}}
\@writefile{lof}{\contentsline {figure}{\numberline {9}{\ignorespaces Goal-directed behavior with SR-TD method, one goal}}{29}{figure.A.9}\protected@file@percent }
\newlabel{fig:one_goal_SR}{{9}{29}{Goal-directed behavior with SR-TD method, one goal}{figure.A.9}{}}
\@writefile{lof}{\contentsline {figure}{\numberline {10}{\ignorespaces Goal-directed behavior with SR-TD distance method, one goal}}{29}{figure.A.10}\protected@file@percent }
\newlabel{fig:one_SR_distance}{{10}{29}{Goal-directed behavior with SR-TD distance method, one goal}{figure.A.10}{}}
\@writefile{lof}{\contentsline {figure}{\numberline {11}{\ignorespaces Goal-directed behavior with SR-TD distance method, two goal}}{30}{figure.A.11}\protected@file@percent }
\newlabel{fig:two_goal_SR_distance}{{11}{30}{Goal-directed behavior with SR-TD distance method, two goal}{figure.A.11}{}}
\@writefile{lof}{\contentsline {figure}{\numberline {12}{\ignorespaces Three rooms clustering }}{30}{figure.A.12}\protected@file@percent }
\newlabel{fig:3_rooms}{{12}{30}{Three rooms clustering}{figure.A.12}{}}
\@writefile{lof}{\contentsline {figure}{\numberline {13}{\ignorespaces Five rooms clustering}}{31}{figure.A.13}\protected@file@percent }
\newlabel{fig:5_rooms}{{13}{31}{Five rooms clustering}{figure.A.13}{}}
\@writefile{lof}{\contentsline {figure}{\numberline {14}{\ignorespaces Russek's latent maze clustering}}{31}{figure.A.14}\protected@file@percent }
\newlabel{fig:latent}{{14}{31}{Russek's latent maze clustering}{figure.A.14}{}}
\@writefile{lof}{\contentsline {figure}{\numberline {15}{\ignorespaces Russek's latent maze hierarchical clustering}}{32}{figure.A.15}\protected@file@percent }
\newlabel{fig:H_clustering}{{15}{32}{Russek's latent maze hierarchical clustering}{figure.A.15}{}}
\@writefile{lof}{\contentsline {figure}{\numberline {16}{\ignorespaces Russek's latent maze hierarchical clustering}}{33}{figure.A.16}\protected@file@percent }
\newlabel{fig:H_clustering}{{16}{33}{Russek's latent maze hierarchical clustering}{figure.A.16}{}}
\bibcite{glimcher2011understanding}{10}
\bibcite{gonner2017predictive}{11}
\bibcite{hafting2005microstructure}{12}
\bibcite{jakel2009does}{13}
\bibcite{khamassi2005actor}{14}
\bibcite{miller2019habits}{15}
\bibcite{mnih2016asynchronous}{16}
\bibcite{mnih2015human}{17}
\bibcite{momennejad2012human}{18}
\bibcite{Momennejad449470}{19}
\bibcite{o1978hippocampus}{20}
\bibcite{scikit-learn}{21}
\bibcite{post1930generalized}{22}
\bibcite{POUCET201751}{23}
\bibcite{russek2017predictive}{24}
\bibcite{shankar2013optimally}{25}
\bibcite{stachenfeld2017hippocampus}{26}
\bibcite{sutton2011reinforcement}{27}
