{
  "simulation_data": {
    "simulation_name" : "relearn_maze",
    "method_type" : {
      "name" : "SR-TD",
      "initial_parameters" : {
        "gamma_sr": 0.1,
        "gamma_td" : 0.1,
        "discount" : 0.9,
        "epsilon" : 0.1
      }
    },
    "maze" : {
      "path" : "mazes/latent_maze.txt",
      "width" : 10,
      "height" : 10
    },
        "exp_events" : [
          {"run_phase" : {
            "samples" : 1,
            "max_step" : 50000,
            "initial_pos" : [[7,0]]
          }
          },
          {"reward_change" : {
            "cell_pos": [1,9],
            "value" : 10
          }
          },
          {"run_phase" : {
            "samples" :  40,
            "max_step" : 1,
            "initial_pos" : [[1,9]]
          }
          },
          {"run_phase" : {
            "samples" : 1,
            "max_step" : -1,
            "initial_pos" : [[7,0]]
          }
          },
          {"run_phase" : {
            "samples" : 20,
            "max_step" : -1,
            "initial_pos" : [[7,0], [8,8]]
          }
          },
          {"reward_change" : {
            "cell_pos": [8,9],
            "value" : 20
          }
            },
          {"run_phase" : {
            "samples" :  40,
            "max_step" : 1,
            "initial_pos" : [[8,9]]
          }
          }
        ],
    "animated" : false,
    "seed" : null
  }
}