\relax 
\providecommand\hyper@newdestlabel[2]{}
\providecommand\HyperFirstAtBeginDocument{\AtBeginDocument}
\HyperFirstAtBeginDocument{\ifx\hyper@anchor\@undefined
\global\let\oldcontentsline\contentsline
\gdef\contentsline#1#2#3#4{\oldcontentsline{#1}{#2}{#3}}
\global\let\oldnewlabel\newlabel
\gdef\newlabel#1#2{\newlabelxx{#1}#2}
\gdef\newlabelxx#1#2#3#4#5#6{\oldnewlabel{#1}{{#2}{#3}}}
\AtEndDocument{\ifx\hyper@anchor\@undefined
\let\contentsline\oldcontentsline
\let\newlabel\oldnewlabel
\fi}
\fi}
\global\let\hyper@last\relax 
\gdef\HyperFirstAtBeginDocument#1{#1}
\providecommand\HyField@AuxAddToFields[1]{}
\providecommand\HyField@AuxAddToCoFields[2]{}
\providecommand \oddpage@label [2]{}
\@writefile{toc}{\contentsline {section}{\numberline {1}Results convergence of differents maze}{1}{section.1}\protected@file@percent }
\newlabel{results-convergence-of-differents-maze}{{1}{1}{Results convergence of differents maze}{section.1}{}}
\@writefile{toc}{\contentsline {subsubsection}{\numberline {1.0.1}1. Re-evaluation of the transition function}{1}{subsubsection.1.0.1}\protected@file@percent }
\newlabel{re-evaluation-of-the-transition-function}{{1.0.1}{1}{1. Re-evaluation of the transition function}{subsubsection.1.0.1}{}}
\@writefile{toc}{\contentsline {subsubsection}{\numberline {1.0.2}2. Re-evaluation of the reward function}{1}{subsubsection.1.0.2}\protected@file@percent }
\newlabel{re-evaluation-of-the-reward-function}{{1.0.2}{1}{2. Re-evaluation of the reward function}{subsubsection.1.0.2}{}}
\@writefile{toc}{\contentsline {section}{\numberline {2}1. Re-evaluation of the transition function}{1}{section.2}\protected@file@percent }
\newlabel{re-evaluation-of-the-transition-function}{{2}{1}{1. Re-evaluation of the transition function}{section.2}{}}
\@writefile{toc}{\contentsline {subsection}{\numberline {2.1}1. distance matrix evaluation for SR-distance actor-critic method with 100 windows}{1}{subsection.2.1}\protected@file@percent }
\newlabel{distance-matrix-evaluation-for-sr-distance-actor-critic-method-with-100-windows}{{2.1}{1}{1. distance matrix evaluation for SR-distance actor-critic method with 100 windows}{subsection.2.1}{}}
\@writefile{toc}{\contentsline {section}{\numberline {3}1. Re-evaluation of the transition function}{1}{section.3}\protected@file@percent }
\newlabel{re-evaluation-of-the-transition-function}{{3}{1}{1. Re-evaluation of the transition function}{section.3}{}}
\@writefile{toc}{\contentsline {subsection}{\numberline {3.1}2. Detour tolman maze with 10 windows}{1}{subsection.3.1}\protected@file@percent }
\newlabel{detour-tolman-maze-with-10-windows}{{3.1}{1}{2. Detour tolman maze with 10 windows}{subsection.3.1}{}}
\@writefile{toc}{\contentsline {subsubsection}{\numberline {3.1.1}Legend:}{1}{subsubsection.3.1.1}\protected@file@percent }
\newlabel{legend}{{3.1.1}{1}{Legend:}{subsubsection.3.1.1}{}}
\@writefile{toc}{\contentsline {subsubsection}{\numberline {3.1.2}Free parameters:}{2}{subsubsection.3.1.2}\protected@file@percent }
\newlabel{free-parameters}{{3.1.2}{2}{Free parameters:}{subsubsection.3.1.2}{}}
\@writefile{toc}{\contentsline {subsubsection}{\numberline {3.1.3}Experiment:}{2}{subsubsection.3.1.3}\protected@file@percent }
\newlabel{experiment}{{3.1.3}{2}{Experiment:}{subsubsection.3.1.3}{}}
\@writefile{toc}{\contentsline {subsubsection}{\numberline {3.1.4}Grid search results}{2}{subsubsection.3.1.4}\protected@file@percent }
\newlabel{grid-search-results}{{3.1.4}{2}{Grid search results}{subsubsection.3.1.4}{}}
\@writefile{toc}{\contentsline {section}{\numberline {4}1. Re-evaluation of the transition function}{2}{section.4}\protected@file@percent }
\newlabel{re-evaluation-of-the-transition-function}{{4}{2}{1. Re-evaluation of the transition function}{section.4}{}}
\@writefile{toc}{\contentsline {subsection}{\numberline {4.1}3. Detour tolman maze for SR-TD actor-critic}{2}{subsection.4.1}\protected@file@percent }
\newlabel{detour-tolman-maze-for-sr-td-actor-critic}{{4.1}{2}{3. Detour tolman maze for SR-TD actor-critic}{subsection.4.1}{}}
\@writefile{toc}{\contentsline {subsubsection}{\numberline {4.1.1}Legend:}{2}{subsubsection.4.1.1}\protected@file@percent }
\newlabel{legend}{{4.1.1}{2}{Legend:}{subsubsection.4.1.1}{}}
\@writefile{toc}{\contentsline {subsubsection}{\numberline {4.1.2}Free parameters:}{2}{subsubsection.4.1.2}\protected@file@percent }
\newlabel{free-parameters}{{4.1.2}{2}{Free parameters:}{subsubsection.4.1.2}{}}
\@writefile{toc}{\contentsline {subsubsection}{\numberline {4.1.3}Experiment:}{3}{subsubsection.4.1.3}\protected@file@percent }
\newlabel{experiment}{{4.1.3}{3}{Experiment:}{subsubsection.4.1.3}{}}
\@writefile{toc}{\contentsline {subsubsection}{\numberline {4.1.4}Grid search results}{3}{subsubsection.4.1.4}\protected@file@percent }
\newlabel{grid-search-results}{{4.1.4}{3}{Grid search results}{subsubsection.4.1.4}{}}
\@writefile{toc}{\contentsline {section}{\numberline {5}2. Re-evaluation of the reward function}{3}{section.5}\protected@file@percent }
\newlabel{re-evaluation-of-the-reward-function}{{5}{3}{2. Re-evaluation of the reward function}{section.5}{}}
\@writefile{toc}{\contentsline {subsection}{\numberline {5.1}1. Relearn tolman maze for SR-distance actor-critic with 10 windows}{3}{subsection.5.1}\protected@file@percent }
\newlabel{relearn-tolman-maze-for-sr-distance-actor-critic-with-10-windows}{{5.1}{3}{1. Relearn tolman maze for SR-distance actor-critic with 10 windows}{subsection.5.1}{}}
\@writefile{toc}{\contentsline {subsubsection}{\numberline {5.1.1}Legend:}{3}{subsubsection.5.1.1}\protected@file@percent }
\newlabel{legend}{{5.1.1}{3}{Legend:}{subsubsection.5.1.1}{}}
\@writefile{toc}{\contentsline {subsubsection}{\numberline {5.1.2}Experiment:}{3}{subsubsection.5.1.2}\protected@file@percent }
\newlabel{experiment}{{5.1.2}{3}{Experiment:}{subsubsection.5.1.2}{}}
\@writefile{toc}{\contentsline {subsubsection}{\numberline {5.1.3}Fixed parameters}{3}{subsubsection.5.1.3}\protected@file@percent }
\newlabel{fixed-parameters}{{5.1.3}{3}{Fixed parameters}{subsubsection.5.1.3}{}}
\@writefile{toc}{\contentsline {section}{\numberline {6}2. Re-evaluation of the reward function}{4}{section.6}\protected@file@percent }
\newlabel{re-evaluation-of-the-reward-function}{{6}{4}{2. Re-evaluation of the reward function}{section.6}{}}
\@writefile{toc}{\contentsline {subsection}{\numberline {6.1}2. Relearn tolman maze for SR-TD actor-critic}{4}{subsection.6.1}\protected@file@percent }
\newlabel{relearn-tolman-maze-for-sr-td-actor-critic}{{6.1}{4}{2. Relearn tolman maze for SR-TD actor-critic}{subsection.6.1}{}}
\@writefile{toc}{\contentsline {subsubsection}{\numberline {6.1.1}Legend:}{4}{subsubsection.6.1.1}\protected@file@percent }
\newlabel{legend}{{6.1.1}{4}{Legend:}{subsubsection.6.1.1}{}}
\@writefile{toc}{\contentsline {subsubsection}{\numberline {6.1.2}Experiment:}{4}{subsubsection.6.1.2}\protected@file@percent }
\newlabel{experiment}{{6.1.2}{4}{Experiment:}{subsubsection.6.1.2}{}}
\@writefile{toc}{\contentsline {subsubsection}{\numberline {6.1.3}Fixed parameters}{4}{subsubsection.6.1.3}\protected@file@percent }
\newlabel{fixed-parameters}{{6.1.3}{4}{Fixed parameters}{subsubsection.6.1.3}{}}
