{
  "simulation_data": {
    "simulation_name" : "detour_maze",
    "method_type" : {
      "name" : "SR-TD_windows",
      "initial_parameters" : {
                "gamma_sr": 0.1,
                "gamma_td": 0.1,
                "epsilon": 0.1,
                "gamma_theta" : 0.1,
        "reward_pos": [2, 9],
        "start_pos": [[2, 0]]
      }
    },
    "maze" : {
      "path" : "mazes/detour_maze.txt",
      "width" : 10,
      "height" : 10
    },
        "exp_events" : [
      {"run_phase" : {
        "samples" : 1,
        "max_step" : 50000,
        "initial_pos" : [[2,0]]
        }
      },
      {"reward_change" :
        {
          "cell_pos": [2,9],
          "value" : 10
        }
      },
      {"run_phase" : {
        "samples" :  50,
        "max_step" : 1,
        "initial_pos" : [[2,9]]
        }
      },
      {"run_phase" : {
        "samples" :  5,
        "max_step" : -1,
        "initial_pos" : [[2,0]]
        }
      },
      {
        "wall_change": {
          "cell_pos": [2, 5],
          "wall_dir": 1,
          "wall_status": true
        }
      },
          {
        "wall_change": {
          "cell_pos": [2, 5],
          "wall_dir": 2,
          "wall_status": true
        }
      },
      {"run_phase" :
        {
          "samples" : 50,
          "max_step" : 1,
          "initial_pos" : [[2,4]]
        }
      }
    ],
    "animated" : true,
    "seed" : null
  }
}