\relax 
\providecommand\hyper@newdestlabel[2]{}
\providecommand\HyperFirstAtBeginDocument{\AtBeginDocument}
\HyperFirstAtBeginDocument{\ifx\hyper@anchor\@undefined
\global\let\oldcontentsline\contentsline
\gdef\contentsline#1#2#3#4{\oldcontentsline{#1}{#2}{#3}}
\global\let\oldnewlabel\newlabel
\gdef\newlabel#1#2{\newlabelxx{#1}#2}
\gdef\newlabelxx#1#2#3#4#5#6{\oldnewlabel{#1}{{#2}{#3}}}
\AtEndDocument{\ifx\hyper@anchor\@undefined
\let\contentsline\oldcontentsline
\let\newlabel\oldnewlabel
\fi}
\fi}
\global\let\hyper@last\relax 
\gdef\HyperFirstAtBeginDocument#1{#1}
\providecommand\HyField@AuxAddToFields[1]{}
\providecommand\HyField@AuxAddToCoFields[2]{}
\providecommand \oddpage@label [2]{}
\@writefile{toc}{\contentsline {section}{\numberline {1}Re-evaluation of the transition function}{1}{section.1}\protected@file@percent }
\newlabel{re-evaluation-of-the-transition-function}{{1}{1}{Re-evaluation of the transition function}{section.1}{}}
\@writefile{toc}{\contentsline {subsection}{\numberline {1.1}distance matrix evaluation for SR-distance actor-critic method with 100 windows}{1}{subsection.1.1}\protected@file@percent }
\newlabel{distance-matrix-evaluation-for-sr-distance-actor-critic-method-with-100-windows}{{1.1}{1}{distance matrix evaluation for SR-distance actor-critic method with 100 windows}{subsection.1.1}{}}
\@writefile{toc}{\contentsline {subsubsection}{\numberline {1.1.1}Detour tolman maze with 100 windows}{2}{subsubsection.1.1.1}\protected@file@percent }
\newlabel{detour-tolman-maze-with-100-windows}{{1.1.1}{2}{Detour tolman maze with 100 windows}{subsubsection.1.1.1}{}}
\@writefile{toc}{\contentsline {subsubsection}{\numberline {1.1.2}Legend:}{3}{subsubsection.1.1.2}\protected@file@percent }
\newlabel{legend}{{1.1.2}{3}{Legend:}{subsubsection.1.1.2}{}}
\@writefile{toc}{\contentsline {subsubsection}{\numberline {1.1.3}Free parameters:}{3}{subsubsection.1.1.3}\protected@file@percent }
\newlabel{free-parameters}{{1.1.3}{3}{Free parameters:}{subsubsection.1.1.3}{}}
\@writefile{toc}{\contentsline {subsubsection}{\numberline {1.1.4}Experiment:}{3}{subsubsection.1.1.4}\protected@file@percent }
\newlabel{experiment}{{1.1.4}{3}{Experiment:}{subsubsection.1.1.4}{}}
\@writefile{toc}{\contentsline {subsubsection}{\numberline {1.1.5}Grid search results}{4}{subsubsection.1.1.5}\protected@file@percent }
\newlabel{grid-search-results}{{1.1.5}{4}{Grid search results}{subsubsection.1.1.5}{}}
\@writefile{toc}{\contentsline {subsection}{\numberline {1.2}Detour tolman maze for SR-TD actor-critic}{4}{subsection.1.2}\protected@file@percent }
\newlabel{detour-tolman-maze-for-sr-td-actor-critic}{{1.2}{4}{Detour tolman maze for SR-TD actor-critic}{subsection.1.2}{}}
\@writefile{toc}{\contentsline {subsubsection}{\numberline {1.2.1}Legend:}{4}{subsubsection.1.2.1}\protected@file@percent }
\newlabel{legend}{{1.2.1}{4}{Legend:}{subsubsection.1.2.1}{}}
\@writefile{toc}{\contentsline {subsubsection}{\numberline {1.2.2}Free parameters:}{4}{subsubsection.1.2.2}\protected@file@percent }
\newlabel{free-parameters}{{1.2.2}{4}{Free parameters:}{subsubsection.1.2.2}{}}
\@writefile{toc}{\contentsline {subsubsection}{\numberline {1.2.3}Experiment:}{4}{subsubsection.1.2.3}\protected@file@percent }
\newlabel{experiment}{{1.2.3}{4}{Experiment:}{subsubsection.1.2.3}{}}
\@writefile{toc}{\contentsline {subsubsection}{\numberline {1.2.4}Grid search results}{5}{subsubsection.1.2.4}\protected@file@percent }
\newlabel{grid-search-results}{{1.2.4}{5}{Grid search results}{subsubsection.1.2.4}{}}
\@writefile{toc}{\contentsline {section}{\numberline {2}Re-evaluation of the reward function}{5}{section.2}\protected@file@percent }
\newlabel{re-evaluation-of-the-reward-function}{{2}{5}{Re-evaluation of the reward function}{section.2}{}}
\@writefile{toc}{\contentsline {subsection}{\numberline {2.1}Relearn tolman maze for SR-distance actor-critic with 10 windows}{5}{subsection.2.1}\protected@file@percent }
\newlabel{relearn-tolman-maze-for-sr-distance-actor-critic-with-10-windows}{{2.1}{5}{Relearn tolman maze for SR-distance actor-critic with 10 windows}{subsection.2.1}{}}
\@writefile{toc}{\contentsline {subsubsection}{\numberline {2.1.1}Legend:}{5}{subsubsection.2.1.1}\protected@file@percent }
\newlabel{legend}{{2.1.1}{5}{Legend:}{subsubsection.2.1.1}{}}
\@writefile{toc}{\contentsline {subsubsection}{\numberline {2.1.2}Experiment:}{6}{subsubsection.2.1.2}\protected@file@percent }
\newlabel{experiment}{{2.1.2}{6}{Experiment:}{subsubsection.2.1.2}{}}
\@writefile{toc}{\contentsline {subsubsection}{\numberline {2.1.3}Fixed parameters}{6}{subsubsection.2.1.3}\protected@file@percent }
\newlabel{fixed-parameters}{{2.1.3}{6}{Fixed parameters}{subsubsection.2.1.3}{}}
\@writefile{toc}{\contentsline {subsection}{\numberline {2.2}Relearn tolman maze for SR-TD actor-critic}{6}{subsection.2.2}\protected@file@percent }
\newlabel{relearn-tolman-maze-for-sr-td-actor-critic}{{2.2}{6}{Relearn tolman maze for SR-TD actor-critic}{subsection.2.2}{}}
\@writefile{toc}{\contentsline {subsubsection}{\numberline {2.2.1}Legend:}{7}{subsubsection.2.2.1}\protected@file@percent }
\newlabel{legend}{{2.2.1}{7}{Legend:}{subsubsection.2.2.1}{}}
\@writefile{toc}{\contentsline {subsubsection}{\numberline {2.2.2}Experiment:}{7}{subsubsection.2.2.2}\protected@file@percent }
\newlabel{experiment}{{2.2.2}{7}{Experiment:}{subsubsection.2.2.2}{}}
\@writefile{toc}{\contentsline {subsubsection}{\numberline {2.2.3}Fixed parameters}{7}{subsubsection.2.2.3}\protected@file@percent }
\newlabel{fixed-parameters}{{2.2.3}{7}{Fixed parameters}{subsubsection.2.2.3}{}}
\@writefile{toc}{\contentsline {subsection}{\numberline {2.3}Clustering tests}{8}{subsection.2.3}\protected@file@percent }
\newlabel{clustering-tests}{{2.3}{8}{Clustering tests}{subsection.2.3}{}}
\@writefile{toc}{\contentsline {subsubsection}{\numberline {2.3.1}Maze with 3 rooms for clustered maze with SR-distance}{8}{subsubsection.2.3.1}\protected@file@percent }
\newlabel{maze-with-3-rooms-for-clustered-maze-with-sr-distance}{{2.3.1}{8}{Maze with 3 rooms for clustered maze with SR-distance}{subsubsection.2.3.1}{}}
\@writefile{toc}{\contentsline {subsubsection}{\numberline {2.3.2}Legend:}{8}{subsubsection.2.3.2}\protected@file@percent }
\newlabel{legend}{{2.3.2}{8}{Legend:}{subsubsection.2.3.2}{}}
\@writefile{toc}{\contentsline {subsubsection}{\numberline {2.3.3}Experiment:}{8}{subsubsection.2.3.3}\protected@file@percent }
\newlabel{experiment}{{2.3.3}{8}{Experiment:}{subsubsection.2.3.3}{}}
\@writefile{toc}{\contentsline {subsubsection}{\numberline {2.3.4}Fixed parameters}{8}{subsubsection.2.3.4}\protected@file@percent }
\newlabel{fixed-parameters}{{2.3.4}{8}{Fixed parameters}{subsubsection.2.3.4}{}}
\@writefile{toc}{\contentsline {subsubsection}{\numberline {2.3.5}Maze with 5 rooms for clustered maze with SR-distance}{11}{subsubsection.2.3.5}\protected@file@percent }
\newlabel{maze-with-5-rooms-for-clustered-maze-with-sr-distance}{{2.3.5}{11}{Maze with 5 rooms for clustered maze with SR-distance}{subsubsection.2.3.5}{}}
\@writefile{toc}{\contentsline {subsubsection}{\numberline {2.3.6}Legend:}{11}{subsubsection.2.3.6}\protected@file@percent }
\newlabel{legend}{{2.3.6}{11}{Legend:}{subsubsection.2.3.6}{}}
\@writefile{toc}{\contentsline {subsubsection}{\numberline {2.3.7}Experiment:}{11}{subsubsection.2.3.7}\protected@file@percent }
\newlabel{experiment}{{2.3.7}{11}{Experiment:}{subsubsection.2.3.7}{}}
\@writefile{toc}{\contentsline {subsubsection}{\numberline {2.3.8}Fixed parameters}{12}{subsubsection.2.3.8}\protected@file@percent }
\newlabel{fixed-parameters}{{2.3.8}{12}{Fixed parameters}{subsubsection.2.3.8}{}}
\@writefile{toc}{\contentsline {subsection}{\numberline {2.4}Latent maze from Russek paper}{16}{subsection.2.4}\protected@file@percent }
\newlabel{latent-maze-from-russek-paper}{{2.4}{16}{Latent maze from Russek paper}{subsection.2.4}{}}
\@writefile{toc}{\contentsline {subsubsection}{\numberline {2.4.1}Legend:}{17}{subsubsection.2.4.1}\protected@file@percent }
\newlabel{legend}{{2.4.1}{17}{Legend:}{subsubsection.2.4.1}{}}
\@writefile{toc}{\contentsline {subsubsection}{\numberline {2.4.2}Experiment:}{17}{subsubsection.2.4.2}\protected@file@percent }
\newlabel{experiment}{{2.4.2}{17}{Experiment:}{subsubsection.2.4.2}{}}
\@writefile{toc}{\contentsline {subsubsection}{\numberline {2.4.3}Fixed parameters}{17}{subsubsection.2.4.3}\protected@file@percent }
\newlabel{fixed-parameters}{{2.4.3}{17}{Fixed parameters}{subsubsection.2.4.3}{}}
\@writefile{toc}{\contentsline {subsubsection}{\numberline {2.4.4}Latent maze from Russek paper with multiple quantile values}{21}{subsubsection.2.4.4}\protected@file@percent }
\newlabel{latent-maze-from-russek-paper-with-multiple-quantile-values}{{2.4.4}{21}{Latent maze from Russek paper with multiple quantile values}{subsubsection.2.4.4}{}}
\@writefile{toc}{\contentsline {subsubsection}{\numberline {2.4.5}Parameters:}{21}{subsubsection.2.4.5}\protected@file@percent }
\newlabel{parameters}{{2.4.5}{21}{Parameters:}{subsubsection.2.4.5}{}}
