{
  "simulation_data": {
    "simulation_name": "latent_maze",
        "method_type": {
            "name": "SR-TD_windows",
            "initial_parameters": {
                "gamma_sr": 0.1,
                "gamma_td": 0.1,
                "epsilon": 0.1,
                "gamma_theta" : 0.1,
                "reward_pos": [1, 9],
                "start_pos": [[7, 0]]
            }
        },
        "maze": {
            "path": "mazes/latent_maze.txt",
            "width": 10,
            "height": 10
        },
        "exp_events": [
            {"run_phase": {
                "samples": 1,
                "max_step": 50000,
                "initial_pos": [[7, 0]]
            }
            },
            {"reward_change":
                {
                    "cell_pos": [1, 9],
                    "value": 10
                }
            },
            {"run_phase": {
                "samples": 50,
                "max_step": 1,
                "initial_pos": [[1, 9]]
            }
            }
        ],
        "animated": false,
        "seed": null
    }
}