[BeGaze]
Converted from:	C:\Documents and Settings\iViewX\Desktop\EXPERIMENTATIONS\Experiments\results\finaleart\S14F27123-finaleart-1.idf
Date:	27.03.2019 15:43:22
Version:	BeGaze 2.5.77
Sample Rate:	50
Subject:	S14F27123
Description:	Anne-flore Perrin

Table Header for Fixations:
Event Type	Trial	Number	Start	End	Duration	Location X	Location Y	Dispersion X	Dispersion Y	Plane	Avg. Pupil Size X	Avg. Pupil Size Y

Table Header for Saccades:
Event Type	Trial	Number	Start	End	Duration	Start Loc.X	Start Loc.Y	End Loc.X	End Loc.Y	Amplitude	Peak Speed	Peak Speed At	Average Speed	Peak Accel.	Peak Decel.	Average Accel.

Table Header for Blinks:
Event Type	Trial	Number	Start	End	Duration

Table Header for User Events:
Event Type	Trial	Number	Start	Description

UserEvent	1	1	30916919973	# Message: venice_from_porche_of_madonna_turner_1835.jpg
Fixation L	1	1	30916929815	30917447068	517253	744.68	786.89	25	55	-1	12.53	12.53
Fixation R	1	1	30916929815	30917447068	517253	744.68	786.89	25	55	-1	12.97	12.97
Blink L	1	1	30917447068	30917566278	119210
Blink R	1	1	30917447068	30917566278	119210
Saccade L	1	1	30917566278	30917685647	119369	905.45	829.22	559.44	855.09	6.73	196.76	1.00	56.35	4812.11	-4691.67	2146.46
Saccade R	1	1	30917566278	30917685647	119369	905.45	829.22	559.44	855.09	6.73	196.76	1.00	56.35	4812.11	-4691.67	2146.46
Fixation L	1	2	30917685647	30917785142	99495	532.38	825.63	41	58	-1	29.34	29.34
Fixation R	1	2	30917685647	30917785142	99495	532.38	825.63	41	58	-1	9.76	9.76
Saccade L	1	2	30917785142	30917904511	119369	518.42	796.88	603.44	408.61	6.48	232.71	0.83	54.27	5399.10	-5613.67	2400.61
Saccade R	1	2	30917785142	30917904511	119369	518.42	796.88	603.44	408.61	6.48	232.71	0.83	54.27	5399.10	-5613.67	2400.61
Fixation L	1	3	30917904511	30918043635	139124	616.05	415.55	16	13	-1	9.35	9.35
Fixation R	1	3	30917904511	30918043635	139124	616.05	415.55	16	13	-1	9.89	9.89
Saccade L	1	3	30918043635	30918083510	39875	620.16	416.04	780.59	248.61	2.06	121.54	0.50	51.75	2790.57	-2881.26	2795.39
Saccade R	1	3	30918043635	30918083510	39875	620.16	416.04	780.59	248.61	2.06	121.54	0.50	51.75	2790.57	-2881.26	2795.39
Fixation L	1	4	30918083510	30918222749	139239	781.28	245.42	8	15	-1	9.36	9.36
Fixation R	1	4	30918083510	30918222749	139239	781.28	245.42	8	15	-1	9.86	9.86
Saccade L	1	4	30918222749	30918242624	19875	783.98	236.00	825.15	144.01	0.83	101.94	1.00	41.63	2462.53	-1552.11	1622.04
Saccade R	1	4	30918222749	30918242624	19875	783.98	236.00	825.15	144.01	0.83	101.94	1.00	41.63	2462.53	-1552.11	1622.04
Fixation L	1	5	30918242624	30918461377	218753	839.49	167.05	40	44	-1	9.27	9.27
Fixation R	1	5	30918242624	30918461377	218753	839.49	167.05	40	44	-1	9.69	9.69
Saccade L	1	5	30918461377	30918501110	39733	848.98	171.10	1256.59	211.97	3.46	302.87	0.50	87.09	7512.47	-7210.04	5026.44
Saccade R	1	5	30918461377	30918501110	39733	848.98	171.10	1256.59	211.97	3.46	302.87	0.50	87.09	7512.47	-7210.04	5026.44
Fixation L	1	6	30918501110	30918680230	179120	1258.96	204.46	29	56	-1	9.35	9.35
Fixation R	1	6	30918501110	30918680230	179120	1258.96	204.46	29	56	-1	9.77	9.77
Saccade L	1	6	30918680230	30918719986	39756	1239.02	245.10	685.83	524.79	5.60	436.70	0.50	140.77	10791.42	-10275.08	7354.30
Saccade R	1	6	30918680230	30918719986	39756	1239.02	245.10	685.83	524.79	5.60	436.70	0.50	140.77	10791.42	-10275.08	7354.30
Fixation L	1	7	30918719986	30918958589	238603	654.49	508.56	36	31	-1	9.87	9.87
Fixation R	1	7	30918719986	30918958589	238603	654.49	508.56	36	31	-1	10.43	10.43
Saccade L	1	7	30918958589	30918978460	19871	649.10	504.60	566.24	474.38	0.67	89.22	1.00	33.67	2078.03	-1535.49	1438.36
Saccade R	1	7	30918958589	30918978460	19871	649.10	504.60	566.24	474.38	0.67	89.22	1.00	33.67	2078.03	-1535.49	1438.36
Fixation L	1	8	30918978460	30919376345	397885	538.48	489.10	46	42	-1	10.11	10.11
Fixation R	1	8	30918978460	30919376345	397885	538.48	489.10	46	42	-1	10.70	10.70
Saccade L	1	8	30919376345	30919416069	39724	520.01	509.97	369.51	627.78	2.06	144.27	0.50	51.89	3534.17	-3308.44	2882.65
Saccade R	1	8	30919376345	30919416069	39724	520.01	509.97	369.51	627.78	2.06	144.27	0.50	51.89	3534.17	-3308.44	2882.65
Fixation L	1	9	30919416069	30919615062	198993	364.14	617.71	13	28	-1	10.22	10.22
Fixation R	1	9	30919416069	30919615062	198993	364.14	617.71	13	28	-1	10.88	10.88
Saccade L	1	9	30919615062	30919654812	39750	370.62	622.77	720.95	852.39	3.50	223.15	1.00	88.13	5448.94	-5250.86	5142.61
Saccade R	1	9	30919615062	30919654812	39750	370.62	622.77	720.95	852.39	3.50	223.15	1.00	88.13	5448.94	-5250.86	5142.61
Fixation L	1	10	30919654812	30919873553	218741	755.74	850.63	75	13	-1	13.78	12.61
Fixation R	1	10	30919654812	30919873553	218741	755.74	850.63	75	13	-1	11.49	11.49
Saccade L	1	10	30919873553	30919893425	19872	793.72	845.18	928.61	843.35	0.92	136.45	1.00	46.51	3292.58	-3058.34	2448.94
Saccade R	1	10	30919873553	30919893425	19872	793.72	845.18	928.61	843.35	0.92	136.45	1.00	46.51	3292.58	-3058.34	2448.94
Fixation L	1	11	30919893425	30920012790	119365	956.16	806.28	38	59	-1	19.29	19.29
Fixation R	1	11	30919893425	30920012790	119365	956.16	806.28	38	59	-1	11.41	11.41
Saccade L	1	11	30920012790	30920092423	79633	941.49	783.92	1275.46	783.52	4.76	189.05	0.75	59.74	4240.47	-4670.02	2765.86
Saccade R	1	11	30920012790	30920092423	79633	941.49	783.92	1275.46	783.52	4.76	189.05	0.75	59.74	4240.47	-4670.02	2765.86
Fixation L	1	12	30920092423	30920191788	99365	1282.44	789.06	16	13	-1	21.30	21.30
Fixation R	1	12	30920092423	30920191788	99365	1282.44	789.06	16	13	-1	10.96	10.96
Saccade L	1	12	30920191788	30920231655	39867	1291.59	797.00	1285.66	803.41	1.50	88.78	0.50	37.67	1968.39	-2167.84	1981.41
Saccade R	1	12	30920191788	30920231655	39867	1291.59	797.00	1285.66	803.41	1.50	88.78	0.50	37.67	1968.39	-2167.84	1981.41
Fixation L	1	13	30920231655	30920410657	179002	1286.32	805.44	4	23	-1	21.21	21.21
Fixation R	1	13	30920231655	30920410657	179002	1286.32	805.44	4	23	-1	10.85	10.85
Saccade L	1	13	30920410657	30920529902	119245	1285.14	809.56	1213.64	730.57	7.23	108.82	0.17	60.59	2483.44	-1290.61	976.07
Saccade R	1	13	30920410657	30920529902	119245	1285.14	809.56	1213.64	730.57	7.23	108.82	0.17	60.59	2483.44	-1290.61	976.07
Fixation L	1	14	30920529902	30920669143	139241	1222.51	781.98	30	68	-1	19.10	19.10
Fixation R	1	14	30920529902	30920669143	139241	1222.51	781.98	30	68	-1	10.99	10.99
Saccade L	1	14	30920669143	30920907877	238734	1235.26	786.62	1602.05	503.72	14.75	205.59	0.33	61.77	5016.15	-2921.45	1643.53
Saccade R	1	14	30920669143	30920907877	238734	1235.26	786.62	1602.05	503.72	14.75	205.59	0.33	61.77	5016.15	-2921.45	1643.53
