[BeGaze]
Converted from:	C:\Documents and Settings\iViewX\Desktop\EXPERIMENTATIONS\Experiments\results\finaleart\S20H24222-finaleart-1.idf
Date:	27.03.2019 15:52:33
Version:	BeGaze 2.5.77
Sample Rate:	50
Subject:	S20H24222
Description:	Hugo Brument

Table Header for Fixations:
Event Type	Trial	Number	Start	End	Duration	Location X	Location Y	Dispersion X	Dispersion Y	Plane	Avg. Pupil Size X	Avg. Pupil Size Y

Table Header for Saccades:
Event Type	Trial	Number	Start	End	Duration	Start Loc.X	Start Loc.Y	End Loc.X	End Loc.Y	Amplitude	Peak Speed	Peak Speed At	Average Speed	Peak Accel.	Peak Decel.	Average Accel.

Table Header for Blinks:
Event Type	Trial	Number	Start	End	Duration

Table Header for User Events:
Event Type	Trial	Number	Start	Description

UserEvent	1	1	11305052359	# Message: the_forest_Cross_1907.jpg
Fixation L	1	1	11305052883	11305311348	258465	902.19	525.75	16	42	-1	11.43	11.43
Fixation R	1	1	11305052883	11305311348	258465	902.19	525.75	16	42	-1	13.83	13.83
Saccade L	1	1	11305311348	11305331347	19999	894.56	518.57	823.95	538.05	0.59	74.09	1.00	29.48	1336.67	-1757.19	1047.65
Saccade R	1	1	11305311348	11305331347	19999	894.56	518.57	823.95	538.05	0.59	74.09	1.00	29.48	1336.67	-1757.19	1047.65
Fixation L	1	2	11305331347	11305530226	198879	810.75	530.79	20	25	-1	11.35	11.35
Fixation R	1	2	11305331347	11305530226	198879	810.75	530.79	20	25	-1	13.96	13.96
Saccade L	1	2	11305530226	11305550091	19865	807.52	527.36	872.90	665.77	0.93	154.82	1.00	46.99	3631.77	-3743.10	2583.41
Saccade R	1	2	11305530226	11305550091	19865	807.52	527.36	872.90	665.77	0.93	154.82	1.00	46.99	3631.77	-3743.10	2583.41
Fixation L	1	3	11305550091	11306385425	835334	899.51	653.37	40	54	-1	9.97	9.97
Fixation R	1	3	11305550091	11306385425	835334	899.51	653.37	40	54	-1	11.69	11.69
Saccade L	1	3	11306385425	11306425306	39881	913.57	629.67	1167.35	708.05	2.30	204.84	0.50	57.78	5065.01	-4857.49	3272.00
Saccade R	1	3	11306385425	11306425306	39881	913.57	629.67	1167.35	708.05	2.30	204.84	0.50	57.78	5065.01	-4857.49	3272.00
Fixation L	1	4	11306425306	11306902658	477352	1160.91	720.04	21	37	-1	9.48	9.48
Fixation R	1	4	11306425306	11306902658	477352	1160.91	720.04	21	37	-1	10.70	10.70
Saccade L	1	4	11306902658	11306942419	39761	1169.71	706.68	869.79	683.75	2.63	171.31	0.50	66.08	4039.98	-3980.94	3637.80
Saccade R	1	4	11306902658	11306942419	39761	1169.71	706.68	869.79	683.75	2.63	171.31	0.50	66.08	4039.98	-3980.94	3637.80
Fixation L	1	5	11306942419	11307181024	238605	868.66	681.91	28	67	-1	9.49	9.49
Fixation R	1	5	11306942419	11307181024	238605	868.66	681.91	28	67	-1	10.47	10.47
Saccade L	1	5	11307181024	11307201014	19990	845.65	727.78	834.63	742.78	0.56	72.85	0.00	27.77	343.76	-1463.67	681.55
Saccade R	1	5	11307181024	11307201014	19990	845.65	727.78	834.63	742.78	0.56	72.85	0.00	27.77	343.76	-1463.67	681.55
Fixation L	1	6	11307201014	11307380017	179003	808.92	744.83	39	10	-1	9.62	9.62
Fixation R	1	6	11307201014	11307380017	179003	808.92	744.83	39	10	-1	10.61	10.61
Saccade L	1	6	11307380017	11307419762	39745	795.53	744.68	546.98	771.34	2.12	169.45	0.50	53.29	4188.55	-4046.24	2940.94
Saccade R	1	6	11307380017	11307419762	39745	795.53	744.68	546.98	771.34	2.12	169.45	0.50	53.29	4188.55	-4046.24	2940.94
Fixation L	1	7	11307419762	11307698263	278501	539.64	794.60	23	40	-1	9.95	9.95
Fixation R	1	7	11307419762	11307698263	278501	539.64	794.60	23	40	-1	11.33	11.33
Saccade L	1	7	11307698263	11307757872	59609	552.68	811.72	654.05	278.82	6.29	243.89	0.67	105.57	5537.41	-5563.51	3774.73
Saccade R	1	7	11307698263	11307757872	59609	552.68	811.72	654.05	278.82	6.29	243.89	0.67	105.57	5537.41	-5563.51	3774.73
Fixation L	1	8	11307757872	11308095974	338102	641.31	300.68	32	39	-1	8.74	8.74
Fixation R	1	8	11307757872	11308095974	338102	641.31	300.68	32	39	-1	10.50	10.50
Saccade L	1	8	11308095974	11308135858	39884	651.34	318.20	752.44	196.02	1.74	87.36	1.00	43.66	1740.69	-1456.25	1462.23
Saccade R	1	8	11308095974	11308135858	39884	651.34	318.20	752.44	196.02	1.74	87.36	1.00	43.66	1740.69	-1456.25	1462.23
Fixation L	1	9	11308135858	11308294976	159118	759.36	213.57	32	40	-1	9.14	9.14
Fixation R	1	9	11308135858	11308294976	159118	759.36	213.57	32	40	-1	10.92	10.92
Saccade L	1	9	11308294976	11308334716	39740	785.12	219.55	1442.54	147.05	6.08	433.90	0.50	153.02	10301.26	-9778.35	7706.95
Saccade R	1	9	11308294976	11308334716	39740	785.12	219.55	1442.54	147.05	6.08	433.90	0.50	153.02	10301.26	-9778.35	7706.95
Fixation L	1	10	11308334716	11308613217	278501	1413.06	168.73	42	52	-1	9.73	9.73
Fixation R	1	10	11308334716	11308613217	278501	1413.06	168.73	42	52	-1	11.15	11.15
Saccade L	1	10	11308613217	11308633081	19864	1400.04	199.88	1387.93	197.93	0.27	29.59	0.00	13.46	245.42	-507.99	297.97
Saccade R	1	10	11308613217	11308633081	19864	1400.04	199.88	1387.93	197.93	0.27	29.59	0.00	13.46	245.42	-507.99	297.97
Fixation L	1	11	11308633081	11308732455	99374	1388.16	194.94	7	7	-1	10.03	10.03
Fixation R	1	11	11308633081	11308732455	99374	1388.16	194.94	7	7	-1	10.82	10.82
Saccade L	1	11	11308732455	11308792202	59747	1386.87	192.23	1002.14	232.86	4.15	223.06	0.67	69.46	5459.63	-5127.54	3274.71
Saccade R	1	11	11308732455	11308792202	59747	1386.87	192.23	1002.14	232.86	4.15	223.06	0.67	69.46	5459.63	-5127.54	3274.71
Fixation L	1	12	11308792202	11309050816	258614	974.87	239.50	36	13	-1	10.24	10.24
Fixation R	1	12	11308792202	11309050816	258614	974.87	239.50	36	13	-1	11.40	11.40
