[BeGaze]
Converted from:	C:\Documents and Settings\iViewX\Desktop\EXPERIMENTATIONS\Experiments\results\finaleart\S19F21442-finaleart-1.idf
Date:	27.03.2019 15:50:58
Version:	BeGaze 2.5.77
Sample Rate:	50
Subject:	S19F21442
Description:	Juliette Veuillez

Table Header for Fixations:
Event Type	Trial	Number	Start	End	Duration	Location X	Location Y	Dispersion X	Dispersion Y	Plane	Avg. Pupil Size X	Avg. Pupil Size Y

Table Header for Saccades:
Event Type	Trial	Number	Start	End	Duration	Start Loc.X	Start Loc.Y	End Loc.X	End Loc.Y	Amplitude	Peak Speed	Peak Speed At	Average Speed	Peak Accel.	Peak Decel.	Average Accel.

Table Header for Blinks:
Event Type	Trial	Number	Start	End	Duration

Table Header for User Events:
Event Type	Trial	Number	Start	Description

UserEvent	1	1	6745612524	# Message: goya-Pavo-muerto-1812.jpg
Fixation L	1	1	6745620492	6746077963	457471	888.80	610.91	11	38	-1	12.75	12.75
Fixation R	1	1	6745620492	6746077963	457471	888.80	610.91	11	38	-1	14.74	14.74
Saccade L	1	1	6746077963	6746197338	119375	893.17	591.35	898.40	460.32	9.04	215.42	0.83	75.77	5287.54	-4825.35	3561.44
Saccade R	1	1	6746077963	6746197338	119375	893.17	591.35	898.40	460.32	9.04	215.42	0.83	75.77	5287.54	-4825.35	3561.44
Fixation L	1	2	6746197338	6746853684	656346	913.46	441.52	40	35	-1	12.13	12.13
Fixation R	1	2	6746197338	6746853684	656346	913.46	441.52	40	35	-1	14.26	14.26
Saccade L	1	2	6746853684	6746873553	19869	880.49	461.40	876.55	494.88	0.52	39.28	0.00	25.93	759.81	-315.89	407.07
Saccade R	1	2	6746853684	6746873553	19869	880.49	461.40	876.55	494.88	0.52	39.28	0.00	25.93	759.81	-315.89	407.07
Fixation L	1	3	6746873553	6747191794	318241	859.07	505.45	27	56	-1	13.26	13.26
Fixation R	1	3	6746873553	6747191794	318241	859.07	505.45	27	56	-1	15.31	15.31
Saccade L	1	3	6747191794	6747231659	39865	850.31	526.36	1008.15	519.62	1.63	100.90	1.00	40.94	1926.58	-2354.36	1718.39
Saccade R	1	3	6747191794	6747231659	39865	850.31	526.36	1008.15	519.62	1.63	100.90	1.00	40.94	1926.58	-2354.36	1718.39
Fixation L	1	4	6747231659	6747510027	278368	1012.01	522.22	18	10	-1	13.55	13.55
Fixation R	1	4	6747231659	6747510027	278368	1012.01	522.22	18	10	-1	15.48	15.48
Saccade L	1	4	6747510027	6747530054	20027	1018.80	516.99	1018.19	418.61	0.60	99.52	1.00	29.85	2453.57	-2434.28	1723.81
Saccade R	1	4	6747510027	6747530054	20027	1018.80	516.99	1018.19	418.61	0.60	99.52	1.00	29.85	2453.57	-2434.28	1723.81
Fixation L	1	5	6747530054	6747868134	338080	1017.89	404.97	13	50	-1	13.73	13.73
Fixation R	1	5	6747530054	6747868134	338080	1017.89	404.97	13	50	-1	15.64	15.64
Saccade L	1	5	6747868134	6747888016	19882	1024.23	420.66	899.10	434.35	1.02	127.31	1.00	51.21	3022.03	-1994.63	2071.30
Saccade R	1	5	6747868134	6747888016	19882	1024.23	420.66	899.10	434.35	1.02	127.31	1.00	51.21	3022.03	-1994.63	2071.30
Fixation L	1	6	6747888016	6748146628	258612	869.98	462.65	39	58	-1	14.09	14.09
Fixation R	1	6	6747888016	6748146628	258612	869.98	462.65	39	58	-1	16.06	16.06
Saccade L	1	6	6748146628	6748166493	19865	859.58	460.93	856.56	462.26	0.06	3.98	0.00	3.24	81.30	-38.02	41.16
Saccade R	1	6	6748146628	6748166493	19865	859.58	460.93	856.56	462.26	0.06	3.98	0.00	3.24	81.30	-38.02	41.16
Fixation L	1	7	6748166493	6748265866	99373	864.65	466.49	53	8	-1	14.25	14.25
Fixation R	1	7	6748166493	6748265866	99373	864.65	466.49	53	8	-1	16.25	16.25
Saccade L	1	7	6748265866	6748285747	19881	907.20	469.40	986.77	489.99	0.90	83.14	1.00	45.05	2026.38	-1882.40	1410.27
Saccade R	1	7	6748265866	6748285747	19881	907.20	469.40	986.77	489.99	0.90	83.14	1.00	45.05	2026.38	-1882.40	1410.27
Fixation L	1	8	6748285747	6748524488	238741	1010.40	517.49	30	42	-1	14.13	14.13
Fixation R	1	8	6748285747	6748524488	238741	1010.40	517.49	30	42	-1	16.24	16.24
Saccade L	1	8	6748524488	6748584106	59618	1014.32	522.41	348.81	1126.17	9.64	370.38	0.67	161.73	9208.27	-7888.40	6183.11
Saccade R	1	8	6748524488	6748584106	59618	1014.32	522.41	348.81	1126.17	9.64	370.38	0.67	161.73	9208.27	-7888.40	6183.11
Fixation L	1	9	6748584106	6748802973	218867	284.94	1139.94	78	20	-1	13.53	13.53
Fixation R	1	9	6748584106	6748802973	218867	284.94	1139.94	78	20	-1	16.09	16.09
Saccade L	1	9	6748802973	6748822848	19875	272.46	1138.74	249.14	1140.58	0.26	23.67	1.00	13.08	232.60	-308.95	252.50
Saccade R	1	9	6748802973	6748822848	19875	272.46	1138.74	249.14	1140.58	0.26	23.67	1.00	13.08	232.60	-308.95	252.50
Fixation L	1	10	6748822848	6749180830	357982	226.16	1139.68	59	11	-1	11.23	11.23
Fixation R	1	10	6748822848	6749180830	357982	226.16	1139.68	59	11	-1	14.28	14.28
Saccade L	1	10	6749180830	6749260452	79622	200.89	1136.55	1086.14	567.41	12.43	346.54	0.75	156.09	7930.77	-8444.52	5483.22
Saccade R	1	10	6749180830	6749260452	79622	200.89	1136.55	1086.14	567.41	12.43	346.54	0.75	156.09	7930.77	-8444.52	5483.22
Fixation L	1	11	6749260452	6749499071	238619	1098.90	549.78	18	33	-1	10.93	10.93
Fixation R	1	11	6749260452	6749499071	238619	1098.90	549.78	18	33	-1	12.91	12.91
Saccade L	1	11	6749499071	6749598561	99490	1089.67	533.60	1027.60	530.85	1.85	64.50	0.20	18.58	1554.01	-1549.66	615.44
Saccade R	1	11	6749499071	6749598561	99490	1089.67	533.60	1027.60	530.85	1.85	64.50	0.20	18.58	1554.01	-1549.66	615.44
