[BeGaze]
Converted from:	C:\Documents and Settings\iViewX\Desktop\EXPERIMENTATIONS\Experiments\results\finaleart\S11H21112-finaleart-1.idf
Date:	27.03.2019 15:39:35
Version:	BeGaze 2.5.77
Sample Rate:	50
Subject:	S11H21112
Description:	Clement legrand-Duchenne

Table Header for Fixations:
Event Type	Trial	Number	Start	End	Duration	Location X	Location Y	Dispersion X	Dispersion Y	Plane	Avg. Pupil Size X	Avg. Pupil Size Y

Table Header for Saccades:
Event Type	Trial	Number	Start	End	Duration	Start Loc.X	Start Loc.Y	End Loc.X	End Loc.Y	Amplitude	Peak Speed	Peak Speed At	Average Speed	Peak Accel.	Peak Decel.	Average Accel.

Table Header for Blinks:
Event Type	Trial	Number	Start	End	Duration

Table Header for User Events:
Event Type	Trial	Number	Start	Description

UserEvent	1	1	5631378555	# Message: La_Ferme_des_Collettes_Renoir_1908.jpg
Fixation L	1	1	5631394431	5632011148	616717	898.70	523.54	13	31	-1	12.73	12.73
Fixation R	1	1	5631394431	5632011148	616717	898.70	523.54	13	31	-1	14.53	14.53
Saccade L	1	1	5632011148	5632031156	20008	895.48	532.95	899.40	709.83	1.10	178.92	1.00	55.19	4344.08	-4436.44	3115.60
Saccade R	1	1	5632011148	5632031156	20008	895.48	532.95	899.40	709.83	1.10	178.92	1.00	55.19	4344.08	-4436.44	3115.60
Fixation L	1	2	5632031156	5632508630	477474	908.16	722.73	14	37	-1	13.71	13.71
Fixation R	1	2	5632031156	5632508630	477474	908.16	722.73	14	37	-1	15.73	15.73
Saccade L	1	2	5632508630	5632548493	39863	911.54	726.08	801.65	486.34	2.26	140.86	1.00	56.66	3410.22	-3425.61	3206.99
Saccade R	1	2	5632508630	5632548493	39863	911.54	726.08	801.65	486.34	2.26	140.86	1.00	56.66	3410.22	-3425.61	3206.99
Fixation L	1	3	5632548493	5632946363	397870	801.76	497.52	20	22	-1	13.64	13.64
Fixation R	1	3	5632548493	5632946363	397870	801.76	497.52	20	22	-1	15.94	15.94
Saccade L	1	3	5632946363	5632966353	19990	813.55	508.85	869.86	510.58	0.51	56.99	1.00	25.27	1350.39	-1285.58	884.90
Saccade R	1	3	5632946363	5632966353	19990	813.55	508.85	869.86	510.58	0.51	56.99	1.00	25.27	1350.39	-1285.58	884.90
Fixation L	1	4	5632966353	5633324463	358110	891.37	527.15	57	41	-1	13.21	13.21
Fixation R	1	4	5632966353	5633324463	358110	891.37	527.15	57	41	-1	15.69	15.69
Saccade L	1	4	5633324463	5633344339	19876	842.04	552.33	848.69	571.09	0.46	55.89	0.00	23.27	418.23	-1055.48	592.12
Saccade R	1	4	5633324463	5633344339	19876	842.04	552.33	848.69	571.09	0.46	55.89	0.00	23.27	418.23	-1055.48	592.12
Fixation L	1	5	5633344339	5633762195	417856	826.80	573.83	55	23	-1	13.58	13.58
Fixation R	1	5	5633344339	5633762195	417856	826.80	573.83	55	23	-1	15.58	15.58
Saccade L	1	5	5633762195	5633782072	19877	793.60	578.54	734.70	580.57	0.54	59.62	1.00	27.40	1397.93	-1474.80	1118.86
Saccade R	1	5	5633762195	5633782072	19877	793.60	578.54	734.70	580.57	0.54	59.62	1.00	27.40	1397.93	-1474.80	1118.86
Fixation L	1	6	5633782072	5634040812	258740	743.13	581.54	17	72	-1	13.29	13.29
Fixation R	1	6	5633782072	5634040812	258740	743.13	581.54	17	72	-1	15.21	15.21
Saccade L	1	6	5634040812	5634060684	19872	739.33	643.75	729.49	728.14	0.86	85.94	1.00	43.09	2118.63	-1864.00	1687.68
Saccade R	1	6	5634040812	5634060684	19872	739.33	643.75	729.49	728.14	0.86	85.94	1.00	43.09	2118.63	-1864.00	1687.68
Fixation L	1	7	5634060684	5634299422	238738	701.14	750.36	41	33	-1	13.59	13.59
Fixation R	1	7	5634060684	5634299422	238738	701.14	750.36	41	33	-1	15.23	15.23
Saccade L	1	7	5634299422	5634319427	20005	693.90	761.16	731.01	789.05	0.44	46.96	1.00	22.09	1147.20	-983.52	867.12
Saccade R	1	7	5634299422	5634319427	20005	693.90	761.16	731.01	789.05	0.44	46.96	1.00	22.09	1147.20	-983.52	867.12
Fixation L	1	8	5634319427	5634498413	178986	754.99	815.05	32	40	-1	13.71	13.71
Fixation R	1	8	5634319427	5634498413	178986	754.99	815.05	32	40	-1	15.61	15.61
Saccade L	1	8	5634498413	5634518430	20017	758.19	813.72	829.39	820.17	0.84	84.19	1.00	42.03	1953.31	-1599.32	1740.58
Saccade R	1	8	5634498413	5634518430	20017	758.19	813.72	829.39	820.17	0.84	84.19	1.00	42.03	1953.31	-1599.32	1740.58
Fixation L	1	9	5634518430	5634876527	358097	896.90	813.47	83	13	-1	13.85	13.85
Fixation R	1	9	5634518430	5634876527	358097	896.90	813.47	83	13	-1	15.88	15.88
Saccade L	1	9	5634876527	5634896403	19876	895.81	806.42	896.67	802.04	0.08	5.15	1.00	3.81	87.70	-88.71	63.64
Saccade R	1	9	5634876527	5634896403	19876	895.81	806.42	896.67	802.04	0.08	5.15	1.00	3.81	87.70	-88.71	63.64
Fixation L	1	10	5634896403	5635374005	477602	924.91	800.80	41	20	-1	13.75	13.75
Fixation R	1	10	5634896403	5635374005	477602	924.91	800.80	41	20	-1	16.04	16.04
