[BeGaze]
Converted from:	C:\Documents and Settings\iViewX\Desktop\EXPERIMENTATIONS\Experiments\results\finaleart\S12H22222-finaleart-1.idf
Date:	27.03.2019 15:40:57
Version:	BeGaze 2.5.77
Sample Rate:	50
Subject:	S12H22222
Description:	aurele barriere

Table Header for Fixations:
Event Type	Trial	Number	Start	End	Duration	Location X	Location Y	Dispersion X	Dispersion Y	Plane	Avg. Pupil Size X	Avg. Pupil Size Y

Table Header for Saccades:
Event Type	Trial	Number	Start	End	Duration	Start Loc.X	Start Loc.Y	End Loc.X	End Loc.Y	Amplitude	Peak Speed	Peak Speed At	Average Speed	Peak Accel.	Peak Decel.	Average Accel.

Table Header for Blinks:
Event Type	Trial	Number	Start	End	Duration

Table Header for User Events:
Event Type	Trial	Number	Start	Description

UserEvent	1	1	23922417851	# Message: the-pointe-de-per-kiridec-at-roscoff_Rysselberghe_0.jpg
Fixation L	1	1	23922430800	23922848516	417716	991.14	471.82	15	50	-1	12.47	12.47
Fixation R	1	1	23922430800	23922848516	417716	991.14	471.82	15	50	-1	12.01	12.01
Saccade L	1	1	23922848516	23922868384	19868	1002.47	489.59	1038.43	604.94	0.77	122.22	1.00	38.63	2955.70	-2908.18	1975.11
Saccade R	1	1	23922848516	23922868384	19868	1002.47	489.59	1038.43	604.94	0.77	122.22	1.00	38.63	2955.70	-2908.18	1975.11
Fixation L	1	2	23922868384	23923186617	318233	1057.16	598.70	30	24	-1	10.86	10.86
Fixation R	1	2	23922868384	23923186617	318233	1057.16	598.70	30	24	-1	10.56	10.56
Saccade L	1	2	23923186617	23923246246	59629	1068.98	589.65	1491.95	508.45	4.61	212.31	0.67	77.27	5236.26	-5078.84	3110.36
Saccade R	1	2	23923186617	23923246246	59629	1068.98	589.65	1491.95	508.45	4.61	212.31	0.67	77.27	5236.26	-5078.84	3110.36
Fixation L	1	3	23923246246	23923484977	238731	1495.27	506.50	8	25	-1	9.27	9.27
Fixation R	1	3	23923246246	23923484977	238731	1495.27	506.50	8	25	-1	9.16	9.16
Saccade L	1	3	23923484977	23923544601	59624	1494.94	502.68	859.18	515.62	6.54	257.98	0.67	109.64	6410.55	-6258.36	4465.90
Saccade R	1	3	23923484977	23923544601	59624	1494.94	502.68	859.18	515.62	6.54	257.98	0.67	109.64	6410.55	-6258.36	4465.90
Fixation L	1	4	23923544601	23924021954	477353	859.88	512.18	10	29	-1	9.48	9.48
Fixation R	1	4	23923544601	23924021954	477353	859.88	512.18	10	29	-1	9.36	9.36
Saccade L	1	4	23924021954	23924061707	39753	865.08	512.70	997.92	928.09	4.32	266.89	0.50	108.60	6605.63	-4585.84	4880.82
Saccade R	1	4	23924021954	23924061707	39753	865.08	512.70	997.92	928.09	4.32	266.89	0.50	108.60	6605.63	-4585.84	4880.82
Fixation L	1	5	23924061707	23924300448	238741	997.35	867.05	15	82	-1	10.33	10.33
Fixation R	1	5	23924061707	23924300448	238741	997.35	867.05	15	82	-1	10.17	10.17
Saccade L	1	5	23924300448	23924320319	19871	989.22	859.00	986.58	858.24	0.05	5.06	0.00	2.67	22.43	-102.39	51.68
Saccade R	1	5	23924300448	23924320319	19871	989.22	859.00	986.58	858.24	0.05	5.06	0.00	2.67	22.43	-102.39	51.68
Fixation L	1	6	23924320319	23924857422	537103	968.86	862.69	58	41	-1	10.35	10.35
Fixation R	1	6	23924320319	23924857422	537103	968.86	862.69	58	41	-1	10.00	10.00
Saccade L	1	6	23924857422	23924877294	19872	944.43	838.34	968.69	809.89	0.73	64.78	1.00	36.82	898.97	-587.43	678.41
Saccade R	1	6	23924857422	23924877294	19872	944.43	838.34	968.69	809.89	0.73	64.78	1.00	36.82	898.97	-587.43	678.41
Fixation L	1	7	23924877294	23924976666	99372	992.35	759.31	33	64	-1	10.40	10.40
Fixation R	1	7	23924877294	23924976666	99372	992.35	759.31	33	64	-1	9.93	9.93
Saccade L	1	7	23924976666	23924996660	19994	1001.56	751.27	996.30	717.00	0.28	35.07	1.00	13.89	753.53	-835.19	597.62
Saccade R	1	7	23924976666	23924996660	19994	1001.56	751.27	996.30	717.00	0.28	35.07	1.00	13.89	753.53	-835.19	597.62
Fixation L	1	8	23924996660	23926130360	1133700	1001.29	727.41	10	37	-1	10.53	10.53
Fixation R	1	8	23924996660	23926130360	1133700	1001.29	727.41	10	37	-1	10.26	10.26
Saccade L	1	8	23926130360	23926150239	19879	1000.39	719.07	919.12	673.67	0.73	94.16	1.00	36.71	2345.83	-1977.66	1533.81
Saccade R	1	8	23926130360	23926150239	19879	1000.39	719.07	919.12	673.67	0.73	94.16	1.00	36.71	2345.83	-1977.66	1533.81
Fixation L	1	9	23926150239	23926408857	258618	908.46	636.46	13	50	-1	10.85	10.85
Fixation R	1	9	23926150239	23926408857	258618	908.46	636.46	13	50	-1	10.46	10.46
