[BeGaze]
Converted from:	C:\Documents and Settings\iViewX\Desktop\EXPERIMENTATIONS\Experiments\results\finaleart\S18F56223-finaleart-1.idf
Date:	27.03.2019 15:48:07
Version:	BeGaze 2.5.77
Sample Rate:	50
Subject:	S18F56223
Description:	Pascale Sebillot

Table Header for Fixations:
Event Type	Trial	Number	Start	End	Duration	Location X	Location Y	Dispersion X	Dispersion Y	Plane	Avg. Pupil Size X	Avg. Pupil Size Y

Table Header for Saccades:
Event Type	Trial	Number	Start	End	Duration	Start Loc.X	Start Loc.Y	End Loc.X	End Loc.Y	Amplitude	Peak Speed	Peak Speed At	Average Speed	Peak Accel.	Peak Decel.	Average Accel.

Table Header for Blinks:
Event Type	Trial	Number	Start	End	Duration

Table Header for User Events:
Event Type	Trial	Number	Start	Description

UserEvent	1	1	2172464159	# Message: void.jpg
Fixation L	1	1	2172481632	2173078357	596725	1327.37	757.11	28	70	-1	14.90	14.90
Fixation R	1	1	2172481632	2173078357	596725	1327.37	757.11	28	70	-1	13.49	13.49
Saccade L	1	1	2173078357	2173138107	59750	1325.27	768.44	1219.67	670.93	3.01	135.89	0.67	50.45	3368.15	-2395.89	1669.69
Saccade R	1	1	2173078357	2173138107	59750	1325.27	768.44	1219.67	670.93	3.01	135.89	0.67	50.45	3368.15	-2395.89	1669.69
Fixation L	1	2	2173138107	2173356841	218734	1201.33	672.01	26	72	-1	14.24	14.24
Fixation R	1	2	2173138107	2173356841	218734	1201.33	672.01	26	72	-1	13.49	13.49
Saccade L	1	2	2173356841	2173456337	99496	1197.78	653.52	912.34	648.64	4.02	175.81	0.80	40.40	4336.49	-3995.30	1878.50
Saccade R	1	2	2173356841	2173456337	99496	1197.78	653.52	912.34	648.64	4.02	175.81	0.80	40.40	4336.49	-3995.30	1878.50
Fixation L	1	3	2173456337	2173615447	159110	918.69	647.63	69	23	-1	14.47	14.47
Fixation R	1	3	2173456337	2173615447	159110	918.69	647.63	69	23	-1	13.54	13.54
Saccade L	1	3	2173615447	2173694943	79496	861.41	661.00	347.25	662.26	7.29	273.90	0.25	91.76	6550.19	-6387.23	2696.56
Saccade R	1	3	2173615447	2173694943	79496	861.41	661.00	347.25	662.26	7.29	273.90	0.25	91.76	6550.19	-6387.23	2696.56
Fixation L	1	4	2173694943	2173794445	99502	345.43	650.41	48	24	-1	14.81	14.81
Fixation R	1	4	2173694943	2173794445	99502	345.43	650.41	48	24	-1	13.85	13.85
Saccade L	1	4	2173794445	2173814322	19877	338.34	641.69	314.67	622.80	0.41	34.83	1.00	20.53	707.97	-256.35	491.98
Saccade R	1	4	2173794445	2173814322	19877	338.34	641.69	314.67	622.80	0.41	34.83	1.00	20.53	707.97	-256.35	491.98
Fixation L	1	5	2173814322	2174013186	198864	329.60	601.79	31	66	-1	14.91	14.91
Fixation R	1	5	2173814322	2174013186	198864	329.60	601.79	31	66	-1	14.17	14.17
Saccade L	1	5	2174013186	2174072937	59751	325.90	578.75	873.73	679.97	6.66	358.29	0.67	111.40	8892.46	-8298.31	5705.49
Saccade R	1	5	2174013186	2174072937	59751	325.90	578.75	873.73	679.97	6.66	358.29	0.67	111.40	8892.46	-8298.31	5705.49
Fixation L	1	6	2174072937	2174450795	377858	888.33	681.41	25	50	-1	14.77	14.77
Fixation R	1	6	2174072937	2174450795	377858	888.33	681.41	25	50	-1	14.06	14.06
