[BeGaze]
Converted from:	C:\Documents and Settings\iViewX\Desktop\EXPERIMENTATIONS\Experiments\results\finaleart\S9H29221-finaleart-1.idf
Date:	27.03.2019 16:03:42
Version:	BeGaze 2.5.77
Sample Rate:	50
Subject:	S9H29221
Description:	steven

Table Header for Fixations:
Event Type	Trial	Number	Start	End	Duration	Location X	Location Y	Dispersion X	Dispersion Y	Plane	Avg. Pupil Size X	Avg. Pupil Size Y

Table Header for Saccades:
Event Type	Trial	Number	Start	End	Duration	Start Loc.X	Start Loc.Y	End Loc.X	End Loc.Y	Amplitude	Peak Speed	Peak Speed At	Average Speed	Peak Accel.	Peak Decel.	Average Accel.

Table Header for Blinks:
Event Type	Trial	Number	Start	End	Duration

Table Header for User Events:
Event Type	Trial	Number	Start	Description

UserEvent	1	1	6596483602	# Message: still-life-with-a-puro-(II)_matisse_1904.jpg
Saccade L	1	1	6596501184	6596698681	197497	1151.85	476.46	1066.29	506.75	18.50	363.34	0.30	93.69	8972.05	-7684.27	3361.59
Saccade R	1	1	6596501184	6596540938	39754	1151.85	476.46	1143.64	474.14	3.70	363.34	1.00	93.05	8972.05	0.00	3556.18
Blink R	1	1	6596540938	6596720044	179106
Fixation L	1	1	6596698681	6597001747	303066	1082.94	470.78	39	56	-1	13.80	13.80
Fixation R	1	1	6596720044	6597217264	497220	1099.31	450.50	46	51	-1	13.56	13.56
Saccade L	1	2	6597001747	6597029754	28007	1100.72	458.38	1104.02	441.41	0.22	17.49	1.00	7.93	226.51	-307.81	202.92
Fixation L	1	2	6597029754	6597217264	187510	1111.06	436.08	12	12	-1	13.37	13.37
Saccade L	1	3	6597217264	6597257013	39749	1114.64	432.06	905.90	502.25	1.99	138.62	0.50	50.16	3355.79	-2926.25	2544.23
Saccade R	1	2	6597217264	6597257013	39749	1114.64	432.06	905.90	502.25	1.99	138.62	0.50	50.16	3355.79	-2926.25	2544.23
Fixation L	1	3	6597257013	6597436027	179014	910.16	522.18	24	33	-1	12.38	12.38
Fixation R	1	2	6597257013	6597436027	179014	910.16	522.18	24	33	-1	12.48	12.48
Saccade L	1	4	6597436027	6597455887	19860	898.06	535.91	711.32	559.58	1.33	190.36	1.00	66.80	4481.05	-4651.07	3158.00
Saccade R	1	3	6597436027	6597455887	19860	898.06	535.91	711.32	559.58	1.33	190.36	1.00	66.80	4481.05	-4651.07	3158.00
Fixation L	1	4	6597455887	6597654886	198999	680.11	583.29	40	34	-1	11.15	11.15
Fixation R	1	3	6597455887	6597654886	198999	680.11	583.29	40	34	-1	11.63	11.63
Saccade L	1	5	6597654886	6597694618	39732	676.37	591.76	565.65	414.42	1.90	156.62	1.00	47.91	3902.48	-3731.15	2446.07
Saccade R	1	4	6597654886	6597694618	39732	676.37	591.76	565.65	414.42	1.90	156.62	1.00	47.91	3902.48	-3731.15	2446.07
Fixation L	1	5	6597694618	6598092350	397732	554.27	398.25	27	38	-1	10.05	10.05
Fixation R	1	4	6597694618	6598092350	397732	554.27	398.25	27	38	-1	10.59	10.59
Saccade L	1	6	6598092350	6598112227	19877	546.62	375.57	615.51	377.11	0.46	69.71	1.00	23.05	1606.85	-1596.46	1096.51
Saccade R	1	5	6598092350	6598112227	19877	546.62	375.57	615.51	377.11	0.46	69.71	1.00	23.05	1606.85	-1596.46	1096.51
Fixation L	1	6	6598112227	6598271350	159123	633.20	379.06	60	17	-1	9.66	9.66
Fixation R	1	5	6598112227	6598271350	159123	633.20	379.06	60	17	-1	10.29	10.29
Saccade L	1	7	6598271350	6598311225	39875	675.84	390.44	1010.10	554.57	3.47	238.11	0.50	87.07	5862.81	-5897.26	4495.35
Saccade R	1	6	6598271350	6598311225	39875	675.84	390.44	1010.10	554.57	3.47	238.11	0.50	87.07	5862.81	-5897.26	4495.35
Fixation L	1	7	6598311225	6598430586	119361	1021.97	552.70	72	8	-1	9.43	9.43
Fixation R	1	6	6598311225	6598430586	119361	1021.97	552.70	72	8	-1	10.08	10.08
Saccade L	1	8	6598430586	6598470338	39752	1081.85	550.10	1465.16	538.98	3.65	239.92	0.50	91.87	5989.06	-5939.82	4353.39
Saccade R	1	7	6598430586	6598470338	39752	1081.85	550.10	1465.16	538.98	3.65	239.92	0.50	91.87	5989.06	-5939.82	4353.39
Fixation L	1	8	6598470338	6598728833	258495	1445.61	527.89	36	18	-1	9.34	9.34
Fixation R	1	7	6598470338	6598728833	258495	1445.61	527.89	36	18	-1	10.05	10.05
Saccade L	1	9	6598728833	6598788582	59749	1429.55	523.14	888.52	657.14	5.84	258.44	0.67	97.73	6402.48	-6035.68	4032.49
Saccade R	1	8	6598728833	6598788582	59749	1429.55	523.14	888.52	657.14	5.84	258.44	0.67	97.73	6402.48	-6035.68	4032.49
Fixation L	1	9	6598788582	6598987430	198848	869.62	647.58	65	21	-1	9.08	9.08
Fixation R	1	8	6598788582	6598987430	198848	869.62	647.58	65	21	-1	9.61	9.61
Saccade L	1	10	6598987430	6599007323	19893	823.25	643.51	775.12	648.84	0.58	48.99	1.00	29.28	1016.49	-1059.92	980.30
Saccade R	1	9	6598987430	6599007323	19893	823.25	643.51	775.12	648.84	0.58	48.99	1.00	29.28	1016.49	-1059.92	980.30
Fixation L	1	10	6599007323	6599325555	318232	741.01	641.09	81	13	-1	8.90	8.90
Fixation R	1	9	6599007323	6599325555	318232	741.01	641.09	81	13	-1	9.54	9.54
Saccade L	1	11	6599325555	6599345422	19867	693.93	636.35	685.45	634.48	0.14	12.20	1.00	7.14	334.21	134.62	223.14
Saccade R	1	10	6599325555	6599345422	19867	693.93	636.35	685.45	634.48	0.14	12.20	1.00	7.14	334.21	134.62	223.14
Fixation L	1	11	6599345422	6599643781	298359	637.48	636.07	69	9	-1	8.69	8.69
Fixation R	1	10	6599345422	6599643781	298359	637.48	636.07	69	9	-1	9.39	9.39
Saccade L	1	12	6599643781	6599703533	59752	633.10	632.56	773.40	534.32	2.09	90.17	0.67	35.03	1862.14	-1875.28	1247.63
Saccade R	1	11	6599643781	6599703533	59752	633.10	632.56	773.40	534.32	2.09	90.17	0.67	35.03	1862.14	-1875.28	1247.63
Fixation L	1	12	6599703533	6599902391	198858	822.15	514.25	71	26	-1	8.73	8.73
Fixation R	1	11	6599703533	6599902391	198858	822.15	514.25	71	26	-1	9.39	9.39
Saccade L	1	13	6599902391	6599922273	19882	844.59	507.97	849.59	508.18	0.06	5.06	1.00	2.84	92.91	-69.24	56.19
Saccade R	1	12	6599902391	6599922273	19882	844.59	507.97	849.59	508.18	0.06	5.06	1.00	2.84	92.91	-69.24	56.19
Fixation L	1	13	6599922273	6600200750	278477	854.08	512.62	7	8	-1	8.76	8.76
Fixation R	1	12	6599922273	6600200750	278477	854.08	512.62	7	8	-1	9.35	9.35
Saccade L	1	14	6600200750	6600220625	19875	850.31	514.64	765.49	479.66	0.78	92.81	1.00	39.14	2310.65	-2160.57	1941.71
Saccade R	1	13	6600200750	6600220625	19875	850.31	514.64	765.49	479.66	0.78	92.81	1.00	39.14	2310.65	-2160.57	1941.71
Fixation L	1	14	6600220625	6600320125	99500	739.80	430.68	32	65	-1	8.74	8.74
Fixation R	1	13	6600220625	6600320125	99500	739.80	430.68	32	65	-1	9.25	9.25
Saccade L	1	15	6600320125	6600339997	19872	733.29	414.33	730.79	411.68	0.10	6.86	0.00	5.13	153.00	-42.94	75.10
Saccade R	1	14	6600320125	6600339997	19872	733.29	414.33	730.79	411.68	0.10	6.86	0.00	5.13	153.00	-42.94	75.10
Fixation L	1	15	6600339997	6600439364	99367	724.19	412.73	40	27	-1	8.79	8.79
Fixation R	1	14	6600339997	6600439364	99367	724.19	412.73	40	27	-1	9.35	9.35
Saccade L	1	16	6600439364	6600479235	39871	691.89	398.37	634.86	381.18	1.91	102.59	0.50	47.99	2391.74	0.00	823.26
Saccade R	1	15	6600439364	6600479235	39871	691.89	398.37	634.86	381.18	1.91	102.59	0.50	47.99	2391.74	0.00	823.26
