[BeGaze]
Converted from:	C:\Documents and Settings\iViewX\Desktop\EXPERIMENTATIONS\Experiments\results\finaleart\S19F21442-finaleart-1.idf
Date:	27.03.2019 15:50:36
Version:	BeGaze 2.5.77
Sample Rate:	50
Subject:	S19F21442
Description:	Juliette Veuillez

Table Header for Fixations:
Event Type	Trial	Number	Start	End	Duration	Location X	Location Y	Dispersion X	Dispersion Y	Plane	Avg. Pupil Size X	Avg. Pupil Size Y

Table Header for Saccades:
Event Type	Trial	Number	Start	End	Duration	Start Loc.X	Start Loc.Y	End Loc.X	End Loc.Y	Amplitude	Peak Speed	Peak Speed At	Average Speed	Peak Accel.	Peak Decel.	Average Accel.

Table Header for Blinks:
Event Type	Trial	Number	Start	End	Duration

Table Header for User Events:
Event Type	Trial	Number	Start	Description

UserEvent	1	1	6305705904	# Message: void.jpg
Saccade L	1	1	6305724938	6305844294	119356	408.70	605.30	380.66	709.04	5.21	109.03	0.83	43.62	2002.30	-2226.67	1137.47
Saccade R	1	1	6305724938	6305844294	119356	408.70	605.30	380.66	709.04	5.21	109.03	0.83	43.62	2002.30	-2226.67	1137.47
Fixation L	1	1	6305844294	6305943702	99408	372.20	709.35	17	12	-1	12.97	12.97
Fixation R	1	1	6305844294	6305943702	99408	372.20	709.35	17	12	-1	15.50	15.50
Saccade L	1	2	6305943702	6305983543	39841	372.85	712.60	443.86	652.00	0.95	91.46	0.50	23.88	2192.45	-2237.61	1330.13
Saccade R	1	2	6305943702	6305983543	39841	372.85	712.60	443.86	652.00	0.95	91.46	0.50	23.88	2192.45	-2237.61	1330.13
Fixation L	1	2	6305983543	6306341539	357996	463.52	673.15	37	61	-1	12.84	12.84
Fixation R	1	2	6305983543	6306341539	357996	463.52	673.15	37	61	-1	15.40	15.40
Saccade L	1	3	6306341539	6306361410	19871	472.51	679.30	479.69	678.05	0.09	7.36	1.00	4.50	76.88	-86.36	70.48
Saccade R	1	3	6306341539	6306361410	19871	472.51	679.30	479.69	678.05	0.09	7.36	1.00	4.50	76.88	-86.36	70.48
Fixation L	1	3	6306361410	6306878504	517094	479.26	685.02	25	31	-1	10.79	10.79
Fixation R	1	3	6306361410	6306878504	517094	479.26	685.02	25	31	-1	13.09	13.09
Blink L	1	1	6306878504	6307017746	139242
Blink R	1	1	6306878504	6307017746	139242
Fixation L	1	4	6307017746	6307694094	676348	801.32	560.81	25	63	-1	11.78	11.78
Fixation R	1	4	6307017746	6307694094	676348	801.32	560.81	25	63	-1	13.58	13.58
