[BeGaze]
Converted from:	C:\Documents and Settings\iViewX\Desktop\EXPERIMENTATIONS\Experiments\results\finaleart\S19F21442-finaleart-1.idf
Date:	27.03.2019 15:51:09
Version:	BeGaze 2.5.77
Sample Rate:	50
Subject:	S19F21442
Description:	Juliette Veuillez

Table Header for Fixations:
Event Type	Trial	Number	Start	End	Duration	Location X	Location Y	Dispersion X	Dispersion Y	Plane	Avg. Pupil Size X	Avg. Pupil Size Y

Table Header for Saccades:
Event Type	Trial	Number	Start	End	Duration	Start Loc.X	Start Loc.Y	End Loc.X	End Loc.Y	Amplitude	Peak Speed	Peak Speed At	Average Speed	Peak Accel.	Peak Decel.	Average Accel.

Table Header for Blinks:
Event Type	Trial	Number	Start	End	Duration

Table Header for User Events:
Event Type	Trial	Number	Start	Description

UserEvent	1	1	7142723647	# Message: Kiprensky-standing-sitter-with-a-stick-sitter-on-a-rock-1801.jpg
Fixation L	1	1	7142724920	7142963522	238602	810.72	623.61	29	34	-1	15.14	15.14
Fixation R	1	1	7142724920	7142963522	238602	810.72	623.61	29	34	-1	16.04	16.04
Saccade L	1	1	7142963522	7142983396	19874	834.39	600.05	848.79	571.62	0.51	42.84	0.00	25.73	679.23	-501.57	524.71
Saccade R	1	1	7142963522	7142983396	19874	834.39	600.05	848.79	571.62	0.51	42.84	0.00	25.73	679.23	-501.57	524.71
Fixation L	1	2	7142983396	7143162392	178996	869.88	565.06	26	20	-1	15.34	15.34
Fixation R	1	2	7142983396	7143162392	178996	869.88	565.06	26	20	-1	16.16	16.16
Saccade L	1	2	7143162392	7143202260	39868	875.65	562.01	659.76	194.71	3.93	277.38	1.00	98.53	6871.45	-6140.39	5054.99
Saccade R	1	2	7143162392	7143202260	39868	875.65	562.01	659.76	194.71	3.93	277.38	1.00	98.53	6871.45	-6140.39	5054.99
Fixation L	1	3	7143202260	7143301645	99385	620.96	215.22	56	35	-1	13.56	13.56
Fixation R	1	3	7143202260	7143301645	99385	620.96	215.22	56	35	-1	14.65	14.65
Saccade L	1	3	7143301645	7143421021	119376	612.69	216.85	579.04	493.01	5.62	145.91	0.83	47.09	3610.69	-2529.37	1778.54
Saccade R	1	3	7143301645	7143421021	119376	612.69	216.85	579.04	493.01	5.62	145.91	0.83	47.09	3610.69	-2529.37	1778.54
Fixation L	1	4	7143421021	7143580132	159111	570.02	513.76	32	42	-1	11.02	11.02
Fixation R	1	4	7143421021	7143580132	159111	570.02	513.76	32	42	-1	11.59	11.59
Saccade L	1	4	7143580132	7143619871	39739	558.13	500.80	560.22	107.41	3.42	313.56	0.50	86.16	7461.36	-7753.58	4712.52
Saccade R	1	4	7143580132	7143619871	39739	558.13	500.80	560.22	107.41	3.42	313.56	0.50	86.16	7461.36	-7753.58	4712.52
Fixation L	1	5	7143619871	7143798862	178991	558.63	107.52	7	25	-1	10.76	10.76
Fixation R	1	5	7143619871	7143798862	178991	558.63	107.52	7	25	-1	11.22	11.22
Saccade L	1	5	7143798862	7143858613	59751	558.26	118.60	1326.40	274.67	7.99	326.63	0.67	133.69	8134.80	-8158.72	5579.89
Saccade R	1	5	7143798862	7143858613	59751	558.26	118.60	1326.40	274.67	7.99	326.63	0.67	133.69	8134.80	-8158.72	5579.89
Fixation L	1	6	7143858613	7144156970	298357	1335.42	292.95	55	37	-1	12.00	12.00
Fixation R	1	6	7143858613	7144156970	298357	1335.42	292.95	55	37	-1	11.83	11.83
Saccade L	1	6	7144156970	7144176844	19874	1373.54	312.52	1378.16	326.69	0.13	15.08	1.00	6.40	251.68	-214.77	168.35
Saccade R	1	6	7144156970	7144176844	19874	1373.54	312.52	1378.16	326.69	0.13	15.08	1.00	6.40	251.68	-214.77	168.35
Fixation L	1	7	7144176844	7144455333	278489	1381.49	344.57	26	63	-1	12.25	12.25
Fixation R	1	7	7144176844	7144455333	278489	1381.49	344.57	26	63	-1	11.83	11.83
Saccade L	1	7	7144455333	7144475215	19882	1403.11	387.93	1388.22	551.55	1.17	166.16	1.00	58.80	4062.55	-3562.12	2771.19
Saccade R	1	7	7144455333	7144475215	19882	1403.11	387.93	1388.22	551.55	1.17	166.16	1.00	58.80	4062.55	-3562.12	2771.19
Fixation L	1	8	7144475215	7144733706	258491	1419.32	565.52	39	24	-1	12.30	12.30
Fixation R	1	8	7144475215	7144733706	258491	1419.32	565.52	39	24	-1	12.14	12.14
Saccade L	1	8	7144733706	7144773571	39865	1421.92	568.07	1578.85	755.07	2.19	203.08	1.00	54.93	4950.29	-5046.62	2969.79
Saccade R	1	8	7144733706	7144773571	39865	1421.92	568.07	1578.85	755.07	2.19	203.08	1.00	54.93	4950.29	-5046.62	2969.79
Fixation L	1	9	7144773571	7144952583	179012	1604.48	748.65	59	10	-1	12.77	12.77
Fixation R	1	9	7144773571	7144952583	179012	1604.48	748.65	59	10	-1	11.98	11.98
Saccade L	1	9	7144952583	7144992316	39733	1619.13	747.58	1481.46	1071.66	3.18	223.79	0.50	79.94	5251.35	-5399.74	4441.21
Saccade R	1	9	7144952583	7144992316	39733	1619.13	747.58	1481.46	1071.66	3.18	223.79	0.50	79.94	5251.35	-5399.74	4441.21
Fixation L	1	10	7144992316	7145250928	258612	1481.72	1055.78	12	25	-1	12.52	12.52
Fixation R	1	10	7144992316	7145250928	258612	1481.72	1055.78	12	25	-1	11.84	11.84
Saccade L	1	10	7145250928	7145310549	59621	1475.37	1047.41	632.00	967.17	8.94	344.71	0.67	149.90	8579.50	-7804.17	5990.74
Saccade R	1	10	7145250928	7145310549	59621	1475.37	1047.41	632.00	967.17	8.94	344.71	0.67	149.90	8579.50	-7804.17	5990.74
Fixation L	1	11	7145310549	7145489540	178991	592.06	959.21	55	15	-1	12.33	12.33
Fixation R	1	11	7145310549	7145489540	178991	592.06	959.21	55	15	-1	12.45	12.45
Saccade L	1	11	7145489540	7145549290	59750	576.65	959.02	576.89	279.11	7.02	326.53	0.67	117.44	8096.25	-8042.72	5759.07
Saccade R	1	11	7145489540	7145549290	59750	576.65	959.02	576.89	279.11	7.02	326.53	0.67	117.44	8096.25	-8042.72	5759.07
Fixation L	1	12	7145549290	7145867535	318245	583.45	328.88	11	69	-1	11.87	11.87
Fixation R	1	12	7145549290	7145867535	318245	583.45	328.88	11	69	-1	12.29	12.29
Saccade L	1	12	7145867535	7145887398	19863	581.35	346.36	590.60	493.02	1.03	148.62	1.00	51.61	3664.29	-3578.59	2835.44
Saccade R	1	12	7145867535	7145887398	19863	581.35	346.36	590.60	493.02	1.03	148.62	1.00	51.61	3664.29	-3578.59	2835.44
Fixation L	1	13	7145887398	7146046517	159119	601.40	542.95	19	64	-1	12.53	12.53
Fixation R	1	13	7145887398	7146046517	159119	601.40	542.95	19	64	-1	13.08	13.08
Saccade L	1	13	7146046517	7146086290	39773	610.52	540.12	569.14	65.02	4.05	247.98	0.50	101.84	6009.78	-5923.29	5781.29
Saccade R	1	13	7146046517	7146086290	39773	610.52	540.12	569.14	65.02	4.05	247.98	0.50	101.84	6009.78	-5923.29	5781.29
Fixation L	1	14	7146086290	7146503995	417705	558.95	99.24	23	68	-1	12.67	12.67
Fixation R	1	14	7146086290	7146503995	417705	558.95	99.24	23	68	-1	13.38	13.38
Saccade L	1	14	7146503995	7146523874	19879	569.56	125.62	577.62	135.17	0.14	12.64	1.00	6.96	213.65	-114.61	111.61
Saccade R	1	14	7146503995	7146523874	19879	569.56	125.62	577.62	135.17	0.14	12.64	1.00	6.96	213.65	-114.61	111.61
Fixation L	1	15	7146523874	7146702866	178992	582.59	150.74	12	28	-1	13.34	13.34
Fixation R	1	15	7146523874	7146702866	178992	582.59	150.74	12	28	-1	13.92	13.92
Saccade L	1	15	7146702866	7146722733	19867	584.43	160.36	718.25	162.09	0.94	135.37	1.00	47.31	3302.65	0.00	1651.33
Saccade R	1	15	7146702866	7146722733	19867	584.43	160.36	718.25	162.09	0.94	135.37	1.00	47.31	3302.65	0.00	1651.33
