[BeGaze]
Converted from:	C:\Documents and Settings\iViewX\Desktop\EXPERIMENTATIONS\Experiments\results\finaleart\S02123220-finaleart-1.idf
Date:	27.03.2019 15:33:36
Version:	BeGaze 2.5.77
Sample Rate:	50
Subject:	S02123220
Description:	David Xu

Table Header for Fixations:
Event Type	Trial	Number	Start	End	Duration	Location X	Location Y	Dispersion X	Dispersion Y	Plane	Avg. Pupil Size X	Avg. Pupil Size Y

Table Header for Saccades:
Event Type	Trial	Number	Start	End	Duration	Start Loc.X	Start Loc.Y	End Loc.X	End Loc.Y	Amplitude	Peak Speed	Peak Speed At	Average Speed	Peak Accel.	Peak Decel.	Average Accel.

Table Header for Blinks:
Event Type	Trial	Number	Start	End	Duration

Table Header for User Events:
Event Type	Trial	Number	Start	Description

UserEvent	1	1	1174329609	# Message: Odalisque_Matisse.jpg
Fixation L	1	1	1174341197	1174758917	417720	905.69	400.47	6	54	-1	16.67	16.67
Fixation R	1	1	1174341197	1174758917	417720	905.69	400.47	6	54	-1	14.83	14.83
Saccade L	1	1	1174758917	1174818675	59758	907.94	432.65	547.81	309.03	4.52	168.00	0.67	75.63	3938.77	-3411.00	2788.99
Saccade R	1	1	1174758917	1174818675	59758	907.94	432.65	547.81	309.03	4.52	168.00	0.67	75.63	3938.77	-3411.00	2788.99
Fixation L	1	2	1174818675	1175017516	198841	568.81	287.24	31	61	-1	15.87	15.87
Fixation R	1	2	1174818675	1175017516	198841	568.81	287.24	31	61	-1	14.42	14.42
Saccade L	1	2	1175017516	1175077148	59632	577.31	287.42	945.94	537.64	5.22	277.94	0.67	87.58	6744.18	-6821.12	3747.64
Saccade R	1	2	1175017516	1175077148	59632	577.31	287.42	945.94	537.64	5.22	277.94	0.67	87.58	6744.18	-6821.12	3747.64
Fixation L	1	3	1175077148	1175276018	198870	945.21	545.08	10	15	-1	15.31	15.31
Fixation R	1	3	1175077148	1175276018	198870	945.21	545.08	10	15	-1	13.24	13.24
Saccade L	1	3	1175276018	1175315883	39865	940.68	536.67	693.99	321.03	3.19	230.48	1.00	80.11	5698.71	-5724.24	3706.74
Saccade R	1	3	1175276018	1175315883	39865	940.68	536.67	693.99	321.03	3.19	230.48	1.00	80.11	5698.71	-5724.24	3706.74
Fixation L	1	4	1175315883	1175614240	298357	705.83	286.99	22	55	-1	15.62	15.62
Fixation R	1	4	1175315883	1175614240	298357	705.83	286.99	22	55	-1	13.99	13.99
Saccade L	1	4	1175614240	1175653991	39751	713.33	308.38	957.94	695.91	4.04	262.16	0.50	101.68	6329.21	-5955.24	5562.43
Saccade R	1	4	1175614240	1175653991	39751	713.33	308.38	957.94	695.91	4.04	262.16	0.50	101.68	6329.21	-5955.24	5562.43
Fixation L	1	5	1175653991	1175852852	198861	974.46	715.58	22	43	-1	16.49	16.49
Fixation R	1	5	1175653991	1175852852	198861	974.46	715.58	22	43	-1	14.66	14.66
Saccade L	1	5	1175852852	1175892602	39750	971.58	723.73	735.94	527.27	2.90	215.15	1.00	73.05	5162.01	-5228.49	4159.57
Saccade R	1	5	1175852852	1175892602	39750	971.58	723.73	735.94	527.27	2.90	215.15	1.00	73.05	5162.01	-5228.49	4159.57
Fixation L	1	6	1175892602	1176290453	397851	749.90	550.81	23	45	-1	16.03	16.03
Fixation R	1	6	1175892602	1176290453	397851	749.90	550.81	23	45	-1	14.33	14.33
Saccade L	1	6	1176290453	1176330197	39744	752.37	557.50	1024.79	534.73	2.44	160.48	1.00	61.52	3914.90	-3881.45	3245.32
Saccade R	1	6	1176290453	1176330197	39744	752.37	557.50	1024.79	534.73	2.44	160.48	1.00	61.52	3914.90	-3881.45	3245.32
Fixation L	1	7	1176330197	1176549065	218868	1044.31	518.57	26	64	-1	16.73	16.73
Fixation R	1	7	1176330197	1176549065	218868	1044.31	518.57	26	64	-1	14.62	14.62
Saccade L	1	7	1176549065	1176568936	19871	1050.67	569.13	1167.25	653.72	1.27	145.69	1.00	64.04	3285.98	-3618.34	2356.86
Saccade R	1	7	1176549065	1176568936	19871	1050.67	569.13	1167.25	653.72	1.27	145.69	1.00	64.04	3285.98	-3618.34	2356.86
Fixation L	1	8	1176568936	1176827414	258478	1175.61	687.36	12	44	-1	17.51	17.51
Fixation R	1	8	1176568936	1176827414	258478	1175.61	687.36	12	44	-1	14.99	14.99
Saccade L	1	8	1176827414	1176887162	59748	1174.06	697.99	958.60	887.22	3.37	193.55	0.67	56.34	4828.30	-4286.26	2307.52
Saccade R	1	8	1176827414	1176887162	59748	1174.06	697.99	958.60	887.22	3.37	193.55	0.67	56.34	4828.30	-4286.26	2307.52
Fixation L	1	9	1176887162	1177066160	178998	949.61	890.19	23	58	-1	17.46	17.46
Fixation R	1	9	1176887162	1177066160	178998	949.61	890.19	23	58	-1	15.17	15.17
Saccade L	1	9	1177066160	1177284878	218718	935.57	850.97	703.59	360.51	17.87	376.14	0.09	81.68	9374.46	-6644.98	2961.33
Saccade R	1	9	1177066160	1177284878	218718	935.57	850.97	703.59	360.51	17.87	376.14	0.09	81.68	9374.46	-6644.98	2961.33
Fixation L	1	10	1177284878	1177483874	198996	718.25	383.54	56	40	-1	16.63	16.63
Fixation R	1	10	1177284878	1177483874	198996	718.25	383.54	56	40	-1	15.20	15.20
Saccade L	1	10	1177483874	1177523625	39751	672.02	396.61	911.63	307.91	2.86	189.70	1.00	71.93	3309.45	-4358.17	2504.82
Saccade R	1	10	1177483874	1177523625	39751	672.02	396.61	911.63	307.91	2.86	189.70	1.00	71.93	3309.45	-4358.17	2504.82
Fixation L	1	11	1177523625	1177682745	159120	942.16	306.54	41	37	-1	17.03	17.03
Fixation R	1	11	1177523625	1177682745	159120	942.16	306.54	41	37	-1	15.23	15.23
Saccade L	1	11	1177682745	1177722498	39753	942.94	322.25	1307.36	545.24	3.73	260.95	1.00	93.87	6397.85	-6250.22	5099.06
Saccade R	1	11	1177682745	1177722498	39753	942.94	322.25	1307.36	545.24	3.73	260.95	1.00	93.87	6397.85	-6250.22	5099.06
Fixation L	1	12	1177722498	1178000973	278475	1313.50	573.05	14	43	-1	17.65	17.65
Fixation R	1	12	1177722498	1178000973	278475	1313.50	573.05	14	43	-1	15.20	15.20
Saccade L	1	12	1178000973	1178120344	119371	1307.56	588.59	657.31	1152.34	14.23	290.35	0.33	119.17	7216.15	-4633.07	3172.21
Saccade R	1	12	1178000973	1178120344	119371	1307.56	588.59	657.31	1152.34	14.23	290.35	0.33	119.17	7216.15	-4633.07	3172.21
Fixation L	1	13	1178120344	1178239704	119360	668.17	1168.50	20	38	-1	17.11	17.11
Fixation R	1	13	1178120344	1178239704	119360	668.17	1168.50	20	38	-1	15.03	15.03
Saccade L	1	13	1178239704	1178319204	79500	677.69	1168.89	449.51	1168.28	3.78	223.69	0.25	47.52	5292.62	-5505.42	2245.15
Saccade R	1	13	1178239704	1178319204	79500	677.69	1168.89	449.51	1168.28	3.78	223.69	0.25	47.52	5292.62	-5505.42	2245.15
