[BeGaze]
Converted from:	C:\Documents and Settings\iViewX\Desktop\EXPERIMENTATIONS\Experiments\results\finaleart\S20H24222-finaleart-1.idf
Date:	27.03.2019 15:53:15
Version:	BeGaze 2.5.77
Sample Rate:	50
Subject:	S20H24222
Description:	Hugo Brument

Table Header for Fixations:
Event Type	Trial	Number	Start	End	Duration	Location X	Location Y	Dispersion X	Dispersion Y	Plane	Avg. Pupil Size X	Avg. Pupil Size Y

Table Header for Saccades:
Event Type	Trial	Number	Start	End	Duration	Start Loc.X	Start Loc.Y	End Loc.X	End Loc.Y	Amplitude	Peak Speed	Peak Speed At	Average Speed	Peak Accel.	Peak Decel.	Average Accel.

Table Header for Blinks:
Event Type	Trial	Number	Start	End	Duration

Table Header for User Events:
Event Type	Trial	Number	Start	Description

UserEvent	1	1	11809876894	# Message: Automne_En_France_Carr_1911.jpg
Fixation L	1	1	11809889131	11810048401	159270	886.12	495.14	3	22	-1	14.53	14.53
Fixation R	1	1	11809889131	11810048401	159270	886.12	495.14	3	22	-1	16.16	16.16
Saccade L	1	1	11810048401	11810068087	19686	887.87	495.50	972.08	506.81	0.54	85.95	1.00	27.34	2021.96	-1821.91	1365.40
Saccade R	1	1	11810048401	11810068087	19686	887.87	495.50	972.08	506.81	0.54	85.95	1.00	27.34	2021.96	-1821.91	1365.40
Fixation L	1	2	11810068087	11810465972	397885	956.09	498.34	27	29	-1	14.55	14.55
Fixation R	1	2	11810068087	11810465972	397885	956.09	498.34	27	29	-1	16.13	16.13
Saccade L	1	2	11810465972	11810485854	19882	959.23	494.19	803.64	501.85	0.87	157.55	1.00	43.93	3861.82	-3427.20	2490.60
Saccade R	1	2	11810465972	11810485854	19882	959.23	494.19	803.64	501.85	0.87	157.55	1.00	43.93	3861.82	-3427.20	2490.60
Fixation L	1	3	11810485854	11810863687	377833	772.80	470.18	41	55	-1	11.44	11.44
Fixation R	1	3	11810485854	11810863687	377833	772.80	470.18	41	55	-1	13.00	13.00
Saccade L	1	3	11810863687	11810883567	19880	762.38	450.54	731.22	426.28	0.51	57.32	1.00	25.82	1310.03	-814.29	1031.74
Saccade R	1	3	11810863687	11810883567	19880	762.38	450.54	731.22	426.28	0.51	57.32	1.00	25.82	1310.03	-814.29	1031.74
Fixation L	1	4	11810883567	11811162071	278504	674.10	417.17	66	28	-1	9.75	9.75
Fixation R	1	4	11810883567	11811162071	278504	674.10	417.17	66	28	-1	11.16	11.16
Saccade L	1	4	11811162071	11811221672	59601	674.16	413.93	1386.66	612.13	7.89	360.35	0.67	132.33	8942.15	-8489.48	6167.55
Saccade R	1	4	11811162071	11811221672	59601	674.16	413.93	1386.66	612.13	7.89	360.35	0.67	132.33	8942.15	-8489.48	6167.55
Fixation L	1	5	11811221672	11811599674	378002	1375.91	613.52	18	45	-1	9.92	9.92
Fixation R	1	5	11811221672	11811599674	378002	1375.91	613.52	18	45	-1	10.86	10.86
Saccade L	1	5	11811599674	11811619536	19862	1381.14	621.36	1523.15	706.57	1.03	167.50	1.00	51.79	4073.93	-4086.58	2951.19
Saccade R	1	5	11811599674	11811619536	19862	1381.14	621.36	1523.15	706.57	1.03	167.50	1.00	51.79	4073.93	-4086.58	2951.19
Fixation L	1	6	11811619536	11812256009	636473	1503.37	742.95	42	56	-1	10.02	10.02
Fixation R	1	6	11811619536	11812256009	636473	1503.37	742.95	42	56	-1	10.83	10.83
Saccade L	1	6	11812256009	11812315756	59747	1481.10	718.13	874.14	949.27	7.16	337.26	0.33	119.87	8202.10	-7867.52	5990.39
Saccade R	1	6	11812256009	11812315756	59747	1481.10	718.13	874.14	949.27	7.16	337.26	0.33	119.87	8202.10	-7867.52	5990.39
Fixation L	1	7	11812315756	11812574241	258485	868.13	937.30	19	70	-1	11.04	11.04
Fixation R	1	7	11812315756	11812574241	258485	868.13	937.30	19	70	-1	12.01	12.01
Saccade L	1	7	11812574241	11812653853	79612	873.57	943.73	1013.66	423.05	6.63	246.22	0.75	83.22	5251.22	-5893.69	2923.18
Saccade R	1	7	11812574241	11812653853	79612	873.57	943.73	1013.66	423.05	6.63	246.22	0.75	83.22	5251.22	-5893.69	2923.18
Fixation L	1	8	11812653853	11812812977	159124	1021.98	387.73	20	57	-1	11.29	11.29
Fixation R	1	8	11812653853	11812812977	159124	1021.98	387.73	20	57	-1	12.42	12.42
Saccade L	1	8	11812812977	11812852734	39757	1015.40	384.06	705.97	200.38	3.60	222.59	0.50	90.67	5164.40	-4827.59	4421.50
Saccade R	1	8	11812812977	11812852734	39757	1015.40	384.06	705.97	200.38	3.60	222.59	0.50	90.67	5164.40	-4827.59	4421.50
Fixation L	1	9	11812852734	11813867064	1014330	708.69	166.46	20	69	-1	10.99	10.99
Fixation R	1	9	11812852734	11813867064	1014330	708.69	166.46	20	69	-1	12.13	12.13
