[BeGaze]
Converted from:	C:\Documents and Settings\iViewX\Desktop\EXPERIMENTATIONS\Experiments\results\finaleart\S20H24222-finaleart-1.idf
Date:	27.03.2019 15:52:07
Version:	BeGaze 2.5.77
Sample Rate:	50
Subject:	S20H24222
Description:	Hugo Brument

Table Header for Fixations:
Event Type	Trial	Number	Start	End	Duration	Location X	Location Y	Dispersion X	Dispersion Y	Plane	Avg. Pupil Size X	Avg. Pupil Size Y

Table Header for Saccades:
Event Type	Trial	Number	Start	End	Duration	Start Loc.X	Start Loc.Y	End Loc.X	End Loc.Y	Amplitude	Peak Speed	Peak Speed At	Average Speed	Peak Accel.	Peak Decel.	Average Accel.

Table Header for Blinks:
Event Type	Trial	Number	Start	End	Duration

Table Header for User Events:
Event Type	Trial	Number	Start	Description

UserEvent	1	1	11062929341	# Message: REJECTED_Volga_Lagoon_Vassiliev_1870.jpg
Fixation L	1	1	11062929556	11063367159	437603	916.66	466.83	15	37	-1	11.51	11.51
Fixation R	1	1	11062929556	11063367159	437603	916.66	466.83	15	37	-1	13.44	13.44
Saccade L	1	1	11063367159	11063406900	39741	919.13	483.20	876.38	673.73	1.80	118.81	1.00	45.29	2720.81	-2865.00	2265.85
Saccade R	1	1	11063367159	11063406900	39741	919.13	483.20	876.38	673.73	1.80	118.81	1.00	45.29	2720.81	-2865.00	2265.85
Fixation L	1	2	11063406900	11063705275	298375	858.24	662.39	24	34	-1	10.23	10.23
Fixation R	1	2	11063406900	11063705275	298375	858.24	662.39	24	34	-1	12.16	12.16
Saccade L	1	2	11063705275	11063745017	39742	855.16	657.82	510.67	646.68	3.06	233.82	1.00	77.08	5654.19	-5653.37	4080.33
Saccade R	1	2	11063705275	11063745017	39742	855.16	657.82	510.67	646.68	3.06	233.82	1.00	77.08	5654.19	-5653.37	4080.33
Fixation L	1	3	11063745017	11064083124	338107	463.47	646.65	68	26	-1	8.94	8.94
Fixation R	1	3	11063745017	11064083124	338107	463.47	646.65	68	26	-1	10.61	10.61
Saccade L	1	3	11064083124	11064102985	19861	442.33	628.83	440.44	619.73	0.14	10.26	1.00	6.80	170.45	-72.10	125.15
Saccade R	1	3	11064083124	11064102985	19861	442.33	628.83	440.44	619.73	0.14	10.26	1.00	6.80	170.45	-72.10	125.15
Fixation L	1	4	11064102985	11064242251	139266	440.82	628.04	13	22	-1	8.22	8.22
Fixation R	1	4	11064102985	11064242251	139266	440.82	628.04	13	22	-1	10.04	10.04
Saccade L	1	4	11064242251	11064282119	39868	449.05	625.01	380.45	875.89	2.45	141.09	1.00	61.50	3081.73	-3219.05	2937.94
Saccade R	1	4	11064242251	11064282119	39868	449.05	625.01	380.45	875.89	2.45	141.09	1.00	61.50	3081.73	-3219.05	2937.94
Fixation L	1	5	11064282119	11064600352	318233	360.58	890.62	30	47	-1	8.26	8.26
Fixation R	1	5	11064282119	11064600352	318233	360.58	890.62	30	47	-1	9.90	9.90
Saccade L	1	5	11064600352	11064759462	159110	369.87	913.91	282.17	284.92	12.95	291.16	0.12	81.39	6708.39	-5540.98	2551.62
Saccade R	1	5	11064600352	11064719616	119264	369.87	913.91	223.54	275.85	11.13	291.16	0.17	93.36	6708.39	-5540.98	3138.20
Fixation R	1	6	11064719616	11064898584	178968	244.12	276.54	58	21	-1	9.87	9.87
Fixation L	1	6	11064799215	11064898584	99369	236.50	276.44	24	16	-1	10.43	10.43
Saccade L	1	6	11064898584	11064938478	39894	252.27	279.45	485.08	221.86	2.19	123.47	0.50	54.92	2965.05	-2925.06	2682.97
Saccade R	1	6	11064898584	11064938478	39894	252.27	279.45	485.08	221.86	2.19	123.47	0.50	54.92	2965.05	-2925.06	2682.97
Fixation L	1	7	11064938478	11065117449	178971	470.09	187.55	21	59	-1	11.06	11.06
Fixation R	1	7	11064938478	11065117449	178971	470.09	187.55	21	59	-1	10.50	10.50
Saccade L	1	7	11065117449	11065177070	59621	469.54	173.16	1192.04	284.69	7.62	413.11	0.67	127.73	10227.78	-9806.36	6422.36
Saccade R	1	7	11065117449	11065177070	59621	469.54	173.16	1192.04	284.69	7.62	413.11	0.67	127.73	10227.78	-9806.36	6422.36
Fixation L	1	8	11065177070	11065395928	218858	1194.23	306.96	17	34	-1	11.39	11.39
Fixation R	1	8	11065177070	11065395928	218858	1194.23	306.96	17	34	-1	10.13	10.13
Saccade L	1	8	11065395928	11065435691	39763	1202.05	309.78	1479.43	327.23	2.39	191.27	1.00	60.22	4734.99	-4320.55	3273.00
Saccade R	1	8	11065395928	11065435691	39763	1202.05	309.78	1479.43	327.23	2.39	191.27	1.00	60.22	4734.99	-4320.55	3273.00
Fixation L	1	9	11065435691	11065674296	238605	1480.88	346.29	11	36	-1	11.70	11.70
Fixation R	1	9	11065435691	11065674296	238605	1480.88	346.29	11	36	-1	10.00	10.00
Saccade L	1	9	11065674296	11065694175	19879	1477.31	362.45	1541.56	467.96	0.79	124.95	1.00	39.62	3101.50	-2943.87	2181.76
Saccade R	1	9	11065674296	11065694175	19879	1477.31	362.45	1541.56	467.96	0.79	124.95	1.00	39.62	3101.50	-2943.87	2181.76
Fixation L	1	10	11065694175	11066052294	358119	1542.74	498.31	13	44	-1	12.67	12.67
Fixation R	1	10	11065694175	11066052294	358119	1542.74	498.31	13	44	-1	10.50	10.50
Saccade L	1	10	11066052294	11066072165	19871	1539.62	491.68	1451.72	521.41	0.53	93.86	1.00	26.66	2287.13	-1990.85	1465.14
Saccade R	1	10	11066052294	11066072165	19871	1539.62	491.68	1451.72	521.41	0.53	93.86	1.00	26.66	2287.13	-1990.85	1465.14
Fixation L	1	11	11066072165	11066251203	179038	1445.44	537.93	20	33	-1	12.66	12.66
Fixation R	1	11	11066072165	11066251203	179038	1445.44	537.93	20	33	-1	10.64	10.64
Saccade L	1	11	11066251203	11066271020	19817	1458.23	553.81	1561.09	779.52	1.50	250.77	1.00	75.74	6218.08	-5579.90	4009.58
Saccade R	1	11	11066251203	11066271020	19817	1458.23	553.81	1561.09	779.52	1.50	250.77	1.00	75.74	6218.08	-5579.90	4009.58
Fixation L	1	12	11066271020	11066907494	636474	1572.26	843.36	20	78	-1	12.82	12.82
Fixation R	1	12	11066271020	11066907494	636474	1572.26	843.36	20	78	-1	10.68	10.68
Saccade L	1	12	11066907494	11066927494	20000	1571.46	853.12	1573.44	680.11	1.24	174.98	1.00	61.78	4278.38	0.00	2139.19
Saccade R	1	12	11066907494	11066927494	20000	1571.46	853.12	1573.44	680.11	1.24	174.98	1.00	61.78	4278.38	0.00	2139.19
