[BeGaze]
Converted from:	C:\Documents and Settings\iViewX\Desktop\EXPERIMENTATIONS\Experiments\results\finaleart\S20H24222-finaleart-1.idf
Date:	27.03.2019 15:53:48
Version:	BeGaze 2.5.77
Sample Rate:	50
Subject:	S20H24222
Description:	Hugo Brument

Table Header for Fixations:
Event Type	Trial	Number	Start	End	Duration	Location X	Location Y	Dispersion X	Dispersion Y	Plane	Avg. Pupil Size X	Avg. Pupil Size Y

Table Header for Saccades:
Event Type	Trial	Number	Start	End	Duration	Start Loc.X	Start Loc.Y	End Loc.X	End Loc.Y	Amplitude	Peak Speed	Peak Speed At	Average Speed	Peak Accel.	Peak Decel.	Average Accel.

Table Header for Blinks:
Event Type	Trial	Number	Start	End	Duration

Table Header for User Events:
Event Type	Trial	Number	Start	Description

UserEvent	1	1	12181806581	# Message: lair_of_the_sea_serpent_vedder_1899.jpg
Fixation L	1	1	12181811039	12182785636	974597	880.65	574.99	13	85	-1	11.54	11.54
Fixation R	1	1	12181811039	12182785636	974597	880.65	574.99	13	85	-1	11.78	11.78
Saccade L	1	1	12182785636	12182805491	19855	877.60	597.58	800.48	609.24	0.46	78.91	1.00	22.92	1920.04	-1449.84	1192.30
Saccade R	1	1	12182785636	12182805491	19855	877.60	597.58	800.48	609.24	0.46	78.91	1.00	22.92	1920.04	-1449.84	1192.30
Fixation L	1	2	12182805491	12183243092	437601	795.23	621.38	23	31	-1	9.94	9.94
Fixation R	1	2	12182805491	12183243092	437601	795.23	621.38	23	31	-1	10.08	10.08
Saccade L	1	2	12183243092	12183282842	39750	798.32	619.89	1201.72	627.48	3.52	261.47	1.00	88.47	6494.25	-6149.77	4789.88
Saccade R	1	2	12183243092	12183282842	39750	798.32	619.89	1201.72	627.48	3.52	261.47	1.00	88.47	6494.25	-6149.77	4789.88
Fixation L	1	3	12183282842	12183541460	258618	1240.32	649.59	49	38	-1	10.45	10.45
Fixation R	1	3	12183282842	12183541460	258618	1240.32	649.59	49	38	-1	10.25	10.25
Saccade L	1	3	12183541460	12183581204	39744	1250.73	665.04	1444.51	670.99	1.67	107.28	1.00	41.92	2647.84	-2579.13	2341.29
Saccade R	1	3	12183541460	12183581204	39744	1250.73	665.04	1444.51	670.99	1.67	107.28	1.00	41.92	2647.84	-2579.13	2341.29
Fixation L	1	4	12183581204	12183979063	397859	1439.58	683.28	65	26	-1	10.83	10.83
Fixation R	1	4	12183581204	12183979063	397859	1439.58	683.28	65	26	-1	10.46	10.46
Saccade L	1	4	12183979063	12183998944	19881	1498.32	680.33	1554.68	666.74	0.68	64.17	0.00	34.11	1229.66	-1500.84	1361.50
Saccade R	1	4	12183979063	12183998944	19881	1498.32	680.33	1554.68	666.74	0.68	64.17	0.00	34.11	1229.66	-1500.84	1361.50
Fixation L	1	5	12183998944	12184138183	139239	1544.47	670.45	21	9	-1	11.39	11.39
Fixation R	1	5	12183998944	12184138183	139239	1544.47	670.45	21	9	-1	10.46	10.46
Saccade L	1	5	12184138183	12184197802	59619	1533.26	673.64	794.87	665.77	7.54	386.80	0.67	126.51	9548.13	-9529.51	6457.36
Saccade R	1	5	12184138183	12184197802	59619	1533.26	673.64	794.87	665.77	7.54	386.80	0.67	126.51	9548.13	-9529.51	6457.36
Fixation L	1	6	12184197802	12184794528	596726	773.51	650.59	36	60	-1	10.75	10.75
Fixation R	1	6	12184197802	12184794528	596726	773.51	650.59	36	60	-1	10.71	10.71
Saccade L	1	6	12184794528	12184814400	19872	797.95	635.56	804.78	636.71	0.24	16.77	0.00	11.83	-16.15	-162.92	112.16
Saccade R	1	6	12184794528	12184814400	19872	797.95	635.56	804.78	636.71	0.24	16.77	0.00	11.83	-16.15	-162.92	112.16
Fixation L	1	7	12184814400	12185212280	397880	807.98	607.11	16	42	-1	10.56	10.56
Fixation R	1	7	12184814400	12185212280	397880	807.98	607.11	16	42	-1	10.53	10.53
Saccade L	1	7	12185212280	12185252001	39721	808.23	594.77	568.12	582.07	1.99	157.86	0.50	50.12	3914.83	-3818.77	2961.20
Saccade R	1	7	12185212280	12185252001	39721	808.23	594.77	568.12	582.07	1.99	157.86	0.50	50.12	3914.83	-3818.77	2961.20
Fixation L	1	8	12185252001	12185411124	159123	568.15	567.52	18	25	-1	10.59	10.59
Fixation R	1	8	12185252001	12185411124	159123	568.15	567.52	18	25	-1	10.85	10.85
Saccade L	1	8	12185411124	12185450871	39747	554.77	556.98	163.84	559.15	3.42	292.80	0.50	86.12	7219.31	-6885.45	4680.23
Saccade R	1	8	12185411124	12185450871	39747	554.77	556.98	163.84	559.15	3.42	292.80	0.50	86.12	7219.31	-6885.45	4680.23
Fixation L	1	9	12185450871	12185709491	258620	178.55	554.07	26	33	-1	10.12	10.12
Fixation R	1	9	12185450871	12185709491	258620	178.55	554.07	26	33	-1	10.61	10.61
Saccade L	1	9	12185709491	12185788977	79486	190.23	579.78	1005.03	490.97	11.71	373.41	0.50	147.27	8727.88	-9036.89	4766.06
Saccade R	1	9	12185709491	12185788977	79486	190.23	579.78	1005.03	490.97	11.71	373.41	0.50	147.27	8727.88	-9036.89	4766.06
