[BeGaze]
Converted from:	C:\Documents and Settings\iViewX\Desktop\EXPERIMENTATIONS\Experiments\results\finaleart\S14F27123-finaleart-1.idf
Date:	27.03.2019 15:43:53
Version:	BeGaze 2.5.77
Sample Rate:	50
Subject:	S14F27123
Description:	Anne-flore Perrin

Table Header for Fixations:
Event Type	Trial	Number	Start	End	Duration	Location X	Location Y	Dispersion X	Dispersion Y	Plane	Avg. Pupil Size X	Avg. Pupil Size Y

Table Header for Saccades:
Event Type	Trial	Number	Start	End	Duration	Start Loc.X	Start Loc.Y	End Loc.X	End Loc.Y	Amplitude	Peak Speed	Peak Speed At	Average Speed	Peak Accel.	Peak Decel.	Average Accel.

Table Header for Blinks:
Event Type	Trial	Number	Start	End	Duration

Table Header for User Events:
Event Type	Trial	Number	Start	Description

UserEvent	1	1	31520893488	# Message: void.jpg
Fixation L	1	1	31520896831	31521075817	178986	1411.89	684.58	44	46	-1	12.56	12.56
Fixation R	1	1	31520896831	31521075817	178986	1411.89	684.58	44	46	-1	12.47	12.47
Saccade L	1	1	31521075817	31521155436	79619	1400.82	686.94	1539.48	1008.27	25.81	1800.02	1.00	324.13	45624.05	-6161.47	17867.86
Saccade R	1	1	31521075817	31521155436	79619	1400.82	686.94	1539.48	1008.27	25.81	1800.02	1.00	324.13	45624.05	-6161.47	17867.86
Fixation L	1	2	31521215086	31521413926	198840	1552.12	1002.78	42	13	-1	21.18	21.18
Fixation R	1	2	31521215086	31521413926	198840	1552.12	1002.78	42	13	-1	12.51	12.51
Blink L	1	1	31521413926	31521891399	477473
Blink R	1	1	31521413926	31521891399	477473
Fixation L	1	3	31521891399	31522289136	397737	824.51	552.64	21	45	-1	13.05	13.05
Fixation R	1	3	31521891399	31522289136	397737	824.51	552.64	21	45	-1	14.27	14.27
Saccade L	1	2	31522289136	31522309012	19876	818.05	547.38	685.72	545.85	0.74	133.85	1.00	37.43	3279.20	-3010.95	2155.05
Saccade R	1	2	31522289136	31522309012	19876	818.05	547.38	685.72	545.85	0.74	133.85	1.00	37.43	3279.20	-3010.95	2155.05
Fixation L	1	4	31522309012	31522746618	437606	701.76	552.93	58	40	-1	11.36	11.36
Fixation R	1	4	31522309012	31522746618	437606	701.76	552.93	58	40	-1	12.16	12.16
Saccade L	1	3	31522746618	31522766491	19873	737.72	568.12	738.54	565.13	0.17	24.27	1.00	8.44	81.71	-528.31	232.93
Saccade R	1	3	31522746618	31522766491	19873	737.72	568.12	738.54	565.13	0.17	24.27	1.00	8.44	81.71	-528.31	232.93
Fixation L	1	5	31522766491	31522885858	119367	740.78	568.42	8	16	-1	11.22	11.22
Fixation R	1	5	31522766491	31522885858	119367	740.78	568.42	8	16	-1	12.55	12.55
