[BeGaze]
Converted from:	C:\Documents and Settings\iViewX\Desktop\EXPERIMENTATIONS\Experiments\results\finaleart\S18F56223-finaleart-1.idf
Date:	27.03.2019 15:48:00
Version:	BeGaze 2.5.77
Sample Rate:	50
Subject:	S18F56223
Description:	Pascale Sebillot

Table Header for Fixations:
Event Type	Trial	Number	Start	End	Duration	Location X	Location Y	Dispersion X	Dispersion Y	Plane	Avg. Pupil Size X	Avg. Pupil Size Y

Table Header for Saccades:
Event Type	Trial	Number	Start	End	Duration	Start Loc.X	Start Loc.Y	End Loc.X	End Loc.Y	Amplitude	Peak Speed	Peak Speed At	Average Speed	Peak Accel.	Peak Decel.	Average Accel.

Table Header for Blinks:
Event Type	Trial	Number	Start	End	Duration

Table Header for User Events:
Event Type	Trial	Number	Start	Description

UserEvent	1	1	2117475467	# Message: void.jpg
Saccade L	1	1	2117485578	2117565039	79461	944.39	332.86	1583.35	819.15	16.65	421.60	0.25	209.50	8340.41	-9313.31	4283.45
Saccade R	1	1	2117485578	2117565039	79461	944.39	332.86	1583.35	819.15	16.65	421.60	0.25	209.50	8340.41	-9313.31	4283.45
Fixation L	1	1	2117565039	2118102133	537094	1550.17	827.91	42	39	-1	12.79	12.79
Fixation R	1	1	2117565039	2118102133	537094	1550.17	827.91	42	39	-1	13.03	13.03
Saccade L	1	2	2118102133	2118141880	39747	1544.44	825.41	1406.22	658.34	2.13	170.16	1.00	53.53	4150.69	-4100.79	2443.45
Saccade R	1	2	2118102133	2118141880	39747	1544.44	825.41	1406.22	658.34	2.13	170.16	1.00	53.53	4150.69	-4100.79	2443.45
Fixation L	1	2	2118141880	2118241382	99502	1374.60	662.12	51	41	-1	12.31	12.31
Fixation R	1	2	2118141880	2118241382	99502	1374.60	662.12	51	41	-1	12.10	12.10
Saccade L	1	3	2118241382	2118261254	19872	1354.58	686.05	1119.68	705.24	1.69	238.28	1.00	85.27	5446.12	-5896.42	3854.23
Saccade R	1	3	2118241382	2118261254	19872	1354.58	686.05	1119.68	705.24	1.69	238.28	1.00	85.27	5446.12	-5896.42	3854.23
Fixation L	1	3	2118261254	2118360625	99371	1107.34	680.99	18	42	-1	11.35	11.35
Fixation R	1	3	2118261254	2118360625	99371	1107.34	680.99	18	42	-1	11.85	11.85
Saccade L	1	4	2118360625	2119096596	735971	1102.05	692.36	1006.32	788.64	137.50	450.05	0.97	186.83	8553.43	-11216.39	4237.86
Saccade R	1	4	2118360625	2119096596	735971	1102.05	692.36	1006.32	788.64	137.50	450.05	0.97	186.83	8553.43	-11216.39	4237.86
Fixation L	1	4	2119096596	2119215967	119371	997.33	793.12	56	16	-1	12.73	12.73
Fixation R	1	4	2119096596	2119215967	119371	997.33	793.12	56	16	-1	13.40	13.40
Saccade L	1	5	2119215967	2119474455	258488	949.86	784.39	934.38	706.50	15.10	154.93	0.23	58.40	2857.16	-2194.58	937.34
Saccade R	1	5	2119215967	2119474455	258488	949.86	784.39	934.38	706.50	15.10	154.93	0.23	58.40	2857.16	-2194.58	937.34
