[BeGaze]
Converted from:	C:\Documents and Settings\iViewX\Desktop\EXPERIMENTATIONS\Experiments\results\finaleart\S5121332-finaleart-1.idf
Date:	27.03.2019 15:35:14
Version:	BeGaze 2.5.77
Sample Rate:	50
Subject:	S5121332
Description:	Dylan Marinho

Table Header for Fixations:
Event Type	Trial	Number	Start	End	Duration	Location X	Location Y	Dispersion X	Dispersion Y	Plane	Avg. Pupil Size X	Avg. Pupil Size Y

Table Header for Saccades:
Event Type	Trial	Number	Start	End	Duration	Start Loc.X	Start Loc.Y	End Loc.X	End Loc.Y	Amplitude	Peak Speed	Peak Speed At	Average Speed	Peak Accel.	Peak Decel.	Average Accel.

Table Header for Blinks:
Event Type	Trial	Number	Start	End	Duration

Table Header for User Events:
Event Type	Trial	Number	Start	Description

UserEvent	1	1	9618023100	# Message: the_forest_Cross_1907.jpg
Fixation L	1	1	9618034983	9618432827	397844	969.06	488.13	20	18	-1	15.28	15.28
Fixation R	1	1	9618034983	9618432827	397844	969.06	488.13	20	18	-1	14.99	14.99
Saccade L	1	1	9618432827	9618472589	39762	961.22	481.57	957.24	674.87	1.62	103.33	0.50	40.71	2502.93	-2547.59	2343.72
Saccade R	1	1	9618432827	9618472589	39762	961.22	481.57	957.24	674.87	1.62	103.33	0.50	40.71	2502.93	-2547.59	2343.72
Fixation L	1	2	9618472589	9619387517	914928	968.83	669.24	46	33	-1	13.69	13.69
Fixation R	1	2	9618472589	9619387517	914928	968.83	669.24	46	33	-1	13.50	13.50
Saccade L	1	2	9619387517	9619427273	39756	1002.31	664.61	1184.23	720.50	1.87	135.37	0.50	47.11	3291.93	-2702.69	2190.25
Saccade R	1	2	9619387517	9619427273	39756	1002.31	664.61	1184.23	720.50	1.87	135.37	0.50	47.11	3291.93	-2702.69	2190.25
Fixation L	1	3	9619427273	9619705741	278468	1204.30	737.63	23	48	-1	13.42	13.42
Fixation R	1	3	9619427273	9619705741	278468	1204.30	737.63	23	48	-1	13.41	13.41
Saccade L	1	3	9619705741	9619765371	59630	1205.27	751.86	805.91	752.16	4.10	233.66	0.67	68.74	5799.67	-5700.33	3439.77
Saccade R	1	3	9619705741	9619765371	59630	1205.27	751.86	805.91	752.16	4.10	233.66	0.67	68.74	5799.67	-5700.33	3439.77
Fixation L	1	4	9619765371	9619944356	178985	805.04	751.24	6	5	-1	13.27	13.27
Fixation R	1	4	9619765371	9619944356	178985	805.04	751.24	6	5	-1	13.32	13.32
Blink L	1	1	9619944356	9620083605	139249
Blink R	1	1	9619944356	9620083605	139249
Fixation L	1	5	9620083605	9620541071	457466	992.92	277.16	10	89	-1	13.74	13.74
Fixation R	1	5	9620083605	9620541071	457466	992.92	277.16	10	89	-1	14.17	14.17
Saccade L	1	4	9620541071	9620600825	59754	996.19	303.53	1071.15	305.07	1.09	68.07	1.00	18.20	1635.50	-1612.53	781.47
Saccade R	1	4	9620541071	9620600825	59754	996.19	303.53	1071.15	305.07	1.09	68.07	1.00	18.20	1635.50	-1612.53	781.47
Fixation L	1	6	9620600825	9620919049	318224	1100.04	315.77	43	19	-1	13.91	13.91
Fixation R	1	6	9620600825	9620919049	318224	1100.04	315.77	43	19	-1	14.05	14.05
Saccade L	1	5	9620919049	9620938927	19878	1114.43	324.16	1283.09	325.73	1.10	170.58	1.00	55.27	4229.71	-3945.35	2956.27
Saccade R	1	5	9620919049	9620938927	19878	1114.43	324.16	1283.09	325.73	1.10	170.58	1.00	55.27	4229.71	-3945.35	2956.27
Fixation L	1	7	9620938927	9621316782	377855	1328.74	325.92	51	3	-1	13.46	13.46
Fixation R	1	7	9620938927	9621316782	377855	1328.74	325.92	51	3	-1	13.83	13.83
Saccade L	1	6	9621316782	9621356524	39742	1327.33	323.92	1003.03	327.99	2.74	182.59	1.00	68.86	4541.53	-4528.83	3989.03
Saccade R	1	6	9621316782	9621356524	39742	1327.33	323.92	1003.03	327.99	2.74	182.59	1.00	68.86	4541.53	-4528.83	3989.03
Fixation L	1	8	9621356524	9621515639	159115	987.69	340.22	19	22	-1	13.88	13.88
Fixation R	1	8	9621356524	9621515639	159115	987.69	340.22	19	22	-1	13.75	13.75
Saccade L	1	7	9621515639	9621555388	39749	985.77	350.20	1000.48	609.96	2.46	180.04	1.00	61.88	4461.45	-4150.51	2913.14
Saccade R	1	7	9621515639	9621555388	39749	985.77	350.20	1000.48	609.96	2.46	180.04	1.00	61.88	4461.45	-4150.51	2913.14
Fixation L	1	9	9621555388	9622012863	457475	1026.09	664.98	33	64	-1	14.45	14.45
Fixation R	1	9	9621555388	9622012863	457475	1026.09	664.98	33	64	-1	14.57	14.57
