[BeGaze]
Converted from:	C:\Documents and Settings\iViewX\Desktop\EXPERIMENTATIONS\Experiments\results\finaleart\S5121332-finaleart-1.idf
Date:	27.03.2019 15:34:56
Version:	BeGaze 2.5.77
Sample Rate:	50
Subject:	S5121332
Description:	Dylan Marinho

Table Header for Fixations:
Event Type	Trial	Number	Start	End	Duration	Location X	Location Y	Dispersion X	Dispersion Y	Plane	Avg. Pupil Size X	Avg. Pupil Size Y

Table Header for Saccades:
Event Type	Trial	Number	Start	End	Duration	Start Loc.X	Start Loc.Y	End Loc.X	End Loc.Y	Amplitude	Peak Speed	Peak Speed At	Average Speed	Peak Accel.	Peak Decel.	Average Accel.

Table Header for Blinks:
Event Type	Trial	Number	Start	End	Duration

Table Header for User Events:
Event Type	Trial	Number	Start	Description

UserEvent	1	1	9023727613	# Message: still-life-post-bottle-cup-and-fruit_cezanne_1871.jpg
Saccade L	1	1	9023733710	9023793339	59629	936.22	623.12	933.02	618.82	13.43	1118.18	1.00	225.22	27923.39	-79.84	5608.36
Saccade R	1	1	9023733710	9023793339	59629	936.22	623.12	933.02	618.82	13.43	1118.18	1.00	225.22	27923.39	-79.84	5608.36
Blink L	1	1	9023793339	9023912696	119357
Blink R	1	1	9023793339	9023912696	119357
Fixation L	1	1	9023912696	9024270682	357986	928.10	591.49	12	68	-1	19.22	19.22
Fixation R	1	1	9023912696	9024270682	357986	928.10	591.49	12	68	-1	18.94	18.94
Saccade L	1	2	9024270682	9024290556	19874	926.71	596.91	905.90	706.34	0.64	112.67	1.00	32.12	2773.65	-2604.04	1796.52
Saccade R	1	2	9024270682	9024290556	19874	926.71	596.91	905.90	706.34	0.64	112.67	1.00	32.12	2773.65	-2604.04	1796.52
Fixation L	1	2	9024290556	9024549168	258612	886.90	707.48	66	6	-1	18.59	18.59
Fixation R	1	2	9024290556	9024549168	258612	886.90	707.48	66	6	-1	18.22	18.22
Saccade L	1	3	9024549168	9024569044	19876	839.68	705.67	649.35	685.41	1.35	193.55	1.00	67.75	4831.64	-4661.16	3287.55
Saccade R	1	3	9024549168	9024569044	19876	839.68	705.67	649.35	685.41	1.35	193.55	1.00	67.75	4831.64	-4661.16	3287.55
Fixation L	1	3	9024569044	9024728155	159111	633.93	657.32	26	34	-1	17.82	17.82
Fixation R	1	3	9024569044	9024728155	159111	633.93	657.32	26	34	-1	17.12	17.12
Saccade L	1	4	9024728155	9024767891	39736	623.14	651.40	570.45	520.91	1.45	84.42	1.00	36.45	2032.60	-1987.75	1635.95
Saccade R	1	4	9024728155	9024767891	39736	623.14	651.40	570.45	520.91	1.45	84.42	1.00	36.45	2032.60	-1987.75	1635.95
Fixation L	1	4	9024767891	9025106007	338116	532.13	513.37	60	19	-1	16.71	16.71
Fixation R	1	4	9024767891	9025106007	338116	532.13	513.37	60	19	-1	16.23	16.23
Saccade L	1	5	9025106007	9025126000	19993	509.62	508.55	453.41	446.72	0.61	84.53	1.00	30.60	2080.81	-1994.95	1563.28
Saccade R	1	5	9025106007	9025126000	19993	509.62	508.55	453.41	446.72	0.61	84.53	1.00	30.60	2080.81	-1994.95	1563.28
Fixation L	1	5	9025126000	9025265136	139136	427.80	459.59	33	27	-1	16.22	16.22
Fixation R	1	5	9025126000	9025265136	139136	427.80	459.59	33	27	-1	15.90	15.90
Saccade L	1	6	9025265136	9025304998	39862	424.32	467.13	507.75	316.65	1.71	92.12	0.50	43.02	1898.71	-1999.39	1910.35
Saccade R	1	6	9025265136	9025304998	39862	424.32	467.13	507.75	316.65	1.71	92.12	0.50	43.02	1898.71	-1999.39	1910.35
Fixation L	1	6	9025304998	9025643105	338107	529.02	297.26	28	31	-1	15.52	15.52
Fixation R	1	6	9025304998	9025643105	338107	529.02	297.26	28	31	-1	15.72	15.72
Saccade L	1	7	9025643105	9025662970	19865	536.18	292.76	619.03	297.83	0.59	83.97	1.00	29.64	2011.79	-1916.70	1449.13
Saccade R	1	7	9025643105	9025662970	19865	536.18	292.76	619.03	297.83	0.59	83.97	1.00	29.64	2011.79	-1916.70	1449.13
Fixation L	1	7	9025662970	9025941456	278486	656.93	310.18	54	18	-1	15.10	15.10
Fixation R	1	7	9025662970	9025941456	278486	656.93	310.18	54	18	-1	15.51	15.51
Saccade L	1	8	9025941456	9026001072	59616	673.05	307.91	1093.31	591.46	5.33	214.63	0.67	89.43	5296.14	-5236.62	3817.82
Saccade R	1	8	9025941456	9026001072	59616	673.05	307.91	1093.31	591.46	5.33	214.63	0.67	89.43	5296.14	-5236.62	3817.82
Fixation L	1	8	9026001072	9026219928	218856	1096.85	607.11	8	34	-1	15.86	15.86
Fixation R	1	8	9026001072	9026219928	218856	1096.85	607.11	8	34	-1	15.79	15.79
Saccade L	1	9	9026219928	9026239819	19891	1096.63	612.67	1230.71	607.45	0.88	135.72	1.00	44.33	3224.45	-2972.65	2292.44
Saccade R	1	9	9026219928	9026239819	19891	1096.63	612.67	1230.71	607.45	0.88	135.72	1.00	44.33	3224.45	-2972.65	2292.44
Fixation L	1	9	9026239819	9026398932	159113	1277.85	584.90	60	37	-1	16.13	16.13
Fixation R	1	9	9026239819	9026398932	159113	1277.85	584.90	60	37	-1	16.30	16.30
Saccade L	1	10	9026398932	9026418800	19868	1291.44	570.33	1291.41	567.98	0.03	3.04	1.00	1.76	21.86	-16.68	14.89
Saccade R	1	10	9026398932	9026418800	19868	1291.44	570.33	1291.41	567.98	0.03	3.04	1.00	1.76	21.86	-16.68	14.89
Fixation L	1	10	9026418800	9026577917	159117	1292.79	567.92	2	10	-1	16.11	16.11
Fixation R	1	10	9026418800	9026577917	159117	1292.79	567.92	2	10	-1	16.20	16.20
Saccade L	1	11	9026577917	9026597781	19864	1291.52	574.91	1286.74	684.46	0.65	110.91	1.00	32.96	2753.65	-2670.58	1876.28
Saccade R	1	11	9026577917	9026597781	19864	1291.52	574.91	1286.74	684.46	0.65	110.91	1.00	32.96	2753.65	-2670.58	1876.28
Fixation L	1	11	9026597781	9026975637	377856	1265.63	700.62	43	22	-1	16.29	16.29
Fixation R	1	11	9026597781	9026975637	377856	1265.63	700.62	43	22	-1	16.16	16.16
Blink L	1	2	9026975637	9027194509	218872
Blink R	1	2	9026975637	9027194509	218872
Fixation L	1	12	9027194509	9027433108	238599	1132.90	710.08	6	22	-1	17.38	17.38
Fixation R	1	12	9027194509	9027433108	238599	1132.90	710.08	6	22	-1	17.46	17.46
Saccade L	1	12	9027433108	9027472999	39891	1135.42	715.04	903.59	725.33	2.00	134.04	1.00	50.14	3343.18	-3155.26	2788.97
Saccade R	1	12	9027433108	9027472999	39891	1135.42	715.04	903.59	725.33	2.00	134.04	1.00	50.14	3343.18	-3155.26	2788.97
Fixation L	1	13	9027472999	9027711596	238597	906.73	749.93	8	33	-1	17.17	17.17
Fixation R	1	13	9027472999	9027711596	238597	906.73	749.93	8	33	-1	17.47	17.47
