[BeGaze]
Converted from:	C:\Documents and Settings\iViewX\Desktop\EXPERIMENTATIONS\Experiments\results\finaleart\S18F56223-finaleart-1.idf
Date:	27.03.2019 15:48:31
Version:	BeGaze 2.5.77
Sample Rate:	50
Subject:	S18F56223
Description:	Pascale Sebillot

Table Header for Fixations:
Event Type	Trial	Number	Start	End	Duration	Location X	Location Y	Dispersion X	Dispersion Y	Plane	Avg. Pupil Size X	Avg. Pupil Size Y

Table Header for Saccades:
Event Type	Trial	Number	Start	End	Duration	Start Loc.X	Start Loc.Y	End Loc.X	End Loc.Y	Amplitude	Peak Speed	Peak Speed At	Average Speed	Peak Accel.	Peak Decel.	Average Accel.

Table Header for Blinks:
Event Type	Trial	Number	Start	End	Duration

Table Header for User Events:
Event Type	Trial	Number	Start	Description

UserEvent	1	1	2403792297	# Message: void.jpg
Fixation L	1	1	2403803621	2403962741	159120	698.42	421.79	2	35	-1	13.72	13.72
Fixation R	1	1	2403803621	2403962741	159120	698.42	421.79	2	35	-1	13.23	13.23
Saccade L	1	1	2403962741	2404002618	39877	698.91	406.56	349.09	562.18	3.41	265.71	0.50	85.61	6589.62	-5837.37	4585.37
Saccade R	1	1	2403962741	2404002618	39877	698.91	406.56	349.09	562.18	3.41	265.71	0.50	85.61	6589.62	-5837.37	4585.37
Fixation L	1	2	2404002618	2404181605	178987	346.30	567.62	35	39	-1	13.43	13.43
Fixation R	1	2	2404002618	2404181605	178987	346.30	567.62	35	39	-1	13.29	13.29
Saccade L	1	2	2404181605	2404201474	19869	337.45	550.03	329.34	487.10	0.71	64.19	1.00	35.72	1331.04	-710.00	1113.86
Saccade R	1	2	2404181605	2404201474	19869	337.45	550.03	329.34	487.10	0.71	64.19	1.00	35.72	1331.04	-710.00	1113.86
Fixation L	1	3	2404201474	2404400341	198867	325.72	514.02	22	59	-1	13.27	13.27
Fixation R	1	3	2404201474	2404400341	198867	325.72	514.02	22	59	-1	13.47	13.47
Saccade L	1	3	2404400341	2404420216	19875	338.57	519.32	504.03	532.29	1.03	167.86	1.00	51.59	4043.96	-2737.69	2324.13
Saccade R	1	3	2404400341	2404420216	19875	338.57	519.32	504.03	532.29	1.03	167.86	1.00	51.59	4043.96	-2737.69	2324.13
Fixation L	1	4	2404420216	2404559462	139246	512.45	583.22	18	76	-1	13.90	13.90
Fixation R	1	4	2404420216	2404559462	139246	512.45	583.22	18	76	-1	13.71	13.71
Saccade L	1	4	2404559462	2404579335	19873	521.48	605.99	525.68	617.46	0.17	14.01	1.00	8.35	-37.27	-149.25	75.97
Saccade R	1	4	2404559462	2404579335	19873	521.48	605.99	525.68	617.46	0.17	14.01	1.00	8.35	-37.27	-149.25	75.97
Fixation L	1	5	2404579335	2404718585	139250	532.68	626.58	24	21	-1	14.35	14.35
Fixation R	1	5	2404579335	2404718585	139250	532.68	626.58	24	21	-1	14.01	14.01
Saccade L	1	5	2404718585	2404758326	39741	547.77	630.44	545.49	493.25	2.00	122.54	0.50	50.21	2779.34	-857.16	1024.11
Saccade R	1	5	2404718585	2404758326	39741	547.77	630.44	545.49	493.25	2.00	122.54	0.50	50.21	2779.34	-857.16	1024.11
Fixation L	1	6	2404758326	2404917441	159115	543.93	416.72	5	92	-1	15.05	15.05
Fixation R	1	6	2404758326	2404917441	159115	543.93	416.72	5	92	-1	14.48	14.48
Saccade L	1	6	2404917441	2404937451	20010	543.35	404.92	538.88	396.00	0.17	10.74	1.00	8.64	129.89	-175.39	107.18
Saccade R	1	6	2404917441	2404937451	20010	543.35	404.92	538.88	396.00	0.17	10.74	1.00	8.64	129.89	-175.39	107.18
Fixation L	1	7	2404937451	2405116437	178986	541.59	404.71	5	19	-1	15.15	15.15
Fixation R	1	7	2404937451	2405116437	178986	541.59	404.71	5	19	-1	14.82	14.82
Saccade L	1	7	2405116437	2405156190	39753	543.78	415.53	344.54	407.07	1.92	134.31	0.50	48.23	3199.95	-2603.42	2134.18
Saccade R	1	7	2405116437	2405156190	39753	543.78	415.53	344.54	407.07	1.92	134.31	0.50	48.23	3199.95	-2603.42	2134.18
Fixation L	1	8	2405156190	2405693166	536976	324.34	388.66	44	51	-1	14.70	14.70
Fixation R	1	8	2405156190	2405693166	536976	324.34	388.66	44	51	-1	14.91	14.91
Saccade L	1	8	2405693166	2405792670	99504	314.54	411.26	910.20	493.59	10.22	327.55	0.40	102.70	8112.96	-4683.90	3510.33
Saccade R	1	8	2405693166	2405792670	99504	314.54	411.26	910.20	493.59	10.22	327.55	0.40	102.70	8112.96	-4683.90	3510.33
