[BeGaze]
Converted from:	C:\Documents and Settings\iViewX\Desktop\EXPERIMENTATIONS\Experiments\results\finaleart\S7121223-finaleart-1.idf
Date:	27.03.2019 15:37:09
Version:	BeGaze 2.5.77
Sample Rate:	50
Subject:	S7121223
Description:	Gregoire pacreau

Table Header for Fixations:
Event Type	Trial	Number	Start	End	Duration	Location X	Location Y	Dispersion X	Dispersion Y	Plane	Avg. Pupil Size X	Avg. Pupil Size Y

Table Header for Saccades:
Event Type	Trial	Number	Start	End	Duration	Start Loc.X	Start Loc.Y	End Loc.X	End Loc.Y	Amplitude	Peak Speed	Peak Speed At	Average Speed	Peak Accel.	Peak Decel.	Average Accel.

Table Header for Blinks:
Event Type	Trial	Number	Start	End	Duration

Table Header for User Events:
Event Type	Trial	Number	Start	Description

UserEvent	1	1	4907677825	# Message: Turner-chichester-canal-1828.jpg
Fixation L	1	1	4907688903	4908066886	377983	898.15	488.11	6	72	-1	14.07	14.07
Fixation R	1	1	4907688903	4908066886	377983	898.15	488.11	6	72	-1	14.00	14.00
Saccade L	1	1	4908066886	4908086773	19887	900.10	535.70	938.96	650.47	0.84	122.56	1.00	42.35	3045.83	-2787.22	2073.70
Saccade R	1	1	4908066886	4908086773	19887	900.10	535.70	938.96	650.47	0.84	122.56	1.00	42.35	3045.83	-2787.22	2073.70
Fixation L	1	2	4908086773	4908206233	119460	936.47	639.65	31	21	-1	13.98	13.98
Fixation R	1	2	4908086773	4908206233	119460	936.47	639.65	31	21	-1	14.17	14.17
Saccade L	1	2	4908206233	4908226091	19858	957.35	652.83	1010.11	673.99	0.52	57.51	1.00	26.00	1276.53	-1063.40	927.04
Saccade R	1	2	4908206233	4908226091	19858	957.35	652.83	1010.11	673.99	0.52	57.51	1.00	26.00	1276.53	-1063.40	927.04
Fixation L	1	3	4908226091	4908564566	338475	1037.29	672.92	51	39	-1	11.18	11.18
Fixation R	1	3	4908226091	4908564566	338475	1037.29	672.92	51	39	-1	11.06	11.06
Saccade L	1	3	4908564566	4908584556	19990	1062.10	695.43	1064.08	701.65	0.10	6.60	1.00	4.79	62.67	-109.36	74.61
Saccade R	1	3	4908564566	4908584556	19990	1062.10	695.43	1064.08	701.65	0.10	6.60	1.00	4.79	62.67	-109.36	74.61
Fixation L	1	4	4908584556	4908783671	199115	1069.78	699.38	8	6	-1	10.43	10.43
Fixation R	1	4	4908584556	4908783671	199115	1069.78	699.38	8	6	-1	10.13	10.13
Saccade L	1	4	4908783671	4908863300	79629	1072.09	695.47	248.35	747.06	9.88	322.50	0.50	124.07	8012.39	-6268.76	4824.35
Saccade R	1	4	4908783671	4908863300	79629	1072.09	695.47	248.35	747.06	9.88	322.50	0.50	124.07	8012.39	-6268.76	4824.35
Fixation L	1	5	4908863300	4909142039	278739	280.25	749.15	55	34	-1	10.11	10.11
Fixation R	1	5	4908863300	4909142039	278739	280.25	749.15	55	34	-1	9.85	9.85
Saccade L	1	5	4909142039	4909162037	19998	304.20	760.29	333.20	759.64	0.25	29.34	1.00	12.55	654.37	-699.45	534.52
Saccade R	1	5	4909142039	4909162037	19998	304.20	760.29	333.20	759.64	0.25	29.34	1.00	12.55	654.37	-699.45	534.52
Fixation L	1	6	4909162037	4909420895	258858	346.85	752.09	23	32	-1	10.70	10.70
Fixation R	1	6	4909162037	4909420895	258858	346.85	752.09	23	32	-1	10.75	10.75
Saccade L	1	6	4909420895	4909440770	19875	350.43	728.30	345.76	666.57	0.51	62.62	1.00	25.43	1474.27	-1432.51	1092.82
Saccade R	1	6	4909420895	4909440770	19875	350.43	728.30	345.76	666.57	0.51	62.62	1.00	25.43	1474.27	-1432.51	1092.82
Fixation L	1	7	4909440770	4909580136	139366	338.34	653.70	12	55	-1	11.59	11.59
Fixation R	1	7	4909440770	4909580136	139366	338.34	653.70	12	55	-1	11.70	11.70
Saccade L	1	7	4909580136	4909600129	19993	337.07	610.74	331.96	579.13	0.53	52.40	0.00	26.42	732.19	-865.85	782.85
Saccade R	1	7	4909580136	4909600129	19993	337.07	610.74	331.96	579.13	0.53	52.40	0.00	26.42	732.19	-865.85	782.85
Fixation L	1	8	4909600129	4910018239	418110	336.84	560.84	9	25	-1	11.76	11.76
Fixation R	1	8	4909600129	4910018239	418110	336.84	560.84	9	25	-1	11.96	11.96
Saccade L	1	8	4910018239	4910077984	59745	340.10	562.63	1014.96	603.23	7.07	323.88	0.67	118.36	8016.87	-7528.85	5357.17
Saccade R	1	8	4910018239	4910077984	59745	340.10	562.63	1014.96	603.23	7.07	323.88	0.67	118.36	8016.87	-7528.85	5357.17
Fixation L	1	9	4910077984	4910675327	597343	1034.06	630.89	32	36	-1	12.03	12.03
Fixation R	1	9	4910077984	4910675327	597343	1034.06	630.89	32	36	-1	11.84	11.84
Saccade L	1	9	4910675327	4910715235	39908	1047.82	626.15	1382.18	643.27	2.92	176.45	1.00	73.08	4368.22	-4133.11	3997.86
Saccade R	1	9	4910675327	4910715235	39908	1047.82	626.15	1382.18	643.27	2.92	176.45	1.00	73.08	4368.22	-4133.11	3997.86
Fixation L	1	10	4910715235	4911153307	438072	1417.01	650.50	39	11	-1	11.55	11.55
Fixation R	1	10	4910715235	4911153307	438072	1417.01	650.50	39	11	-1	10.98	10.98
Saccade L	1	10	4911153307	4911193071	39764	1419.25	653.62	1163.83	676.80	2.19	134.38	1.00	55.12	3264.54	-3311.52	3130.08
Saccade R	1	10	4911153307	4911193071	39764	1419.25	653.62	1163.83	676.80	2.19	134.38	1.00	55.12	3264.54	-3311.52	3130.08
Fixation L	1	11	4911193071	4911471906	278835	1154.35	708.73	17	62	-1	12.16	12.16
Fixation R	1	11	4911193071	4911471906	278835	1154.35	708.73	17	62	-1	11.66	11.66
Saccade L	1	11	4911471906	4911491793	19887	1146.46	733.40	1072.98	711.30	0.59	77.61	1.00	29.45	1863.33	-1818.03	1412.88
Saccade R	1	11	4911471906	4911491793	19887	1146.46	733.40	1072.98	711.30	0.59	77.61	1.00	29.45	1863.33	-1818.03	1412.88
Fixation L	1	12	4911491793	4911671024	179231	1051.26	725.93	27	23	-1	13.00	13.00
Fixation R	1	12	4911491793	4911671024	179231	1051.26	725.93	27	23	-1	12.22	12.22
