[BeGaze]
Converted from:	C:\Documents and Settings\iViewX\Desktop\EXPERIMENTATIONS\Experiments\results\finaleart\S8119532-finaleart-1.idf
Date:	27.03.2019 16:00:46
Version:	BeGaze 2.5.77
Sample Rate:	50
Subject:	S8119532
Description:	Alexandre Drewery

Table Header for Fixations:
Event Type	Trial	Number	Start	End	Duration	Location X	Location Y	Dispersion X	Dispersion Y	Plane	Avg. Pupil Size X	Avg. Pupil Size Y

Table Header for Saccades:
Event Type	Trial	Number	Start	End	Duration	Start Loc.X	Start Loc.Y	End Loc.X	End Loc.Y	Amplitude	Peak Speed	Peak Speed At	Average Speed	Peak Accel.	Peak Decel.	Average Accel.

Table Header for Blinks:
Event Type	Trial	Number	Start	End	Duration

Table Header for User Events:
Event Type	Trial	Number	Start	Description

UserEvent	1	1	3282783539	# Message: flowers-and-fruit-a-melon_fantin-latour_1865.jpg
Fixation L	1	1	3282787876	3283225480	437604	792.01	359.84	31	65	-1	11.72	11.72
Fixation R	1	1	3282787876	3283225480	437604	792.01	359.84	31	65	-1	13.76	13.76
Saccade L	1	1	3283225480	3283245364	19884	783.79	352.26	779.79	346.76	0.23	20.85	0.00	11.48	101.47	-137.04	83.88
Saccade R	1	1	3283225480	3283245364	19884	783.79	352.26	779.79	346.76	0.23	20.85	0.00	11.48	101.47	-137.04	83.88
Fixation L	1	2	3283245364	3283444211	198847	777.35	366.61	6	33	-1	11.69	11.69
Fixation R	1	2	3283245364	3283444211	198847	777.35	366.61	6	33	-1	13.77	13.77
Saccade L	1	2	3283444211	3283464079	19868	778.43	380.33	889.40	482.08	0.87	152.27	1.00	43.76	3697.48	-2670.15	2151.86
Saccade R	1	2	3283444211	3283464079	19868	778.43	380.33	889.40	482.08	0.87	152.27	1.00	43.76	3697.48	-2670.15	2151.86
Fixation L	1	3	3283464079	3283682817	218738	877.34	467.38	21	49	-1	11.67	11.67
Fixation R	1	3	3283464079	3283682817	218738	877.34	467.38	21	49	-1	13.94	13.94
Saccade L	1	3	3283682817	3283702823	20006	871.28	463.59	864.81	590.00	0.75	128.02	1.00	37.44	3017.15	-2575.82	1951.67
Saccade R	1	3	3283682817	3283702823	20006	871.28	463.59	864.81	590.00	0.75	128.02	1.00	37.44	3017.15	-2575.82	1951.67
Fixation L	1	4	3283702823	3283845992	143169	856.10	602.95	22	27	-1	12.07	12.07
Fixation R	1	4	3283702823	3283845992	143169	856.10	602.95	22	27	-1	14.27	14.27
Saccade L	1	4	3283845992	3283901682	55690	842.38	605.94	580.15	606.37	3.36	227.01	0.64	60.34	5321.18	-5418.11	3049.27
Saccade R	1	4	3283845992	3283901682	55690	842.38	605.94	580.15	606.37	3.36	227.01	0.64	60.34	5321.18	-5418.11	3049.27
Fixation L	1	5	3283901682	3284120415	218733	557.28	590.03	38	51	-1	12.76	12.76
Fixation R	1	5	3283901682	3284120415	218733	557.28	590.03	38	51	-1	15.19	15.19
Saccade L	1	5	3284120415	3284160291	39876	553.85	589.44	502.72	615.19	1.13	61.25	0.50	28.41	1283.06	-828.82	739.97
Saccade R	1	5	3284120415	3284160291	39876	553.85	589.44	502.72	615.19	1.13	61.25	0.50	28.41	1283.06	-828.82	739.97
Fixation L	1	6	3284160291	3284379031	218740	503.81	635.27	43	41	-1	13.40	13.40
Fixation R	1	6	3284160291	3284379031	218740	503.81	635.27	43	41	-1	15.82	15.82
Saccade L	1	6	3284379031	3284418778	39747	502.95	636.94	886.17	862.91	4.01	241.37	1.00	100.85	5807.40	-5807.66	5290.71
Saccade R	1	6	3284379031	3284418778	39747	502.95	636.94	886.17	862.91	4.01	241.37	1.00	100.85	5807.40	-5807.66	5290.71
Fixation L	1	7	3284418778	3284577894	159116	886.55	859.78	9	24	-1	14.29	14.29
Fixation R	1	7	3284418778	3284577894	159116	886.55	859.78	9	24	-1	16.19	16.19
Saccade L	1	7	3284577894	3284637645	59751	883.33	855.82	1075.93	394.12	5.43	225.19	0.67	90.89	5468.22	-4878.38	3883.17
Saccade R	1	7	3284577894	3284637645	59751	883.33	855.82	1075.93	394.12	5.43	225.19	0.67	90.89	5468.22	-4878.38	3883.17
Fixation L	1	8	3284637645	3284876257	238612	1086.78	396.91	33	40	-1	14.07	14.07
Fixation R	1	8	3284637645	3284876257	238612	1086.78	396.91	33	40	-1	15.77	15.77
Saccade L	1	8	3284876257	3284916006	39749	1105.95	398.22	1349.82	851.75	4.68	338.81	0.50	117.72	8388.82	-8022.34	6564.57
Saccade R	1	8	3284876257	3284916006	39749	1105.95	398.22	1349.82	851.75	4.68	338.81	0.50	117.72	8388.82	-8022.34	6564.57
Fixation L	1	9	3284916006	3285194497	278491	1364.13	859.27	19	30	-1	14.06	14.06
Fixation R	1	9	3284916006	3285194497	278491	1364.13	859.27	19	30	-1	14.93	14.93
Saccade L	1	9	3285194497	3285274125	79628	1355.09	881.24	562.33	628.58	10.63	333.59	0.50	133.52	7976.11	-6197.64	4612.83
Saccade R	1	9	3285194497	3285274125	79628	1355.09	881.24	562.33	628.58	10.63	333.59	0.50	133.52	7976.11	-6197.64	4612.83
Fixation L	1	10	3285274125	3285532610	258485	539.12	642.13	47	39	-1	14.16	14.16
Fixation R	1	10	3285274125	3285532610	258485	539.12	642.13	47	39	-1	15.83	15.83
Saccade L	1	10	3285532610	3285552475	19865	514.44	644.88	497.86	636.47	0.19	18.81	1.00	9.79	196.33	-115.16	131.14
Saccade R	1	10	3285532610	3285552475	19865	514.44	644.88	497.86	636.47	0.19	18.81	1.00	9.79	196.33	-115.16	131.14
Fixation L	1	11	3285552475	3285711612	159137	495.88	639.65	8	24	-1	14.07	14.07
Fixation R	1	11	3285552475	3285711612	159137	495.88	639.65	8	24	-1	16.15	16.15
Saccade L	1	11	3285711612	3285751465	39853	499.65	645.20	958.15	831.12	4.20	353.72	0.50	105.31	8769.83	-8510.02	6135.04
Saccade R	1	11	3285711612	3285751465	39853	499.65	645.20	958.15	831.12	4.20	353.72	0.50	105.31	8769.83	-8510.02	6135.04
Fixation L	1	12	3285751465	3286149193	397728	961.33	852.34	14	31	-1	15.03	15.03
Fixation R	1	12	3285751465	3286149193	397728	961.33	852.34	14	31	-1	16.61	16.61
Saccade L	1	12	3286149193	3286189066	39873	967.94	857.88	1351.86	863.94	3.25	289.42	0.50	81.62	7151.37	-6966.74	4707.41
Saccade R	1	12	3286149193	3286189066	39873	967.94	857.88	1351.86	863.94	3.25	289.42	0.50	81.62	7151.37	-6966.74	4707.41
Fixation L	1	13	3286189066	3286427683	238617	1361.64	871.40	43	17	-1	15.74	15.74
Fixation R	1	13	3286189066	3286427683	238617	1361.64	871.40	43	17	-1	16.45	16.45
Saccade L	1	13	3286427683	3286507312	79629	1327.99	879.53	533.44	860.16	11.37	398.71	0.25	142.85	9813.22	-8120.40	6990.59
Saccade R	1	13	3286427683	3286507312	79629	1327.99	879.53	533.44	860.16	11.37	398.71	0.25	142.85	9813.22	-8120.40	6990.59
Fixation L	1	14	3286507312	3286825535	318223	523.12	839.99	50	31	-1	15.27	15.27
Fixation R	1	14	3286507312	3286825535	318223	523.12	839.99	50	31	-1	17.09	17.09
