[BeGaze]
Converted from:	C:\Documents and Settings\iViewX\Desktop\EXPERIMENTATIONS\Experiments\results\finaleart\S6124332-finaleart-1.idf
Date:	27.03.2019 15:36:19
Version:	BeGaze 2.5.77
Sample Rate:	50
Subject:	S6124332
Description:	Romain Ferrand

Table Header for Fixations:
Event Type	Trial	Number	Start	End	Duration	Location X	Location Y	Dispersion X	Dispersion Y	Plane	Avg. Pupil Size X	Avg. Pupil Size Y

Table Header for Saccades:
Event Type	Trial	Number	Start	End	Duration	Start Loc.X	Start Loc.Y	End Loc.X	End Loc.Y	Amplitude	Peak Speed	Peak Speed At	Average Speed	Peak Accel.	Peak Decel.	Average Accel.

Table Header for Blinks:
Event Type	Trial	Number	Start	End	Duration

Table Header for User Events:
Event Type	Trial	Number	Start	Description

UserEvent	1	1	12630484767	# Message: void.jpg
Fixation L	1	1	12630499921	12630619278	119357	1645.41	266.49	9	19	-1	20.00	20.00
Fixation R	1	1	12630499921	12630619278	119357	1645.41	266.49	9	19	-1	18.85	18.85
Saccade L	1	1	12630619278	12630639165	19887	1648.81	255.43	1710.62	242.08	0.67	63.98	1.00	33.84	1419.07	-1162.93	1152.17
Saccade R	1	1	12630619278	12630639165	19887	1648.81	255.43	1710.62	242.08	0.67	63.98	1.00	33.84	1419.07	-1162.93	1152.17
Fixation L	1	2	12630639165	12631036891	397726	1658.02	256.06	62	30	-1	20.09	20.09
Fixation R	1	2	12630639165	12631036891	397726	1658.02	256.06	62	30	-1	18.98	18.98
Saccade L	1	2	12631036891	12631196000	159109	1666.80	257.60	1137.34	706.86	11.61	261.36	0.75	72.96	5662.77	-4218.18	2263.39
Saccade R	1	2	12631036891	12631196000	159109	1666.80	257.60	1137.34	706.86	11.61	261.36	0.75	72.96	5662.77	-4218.18	2263.39
Fixation L	1	3	12631196000	12632130813	934813	1123.22	674.74	48	50	-1	20.25	20.25
Fixation R	1	3	12631196000	12632130813	934813	1123.22	674.74	48	50	-1	19.39	19.39
Saccade L	1	3	12632130813	12632150805	19992	1106.10	656.58	1084.24	654.45	0.29	27.06	0.00	14.57	473.09	-534.67	490.61
Saccade R	1	3	12632130813	12632150805	19992	1106.10	656.58	1084.24	654.45	0.29	27.06	0.00	14.57	473.09	-534.67	490.61
Fixation L	1	4	12632150805	12632449175	298370	1076.09	648.32	24	13	-1	20.57	20.57
Fixation R	1	4	12632150805	12632449175	298370	1076.09	648.32	24	13	-1	19.51	19.51
