[BeGaze]
Converted from:	C:\Documents and Settings\iViewX\Desktop\EXPERIMENTATIONS\Experiments\results\finaleart\S3121421-finaleart-1.idf
Date:	27.03.2019 15:33:48
Version:	BeGaze 2.5.77
Sample Rate:	50
Subject:	S3121421
Description:	Jean Jouve

Table Header for Fixations:
Event Type	Trial	Number	Start	End	Duration	Location X	Location Y	Dispersion X	Dispersion Y	Plane	Avg. Pupil Size X	Avg. Pupil Size Y

Table Header for Saccades:
Event Type	Trial	Number	Start	End	Duration	Start Loc.X	Start Loc.Y	End Loc.X	End Loc.Y	Amplitude	Peak Speed	Peak Speed At	Average Speed	Peak Accel.	Peak Decel.	Average Accel.

Table Header for Blinks:
Event Type	Trial	Number	Start	End	Duration

Table Header for User Events:
Event Type	Trial	Number	Start	Description

UserEvent	1	1	3916096534	# Message: Turner-snow-storm-boat-off-a-harbours-mouth-1842.jpg
Fixation L	1	1	3916104472	3916562451	457979	1146.97	243.69	15	13	-1	11.62	11.62
Fixation R	1	1	3916104472	3916562451	457979	1146.97	243.69	15	13	-1	11.68	11.68
Saccade L	1	1	3916562451	3916661949	99498	1144.14	247.26	954.99	637.92	7.75	338.52	0.20	77.85	28690.29	-6900.28	7427.51
Saccade R	1	1	3916562451	3916661949	99498	1144.14	247.26	954.99	637.92	7.75	338.52	0.20	77.85	28690.29	-6900.28	7427.51
Blink L	1	1	3916661949	3916821298	159349
Blink R	1	1	3916661949	3916821298	159349
Fixation L	1	2	3916821298	3917040289	218991	967.69	705.32	5	43	-1	12.98	12.98
Fixation R	1	2	3916821298	3917040289	218991	967.69	705.32	5	43	-1	12.91	12.91
Saccade L	1	2	3917040289	3917060291	20002	968.41	702.11	1125.19	612.05	0.99	182.84	1.00	49.70	4503.14	-4324.19	2981.43
Saccade R	1	2	3917040289	3917060291	20002	968.41	702.11	1125.19	612.05	0.99	182.84	1.00	49.70	4503.14	-4324.19	2981.43
Fixation L	1	3	3917060291	3917438514	378223	1135.83	607.49	17	23	-1	12.93	12.93
Fixation R	1	3	3917060291	3917438514	378223	1135.83	607.49	17	23	-1	12.62	12.62
Saccade L	1	3	3917438514	3917458503	19989	1134.55	609.38	948.62	718.31	1.36	217.89	1.00	68.20	5406.96	-5288.36	3786.19
Saccade R	1	3	3917438514	3917458503	19989	1134.55	609.38	948.62	718.31	1.36	217.89	1.00	68.20	5406.96	-5288.36	3786.19
Fixation L	1	4	3917458503	3917558000	99497	981.81	729.18	43	21	-1	12.50	12.50
Fixation R	1	4	3917458503	3917558000	99497	981.81	729.18	43	21	-1	12.68	12.68
Saccade L	1	4	3917558000	3917578000	20000	983.28	739.75	978.96	778.90	0.51	46.69	1.00	25.44	903.58	-977.46	920.14
Saccade R	1	4	3917558000	3917578000	20000	983.28	739.75	978.96	778.90	0.51	46.69	1.00	25.44	903.58	-977.46	920.14
Fixation L	1	5	3917578000	3917697374	119374	984.26	740.90	6	47	-1	12.41	12.41
Fixation R	1	5	3917578000	3917697374	119374	984.26	740.90	6	47	-1	12.92	12.92
Saccade L	1	5	3917697374	3917737246	39872	985.75	736.60	734.17	395.16	3.99	241.28	0.50	100.04	5829.48	-4693.96	4999.81
Saccade R	1	5	3917697374	3917737246	39872	985.75	736.60	734.17	395.16	3.99	241.28	0.50	100.04	5829.48	-4693.96	4999.81
Fixation L	1	6	3917737246	3917996097	258851	709.19	358.71	36	54	-1	12.59	12.59
Fixation R	1	6	3917737246	3917996097	258851	709.19	358.71	36	54	-1	13.15	13.15
Saccade L	1	6	3917996097	3918055845	59748	698.04	363.41	1238.28	243.66	5.93	257.95	0.67	99.33	6375.96	-5741.24	3889.56
Saccade R	1	6	3917996097	3918055845	59748	698.04	363.41	1238.28	243.66	5.93	257.95	0.67	99.33	6375.96	-5741.24	3889.56
Fixation L	1	7	3918055845	3918673183	617338	1229.13	245.17	25	49	-1	13.61	13.61
Fixation R	1	7	3918055845	3918673183	617338	1229.13	245.17	25	49	-1	13.62	13.62
Saccade L	1	7	3918673183	3918693072	19889	1233.99	215.35	1228.72	161.34	0.46	54.90	1.00	23.10	1190.77	-1038.07	975.60
Saccade R	1	7	3918673183	3918693072	19889	1233.99	215.35	1228.72	161.34	0.46	54.90	1.00	23.10	1190.77	-1038.07	975.60
Fixation L	1	8	3918693072	3918872293	179221	1233.53	174.95	10	63	-1	14.04	14.04
Fixation R	1	8	3918693072	3918872293	179221	1233.53	174.95	10	63	-1	14.02	14.02
Saccade L	1	8	3918872293	3918932041	59748	1239.12	170.17	1003.88	767.93	6.71	273.40	1.00	112.38	6395.69	-6626.07	5145.00
Saccade R	1	8	3918872293	3918932041	59748	1239.12	170.17	1003.88	767.93	6.71	273.40	1.00	112.38	6395.69	-6626.07	5145.00
Fixation L	1	9	3918932041	3919429764	497723	993.20	765.93	55	35	-1	15.20	15.20
Fixation R	1	9	3918932041	3919429764	497723	993.20	765.93	55	35	-1	14.98	14.98
Saccade L	1	9	3919429764	3919449761	19997	1029.84	749.35	1036.43	735.80	0.15	15.24	1.00	7.34	274.69	-53.86	169.95
Saccade R	1	9	3919429764	3919449761	19997	1029.84	749.35	1036.43	735.80	0.15	15.24	1.00	7.34	274.69	-53.86	169.95
Fixation L	1	10	3919449761	3919808115	358354	1038.54	760.41	11	54	-1	14.90	14.90
Fixation R	1	10	3919449761	3919808115	358354	1038.54	760.41	11	54	-1	14.70	14.70
Saccade L	1	10	3919808115	3919847978	39863	1036.22	779.05	876.83	768.31	1.56	110.18	1.00	39.10	2579.71	-2377.03	1730.83
Saccade R	1	10	3919808115	3919847978	39863	1036.22	779.05	876.83	768.31	1.56	110.18	1.00	39.10	2579.71	-2377.03	1730.83
Fixation L	1	11	3919847978	3920086847	238869	886.79	776.35	13	36	-1	14.51	14.51
Fixation R	1	11	3919847978	3920086847	238869	886.79	776.35	13	36	-1	14.75	14.75
