[BeGaze]
Converted from:	C:\Documents and Settings\iViewX\Desktop\EXPERIMENTATIONS\Experiments\results\finaleart\S1022551-finaleart-1.idf
Date:	27.03.2019 15:38:12
Version:	BeGaze 2.5.77
Sample Rate:	50
Subject:	S1022551
Description:	Alexis Nebout

Table Header for Fixations:
Event Type	Trial	Number	Start	End	Duration	Location X	Location Y	Dispersion X	Dispersion Y	Plane	Avg. Pupil Size X	Avg. Pupil Size Y

Table Header for Saccades:
Event Type	Trial	Number	Start	End	Duration	Start Loc.X	Start Loc.Y	End Loc.X	End Loc.Y	Amplitude	Peak Speed	Peak Speed At	Average Speed	Peak Accel.	Peak Decel.	Average Accel.

Table Header for Blinks:
Event Type	Trial	Number	Start	End	Duration

Table Header for User Events:
Event Type	Trial	Number	Start	Description

UserEvent	1	1	8680226845	# Message: void.jpg
Fixation L	1	1	8680230015	8680528376	298361	864.60	127.83	94	4	-1	10.37	10.37
Fixation R	1	1	8680230015	8680528376	298361	864.60	127.83	94	4	-1	9.97	9.97
Saccade L	1	1	8680528376	8680548242	19866	932.64	128.93	935.97	129.04	0.13	15.62	1.00	6.55	-33.87	-306.44	125.06
Saccade R	1	1	8680528376	8680548242	19866	932.64	128.93	935.97	129.04	0.13	15.62	1.00	6.55	-33.87	-306.44	125.06
Fixation L	1	2	8680548242	8680707354	159112	937.27	127.77	6	12	-1	10.46	10.46
Fixation R	1	2	8680548242	8680707354	159112	937.27	127.77	6	12	-1	9.96	9.96
Blink L	1	1	8680707354	8680846643	139289
Blink R	1	1	8680707354	8680846643	139289
Fixation L	1	3	8680846643	8680985856	139213	927.93	262.11	7	23	-1	12.46	12.46
Fixation R	1	3	8680846643	8680985856	139213	927.93	262.11	7	23	-1	11.36	11.36
Saccade L	1	2	8680985856	8681025603	39747	927.35	263.79	1253.92	486.60	3.84	258.62	1.00	96.63	6154.98	-6412.62	4502.65
Saccade R	1	2	8680985856	8681025603	39747	927.35	263.79	1253.92	486.60	3.84	258.62	1.00	96.63	6154.98	-6412.62	4502.65
Fixation L	1	4	8681025603	8681363715	338112	1267.74	528.54	16	55	-1	13.52	13.52
Fixation R	1	4	8681025603	8681363715	338112	1267.74	528.54	16	55	-1	12.01	12.01
Saccade L	1	3	8681363715	8681403580	39865	1270.60	530.70	925.96	507.45	2.93	221.11	0.50	73.45	5442.79	-5284.97	4246.39
Saccade R	1	3	8681363715	8681403580	39865	1270.60	530.70	925.96	507.45	2.93	221.11	0.50	73.45	5442.79	-5284.97	4246.39
Fixation L	1	5	8681403580	8682039928	636348	932.41	489.22	28	56	-1	14.12	14.12
Fixation R	1	5	8681403580	8682039928	636348	932.41	489.22	28	56	-1	12.34	12.34
Saccade L	1	4	8682039928	8682059793	19865	907.94	529.10	913.09	551.03	0.31	22.80	1.00	15.54	183.77	-231.72	172.48
Saccade R	1	4	8682039928	8682059793	19865	907.94	529.10	913.09	551.03	0.31	22.80	1.00	15.54	183.77	-231.72	172.48
Fixation L	1	6	8682059793	8682159294	99501	905.17	557.52	14	32	-1	14.73	14.73
Fixation R	1	6	8682059793	8682159294	99501	905.17	557.52	14	32	-1	12.94	12.94
