[BeGaze]
Converted from:	C:\Documents and Settings\iViewX\Desktop\EXPERIMENTATIONS\Experiments\results\finaleart\S16F14542-finaleart-1.idf
Date:	27.03.2019 15:46:06
Version:	BeGaze 2.5.77
Sample Rate:	50
Subject:	S16F14542
Description:	Diane Dewez

Table Header for Fixations:
Event Type	Trial	Number	Start	End	Duration	Location X	Location Y	Dispersion X	Dispersion Y	Plane	Avg. Pupil Size X	Avg. Pupil Size Y

Table Header for Saccades:
Event Type	Trial	Number	Start	End	Duration	Start Loc.X	Start Loc.Y	End Loc.X	End Loc.Y	Amplitude	Peak Speed	Peak Speed At	Average Speed	Peak Accel.	Peak Decel.	Average Accel.

Table Header for Blinks:
Event Type	Trial	Number	Start	End	Duration

Table Header for User Events:
Event Type	Trial	Number	Start	Description

UserEvent	1	1	6292589039	# Message: REJECTED_landscape_cross_0.jpg
Fixation L	1	1	6292596341	6293053816	457475	927.04	535.35	34	21	-1	13.40	13.40
Fixation R	1	1	6292596341	6293053816	457475	927.04	535.35	34	21	-1	12.94	12.94
Saccade L	1	1	6293053816	6293093583	39767	895.43	530.93	652.07	437.88	2.79	210.55	0.50	70.27	5235.99	-3971.34	2651.41
Saccade R	1	1	6293053816	6293093583	39767	895.43	530.93	652.07	437.88	2.79	210.55	0.50	70.27	5235.99	-3971.34	2651.41
Fixation L	1	2	6293093583	6293193061	99478	626.81	409.03	38	50	-1	12.19	12.19
Fixation R	1	2	6293093583	6293193061	99478	626.81	409.03	38	50	-1	12.30	12.30
Saccade L	1	2	6293193061	6293212938	19877	613.88	387.44	605.29	329.67	0.53	59.08	1.00	26.78	1355.19	-1226.94	869.48
Saccade R	1	2	6293193061	6293212938	19877	613.88	387.44	605.29	329.67	0.53	59.08	1.00	26.78	1355.19	-1226.94	869.48
Fixation L	1	3	6293212938	6293431718	218780	593.54	320.30	18	42	-1	11.31	11.31
Fixation R	1	3	6293212938	6293431718	218780	593.54	320.30	18	42	-1	11.12	11.12
Saccade L	1	3	6293431718	6293451676	19958	588.83	351.88	600.94	480.98	1.00	131.15	1.00	50.09	2934.32	-2996.20	2028.83
Saccade R	1	3	6293431718	6293451676	19958	588.83	351.88	600.94	480.98	1.00	131.15	1.00	50.09	2934.32	-2996.20	2028.83
Fixation L	1	4	6293451676	6293610817	159141	623.39	522.49	36	58	-1	10.98	10.98
Fixation R	1	4	6293451676	6293610817	159141	623.39	522.49	36	58	-1	10.91	10.91
Saccade L	1	4	6293610817	6293730040	119223	637.88	534.13	544.51	415.17	2.93	132.57	1.00	24.59	3052.46	-3063.39	1020.14
Saccade R	1	4	6293610817	6293730040	119223	637.88	534.13	544.51	415.17	2.93	132.57	1.00	24.59	3052.46	-3063.39	1020.14
Fixation L	1	5	6293730040	6293869281	139241	535.46	396.78	13	28	-1	11.33	11.33
Fixation R	1	5	6293730040	6293869281	139241	535.46	396.78	13	28	-1	11.30	11.30
Saccade L	1	5	6293869281	6293909154	39873	531.36	386.70	534.30	200.11	1.64	103.04	0.50	41.24	2515.79	-2272.51	2248.99
Saccade R	1	5	6293869281	6293909154	39873	531.36	386.70	534.30	200.11	1.64	103.04	0.50	41.24	2515.79	-2272.51	2248.99
Fixation L	1	6	6293909154	6294127894	218740	529.26	177.98	8	40	-1	10.90	10.90
Fixation R	1	6	6293909154	6294127894	218740	529.26	177.98	8	40	-1	11.09	11.09
Saccade L	1	6	6294127894	6294167632	39738	533.44	163.23	732.98	498.03	3.71	236.49	1.00	93.31	5774.40	-5435.53	4426.92
Saccade R	1	6	6294127894	6294167632	39738	533.44	163.23	732.98	498.03	3.71	236.49	1.00	93.31	5774.40	-5435.53	4426.92
Fixation L	1	7	6294167632	6294306877	139245	737.89	565.60	7	86	-1	11.49	11.49
Fixation R	1	7	6294167632	6294306877	139245	737.89	565.60	7	86	-1	11.87	11.87
Saccade L	1	7	6294306877	6294426253	119376	740.37	581.16	778.76	759.33	2.76	118.10	1.00	23.11	2897.14	-2636.72	1040.83
Saccade R	1	7	6294306877	6294426253	119376	740.37	581.16	778.76	759.33	2.76	118.10	1.00	23.11	2897.14	-2636.72	1040.83
Fixation L	1	8	6294426253	6294664874	238621	788.55	763.09	28	7	-1	12.76	12.76
Fixation R	1	8	6294426253	6294664874	238621	788.55	763.09	28	7	-1	12.92	12.92
Saccade L	1	8	6294664874	6294704730	39856	803.26	759.34	1050.09	673.33	2.34	185.46	0.50	58.71	4541.07	-4361.45	2978.38
Saccade R	1	8	6294664874	6294704730	39856	803.26	759.34	1050.09	673.33	2.34	185.46	0.50	58.71	4541.07	-4361.45	2978.38
Fixation L	1	9	6294704730	6294963225	258495	1044.81	647.00	10	52	-1	12.93	12.93
Fixation R	1	9	6294704730	6294963225	258495	1044.81	647.00	10	52	-1	12.27	12.27
Blink L	1	1	6294963225	6295221838	258613
Blink R	1	1	6294963225	6295221838	258613
Fixation L	1	10	6295221838	6295639594	417756	1042.49	595.10	56	35	-1	12.34	12.34
Fixation R	1	10	6295221838	6295639594	417756	1042.49	595.10	56	35	-1	12.33	12.33
Saccade L	1	9	6295639594	6295679310	39716	1088.45	597.00	1163.47	572.32	1.28	43.15	0.50	32.20	954.35	-883.10	497.58
Saccade R	1	9	6295639594	6295679310	39716	1088.45	597.00	1163.47	572.32	1.28	43.15	0.50	32.20	954.35	-883.10	497.58
Fixation L	1	11	6295679310	6295878183	198873	1186.81	538.19	32	44	-1	11.60	11.60
Fixation R	1	11	6295679310	6295878183	198873	1186.81	538.19	32	44	-1	11.97	11.97
Saccade L	1	10	6295878183	6295917931	39748	1195.48	531.70	933.62	384.27	2.67	209.55	1.00	67.10	5151.24	-5089.28	3788.24
Saccade R	1	10	6295878183	6295917931	39748	1195.48	531.70	933.62	384.27	2.67	209.55	1.00	67.10	5151.24	-5089.28	3788.24
Fixation L	1	12	6295917931	6296276043	358112	943.06	432.77	13	79	-1	11.12	11.12
Fixation R	1	12	6295917931	6296276043	358112	943.06	432.77	13	79	-1	11.65	11.65
Saccade L	1	11	6296276043	6296295921	19878	945.30	463.34	957.92	530.70	0.46	69.33	1.00	23.24	1583.00	-1684.17	1113.60
Saccade R	1	11	6296276043	6296295921	19878	945.30	463.34	957.92	530.70	0.46	69.33	1.00	23.24	1583.00	-1684.17	1113.60
Fixation L	1	13	6296295921	6296574399	278478	982.39	539.06	37	24	-1	11.39	11.39
Fixation R	1	13	6296295921	6296574399	278478	982.39	539.06	37	24	-1	12.28	12.28
