[BeGaze]
Converted from:	C:\Documents and Settings\iViewX\Desktop\EXPERIMENTATIONS\Experiments\results\finaleart\S8119532-finaleart-1.idf
Date:	27.03.2019 16:01:25
Version:	BeGaze 2.5.77
Sample Rate:	50
Subject:	S8119532
Description:	Alexandre Drewery

Table Header for Fixations:
Event Type	Trial	Number	Start	End	Duration	Location X	Location Y	Dispersion X	Dispersion Y	Plane	Avg. Pupil Size X	Avg. Pupil Size Y

Table Header for Saccades:
Event Type	Trial	Number	Start	End	Duration	Start Loc.X	Start Loc.Y	End Loc.X	End Loc.Y	Amplitude	Peak Speed	Peak Speed At	Average Speed	Peak Accel.	Peak Decel.	Average Accel.

Table Header for Blinks:
Event Type	Trial	Number	Start	End	Duration

Table Header for User Events:
Event Type	Trial	Number	Start	Description

UserEvent	1	1	3694252921	# Message: bathers_cross_1902.jpg
Fixation L	1	1	3694261280	3694429345	168065	865.01	372.39	9	90	-1	11.81	11.81
Fixation R	1	1	3694261280	3694429345	168065	865.01	372.39	9	90	-1	13.92	13.92
Saccade L	1	1	3694429345	3694475831	46486	866.04	440.83	868.30	460.58	1.32	64.19	0.00	28.32	58.63	-1324.59	468.11
Saccade R	1	1	3694429345	3694475831	46486	866.04	440.83	868.30	460.58	1.32	64.19	0.00	28.32	58.63	-1324.59	468.11
Fixation L	1	2	3694475831	3694977228	501397	873.05	462.84	13	54	-1	13.33	13.33
Fixation R	1	2	3694475831	3694977228	501397	873.05	462.84	13	54	-1	15.19	15.19
Saccade L	1	2	3694977228	3694997107	19879	880.33	455.57	879.35	282.61	1.07	174.92	1.00	53.87	4023.90	-4273.13	2784.59
Saccade R	1	2	3694977228	3694997107	19879	880.33	455.57	879.35	282.61	1.07	174.92	1.00	53.87	4023.90	-4273.13	2784.59
Fixation L	1	3	3694997107	3695217200	220093	881.53	267.84	4	24	-1	12.27	12.27
Fixation R	1	3	3694997107	3695217200	220093	881.53	267.84	4	24	-1	13.83	13.83
Saccade L	1	3	3695217200	3695255726	38526	881.66	268.44	889.65	171.61	1.16	98.28	1.00	30.19	2351.20	-2236.59	1542.72
Saccade R	1	3	3695217200	3695255726	38526	881.66	268.44	889.65	171.61	1.16	98.28	1.00	30.19	2351.20	-2236.59	1542.72
Fixation L	1	4	3695255726	3695673454	417728	914.93	165.31	37	39	-1	11.36	11.36
Fixation R	1	4	3695255726	3695673454	417728	914.93	165.31	37	39	-1	12.78	12.78
Saccade L	1	4	3695673454	3695693325	19871	912.97	177.30	899.32	267.07	0.70	91.84	1.00	35.44	2068.29	-1746.21	1294.44
Saccade R	1	4	3695673454	3695693325	19871	912.97	177.30	899.32	267.07	0.70	91.84	1.00	35.44	2068.29	-1746.21	1294.44
Fixation L	1	5	3695693325	3695872317	178992	890.15	272.31	20	41	-1	11.02	11.02
Fixation R	1	5	3695693325	3695872317	178992	890.15	272.31	20	41	-1	12.33	12.33
Saccade L	1	5	3695872317	3695912063	39746	888.91	290.56	1279.33	559.46	4.44	328.42	0.50	111.80	8093.76	-6672.48	5444.09
Saccade R	1	5	3695872317	3695912063	39746	888.91	290.56	1279.33	559.46	4.44	328.42	0.50	111.80	8093.76	-6672.48	5444.09
Fixation L	1	6	3695912063	3696071177	159114	1274.15	504.16	7	72	-1	11.40	11.40
Fixation R	1	6	3695912063	3696071177	159114	1274.15	504.16	7	72	-1	12.51	12.51
Saccade L	1	6	3696071177	3696130928	59751	1274.02	494.38	1297.61	552.14	2.33	119.58	0.33	38.98	2874.02	-1531.12	1134.50
Saccade R	1	6	3696071177	3696130928	59751	1274.02	494.38	1297.61	552.14	2.33	119.58	0.33	38.98	2874.02	-1531.12	1134.50
Fixation L	1	7	3696130928	3696349667	218739	1330.82	582.28	48	45	-1	11.40	11.40
Fixation R	1	7	3696130928	3696349667	218739	1330.82	582.28	48	45	-1	12.47	12.47
Saccade L	1	7	3696349667	3696389420	39753	1336.36	570.72	997.98	439.05	3.23	255.89	0.50	81.21	6109.71	-6169.42	4384.66
Saccade R	1	7	3696349667	3696389420	39753	1336.36	570.72	997.98	439.05	3.23	255.89	0.50	81.21	6109.71	-6169.42	4384.66
Fixation L	1	8	3696389420	3696548537	159117	990.44	439.15	11	26	-1	11.62	11.62
Fixation R	1	8	3696389420	3696548537	159117	990.44	439.15	11	26	-1	12.37	12.37
Saccade L	1	8	3696548537	3696588403	39866	989.43	428.63	946.09	230.80	2.00	141.47	1.00	50.19	3464.12	-2956.65	2140.07
Saccade R	1	8	3696548537	3696588403	39866	989.43	428.63	946.09	230.80	2.00	141.47	1.00	50.19	3464.12	-2956.65	2140.07
Fixation L	1	9	3696588403	3696767398	178995	926.46	204.74	29	43	-1	11.07	11.07
Fixation R	1	9	3696588403	3696767398	178995	926.46	204.74	29	43	-1	12.43	12.43
Saccade L	1	9	3696767398	3696787266	19868	917.76	202.70	918.05	137.05	0.53	66.41	1.00	26.68	1374.05	-1304.33	1094.02
Saccade R	1	9	3696767398	3696787266	19868	917.76	202.70	918.05	137.05	0.53	66.41	1.00	26.68	1374.05	-1304.33	1094.02
Fixation L	1	10	3696787266	3697025891	238625	926.33	119.89	26	43	-1	11.12	11.12
Fixation R	1	10	3696787266	3697025891	238625	926.33	119.89	26	43	-1	12.42	12.42
Saccade L	1	10	3697025891	3697065752	39861	944.39	151.52	1245.74	487.46	4.30	269.78	0.50	107.79	6685.17	-6551.55	5788.65
Saccade R	1	10	3697025891	3697065752	39861	944.39	151.52	1245.74	487.46	4.30	269.78	0.50	107.79	6685.17	-6551.55	5788.65
Fixation L	1	11	3697065752	3697205003	139251	1250.53	487.08	19	16	-1	11.37	11.37
Fixation R	1	11	3697065752	3697205003	139251	1250.53	487.08	19	16	-1	12.61	12.61
Saccade L	1	11	3697205003	3697264627	59624	1259.30	480.68	1395.97	543.55	2.48	149.79	0.33	41.55	3544.29	-2561.07	1501.15
Saccade R	1	11	3697205003	3697264627	59624	1259.30	480.68	1395.97	543.55	2.48	149.79	0.33	41.55	3544.29	-2561.07	1501.15
Fixation L	1	12	3697264627	3697463492	198865	1382.94	559.10	18	76	-1	11.43	11.43
Fixation R	1	12	3697264627	3697463492	198865	1382.94	559.10	18	76	-1	12.42	12.42
Saccade L	1	12	3697463492	3697562983	99491	1377.07	513.33	924.65	158.11	8.55	348.18	0.80	85.98	8538.60	-8284.81	3382.93
Saccade R	1	12	3697463492	3697562983	99491	1377.07	513.33	924.65	158.11	8.55	348.18	0.80	85.98	8538.60	-8284.81	3382.93
Fixation L	1	13	3697562983	3698259082	696099	924.78	171.03	44	52	-1	11.37	11.37
Fixation R	1	13	3697562983	3698259082	696099	924.78	171.03	44	52	-1	12.76	12.76
