[BeGaze]
Converted from:	C:\Documents and Settings\iViewX\Desktop\EXPERIMENTATIONS\Experiments\results\finaleart\S1022551-finaleart-1.idf
Date:	27.03.2019 15:38:26
Version:	BeGaze 2.5.77
Sample Rate:	50
Subject:	S1022551
Description:	Alexis Nebout

Table Header for Fixations:
Event Type	Trial	Number	Start	End	Duration	Location X	Location Y	Dispersion X	Dispersion Y	Plane	Avg. Pupil Size X	Avg. Pupil Size Y

Table Header for Saccades:
Event Type	Trial	Number	Start	End	Duration	Start Loc.X	Start Loc.Y	End Loc.X	End Loc.Y	Amplitude	Peak Speed	Peak Speed At	Average Speed	Peak Accel.	Peak Decel.	Average Accel.

Table Header for Blinks:
Event Type	Trial	Number	Start	End	Duration

Table Header for User Events:
Event Type	Trial	Number	Start	Description

UserEvent	1	1	8954780512	# Message: void.jpg
Fixation L	1	1	8954782390	8955339353	556963	1357.49	496.66	36	21	-1	15.36	15.36
Fixation R	1	1	8954782390	8955339353	556963	1357.49	496.66	36	21	-1	12.93	12.93
Saccade L	1	1	8955339353	8955438856	99503	1345.45	489.70	1470.62	847.01	6.58	200.72	0.20	66.08	4809.97	-4736.64	2863.10
Saccade R	1	1	8955339353	8955438856	99503	1345.45	489.70	1470.62	847.01	6.58	200.72	0.20	66.08	4809.97	-4736.64	2863.10
Fixation L	1	2	8955438856	8955597982	159126	1456.05	826.99	22	32	-1	15.20	15.20
Fixation R	1	2	8955438856	8955597982	159126	1456.05	826.99	22	32	-1	12.39	12.39
Saccade L	1	2	8955597982	8955637732	39750	1453.20	831.05	1571.87	922.43	1.82	103.32	0.50	45.82	2500.00	-1696.98	1872.66
Saccade R	1	2	8955597982	8955637732	39750	1453.20	831.05	1571.87	922.43	1.82	103.32	0.50	45.82	2500.00	-1696.98	1872.66
Fixation L	1	3	8955637732	8955954134	316402	1604.59	948.99	44	35	-1	14.26	14.26
Fixation R	1	3	8955637732	8955954134	316402	1604.59	948.99	44	35	-1	11.55	11.55
Saccade L	1	3	8955954134	8955995700	41566	1605.26	948.38	616.80	961.22	8.38	748.00	0.52	201.60	18647.44	-18556.40	12332.09
Saccade R	1	3	8955954134	8955995700	41566	1605.26	948.38	616.80	961.22	8.38	748.00	0.52	201.60	18647.44	-18556.40	12332.09
Fixation L	1	4	8955995700	8956134953	139253	621.71	963.35	19	20	-1	13.05	13.05
Fixation R	1	4	8955995700	8956134953	139253	621.71	963.35	19	20	-1	10.93	10.93
Blink L	1	1	8956134953	8956413427	278474
Blink R	1	1	8956134953	8956413427	278474
Saccade R	1	4	8956413427	8956433298	19871	1315.29	681.71	870.05	398.13	2.97	532.48	1.00	149.62	12573.65	-13051.39	8556.45
Fixation R	1	5	8956433298	8956572553	139255	855.23	426.50	21	52	-1	11.39	11.39
Fixation L	1	5	8956453169	8956572553	119384	853.11	430.55	7	49	-1	11.88	11.88
Saccade L	1	4	8956572553	8956593365	20812	853.12	449.65	836.17	485.43	0.52	42.30	1.00	24.85	857.87	217.61	616.71
Saccade R	1	5	8956572553	8956593365	20812	853.12	449.65	836.17	485.43	0.52	42.30	1.00	24.85	857.87	217.61	616.71
Fixation L	1	6	8956593365	8956691913	98548	873.71	482.39	58	40	-1	11.68	11.68
Fixation R	1	6	8956593365	8956691913	98548	873.71	482.39	58	40	-1	11.18	11.18
Saccade L	1	5	8956691913	8956711789	19876	894.36	493.03	898.70	494.91	0.09	7.25	0.00	4.75	39.83	-86.61	54.52
Saccade R	1	6	8956691913	8956711789	19876	894.36	493.03	898.70	494.91	0.09	7.25	0.00	4.75	39.83	-86.61	54.52
Fixation L	1	7	8956711789	8956811155	99366	904.17	497.78	9	8	-1	11.81	11.81
Fixation R	1	7	8956711789	8956811155	99366	904.17	497.78	9	8	-1	11.05	11.05
