[BeGaze]
Converted from:	C:\Documents and Settings\iViewX\Desktop\EXPERIMENTATIONS\Experiments\results\finaleart\S18F56223-finaleart-1.idf
Date:	27.03.2019 15:48:17
Version:	BeGaze 2.5.77
Sample Rate:	50
Subject:	S18F56223
Description:	Pascale Sebillot

Table Header for Fixations:
Event Type	Trial	Number	Start	End	Duration	Location X	Location Y	Dispersion X	Dispersion Y	Plane	Avg. Pupil Size X	Avg. Pupil Size Y

Table Header for Saccades:
Event Type	Trial	Number	Start	End	Duration	Start Loc.X	Start Loc.Y	End Loc.X	End Loc.Y	Amplitude	Peak Speed	Peak Speed At	Average Speed	Peak Accel.	Peak Decel.	Average Accel.

Table Header for Blinks:
Event Type	Trial	Number	Start	End	Duration

Table Header for User Events:
Event Type	Trial	Number	Start	Description

UserEvent	1	1	2257968916	# Message: void.jpg
Saccade L	1	1	2257969400	2258566097	596697	706.15	799.95	1069.39	532.95	110.27	568.50	0.20	184.81	8908.41	-13333.00	3146.93
Saccade R	1	1	2257969400	2258566097	596697	706.15	799.95	1069.39	532.95	110.27	568.50	0.20	184.81	8908.41	-13333.00	3146.93
Fixation L	1	1	2258566097	2258685481	119384	1064.82	560.31	19	48	-1	12.81	12.81
Fixation R	1	1	2258566097	2258685481	119384	1064.82	560.31	19	48	-1	12.73	12.73
Saccade L	1	2	2258685481	2258725231	39750	1058.37	565.02	1056.10	598.72	6.77	396.67	1.00	170.35	9227.17	-9731.60	8934.44
Saccade R	1	2	2258685481	2258725231	39750	1058.37	565.02	1056.10	598.72	6.77	396.67	1.00	170.35	9227.17	-9731.60	8934.44
Fixation L	1	2	2258725231	2258924095	198864	1039.63	618.34	23	68	-1	12.17	12.17
Fixation R	1	2	2258725231	2258924095	198864	1039.63	618.34	23	68	-1	11.99	11.99
Saccade L	1	3	2258924095	2259103092	178997	1032.45	649.24	383.37	248.37	16.48	204.67	0.33	92.07	4272.11	-2591.50	1785.11
Saccade R	1	3	2258924095	2259103092	178997	1032.45	649.24	383.37	248.37	16.48	204.67	0.33	92.07	4272.11	-2591.50	1785.11
Fixation L	1	3	2259103092	2259202574	99482	396.72	257.75	54	43	-1	12.58	12.58
Fixation R	1	3	2259103092	2259202574	99482	396.72	257.75	54	43	-1	12.58	12.58
Saccade L	1	4	2259202574	2259222458	19884	413.90	291.72	384.11	301.85	0.66	45.85	1.00	33.24	567.81	-415.35	444.57
Saccade R	1	4	2259202574	2259222458	19884	413.90	291.72	384.11	301.85	0.66	45.85	1.00	33.24	567.81	-415.35	444.57
Fixation L	1	4	2259222458	2259421322	198864	404.03	297.11	55	24	-1	12.58	12.58
Fixation R	1	4	2259222458	2259421322	198864	404.03	297.11	55	24	-1	12.70	12.70
Saccade L	1	5	2259421322	2259958416	537094	394.92	294.52	871.74	562.61	82.01	416.50	0.26	152.69	9712.75	-9749.96	4240.54
Saccade R	1	5	2259421322	2259958416	537094	394.92	294.52	871.74	562.61	82.01	416.50	0.26	152.69	9712.75	-9749.96	4240.54
