[BeGaze]
Converted from:	C:\Documents and Settings\iViewX\Desktop\EXPERIMENTATIONS\Experiments\results\finaleart\S15H25531-finaleart-1.idf
Date:	27.03.2019 15:45:08
Version:	BeGaze 2.5.77
Sample Rate:	50
Subject:	S15H25531
Description:	Mikail Demirdelen

Table Header for Fixations:
Event Type	Trial	Number	Start	End	Duration	Location X	Location Y	Dispersion X	Dispersion Y	Plane	Avg. Pupil Size X	Avg. Pupil Size Y

Table Header for Saccades:
Event Type	Trial	Number	Start	End	Duration	Start Loc.X	Start Loc.Y	End Loc.X	End Loc.Y	Amplitude	Peak Speed	Peak Speed At	Average Speed	Peak Accel.	Peak Decel.	Average Accel.

Table Header for Blinks:
Event Type	Trial	Number	Start	End	Duration

Table Header for User Events:
Event Type	Trial	Number	Start	Description

UserEvent	1	1	4092516680	# Message: Upper_Mississippi_Kensett_1855.jpg
Fixation L	1	1	4092517156	4093054229	537073	930.17	530.50	56	39	-1	13.50	13.50
Fixation R	1	1	4092517156	4093054229	537073	930.17	530.50	56	39	-1	14.41	14.41
Saccade L	1	1	4093054229	4093074121	19892	884.13	556.00	868.99	554.68	0.18	15.37	1.00	9.16	338.15	-130.56	195.49
Saccade R	1	1	4093054229	4093074121	19892	884.13	556.00	868.99	554.68	0.18	15.37	1.00	9.16	338.15	-130.56	195.49
Fixation L	1	2	4093074121	4093272996	198875	863.13	555.54	27	44	-1	11.52	11.52
Fixation R	1	2	4093074121	4093272996	198875	863.13	555.54	27	44	-1	12.08	12.08
Saccade L	1	2	4093272996	4093292859	19863	846.35	519.13	854.39	485.27	0.40	35.21	1.00	19.90	728.70	-754.43	725.30
Saccade R	1	2	4093272996	4093292859	19863	846.35	519.13	854.39	485.27	0.40	35.21	1.00	19.90	728.70	-754.43	725.30
Fixation L	1	3	4093292859	4093412219	119360	849.19	489.00	10	16	-1	10.21	10.21
Fixation R	1	3	4093292859	4093412219	119360	849.19	489.00	10	16	-1	10.90	10.90
Saccade L	1	3	4093412219	4093471888	59669	844.37	488.78	650.57	-56.37	6.36	280.59	0.67	106.53	6755.63	-6199.86	4766.36
Saccade R	1	3	4093412219	4093471888	59669	844.37	488.78	650.57	-56.37	6.36	280.59	0.67	106.53	6755.63	-6199.86	4766.36
Fixation L	1	4	4093471888	4093630966	159078	649.86	-41.67	18	60	-1	9.62	9.62
Fixation R	1	4	4093471888	4093630966	159078	649.86	-41.67	18	60	-1	10.13	10.13
Saccade L	1	4	4093630966	4093770200	139234	648.14	-38.66	1583.75	776.26	20.46	418.17	0.29	146.98	10069.80	-5387.77	4250.63
Saccade R	1	4	4093630966	4093770200	139234	648.14	-38.66	1583.75	776.26	20.46	418.17	0.29	146.98	10069.80	-5387.77	4250.63
Fixation L	1	5	4093770200	4094048691	278491	1571.23	774.17	21	9	-1	9.80	9.80
Fixation R	1	5	4093770200	4094048691	278491	1571.23	774.17	21	9	-1	9.91	9.91
Saccade L	1	5	4094048691	4094108322	59631	1569.06	771.78	1069.21	691.57	5.33	313.59	0.67	89.42	7818.47	-7627.74	4188.01
Saccade R	1	5	4094048691	4094108322	59631	1569.06	771.78	1069.21	691.57	5.33	313.59	0.67	89.42	7818.47	-7627.74	4188.01
Fixation L	1	6	4094108322	4094744788	636466	1051.37	683.62	32	25	-1	10.62	10.62
Fixation R	1	6	4094108322	4094744788	636466	1051.37	683.62	32	25	-1	10.74	10.74
Saccade L	1	6	4094744788	4094784528	39740	1055.69	694.32	812.75	575.63	2.54	156.71	1.00	64.02	3859.45	-2416.23	2785.64
Saccade R	1	6	4094744788	4094784528	39740	1055.69	694.32	812.75	575.63	2.54	156.71	1.00	64.02	3859.45	-2416.23	2785.64
Fixation L	1	7	4094784528	4094903900	119372	813.46	544.76	17	78	-1	11.37	11.37
Fixation R	1	7	4094784528	4094903900	119372	813.46	544.76	17	78	-1	11.87	11.87
Saccade L	1	7	4094903900	4094923773	19873	822.20	520.98	820.26	516.26	0.09	5.90	0.00	4.74	431.56	-41.87	170.27
Saccade R	1	7	4094903900	4094923773	19873	822.20	520.98	820.26	516.26	0.09	5.90	0.00	4.74	431.56	-41.87	170.27
Fixation L	1	8	4094923773	4095142641	218868	818.14	534.16	12	29	-1	11.43	11.43
Fixation R	1	8	4094923773	4095142641	218868	818.14	534.16	12	29	-1	11.76	11.76
Saccade L	1	8	4095142641	4095182384	39743	812.60	540.37	1124.24	559.31	2.61	189.20	1.00	65.77	4680.00	-4440.71	3792.97
Saccade R	1	8	4095142641	4095182384	39743	812.60	540.37	1124.24	559.31	2.61	189.20	1.00	65.77	4680.00	-4440.71	3792.97
Fixation L	1	9	4095182384	4095361376	178992	1139.52	562.41	24	19	-1	11.08	11.08
Fixation R	1	9	4095182384	4095361376	178992	1139.52	562.41	24	19	-1	11.66	11.66
Saccade L	1	9	4095361376	4095381255	19879	1148.37	570.65	1032.44	583.01	0.94	117.93	1.00	47.53	2846.40	-2605.25	2360.43
Saccade R	1	9	4095361376	4095381255	19879	1148.37	570.65	1032.44	583.01	0.94	117.93	1.00	47.53	2846.40	-2605.25	2360.43
Fixation L	1	10	4095381255	4095958117	576862	969.95	590.72	70	29	-1	11.20	11.20
Fixation R	1	10	4095381255	4095958117	576862	969.95	590.72	70	29	-1	11.59	11.59
Saccade L	1	10	4095958117	4095977974	19857	968.66	604.93	967.78	606.75	0.11	10.62	0.00	5.40	106.18	-185.84	128.16
Saccade R	1	10	4095958117	4095977974	19857	968.66	604.93	967.78	606.75	0.11	10.62	0.00	5.40	106.18	-185.84	128.16
Fixation L	1	11	4095977974	4096156965	178991	964.15	608.13	9	8	-1	11.83	11.83
Fixation R	1	11	4095977974	4096156965	178991	964.15	608.13	9	8	-1	12.32	12.32
Saccade L	1	11	4096156965	4096176854	19889	957.99	606.50	830.22	564.51	0.85	136.03	1.00	42.76	3326.86	-2730.88	2171.07
Saccade R	1	11	4096156965	4096176854	19889	957.99	606.50	830.22	564.51	0.85	136.03	1.00	42.76	3326.86	-2730.88	2171.07
Fixation L	1	12	4096176854	4096515078	338224	819.11	567.13	17	34	-1	11.37	11.37
Fixation R	1	12	4096176854	4096515078	338224	819.11	567.13	17	34	-1	11.84	11.84
