[BeGaze]
Converted from:	C:\Documents and Settings\iViewX\Desktop\EXPERIMENTATIONS\Experiments\results\finaleart\S02123220-finaleart-1.idf
Date:	27.03.2019 15:33:33
Version:	BeGaze 2.5.77
Sample Rate:	50
Subject:	S02123220
Description:	David Xu

Table Header for Fixations:
Event Type	Trial	Number	Start	End	Duration	Location X	Location Y	Dispersion X	Dispersion Y	Plane	Avg. Pupil Size X	Avg. Pupil Size Y

Table Header for Saccades:
Event Type	Trial	Number	Start	End	Duration	Start Loc.X	Start Loc.Y	End Loc.X	End Loc.Y	Amplitude	Peak Speed	Peak Speed At	Average Speed	Peak Accel.	Peak Decel.	Average Accel.

Table Header for Blinks:
Event Type	Trial	Number	Start	End	Duration

Table Header for User Events:
Event Type	Trial	Number	Start	Description

UserEvent	1	1	820846037	# Message: void.jpg
Saccade L	1	1	820852669	820952176	99507	1456.45	709.94	1440.36	145.22	11.74	402.99	0.60	118.02	8482.33	-8898.09	3509.62
Saccade R	1	1	820852669	820952176	99507	1456.45	709.94	1440.36	145.22	11.74	402.99	0.60	118.02	8482.33	-8898.09	3509.62
Fixation L	1	1	820952176	821330021	377845	1433.99	182.21	32	51	-1	12.51	12.51
Fixation R	1	1	820952176	821330021	377845	1433.99	182.21	32	51	-1	10.50	10.50
Blink L	1	1	821330021	821648243	318222
Blink R	1	1	821330021	821648243	318222
Saccade L	1	2	821648243	821827235	178992	908.10	314.21	935.64	321.52	9.45	121.79	1.00	52.79	2995.13	-2893.22	1377.59
Saccade R	1	2	821648243	821827235	178992	908.10	314.21	935.64	321.52	9.45	121.79	1.00	52.79	2995.13	-2893.22	1377.59
Fixation L	1	2	821827235	821946612	119377	935.86	331.18	6	56	-1	15.94	15.94
Fixation R	1	2	821827235	821946612	119377	935.86	331.18	6	56	-1	14.16	14.16
Saccade L	1	3	821946612	822105718	159106	933.04	291.06	920.84	273.74	14.47	269.01	0.37	90.97	5905.96	-6216.22	3940.87
Saccade R	1	3	821946612	822105718	159106	933.04	291.06	920.84	273.74	14.47	269.01	0.37	90.97	5905.96	-6216.22	3940.87
Fixation L	1	3	822105718	822563187	457469	924.95	252.58	12	82	-1	16.44	16.44
Fixation R	1	3	822105718	822563187	457469	924.95	252.58	12	82	-1	14.76	14.76
Saccade L	1	4	822563187	822841673	278486	925.65	286.41	936.62	442.22	22.92	220.56	0.71	82.31	3866.40	-4331.76	2185.84
Saccade R	1	4	822563187	822841673	278486	925.65	286.41	936.62	442.22	22.92	220.56	0.71	82.31	3866.40	-4331.76	2185.84
