[BeGaze]
Converted from:	C:\Documents and Settings\iViewX\Desktop\EXPERIMENTATIONS\Experiments\results\finaleart\S18F56223-finaleart-1.idf
Date:	27.03.2019 15:48:30
Version:	BeGaze 2.5.77
Sample Rate:	50
Subject:	S18F56223
Description:	Pascale Sebillot

Table Header for Fixations:
Event Type	Trial	Number	Start	End	Duration	Location X	Location Y	Dispersion X	Dispersion Y	Plane	Avg. Pupil Size X	Avg. Pupil Size Y

Table Header for Saccades:
Event Type	Trial	Number	Start	End	Duration	Start Loc.X	Start Loc.Y	End Loc.X	End Loc.Y	Amplitude	Peak Speed	Peak Speed At	Average Speed	Peak Accel.	Peak Decel.	Average Accel.

Table Header for Blinks:
Event Type	Trial	Number	Start	End	Duration

Table Header for User Events:
Event Type	Trial	Number	Start	Description

UserEvent	1	1	2393614548	# Message: still-life_matisse_0.jpg
Fixation L	1	1	2393619945	2393997818	377873	758.08	605.99	29	59	-1	14.37	14.37
Fixation R	1	1	2393619945	2393997818	377873	758.08	605.99	29	59	-1	13.86	13.86
Saccade L	1	1	2393997818	2394017684	19866	764.75	628.62	765.33	647.28	0.17	18.88	1.00	8.63	327.62	-110.03	163.59
Saccade R	1	1	2393997818	2394017684	19866	764.75	628.62	765.33	647.28	0.17	18.88	1.00	8.63	327.62	-110.03	163.59
Fixation L	1	2	2394017684	2394156929	139245	770.38	644.34	8	20	-1	14.25	14.25
Fixation R	1	2	2394017684	2394156929	139245	770.38	644.34	8	20	-1	13.71	13.71
Saccade L	1	2	2394156929	2394196784	39855	774.25	633.17	1179.66	643.57	4.10	275.03	1.00	102.95	6356.42	-5135.40	4035.83
Saccade R	1	2	2394156929	2394196784	39855	774.25	633.17	1179.66	643.57	4.10	275.03	1.00	102.95	6356.42	-5135.40	4035.83
Fixation L	1	3	2394196784	2394316037	119253	1156.00	649.89	77	20	-1	13.57	13.57
Fixation R	1	3	2394196784	2394316037	119253	1156.00	649.89	77	20	-1	13.69	13.69
Saccade L	1	3	2394316037	2394335923	19886	1158.85	662.95	1155.74	671.45	0.23	14.26	0.00	11.76	27.49	-32.88	29.39
Saccade R	1	3	2394316037	2394335923	19886	1158.85	662.95	1155.74	671.45	0.23	14.26	0.00	11.76	27.49	-32.88	29.39
Fixation L	1	4	2394335923	2394435397	99474	1155.08	667.97	3	26	-1	13.32	13.32
Fixation R	1	4	2394335923	2394435397	99474	1155.08	667.97	3	26	-1	13.51	13.51
Saccade L	1	4	2394435397	2394495033	59636	1154.42	684.77	1176.34	423.47	4.27	215.89	0.67	71.66	4843.29	-4961.61	2972.25
Saccade R	1	4	2394435397	2394495033	59636	1154.42	684.77	1176.34	423.47	4.27	215.89	0.67	71.66	4843.29	-4961.61	2972.25
Fixation L	1	5	2394495033	2394694020	198987	1185.49	446.01	29	32	-1	13.64	13.64
Fixation R	1	5	2394495033	2394694020	198987	1185.49	446.01	29	32	-1	13.23	13.23
Saccade L	1	5	2394694020	2394713894	19874	1192.19	447.39	1183.53	367.82	0.59	80.96	1.00	29.66	1903.58	-1944.62	1485.42
Saccade R	1	5	2394694020	2394713894	19874	1192.19	447.39	1183.53	367.82	0.59	80.96	1.00	29.66	1903.58	-1944.62	1485.42
Fixation L	1	6	2394713894	2394813268	99374	1169.60	334.01	23	59	-1	13.46	13.46
Fixation R	1	6	2394713894	2394813268	99374	1169.60	334.01	23	59	-1	13.22	13.22
Saccade L	1	6	2394813268	2394833263	19995	1161.47	314.07	1160.42	285.37	0.47	35.81	1.00	23.62	755.98	55.12	312.16
Saccade R	1	6	2394813268	2394833263	19995	1161.47	314.07	1160.42	285.37	0.47	35.81	1.00	23.62	755.98	55.12	312.16
Fixation L	1	7	2394833263	2394932630	99367	1148.81	296.62	41	45	-1	13.37	13.37
Fixation R	1	7	2394833263	2394932630	99367	1148.81	296.62	41	45	-1	12.86	12.86
Saccade L	1	7	2394932630	2394952513	19883	1119.26	274.78	973.44	293.82	1.07	148.74	1.00	53.99	3682.78	-3452.52	2561.81
Saccade R	1	7	2394932630	2394952513	19883	1119.26	274.78	973.44	293.82	1.07	148.74	1.00	53.99	3682.78	-3452.52	2561.81
Fixation L	1	8	2394952513	2395151499	198986	993.66	300.49	29	18	-1	13.05	13.05
Fixation R	1	8	2394952513	2395151499	198986	993.66	300.49	29	18	-1	12.44	12.44
Saccade L	1	8	2395151499	2395191245	39746	990.82	309.20	591.57	501.42	3.73	323.45	0.50	93.78	7934.59	-7887.67	5392.43
Saccade R	1	8	2395151499	2395191245	39746	990.82	309.20	591.57	501.42	3.73	323.45	0.50	93.78	7934.59	-7887.67	5392.43
Fixation L	1	9	2395191245	2395429858	238613	592.43	521.75	10	43	-1	12.66	12.66
Fixation R	1	9	2395191245	2395429858	238613	592.43	521.75	10	43	-1	12.59	12.59
Saccade L	1	9	2395429858	2395469739	39881	591.31	539.76	589.89	245.23	2.52	187.52	0.50	63.21	4581.60	-4486.91	3534.75
Saccade R	1	9	2395429858	2395469739	39881	591.31	539.76	589.89	245.23	2.52	187.52	0.50	63.21	4581.60	-4486.91	3534.75
Fixation L	1	10	2395469739	2395628851	159112	592.63	262.56	62	28	-1	12.20	12.20
Fixation R	1	10	2395469739	2395628851	159112	592.63	262.56	62	28	-1	12.71	12.71
Saccade L	1	10	2395628851	2395668596	39745	644.20	266.33	1039.84	242.10	3.71	307.03	0.50	93.38	7623.79	-7668.72	4580.99
Saccade R	1	10	2395628851	2395668596	39745	644.20	266.33	1039.84	242.10	3.71	307.03	0.50	93.38	7623.79	-7668.72	4580.99
Fixation L	1	11	2395668596	2395927221	258625	1044.39	215.96	10	37	-1	13.14	13.14
Fixation R	1	11	2395668596	2395927221	258625	1044.39	215.96	10	37	-1	13.09	13.09
Saccade L	1	11	2395927221	2395986858	59637	1038.93	208.17	1414.93	461.79	5.40	297.95	0.67	90.48	7326.32	-6585.87	3827.60
Saccade R	1	11	2395927221	2395986858	59637	1038.93	208.17	1414.93	461.79	5.40	297.95	0.67	90.48	7326.32	-6585.87	3827.60
Fixation L	1	12	2395986858	2396205599	218741	1435.04	441.69	34	52	-1	13.87	13.87
Fixation R	1	12	2395986858	2396205599	218741	1435.04	441.69	34	52	-1	13.66	13.66
Saccade L	1	12	2396205599	2396245449	39850	1449.89	443.97	1452.22	732.44	2.45	257.65	1.00	61.53	6358.12	-5661.66	3359.05
Saccade R	1	12	2396205599	2396245449	39850	1449.89	443.97	1452.22	732.44	2.45	257.65	1.00	61.53	6358.12	-5661.66	3359.05
Fixation L	1	13	2396245449	2396444317	198868	1435.06	773.39	28	61	-1	14.81	14.81
Fixation R	1	13	2396245449	2396444317	198868	1435.06	773.39	28	61	-1	13.98	13.98
Saccade L	1	13	2396444317	2396563682	119365	1425.67	794.34	1011.67	220.96	11.50	229.21	0.67	96.34	5485.12	-3301.27	2389.52
Saccade R	1	13	2396444317	2396563682	119365	1425.67	794.34	1011.67	220.96	11.50	229.21	0.67	96.34	5485.12	-3301.27	2389.52
Fixation L	1	14	2396563682	2396683073	119391	1000.01	167.92	19	70	-1	14.54	14.54
Fixation R	1	14	2396563682	2396683073	119391	1000.01	167.92	19	70	-1	13.77	13.77
Saccade L	1	14	2396683073	2396702929	19856	997.96	149.99	996.89	140.35	0.14	9.81	1.00	6.86	80.94	-172.38	112.48
Saccade R	1	14	2396683073	2396702929	19856	997.96	149.99	996.89	140.35	0.14	9.81	1.00	6.86	80.94	-172.38	112.48
Fixation L	1	15	2396702929	2397001319	298390	994.67	125.75	14	23	-1	13.53	13.53
Fixation R	1	15	2396702929	2397001319	298390	994.67	125.75	14	23	-1	13.15	13.15
Saccade L	1	15	2397001319	2397041040	39721	986.41	127.71	1159.93	492.31	3.57	257.88	1.00	89.93	6352.68	-6324.37	5185.32
Saccade R	1	15	2397001319	2397041040	39721	986.41	127.71	1159.93	492.31	3.57	257.88	1.00	89.93	6352.68	-6324.37	5185.32
Fixation L	1	16	2397041040	2397379148	338108	1135.24	507.25	37	33	-1	13.73	13.73
Fixation R	1	16	2397041040	2397379148	338108	1135.24	507.25	37	33	-1	13.60	13.60
Saccade L	1	16	2397379148	2397399028	19880	1131.51	525.40	1144.71	630.65	0.59	107.30	1.00	29.48	2603.84	-2486.21	1710.71
Saccade R	1	16	2397379148	2397399028	19880	1131.51	525.40	1144.71	630.65	0.59	107.30	1.00	29.48	2603.84	-2486.21	1710.71
Fixation L	1	17	2397399028	2397597891	198863	1157.81	639.02	23	16	-1	13.87	13.87
Fixation R	1	17	2397399028	2397597891	198863	1157.81	639.02	23	16	-1	14.05	14.05
