[BeGaze]
Converted from:	C:\Documents and Settings\iViewX\Desktop\EXPERIMENTATIONS\Experiments\results\finaleart\S19F21442-finaleart-1.idf
Date:	27.03.2019 15:51:36
Version:	BeGaze 2.5.77
Sample Rate:	50
Subject:	S19F21442
Description:	Juliette Veuillez

Table Header for Fixations:
Event Type	Trial	Number	Start	End	Duration	Location X	Location Y	Dispersion X	Dispersion Y	Plane	Avg. Pupil Size X	Avg. Pupil Size Y

Table Header for Saccades:
Event Type	Trial	Number	Start	End	Duration	Start Loc.X	Start Loc.Y	End Loc.X	End Loc.Y	Amplitude	Peak Speed	Peak Speed At	Average Speed	Peak Accel.	Peak Decel.	Average Accel.

Table Header for Blinks:
Event Type	Trial	Number	Start	End	Duration

Table Header for User Events:
Event Type	Trial	Number	Start	Description

UserEvent	1	1	7719972045	# Message: void.jpg
Fixation L	1	1	7719982127	7720280350	298223	481.47	708.98	35	38	-1	10.48	10.48
Fixation R	1	1	7719982127	7720280350	298223	481.47	708.98	35	38	-1	12.78	12.78
Saccade L	1	1	7720280350	7720320283	39933	497.21	734.18	661.83	552.40	2.37	200.11	1.00	59.27	4647.93	-4995.07	3068.26
Saccade R	1	1	7720280350	7720320283	39933	497.21	734.18	661.83	552.40	2.37	200.11	1.00	59.27	4647.93	-4995.07	3068.26
Fixation L	1	2	7720320283	7720439470	119187	651.57	543.69	13	13	-1	10.47	10.47
Fixation R	1	2	7720320283	7720439470	119187	651.57	543.69	13	13	-1	12.43	12.43
Blink L	1	1	7720439470	7720658333	218863
Blink R	1	1	7720439470	7720658333	218863
Fixation L	1	3	7720658333	7720777733	119400	644.46	681.80	25	59	-1	11.87	11.87
Fixation R	1	3	7720658333	7720777733	119400	644.46	681.80	25	59	-1	12.82	12.82
Saccade L	1	2	7720777733	7720797581	19848	654.83	707.18	657.71	722.09	0.21	15.37	1.00	10.55	46.42	-259.11	105.12
Saccade R	1	2	7720777733	7720797581	19848	654.83	707.18	657.71	722.09	0.21	15.37	1.00	10.55	46.42	-259.11	105.12
Fixation L	1	4	7720797581	7721255058	457477	669.88	741.66	20	36	-1	11.13	11.13
Fixation R	1	4	7720797581	7721255058	457477	669.88	741.66	20	36	-1	12.35	12.35
Saccade L	1	3	7721255058	7721294813	39755	670.90	758.29	738.92	580.82	1.70	135.05	1.00	42.88	3274.88	-3263.90	2442.08
Saccade R	1	3	7721255058	7721294813	39755	670.90	758.29	738.92	580.82	1.70	135.05	1.00	42.88	3274.88	-3263.90	2442.08
Fixation L	1	5	7721294813	7721971056	676243	743.45	577.80	28	25	-1	11.09	11.09
Fixation R	1	5	7721294813	7721971056	676243	743.45	577.80	28	25	-1	12.22	12.22
