[BeGaze]
Converted from:	C:\Documents and Settings\iViewX\Desktop\EXPERIMENTATIONS\Experiments\results\finaleart\S4120113-finaleart-1.idf
Date:	27.03.2019 15:34:39
Version:	BeGaze 2.5.77
Sample Rate:	50
Subject:	S4120113
Description:	Vidal Attias

Table Header for Fixations:
Event Type	Trial	Number	Start	End	Duration	Location X	Location Y	Dispersion X	Dispersion Y	Plane	Avg. Pupil Size X	Avg. Pupil Size Y

Table Header for Saccades:
Event Type	Trial	Number	Start	End	Duration	Start Loc.X	Start Loc.Y	End Loc.X	End Loc.Y	Amplitude	Peak Speed	Peak Speed At	Average Speed	Peak Accel.	Peak Decel.	Average Accel.

Table Header for Blinks:
Event Type	Trial	Number	Start	End	Duration

Table Header for User Events:
Event Type	Trial	Number	Start	Description

UserEvent	1	1	7319164626	# Message: void.jpg
Saccade L	1	1	7319176680	7319276182	99502	514.48	469.04	506.09	983.31	8.13	351.93	0.80	81.70	8552.36	-8511.33	3505.72
Saccade R	1	1	7319176680	7319276182	99502	514.48	469.04	506.09	983.31	8.13	351.93	0.80	81.70	8552.36	-8511.33	3505.72
Fixation L	1	1	7319276182	7319594421	318239	506.23	950.35	18	45	-1	12.55	12.55
Fixation R	1	1	7319276182	7319594421	318239	506.23	950.35	18	45	-1	15.01	15.01
Blink L	1	1	7319594421	7319693896	99475
Blink R	1	1	7319594421	7319892752	298331
Blink L	1	2	7319713777	7319952379	238602
Saccade R	1	2	7319892752	7319912634	19882	1290.47	613.40	1125.68	471.03	2.96	269.72	0.00	149.03	4160.72	-5432.30	4745.28
Fixation R	1	2	7319912634	7320151246	238612	1123.61	511.17	12	85	-1	10.20	10.20
Fixation L	1	2	7319952379	7320230878	278499	1120.06	510.84	22	70	-1	9.29	9.29
Saccade R	1	3	7320151246	7320230878	79632	1116.56	505.75	1103.63	512.59	1.40	60.66	1.00	17.56	1007.47	-69.90	528.93
Saccade L	1	2	7320230878	7320250738	19860	1103.63	512.59	1103.11	572.56	0.87	65.36	1.00	43.92	1007.47	-971.90	960.47
Fixation R	1	3	7320230878	7320370101	139223	1101.53	527.24	29	68	-1	8.82	8.82
Fixation L	1	3	7320250738	7320370101	119363	1101.23	529.34	29	68	-1	9.50	9.50
Saccade L	1	3	7320370101	7320389981	19880	1087.97	518.62	1127.16	526.83	0.96	61.86	1.00	48.47	-177.41	-533.70	366.25
Saccade R	1	4	7320370101	7320389981	19880	1087.97	518.62	1127.16	526.83	0.96	61.86	1.00	48.47	-177.41	-533.70	366.25
Fixation L	1	4	7320389981	7320588837	198856	1101.61	543.32	50	47	-1	9.70	9.70
Fixation R	1	4	7320389981	7320588837	198856	1101.61	543.32	50	47	-1	9.25	9.25
Saccade L	1	4	7320588837	7320608733	19896	1098.13	559.99	1100.46	581.26	0.45	56.18	1.00	22.83	1169.50	438.44	700.83
Saccade R	1	5	7320588837	7320608733	19896	1098.13	559.99	1100.46	581.26	0.45	56.18	1.00	22.83	1169.50	438.44	700.83
Fixation L	1	5	7320608733	7321086069	477336	1098.63	529.09	11	85	-1	10.36	10.36
Fixation R	1	5	7320608733	7321086069	477336	1098.63	529.09	11	85	-1	10.33	10.33
Saccade L	1	5	7321086069	7321245179	159110	1093.11	522.19	1059.06	467.75	5.58	85.33	0.38	35.06	1095.53	-1501.29	604.77
Saccade R	1	6	7321086069	7321245179	159110	1093.11	522.19	1059.06	467.75	5.58	85.33	0.38	35.06	1095.53	-1501.29	604.77
