[BeGaze]
Converted from:	C:\Documents and Settings\iViewX\Desktop\EXPERIMENTATIONS\Experiments\results\finaleart\S11H21112-finaleart-1.idf
Date:	27.03.2019 15:39:22
Version:	BeGaze 2.5.77
Sample Rate:	50
Subject:	S11H21112
Description:	Clement legrand-Duchenne

Table Header for Fixations:
Event Type	Trial	Number	Start	End	Duration	Location X	Location Y	Dispersion X	Dispersion Y	Plane	Avg. Pupil Size X	Avg. Pupil Size Y

Table Header for Saccades:
Event Type	Trial	Number	Start	End	Duration	Start Loc.X	Start Loc.Y	End Loc.X	End Loc.Y	Amplitude	Peak Speed	Peak Speed At	Average Speed	Peak Accel.	Peak Decel.	Average Accel.

Table Header for Blinks:
Event Type	Trial	Number	Start	End	Duration

Table Header for User Events:
Event Type	Trial	Number	Start	Description

UserEvent	1	1	5360445168	# Message: madrazo-y-kuntz-Man-Holding-a-Dagger-1850.jpg
Fixation L	1	1	5360449522	5360628762	179240	1231.71	286.54	65	17	-1	12.99	12.99
Fixation R	1	1	5360449522	5360628762	179240	1231.71	286.54	65	17	-1	15.15	15.15
Saccade L	1	1	5360628762	5360648628	19866	1175.99	290.54	1143.57	283.55	0.61	60.47	0.00	30.91	711.10	-898.77	742.76
Saccade R	1	1	5360628762	5360648628	19866	1175.99	290.54	1143.57	283.55	0.61	60.47	0.00	30.91	711.10	-898.77	742.76
Fixation L	1	2	5360648628	5360887635	239007	1143.80	255.99	20	73	-1	12.98	12.98
Fixation R	1	2	5360648628	5360887635	239007	1143.80	255.99	20	73	-1	15.14	15.14
Saccade L	1	2	5360887635	5360907496	19861	1138.87	308.53	1133.27	349.96	0.68	42.30	1.00	34.00	68.67	-757.00	467.55
Saccade R	1	2	5360887635	5360907496	19861	1138.87	308.53	1133.27	349.96	0.68	42.30	1.00	34.00	68.67	-757.00	467.55
Fixation L	1	3	5360907496	5361046857	139361	1133.70	342.47	12	16	-1	13.40	13.40
Fixation R	1	3	5360907496	5361046857	139361	1133.70	342.47	12	16	-1	15.31	15.31
Saccade L	1	3	5361046857	5361066863	20006	1126.66	337.39	1222.73	351.73	0.76	98.25	1.00	37.86	2400.27	-2239.47	1879.23
Saccade R	1	3	5361046857	5361066863	20006	1126.66	337.39	1222.73	351.73	0.76	98.25	1.00	37.86	2400.27	-2239.47	1879.23
Fixation L	1	4	5361066863	5361425218	358355	1284.88	359.54	84	15	-1	12.62	12.62
Fixation R	1	4	5361066863	5361425218	358355	1284.88	359.54	84	15	-1	14.18	14.18
Saccade L	1	4	5361425218	5361445220	20002	1302.62	354.04	1303.32	347.02	0.10	7.14	1.00	4.91	88.79	-70.60	58.13
Saccade R	1	4	5361425218	5361445220	20002	1302.62	354.04	1303.32	347.02	0.10	7.14	1.00	4.91	88.79	-70.60	58.13
Fixation L	1	5	5361445220	5361962950	517730	1305.80	346.07	30	40	-1	12.18	12.18
Fixation R	1	5	5361445220	5361962950	517730	1305.80	346.07	30	40	-1	13.86	13.86
Saccade L	1	5	5361962950	5361982823	19873	1282.02	374.98	1202.75	512.99	1.10	160.96	1.00	55.19	3954.03	-3593.92	2720.83
Saccade R	1	5	5361962950	5361982823	19873	1282.02	374.98	1202.75	512.99	1.10	160.96	1.00	55.19	3954.03	-3593.92	2720.83
Fixation L	1	6	5361982823	5362142065	159242	1191.04	529.61	30	50	-1	12.62	12.62
Fixation R	1	6	5361982823	5362142065	159242	1191.04	529.61	30	50	-1	14.32	14.32
Saccade L	1	6	5362142065	5362162064	19999	1172.68	563.65	1160.00	656.07	0.75	94.37	1.00	37.47	2299.13	-1992.50	1709.31
Saccade R	1	6	5362142065	5362162064	19999	1172.68	563.65	1160.00	656.07	0.75	94.37	1.00	37.47	2299.13	-1992.50	1709.31
Fixation L	1	7	5362162064	5362301430	139366	1149.92	649.92	21	33	-1	13.03	13.03
Fixation R	1	7	5362162064	5362301430	139366	1149.92	649.92	21	33	-1	14.90	14.90
Saccade L	1	7	5362301430	5362321306	19876	1138.03	667.84	1133.94	812.10	1.01	145.96	1.00	50.88	3517.88	-3565.13	2466.36
Saccade R	1	7	5362301430	5362321306	19876	1138.03	667.84	1133.94	812.10	1.01	145.96	1.00	50.88	3517.88	-3565.13	2466.36
Fixation L	1	8	5362321306	5362679795	358489	1114.21	850.82	35	46	-1	13.24	13.24
Fixation R	1	8	5362321306	5362679795	358489	1114.21	850.82	35	46	-1	15.02	15.02
Saccade L	1	8	5362679795	5362699667	19872	1098.25	858.73	899.02	858.14	1.22	201.47	1.00	61.42	4999.77	-4751.29	3484.39
Saccade R	1	8	5362679795	5362699667	19872	1098.25	858.73	899.02	858.14	1.22	201.47	1.00	61.42	4999.77	-4751.29	3484.39
Fixation L	1	9	5362699667	5362938659	238992	852.43	853.98	54	12	-1	13.41	13.41
Fixation R	1	9	5362699667	5362938659	238992	852.43	853.98	54	12	-1	14.96	14.96
Saccade L	1	9	5362938659	5362958523	19864	844.34	849.12	773.55	727.10	1.05	142.68	1.00	52.68	3527.78	-2610.58	2584.27
Saccade R	1	9	5362938659	5362958523	19864	844.34	849.12	773.55	727.10	1.05	142.68	1.00	52.68	3527.78	-2610.58	2584.27
Fixation L	1	10	5362958523	5363774991	816468	761.13	763.90	18	64	-1	12.73	12.73
Fixation R	1	10	5362958523	5363774991	816468	761.13	763.90	18	64	-1	14.62	14.62
Saccade L	1	10	5363774991	5363794875	19884	762.74	783.67	761.75	910.80	0.75	128.59	1.00	37.78	3061.20	-3172.41	2176.95
Saccade R	1	10	5363774991	5363794875	19884	762.74	783.67	761.75	910.80	0.75	128.59	1.00	37.78	3061.20	-3172.41	2176.95
Fixation L	1	11	5363794875	5364113477	318602	762.13	937.88	8	33	-1	12.95	12.95
Fixation R	1	11	5363794875	5364113477	318602	762.13	937.88	8	33	-1	14.85	14.85
Saccade L	1	11	5364113477	5364153353	39876	766.26	940.76	714.91	790.59	1.52	115.11	0.50	38.19	2809.98	-2507.87	1944.21
Saccade R	1	11	5364113477	5364153353	39876	766.26	940.76	714.91	790.59	1.52	115.11	0.50	38.19	2809.98	-2507.87	1944.21
Fixation L	1	12	5364153353	5364412218	258865	703.04	770.30	22	32	-1	13.13	13.13
Fixation R	1	12	5364153353	5364412218	258865	703.04	770.30	22	32	-1	14.65	14.65
Saccade L	1	12	5364412218	5364432087	19869	695.87	758.40	458.92	723.10	1.66	242.21	1.00	83.61	6007.91	0.00	3003.96
Saccade R	1	12	5364412218	5364432087	19869	695.87	758.40	458.92	723.10	1.66	242.21	1.00	83.61	6007.91	0.00	3003.96
