[BeGaze]
Converted from:	C:\Documents and Settings\iViewX\Desktop\EXPERIMENTATIONS\Experiments\results\finaleart\S4120113-finaleart-1.idf
Date:	27.03.2019 15:34:47
Version:	BeGaze 2.5.77
Sample Rate:	50
Subject:	S4120113
Description:	Vidal Attias

Table Header for Fixations:
Event Type	Trial	Number	Start	End	Duration	Location X	Location Y	Dispersion X	Dispersion Y	Plane	Avg. Pupil Size X	Avg. Pupil Size Y

Table Header for Saccades:
Event Type	Trial	Number	Start	End	Duration	Start Loc.X	Start Loc.Y	End Loc.X	End Loc.Y	Amplitude	Peak Speed	Peak Speed At	Average Speed	Peak Accel.	Peak Decel.	Average Accel.

Table Header for Blinks:
Event Type	Trial	Number	Start	End	Duration

Table Header for User Events:
Event Type	Trial	Number	Start	Description

UserEvent	1	1	7959428015	# Message: REJECTED_Volga_Lagoon_Vassiliev_1870.jpg
Fixation L	1	1	7959435181	7959892657	457476	1027.59	499.66	57	39	-1	12.38	12.38
Fixation R	1	1	7959435181	7959892657	457476	1027.59	499.66	57	39	-1	10.82	10.82
Saccade L	1	1	7959892657	7959932522	39865	994.54	515.30	1025.76	606.16	1.35	73.71	1.00	33.91	978.09	-1170.52	727.18
Saccade R	1	1	7959892657	7959932522	39865	994.54	515.30	1025.76	606.16	1.35	73.71	1.00	33.91	978.09	-1170.52	727.18
Fixation L	1	2	7959932522	7960210880	278358	1050.52	629.36	44	54	-1	12.61	12.61
Fixation R	1	2	7959932522	7960210880	278358	1050.52	629.36	44	54	-1	11.02	11.02
Saccade L	1	2	7960210880	7960230889	20009	1070.58	660.90	1078.00	668.31	0.28	15.94	1.00	13.91	28.03	-104.89	74.82
Saccade R	1	2	7960210880	7960230889	20009	1070.58	660.90	1078.00	668.31	0.28	15.94	1.00	13.91	28.03	-104.89	74.82
Fixation L	1	3	7960230889	7960568987	338098	1106.61	678.64	43	15	-1	13.03	13.03
Fixation R	1	3	7960230889	7960568987	338098	1106.61	678.64	43	15	-1	11.38	11.38
Saccade L	1	3	7960568987	7960608743	39756	1120.30	683.69	1265.58	649.86	1.37	78.55	0.50	34.54	1822.03	-1807.65	1499.44
Saccade R	1	3	7960568987	7960608743	39756	1120.30	683.69	1265.58	649.86	1.37	78.55	0.50	34.54	1822.03	-1807.65	1499.44
Fixation L	1	4	7960608743	7960767847	159104	1263.58	642.14	37	56	-1	13.24	13.24
Fixation R	1	4	7960608743	7960767847	159104	1263.58	642.14	37	56	-1	11.84	11.84
Saccade L	1	4	7960767847	7960807591	39744	1267.63	634.96	1565.12	600.91	2.71	180.35	0.50	68.22	4066.11	-4065.18	3538.24
Saccade R	1	4	7960767847	7960807591	39744	1267.63	634.96	1565.12	600.91	2.71	180.35	0.50	68.22	4066.11	-4065.18	3538.24
Fixation L	1	5	7960807591	7961245184	437593	1555.66	613.69	44	39	-1	13.15	13.15
Fixation R	1	5	7960807591	7961245184	437593	1555.66	613.69	44	39	-1	11.30	11.30
Saccade L	1	5	7961245184	7961284945	39761	1579.96	640.86	1331.54	735.54	2.47	205.14	1.00	62.17	4848.10	-4464.52	2976.75
Saccade R	1	5	7961245184	7961284945	39761	1579.96	640.86	1331.54	735.54	2.47	205.14	1.00	62.17	4848.10	-4464.52	2976.75
Fixation L	1	6	7961284945	7961503797	218852	1313.44	732.54	28	20	-1	13.42	13.42
Fixation R	1	6	7961284945	7961503797	218852	1313.44	732.54	28	20	-1	11.55	11.55
Saccade L	1	6	7961503797	7961543555	39758	1303.00	732.45	1034.52	733.28	2.40	180.47	1.00	60.34	4428.15	-4332.29	3161.28
Saccade R	1	6	7961503797	7961543555	39758	1303.00	732.45	1034.52	733.28	2.40	180.47	1.00	60.34	4428.15	-4332.29	3161.28
Fixation L	1	7	7961543555	7961722540	178985	1025.30	752.39	32	42	-1	13.10	13.10
Fixation R	1	7	7961543555	7961722540	178985	1025.30	752.39	32	42	-1	11.95	11.95
Saccade L	1	7	7961722540	7961762288	39748	1002.26	763.22	676.50	699.50	3.15	233.31	0.50	79.21	5266.24	-5664.27	3731.27
Saccade R	1	7	7961722540	7961762288	39748	1002.26	763.22	676.50	699.50	3.15	233.31	0.50	79.21	5266.24	-5664.27	3731.27
Fixation L	1	8	7961762288	7961901530	139242	668.63	692.19	11	16	-1	13.32	13.32
Fixation R	1	8	7961762288	7961901530	139242	668.63	692.19	11	16	-1	12.11	12.11
Saccade L	1	8	7961901530	7961941394	39864	669.13	694.91	470.63	492.53	2.72	185.86	0.50	68.21	4626.44	-3449.33	3215.74
Saccade R	1	8	7961901530	7961941394	39864	669.13	694.91	470.63	492.53	2.72	185.86	0.50	68.21	4626.44	-3449.33	3215.74
Fixation L	1	9	7961941394	7962199879	258485	496.33	492.33	50	45	-1	12.49	12.49
Fixation R	1	9	7961941394	7962199879	258485	496.33	492.33	50	45	-1	11.41	11.41
Saccade L	1	9	7962199879	7962219767	19888	466.62	469.40	465.10	459.07	0.20	14.56	1.00	9.95	189.83	-71.28	110.82
Saccade R	1	9	7962199879	7962219767	19888	466.62	469.40	465.10	459.07	0.20	14.56	1.00	9.95	189.83	-71.28	110.82
Fixation L	1	10	7962219767	7962597733	377966	451.59	434.19	21	40	-1	11.78	11.78
Fixation R	1	10	7962219767	7962597733	377966	451.59	434.19	21	40	-1	11.16	11.16
Saccade L	1	10	7962597733	7962736985	139252	460.29	444.66	1863.02	123.97	23.58	330.90	0.43	169.36	7100.91	-4001.61	3266.76
Saccade R	1	10	7962597733	7962736985	139252	460.29	444.66	1863.02	123.97	23.58	330.90	0.43	169.36	7100.91	-4001.61	3266.76
Fixation L	1	11	7962736985	7962856216	119231	1837.76	142.52	36	54	-1	12.21	12.21
Fixation R	1	11	7962736985	7962856216	119231	1837.76	142.52	36	54	-1	10.78	10.78
Saccade L	1	11	7962856216	7962876224	20008	1832.88	178.75	1805.09	202.67	0.49	37.10	1.00	24.46	723.87	-471.72	434.09
Saccade R	1	11	7962856216	7962876224	20008	1832.88	178.75	1805.09	202.67	0.49	37.10	1.00	24.46	723.87	-471.72	434.09
Fixation L	1	12	7962876224	7963055204	178980	1802.71	197.39	17	27	-1	12.38	12.38
Fixation R	1	12	7962876224	7963055204	178980	1802.71	197.39	17	27	-1	10.39	10.39
Saccade L	1	12	7963055204	7963134706	79502	1794.96	204.28	1238.41	927.91	11.90	469.01	0.25	149.64	11637.37	-7496.30	6164.71
Saccade R	1	12	7963055204	7963134706	79502	1794.96	204.28	1238.41	927.91	11.90	469.01	0.25	149.64	11637.37	-7496.30	6164.71
Fixation L	1	13	7963134706	7963313711	179005	1242.14	911.49	45	42	-1	13.42	13.42
Fixation R	1	13	7963134706	7963313711	179005	1242.14	911.49	45	42	-1	11.16	11.16
Saccade L	1	13	7963313711	7963433071	119360	1237.18	926.69	996.90	886.67	5.47	142.50	0.17	45.80	3397.12	-3059.23	1629.77
Saccade R	1	13	7963313711	7963433071	119360	1237.18	926.69	996.90	886.67	5.47	142.50	0.17	45.80	3397.12	-3059.23	1629.77
