[BeGaze]
Converted from:	C:\Documents and Settings\iViewX\Desktop\EXPERIMENTATIONS\Experiments\results\finaleart\S11H21112-finaleart-1.idf
Date:	27.03.2019 15:38:37
Version:	BeGaze 2.5.77
Sample Rate:	50
Subject:	S11H21112
Description:	Clement legrand-Duchenne

Table Header for Fixations:
Event Type	Trial	Number	Start	End	Duration	Location X	Location Y	Dispersion X	Dispersion Y	Plane	Avg. Pupil Size X	Avg. Pupil Size Y

Table Header for Saccades:
Event Type	Trial	Number	Start	End	Duration	Start Loc.X	Start Loc.Y	End Loc.X	End Loc.Y	Amplitude	Peak Speed	Peak Speed At	Average Speed	Peak Accel.	Peak Decel.	Average Accel.

Table Header for Blinks:
Event Type	Trial	Number	Start	End	Duration

Table Header for User Events:
Event Type	Trial	Number	Start	Description

UserEvent	1	1	3969999645	# Message: The_Joy_Of_Life_Matisse_1906.jpg
Fixation L	1	1	3970001438	3970100799	99361	1053.98	318.14	56	23	-1	16.33	16.33
Fixation R	1	1	3970001438	3970100799	99361	1053.98	318.14	56	23	-1	18.88	18.88
Saccade L	1	1	3970100799	3970120799	20000	1009.25	302.09	941.58	297.74	0.70	68.60	1.00	35.16	1693.81	-1292.99	1355.78
Saccade R	1	1	3970100799	3970120799	20000	1009.25	302.09	941.58	297.74	0.70	68.60	1.00	35.16	1693.81	-1292.99	1355.78
Fixation L	1	2	3970120799	3970697537	576738	936.18	293.96	15	51	-1	16.00	16.00
Fixation R	1	2	3970120799	3970697537	576738	936.18	293.96	15	51	-1	18.77	18.77
Saccade L	1	2	3970697537	3970816892	119355	936.58	289.26	931.80	621.23	4.85	142.95	0.17	40.66	3559.99	-3474.03	1918.47
Saccade R	1	2	3970697537	3970816892	119355	936.58	289.26	931.80	621.23	4.85	142.95	0.17	40.66	3559.99	-3474.03	1918.47
Fixation L	1	3	3970816892	3971095387	278495	904.86	636.63	35	33	-1	15.67	15.67
Fixation R	1	3	3970816892	3971095387	278495	904.86	636.63	35	33	-1	18.46	18.46
Saccade L	1	3	3971095387	3971135144	39757	898.41	646.20	543.64	616.17	3.29	245.22	0.50	82.80	5690.55	-6020.38	4092.17
Saccade R	1	3	3971095387	3971135144	39757	898.41	646.20	543.64	616.17	3.29	245.22	0.50	82.80	5690.55	-6020.38	4092.17
Fixation L	1	4	3971135144	3971373871	238727	552.59	618.47	21	16	-1	13.98	13.98
Fixation R	1	4	3971135144	3971373871	238727	552.59	618.47	21	16	-1	16.67	16.67
Saccade L	1	4	3971373871	3971393749	19878	558.49	624.96	399.02	625.04	1.05	161.29	1.00	52.68	3962.22	-3897.91	2938.53
Saccade R	1	4	3971373871	3971393749	19878	558.49	624.96	399.02	625.04	1.05	161.29	1.00	52.68	3962.22	-3897.91	2938.53
Fixation L	1	5	3971393749	3971771622	377873	366.66	615.09	45	28	-1	12.89	12.89
Fixation R	1	5	3971393749	3971771622	377873	366.66	615.09	45	28	-1	15.66	15.66
Saccade L	1	5	3971771622	3971811351	39729	363.76	632.70	814.53	384.89	4.52	279.04	0.50	113.71	6752.59	-6169.71	6078.08
Saccade R	1	5	3971771622	3971811351	39729	363.76	632.70	814.53	384.89	4.52	279.04	0.50	113.71	6752.59	-6169.71	6078.08
Fixation L	1	6	3971811351	3972090571	279220	847.06	349.73	38	53	-1	12.51	12.51
Fixation R	1	6	3971811351	3972090571	279220	847.06	349.73	38	53	-1	14.72	14.72
Saccade L	1	6	3972090571	3972109743	19172	843.56	341.22	862.84	168.43	1.09	175.83	1.00	56.98	4054.90	-4100.81	2838.25
Saccade R	1	6	3972090571	3972109743	19172	843.56	341.22	862.84	168.43	1.09	175.83	1.00	56.98	4054.90	-4100.81	2838.25
Fixation L	1	7	3972109743	3972348455	238712	888.04	184.27	30	40	-1	12.09	12.09
Fixation R	1	7	3972109743	3972348455	238712	888.04	184.27	30	40	-1	14.60	14.60
Saccade L	1	7	3972348455	3972408110	59655	890.63	195.97	1205.40	641.51	5.59	301.95	0.67	93.73	7519.15	-7439.16	5122.47
Saccade R	1	7	3972348455	3972408110	59655	890.63	195.97	1205.40	641.51	5.59	301.95	0.67	93.73	7519.15	-7439.16	5122.47
Fixation L	1	8	3972408110	3972527463	119353	1196.10	636.95	27	39	-1	12.84	12.84
Fixation R	1	8	3972408110	3972527463	119353	1196.10	636.95	27	39	-1	15.02	15.02
Saccade L	1	8	3972527463	3972547334	19871	1178.05	663.28	1184.51	753.81	0.74	91.82	1.00	37.04	2095.29	-2244.83	1728.86
Saccade R	1	8	3972527463	3972547334	19871	1178.05	663.28	1184.51	753.81	0.74	91.82	1.00	37.04	2095.29	-2244.83	1728.86
Fixation L	1	9	3972547334	3972885435	338101	1170.21	768.86	22	25	-1	13.45	13.45
Fixation R	1	9	3972547334	3972885435	338101	1170.21	768.86	22	25	-1	15.27	15.27
Saccade L	1	9	3972885435	3972905318	19883	1162.47	771.74	987.48	905.10	1.44	222.46	1.00	72.55	5468.93	-5468.25	4023.89
Saccade R	1	9	3972885435	3972905318	19883	1162.47	771.74	987.48	905.10	1.44	222.46	1.00	72.55	5468.93	-5468.25	4023.89
Fixation L	1	10	3972905318	3973263413	358095	983.69	971.13	20	79	-1	13.71	13.71
Fixation R	1	10	3972905318	3973263413	358095	983.69	971.13	20	79	-1	15.83	15.83
Saccade L	1	10	3973263413	3973283290	19877	993.25	980.14	994.07	980.35	0.07	6.85	1.00	3.67	141.67	-124.13	100.52
Saccade R	1	10	3973263413	3973283290	19877	993.25	980.14	994.07	980.35	0.07	6.85	1.00	3.67	141.67	-124.13	100.52
Fixation L	1	11	3973283290	3973681019	397729	1006.50	980.91	28	17	-1	13.51	13.51
Fixation R	1	11	3973283290	3973681019	397729	1006.50	980.91	28	17	-1	15.87	15.87
Saccade L	1	11	3973681019	3973720897	39878	1022.32	988.57	1498.70	940.07	4.09	289.46	0.50	102.54	7197.68	-7041.75	5846.66
Saccade R	1	11	3973681019	3973720897	39878	1022.32	988.57	1498.70	940.07	4.09	289.46	0.50	102.54	7197.68	-7041.75	5846.66
Fixation L	1	12	3973720897	3973899895	178998	1492.97	938.30	22	20	-1	13.90	13.90
Fixation R	1	12	3973720897	3973899895	178998	1492.97	938.30	22	20	-1	15.91	15.91
Saccade L	1	12	3973899895	3973999249	99354	1480.43	936.12	1475.19	634.89	4.60	167.67	0.20	46.34	4138.09	-4100.68	2473.63
Saccade R	1	12	3973899895	3973999249	99354	1480.43	936.12	1475.19	634.89	4.60	167.67	0.20	46.34	4138.09	-4100.68	2473.63
