[BeGaze]
Converted from:	C:\Documents and Settings\iViewX\Desktop\EXPERIMENTATIONS\Experiments\results\finaleart\S7121223-finaleart-1.idf
Date:	27.03.2019 15:37:26
Version:	BeGaze 2.5.77
Sample Rate:	50
Subject:	S7121223
Description:	Gregoire pacreau

Table Header for Fixations:
Event Type	Trial	Number	Start	End	Duration	Location X	Location Y	Dispersion X	Dispersion Y	Plane	Avg. Pupil Size X	Avg. Pupil Size Y

Table Header for Saccades:
Event Type	Trial	Number	Start	End	Duration	Start Loc.X	Start Loc.Y	End Loc.X	End Loc.Y	Amplitude	Peak Speed	Peak Speed At	Average Speed	Peak Accel.	Peak Decel.	Average Accel.

Table Header for Blinks:
Event Type	Trial	Number	Start	End	Duration

Table Header for User Events:
Event Type	Trial	Number	Start	Description

UserEvent	1	1	5552712129	# Message: void.jpg
Fixation L	1	1	5552716834	5552856213	139379	782.99	621.91	35	22	-1	13.41	13.41
Fixation R	1	1	5552716834	5552856213	139379	782.99	621.91	35	22	-1	13.32	13.32
Saccade L	1	1	5552856213	5552875940	19727	755.35	630.31	551.89	797.63	1.75	266.29	1.00	88.51	6558.48	-6423.86	4519.80
Saccade R	1	1	5552856213	5552875940	19727	755.35	630.31	551.89	797.63	1.75	266.29	1.00	88.51	6558.48	-6423.86	4519.80
Fixation L	1	2	5552875940	5553472680	596740	506.55	831.64	50	41	-1	13.70	13.70
Fixation R	1	2	5552875940	5553472680	596740	506.55	831.64	50	41	-1	13.85	13.85
Saccade L	1	2	5553472680	5553532293	59613	503.07	828.03	617.89	712.66	2.43	82.93	0.67	40.77	2017.67	-1333.90	1364.87
Saccade R	1	2	5553472680	5553532293	59613	503.07	828.03	617.89	712.66	2.43	82.93	0.67	40.77	2017.67	-1333.90	1364.87
Fixation L	1	3	5553532293	5553711275	178982	634.11	661.28	31	65	-1	14.24	14.24
Fixation R	1	3	5553532293	5553711275	178982	634.11	661.28	31	65	-1	14.24	14.24
Saccade L	1	3	5553711275	5553731144	19869	645.59	647.24	652.70	649.31	0.11	7.49	1.00	5.47	32.94	-160.10	64.58
Saccade R	1	3	5553711275	5553731144	19869	645.59	647.24	652.70	649.31	0.11	7.49	1.00	5.47	32.94	-160.10	64.58
Fixation L	1	4	5553731144	5554705724	974580	675.72	651.43	34	33	-1	14.54	14.54
Fixation R	1	4	5553731144	5554705724	974580	675.72	651.43	34	33	-1	14.64	14.64
