[BeGaze]
Converted from:	C:\Documents and Settings\iViewX\Desktop\EXPERIMENTATIONS\Experiments\results\finaleart\S20H24222-finaleart-1.idf
Date:	27.03.2019 15:52:29
Version:	BeGaze 2.5.77
Sample Rate:	50
Subject:	S20H24222
Description:	Hugo Brument

Table Header for Fixations:
Event Type	Trial	Number	Start	End	Duration	Location X	Location Y	Dispersion X	Dispersion Y	Plane	Avg. Pupil Size X	Avg. Pupil Size Y

Table Header for Saccades:
Event Type	Trial	Number	Start	End	Duration	Start Loc.X	Start Loc.Y	End Loc.X	End Loc.Y	Amplitude	Peak Speed	Peak Speed At	Average Speed	Peak Accel.	Peak Decel.	Average Accel.

Table Header for Blinks:
Event Type	Trial	Number	Start	End	Duration

Table Header for User Events:
Event Type	Trial	Number	Start	Description

UserEvent	1	1	11219779932	# Message: void.jpg
Fixation L	1	1	11219782971	11219902350	119379	57.83	1079.30	23	63	-1	10.66	10.66
Fixation R	1	1	11219782971	11219902350	119379	57.83	1079.30	23	63	-1	12.61	12.61
Saccade L	1	1	11219902350	11219942123	39773	65.66	1037.20	62.67	1096.41	1.63	82.67	1.00	40.99	677.30	-1179.78	628.41
Saccade R	1	1	11219902350	11219942123	39773	65.66	1037.20	62.67	1096.41	1.63	82.67	1.00	40.99	677.30	-1179.78	628.41
Fixation L	1	2	11219942123	11220160815	218692	63.96	1117.10	23	67	-1	10.79	10.79
Fixation R	1	2	11219942123	11220160815	218692	63.96	1117.10	23	67	-1	12.89	12.89
Saccade L	1	2	11220160815	11220319944	159129	63.15	1111.53	15.00	0.00	21.50	1109.88	0.88	135.10	25318.88	-27633.85	6177.74
Saccade R	1	2	11220160815	11220220562	59747	63.15	1111.53	66.11	1105.00	2.37	86.45	1.00	39.61	2241.15	-1357.64	1353.10
Blink R	1	1	11220220562	11220379693	159131
Blink L	1	1	11220319944	11220399579	79635
Saccade R	1	3	11220379693	11220479052	99359	4.55	0.00	705.64	1112.14	26.12	1361.84	0.40	262.87	33996.99	-30551.92	12852.63
Saccade L	1	3	11220399579	11220479052	79473	3.73	0.00	705.64	1112.14	23.83	1361.84	0.25	299.84	33996.99	-30551.92	14981.18
Fixation L	1	3	11220479052	11220578545	99493	711.66	1128.88	16	32	-1	11.84	11.84
Fixation R	1	3	11220479052	11220578545	99493	711.66	1128.88	16	32	-1	13.42	13.42
Saccade L	1	4	11220578545	11220618287	39742	718.26	1119.46	1078.35	1153.41	3.20	289.34	1.00	80.47	6816.88	-6925.37	4275.31
Saccade R	1	4	11220578545	11220618287	39742	718.26	1119.46	1078.35	1153.41	3.20	289.34	1.00	80.47	6816.88	-6925.37	4275.31
Fixation L	1	4	11220618287	11220817285	198998	1107.70	1159.59	41	15	-1	11.96	11.96
Fixation R	1	4	11220618287	11220817285	198998	1107.70	1159.59	41	15	-1	13.06	13.06
Saccade L	1	5	11220817285	11220876910	59625	1111.80	1168.11	1022.63	571.16	6.31	343.23	0.33	105.89	8443.40	-6529.60	5194.10
Saccade R	1	5	11220817285	11220876910	59625	1111.80	1168.11	1022.63	571.16	6.31	343.23	0.33	105.89	8443.40	-6529.60	5194.10
Fixation L	1	5	11220876910	11221195147	318237	1005.77	558.16	22	19	-1	11.83	11.83
Fixation R	1	5	11220876910	11221195147	318237	1005.77	558.16	22	19	-1	12.70	12.70
Saccade L	1	6	11221195147	11221215021	19874	999.90	557.61	835.64	561.13	1.14	166.17	1.00	57.11	4135.20	-3459.76	3034.05
Saccade R	1	6	11221195147	11221215021	19874	999.90	557.61	835.64	561.13	1.14	166.17	1.00	57.11	4135.20	-3459.76	3034.05
Fixation L	1	6	11221215021	11221413890	198869	805.57	585.63	54	40	-1	11.76	11.76
Fixation R	1	6	11221215021	11221413890	198869	805.57	585.63	54	40	-1	12.63	12.63
Saccade L	1	7	11221413890	11221433881	19991	806.02	595.90	804.58	608.19	0.16	12.52	1.00	8.20	175.02	-279.07	186.12
Saccade R	1	7	11221413890	11221433881	19991	806.02	595.90	804.58	608.19	0.16	12.52	1.00	8.20	175.02	-279.07	186.12
Fixation L	1	7	11221433881	11221593017	159136	817.69	599.67	54	24	-1	11.61	11.61
Fixation R	1	7	11221433881	11221593017	159136	817.69	599.67	54	24	-1	12.72	12.72
Saccade L	1	8	11221593017	11221612871	19854	858.47	584.07	862.68	558.05	0.36	27.60	1.00	17.99	-23.42	-477.84	244.81
Saccade R	1	8	11221593017	11221612871	19854	858.47	584.07	862.68	558.05	0.36	27.60	1.00	17.99	-23.42	-477.84	244.81
Fixation L	1	8	11221612871	11221771995	159124	871.76	562.18	13	9	-1	12.06	12.06
Fixation R	1	8	11221612871	11221771995	159124	871.76	562.18	13	9	-1	13.33	13.33
