[BeGaze]
Converted from:	C:\Documents and Settings\iViewX\Desktop\EXPERIMENTATIONS\Experiments\results\finaleart\S9H29221-finaleart-1.idf
Date:	27.03.2019 16:03:07
Version:	BeGaze 2.5.77
Sample Rate:	50
Subject:	S9H29221
Description:	steven

Table Header for Fixations:
Event Type	Trial	Number	Start	End	Duration	Location X	Location Y	Dispersion X	Dispersion Y	Plane	Avg. Pupil Size X	Avg. Pupil Size Y

Table Header for Saccades:
Event Type	Trial	Number	Start	End	Duration	Start Loc.X	Start Loc.Y	End Loc.X	End Loc.Y	Amplitude	Peak Speed	Peak Speed At	Average Speed	Peak Accel.	Peak Decel.	Average Accel.

Table Header for Blinks:
Event Type	Trial	Number	Start	End	Duration

Table Header for User Events:
Event Type	Trial	Number	Start	Description

UserEvent	1	1	6134214166	# Message: void.jpg
Fixation L	1	1	6134233060	6134417768	184708	778.98	509.51	1	2	-1	12.68	12.68
Fixation R	1	1	6134233060	6134417768	184708	778.98	509.51	1	2	-1	12.06	12.06
Saccade L	1	1	6134417768	6134431942	14174	779.64	507.85	711.28	547.32	0.37	79.85	1.00	26.04	1971.43	-1465.73	1309.15
Saccade R	1	1	6134417768	6134431942	14174	779.64	507.85	711.28	547.32	0.37	79.85	1.00	26.04	1971.43	-1465.73	1309.15
Fixation L	1	2	6134431942	6134653252	221310	703.75	562.73	12	25	-1	13.30	13.30
Fixation R	1	2	6134431942	6134653252	221310	703.75	562.73	12	25	-1	12.58	12.58
Saccade L	1	2	6134653252	6134720575	67323	698.54	567.49	609.36	591.58	3.18	93.44	1.00	47.23	2191.18	-1214.12	1805.89
Saccade R	1	2	6134653252	6134720575	67323	698.54	567.49	609.36	591.58	3.18	93.44	1.00	47.23	2191.18	-1214.12	1805.89
Fixation L	1	3	6134720575	6134909270	188695	605.81	641.72	16	83	-1	13.45	13.45
Fixation R	1	3	6134720575	6134909270	188695	605.81	641.72	16	83	-1	13.02	13.02
Saccade L	1	3	6134909270	6135028865	119595	601.66	658.48	682.24	625.62	2.01	84.94	1.00	16.77	2087.97	-1336.29	558.24
Saccade R	1	3	6134909270	6135028865	119595	601.66	658.48	682.24	625.62	2.01	84.94	1.00	16.77	2087.97	-1336.29	558.24
Fixation L	1	4	6135028865	6135188450	159585	703.35	615.24	34	30	-1	13.41	13.41
Fixation R	1	4	6135028865	6135188450	159585	703.35	615.24	34	30	-1	13.11	13.11
Blink L	1	1	6135188450	6135406609	218159
Blink R	1	1	6135188450	6135406609	218159
Saccade L	1	4	6135406609	6135446364	39755	1039.01	455.82	1047.32	361.33	1.91	105.89	1.00	48.15	887.84	-1447.99	990.73
Saccade R	1	4	6135406609	6135446364	39755	1039.01	455.82	1047.32	361.33	1.91	105.89	1.00	48.15	887.84	-1447.99	990.73
Fixation L	1	5	6135446364	6135804355	357991	1041.65	315.69	29	62	-1	14.97	14.97
Fixation R	1	5	6135446364	6135804355	357991	1041.65	315.69	29	62	-1	14.52	14.52
Saccade L	1	5	6135804355	6135824229	19874	1064.50	318.95	1102.24	324.38	0.42	38.58	1.00	21.03	921.64	-840.49	712.29
Saccade R	1	5	6135804355	6135824229	19874	1064.50	318.95	1102.24	324.38	0.42	38.58	1.00	21.03	921.64	-840.49	712.29
Fixation L	1	6	6135824229	6136062960	238731	1123.25	347.71	36	47	-1	14.60	14.60
Fixation R	1	6	6135824229	6136062960	238731	1123.25	347.71	36	47	-1	13.79	13.79
