[BeGaze]
Converted from:	C:\Documents and Settings\iViewX\Desktop\EXPERIMENTATIONS\Experiments\results\finaleart\S9H29221-finaleart-1.idf
Date:	27.03.2019 16:02:02
Version:	BeGaze 2.5.77
Sample Rate:	50
Subject:	S9H29221
Description:	steven

Table Header for Fixations:
Event Type	Trial	Number	Start	End	Duration	Location X	Location Y	Dispersion X	Dispersion Y	Plane	Avg. Pupil Size X	Avg. Pupil Size Y

Table Header for Saccades:
Event Type	Trial	Number	Start	End	Duration	Start Loc.X	Start Loc.Y	End Loc.X	End Loc.Y	Amplitude	Peak Speed	Peak Speed At	Average Speed	Peak Accel.	Peak Decel.	Average Accel.

Table Header for Blinks:
Event Type	Trial	Number	Start	End	Duration

Table Header for User Events:
Event Type	Trial	Number	Start	Description

UserEvent	1	1	5572362887	# Message: avenue_of_trees_in_a_small_town_sisley_1866.jpg
Fixation L	1	1	5572377718	5572572272	194554	1160.48	454.93	46	5	-1	11.92	11.92
Fixation R	1	1	5572377718	5572572272	194554	1160.48	454.93	46	5	-1	11.75	11.75
Blink L	1	1	5572572272	5572795312	223040
Blink R	1	1	5572572272	5572795312	223040
Fixation L	1	2	5572795312	5573232909	437597	1071.00	419.00	25	49	-1	12.30	12.30
Fixation R	1	2	5572795312	5573232909	437597	1071.00	419.00	25	49	-1	12.47	12.47
Saccade L	1	1	5573232909	5573272653	39744	1054.92	437.55	1022.15	539.80	1.09	63.80	1.00	27.53	1468.94	-1455.89	1142.66
Saccade R	1	1	5573232909	5573272653	39744	1054.92	437.55	1022.15	539.80	1.09	63.80	1.00	27.53	1468.94	-1455.89	1142.66
Fixation L	1	3	5573272653	5573630764	358111	990.78	574.46	43	54	-1	11.49	11.49
Fixation R	1	3	5573272653	5573630764	358111	990.78	574.46	43	54	-1	11.54	11.54
Saccade L	1	2	5573630764	5573650642	19878	989.07	594.41	1026.02	719.02	0.81	131.46	1.00	40.54	3224.80	-3039.53	2112.65
Saccade R	1	2	5573630764	5573650642	19878	989.07	594.41	1026.02	719.02	0.81	131.46	1.00	40.54	3224.80	-3039.53	2112.65
Fixation L	1	4	5573650642	5574108125	457483	1070.65	725.42	77	22	-1	11.49	11.49
Fixation R	1	4	5573650642	5574108125	457483	1070.65	725.42	77	22	-1	11.72	11.72
Saccade L	1	3	5574108125	5574127994	19869	1103.11	733.11	1104.57	735.64	0.07	6.30	1.00	3.58	60.72	-83.79	65.44
Saccade R	1	3	5574108125	5574127994	19869	1103.11	733.11	1104.57	735.64	0.07	6.30	1.00	3.58	60.72	-83.79	65.44
Fixation L	1	5	5574127994	5574227366	99372	1105.14	734.88	18	12	-1	11.42	11.42
Fixation R	1	5	5574127994	5574227366	99372	1105.14	734.88	18	12	-1	11.33	11.33
Saccade L	1	4	5574227366	5574247366	20000	1093.39	742.47	1055.38	801.84	0.58	71.31	1.00	29.19	1605.95	-1575.35	1123.19
Saccade R	1	4	5574227366	5574247366	20000	1093.39	742.47	1055.38	801.84	0.58	71.31	1.00	29.19	1605.95	-1575.35	1123.19
Fixation L	1	6	5574247366	5574585479	338113	1043.72	817.37	35	24	-1	11.28	11.28
Fixation R	1	6	5574247366	5574585479	338113	1043.72	817.37	35	24	-1	11.37	11.37
Saccade L	1	5	5574585479	5574645094	59615	1037.92	807.12	1450.36	736.58	4.72	156.27	0.33	79.11	3835.61	-2766.03	2741.93
Saccade R	1	5	5574585479	5574645094	59615	1037.92	807.12	1450.36	736.58	4.72	156.27	0.33	79.11	3835.61	-2766.03	2741.93
Fixation L	1	7	5574645094	5575142318	497224	1490.47	726.57	52	41	-1	11.35	11.35
Fixation R	1	7	5574645094	5575142318	497224	1490.47	726.57	52	41	-1	11.30	11.30
Saccade L	1	6	5575142318	5575162320	20002	1503.10	707.23	1517.36	704.83	0.19	14.63	1.00	9.25	331.25	-121.70	210.91
Saccade R	1	6	5575142318	5575162320	20002	1503.10	707.23	1517.36	704.83	0.19	14.63	1.00	9.25	331.25	-121.70	210.91
Fixation L	1	8	5575162320	5575579926	417606	1548.64	710.21	46	12	-1	11.73	11.73
Fixation R	1	8	5575162320	5575579926	417606	1548.64	710.21	46	12	-1	11.57	11.57
Saccade L	1	7	5575579926	5575639678	59752	1559.98	712.19	1084.26	669.35	5.23	202.01	0.67	87.55	4974.86	-4219.92	3270.20
Saccade R	1	7	5575579926	5575639678	59752	1559.98	712.19	1084.26	669.35	5.23	202.01	0.67	87.55	4974.86	-4219.92	3270.20
Fixation L	1	9	5575639678	5575758922	119244	1044.37	665.03	54	28	-1	12.41	12.41
Fixation R	1	9	5575639678	5575758922	119244	1044.37	665.03	54	28	-1	11.99	11.99
Saccade L	1	8	5575758922	5575778917	19995	1029.52	650.64	953.29	645.74	0.60	77.27	1.00	30.24	1672.99	-1778.62	1227.56
Saccade R	1	8	5575758922	5575778917	19995	1029.52	650.64	953.29	645.74	0.60	77.27	1.00	30.24	1672.99	-1778.62	1227.56
Fixation L	1	10	5575778917	5576196522	417605	927.30	614.55	37	42	-1	11.95	11.95
Fixation R	1	10	5575778917	5576196522	417605	927.30	614.55	37	42	-1	11.99	11.99
Saccade L	1	9	5576196522	5576236390	39868	915.81	618.77	808.44	598.40	1.03	79.16	1.00	25.85	1916.43	-1477.28	1143.95
Saccade R	1	9	5576196522	5576236390	39868	915.81	618.77	808.44	598.40	1.03	79.16	1.00	25.85	1916.43	-1477.28	1143.95
Fixation L	1	11	5576236390	5576395512	159122	794.97	594.05	19	23	-1	11.92	11.92
Fixation R	1	11	5576236390	5576395512	159122	794.97	594.05	19	23	-1	12.38	12.38
