[BeGaze]
Converted from:	C:\Documents and Settings\iViewX\Desktop\EXPERIMENTATIONS\Experiments\results\finaleart\S16F14542-finaleart-1.idf
Date:	27.03.2019 15:46:10
Version:	BeGaze 2.5.77
Sample Rate:	50
Subject:	S16F14542
Description:	Diane Dewez

Table Header for Fixations:
Event Type	Trial	Number	Start	End	Duration	Location X	Location Y	Dispersion X	Dispersion Y	Plane	Avg. Pupil Size X	Avg. Pupil Size Y

Table Header for Saccades:
Event Type	Trial	Number	Start	End	Duration	Start Loc.X	Start Loc.Y	End Loc.X	End Loc.Y	Amplitude	Peak Speed	Peak Speed At	Average Speed	Peak Accel.	Peak Decel.	Average Accel.

Table Header for Blinks:
Event Type	Trial	Number	Start	End	Duration

Table Header for User Events:
Event Type	Trial	Number	Start	Description

UserEvent	1	1	6329188688	# Message: nature_morte_aux_oranges_Vlaminck_1909.jpg
Fixation L	1	1	6329198717	6329676075	477358	920.36	563.12	17	46	-1	12.33	12.33
Fixation R	1	1	6329198717	6329676075	477358	920.36	563.12	17	46	-1	12.71	12.71
Saccade L	1	1	6329676075	6329695951	19876	932.44	551.43	943.16	466.40	0.56	86.69	1.00	27.98	1991.81	-1655.93	1250.77
Saccade R	1	1	6329676075	6329695951	19876	932.44	551.43	943.16	466.40	0.56	86.69	1.00	27.98	1991.81	-1655.93	1250.77
Fixation L	1	2	6329695951	6329874934	178983	961.42	447.57	29	34	-1	13.00	13.00
Fixation R	1	2	6329695951	6329874934	178983	961.42	447.57	29	34	-1	13.38	13.38
Saccade L	1	2	6329874934	6329894943	20009	972.52	431.98	916.65	369.95	0.65	84.45	1.00	32.56	1995.45	-1853.49	1396.24
Saccade R	1	2	6329874934	6329894943	20009	972.52	431.98	916.65	369.95	0.65	84.45	1.00	32.56	1995.45	-1853.49	1396.24
Fixation L	1	3	6329894943	6329994293	99350	893.86	340.61	32	58	-1	12.74	12.74
Fixation R	1	3	6329894943	6329994293	99350	893.86	340.61	32	58	-1	12.95	12.95
Saccade L	1	3	6329994293	6330014175	19882	885.09	311.03	882.28	296.27	0.34	24.83	1.00	17.22	233.06	76.66	170.89
Saccade R	1	3	6329994293	6330014175	19882	885.09	311.03	882.28	296.27	0.34	24.83	1.00	17.22	233.06	76.66	170.89
Fixation L	1	4	6330014175	6330173283	159108	884.70	316.54	6	32	-1	12.62	12.62
Fixation R	1	4	6330014175	6330173283	159108	884.70	316.54	6	32	-1	12.79	12.79
Saccade L	1	4	6330173283	6330193168	19885	888.89	322.02	799.04	313.22	0.67	91.32	1.00	33.51	2223.67	-2105.61	1653.37
Saccade R	1	4	6330173283	6330193168	19885	888.89	322.02	799.04	313.22	0.67	91.32	1.00	33.51	2223.67	-2105.61	1653.37
Fixation L	1	5	6330193168	6330511403	318235	765.76	333.20	49	48	-1	12.59	12.59
Fixation R	1	5	6330193168	6330511403	318235	765.76	333.20	49	48	-1	12.79	12.79
Saccade L	1	5	6330511403	6330531393	19990	749.68	361.70	736.70	361.96	0.24	27.70	0.00	11.97	302.24	-541.94	314.53
Saccade R	1	5	6330511403	6330531393	19990	749.68	361.70	736.70	361.96	0.24	27.70	0.00	11.97	302.24	-541.94	314.53
Fixation L	1	6	6330531393	6330770027	238634	724.57	385.47	23	64	-1	13.13	13.13
Fixation R	1	6	6330531393	6330770027	238634	724.57	385.47	23	64	-1	13.18	13.18
Saccade L	1	6	6330770027	6330789884	19857	719.54	426.66	802.69	419.91	0.79	84.38	1.00	39.65	1639.52	-1990.08	1325.22
Saccade R	1	6	6330770027	6330789884	19857	719.54	426.66	802.69	419.91	0.79	84.38	1.00	39.65	1639.52	-1990.08	1325.22
Fixation L	1	7	6330789884	6330988879	198995	831.54	444.02	37	35	-1	13.85	13.85
Fixation R	1	7	6330789884	6330988879	198995	831.54	444.02	37	35	-1	14.48	14.48
Saccade L	1	7	6330988879	6331028625	39746	834.92	455.74	487.12	726.20	3.64	284.04	0.50	91.50	7029.68	-7047.81	5491.44
Saccade R	1	7	6330988879	6331028625	39746	834.92	455.74	487.12	726.20	3.64	284.04	0.50	91.50	7029.68	-7047.81	5491.44
Fixation L	1	8	6331028625	6331267245	238620	481.38	721.17	23	11	-1	14.78	14.78
Fixation R	1	8	6331028625	6331267245	238620	481.38	721.17	23	11	-1	15.14	15.14
Saccade L	1	8	6331267245	6331326984	59739	495.61	715.90	1073.47	689.74	6.30	276.26	0.33	105.43	6841.21	-5390.09	4816.09
Saccade R	1	8	6331267245	6331326984	59739	495.61	715.90	1073.47	689.74	6.30	276.26	0.33	105.43	6841.21	-5390.09	4816.09
Fixation L	1	9	6331326984	6331625341	298357	1089.09	698.85	20	17	-1	14.86	14.86
Fixation R	1	9	6331326984	6331625341	298357	1089.09	698.85	20	17	-1	14.58	14.58
Saccade L	1	9	6331625341	6331684971	59630	1089.98	696.67	1120.11	321.71	4.09	249.44	0.33	68.56	6184.50	-5369.28	3232.73
Saccade R	1	9	6331625341	6331684971	59630	1089.98	696.67	1120.11	321.71	4.09	249.44	0.33	68.56	6184.50	-5369.28	3232.73
Fixation L	1	10	6331684971	6331844087	159116	1137.76	290.93	36	44	-1	14.02	14.02
Fixation R	1	10	6331684971	6331844087	159116	1137.76	290.93	36	44	-1	13.98	13.98
Saccade L	1	10	6331844087	6331883831	39744	1156.76	277.46	1173.33	226.76	0.70	32.42	1.00	17.69	559.84	-160.86	328.53
Saccade R	1	10	6331844087	6331883831	39744	1156.76	277.46	1173.33	226.76	0.70	32.42	1.00	17.69	559.84	-160.86	328.53
Fixation L	1	11	6331883831	6332102694	218863	1184.21	182.38	22	60	-1	13.63	13.63
Fixation R	1	11	6331883831	6332102694	218863	1184.21	182.38	22	60	-1	13.14	13.14
Blink L	1	1	6332102694	6332261810	159116
Blink R	1	1	6332102694	6332261810	159116
Fixation L	1	12	6332261810	6332798786	536976	764.80	416.27	18	58	-1	14.68	14.68
Fixation R	1	12	6332261810	6332798786	536976	764.80	416.27	18	58	-1	14.99	14.99
Saccade L	1	11	6332798786	6332818667	19881	767.32	438.46	753.09	549.71	0.65	113.44	1.00	32.88	2736.34	-2686.75	1897.66
Saccade R	1	11	6332798786	6332818667	19881	767.32	438.46	753.09	549.71	0.65	113.44	1.00	32.88	2736.34	-2686.75	1897.66
Fixation L	1	13	6332818667	6333077271	258604	720.99	527.10	48	37	-1	14.48	14.48
Fixation R	1	13	6332818667	6333077271	258604	720.99	527.10	48	37	-1	15.11	15.11
Saccade L	1	12	6333077271	6333176776	99505	704.30	512.00	799.38	709.39	3.54	186.51	0.20	35.61	4628.74	-4236.56	1656.15
Saccade R	1	12	6333077271	6333176776	99505	704.30	512.00	799.38	709.39	3.54	186.51	0.20	35.61	4628.74	-4236.56	1656.15
