[BeGaze]
Converted from:	C:\Documents and Settings\iViewX\Desktop\EXPERIMENTATIONS\Experiments\results\finaleart\S1022551-finaleart-1.idf
Date:	27.03.2019 15:37:52
Version:	BeGaze 2.5.77
Sample Rate:	50
Subject:	S1022551
Description:	Alexis Nebout

Table Header for Fixations:
Event Type	Trial	Number	Start	End	Duration	Location X	Location Y	Dispersion X	Dispersion Y	Plane	Avg. Pupil Size X	Avg. Pupil Size Y

Table Header for Saccades:
Event Type	Trial	Number	Start	End	Duration	Start Loc.X	Start Loc.Y	End Loc.X	End Loc.Y	Amplitude	Peak Speed	Peak Speed At	Average Speed	Peak Accel.	Peak Decel.	Average Accel.

Table Header for Blinks:
Event Type	Trial	Number	Start	End	Duration

Table Header for User Events:
Event Type	Trial	Number	Start	Description

UserEvent	1	1	8140156024	# Message: The_Gardener_Vlaminck_1904.jpg
Fixation L	1	1	8140156099	8140951684	795585	934.79	516.70	21	25	-1	14.31	14.31
Fixation R	1	1	8140156099	8140951684	795585	934.79	516.70	21	25	-1	11.98	11.98
Saccade L	1	1	8140951684	8140991431	39747	932.45	518.59	1221.98	437.97	2.66	188.65	0.50	66.89	4665.65	-4447.71	3810.14
Saccade R	1	1	8140951684	8140991431	39747	932.45	518.59	1221.98	437.97	2.66	188.65	0.50	66.89	4665.65	-4447.71	3810.14
Fixation L	1	2	8140991431	8141289797	298366	1216.10	431.66	8	10	-1	12.70	12.70
Fixation R	1	2	8140991431	8141289797	298366	1216.10	431.66	8	10	-1	10.64	10.64
Saccade L	1	2	8141289797	8141329546	39749	1221.14	433.51	877.95	638.17	3.50	234.58	1.00	87.96	5768.26	-5500.45	4781.12
Saccade R	1	2	8141289797	8141329546	39749	1221.14	433.51	877.95	638.17	3.50	234.58	1.00	87.96	5768.26	-5500.45	4781.12
Fixation L	1	3	8141329546	8141647799	318253	865.58	697.12	18	77	-1	10.69	10.69
Fixation R	1	3	8141329546	8141647799	318253	865.58	697.12	18	77	-1	9.37	9.37
Saccade L	1	3	8141647799	8141667781	19982	873.78	712.91	882.28	719.39	0.17	10.82	1.00	8.32	14.60	-184.47	110.21
Saccade R	1	3	8141647799	8141667781	19982	873.78	712.91	882.28	719.39	0.17	10.82	1.00	8.32	14.60	-184.47	110.21
Fixation L	1	4	8141667781	8141866650	198869	890.81	730.06	16	26	-1	10.48	10.48
Fixation R	1	4	8141667781	8141866650	198869	890.81	730.06	16	26	-1	9.51	9.51
Blink L	1	1	8141866650	8141946141	79491
Blink R	1	1	8141866650	8141946141	79491
Fixation L	1	5	8141946141	8142224618	278477	784.85	797.26	16	18	-1	11.50	11.50
Fixation R	1	5	8141946141	8142224618	278477	784.85	797.26	16	18	-1	10.40	10.40
Saccade L	1	4	8142224618	8142244503	19885	791.35	790.66	865.35	769.18	0.59	77.95	1.00	29.46	1854.93	-1416.37	1322.84
Saccade R	1	4	8142224618	8142244503	19885	791.35	790.66	865.35	769.18	0.59	77.95	1.00	29.46	1854.93	-1416.37	1322.84
Fixation L	1	6	8142244503	8142522990	278487	860.91	758.89	32	17	-1	11.81	11.81
Fixation R	1	6	8142244503	8142522990	278487	860.91	758.89	32	17	-1	10.80	10.80
Saccade L	1	5	8142522990	8142562733	39743	866.16	756.52	1216.01	492.54	3.60	283.38	0.50	90.49	7056.47	-6971.69	5394.06
Saccade R	1	5	8142522990	8142562733	39743	866.16	756.52	1216.01	492.54	3.60	283.38	0.50	90.49	7056.47	-6971.69	5394.06
Fixation L	1	7	8142562733	8142741853	179120	1224.66	466.40	42	54	-1	11.55	11.55
Fixation R	1	7	8142562733	8142741853	179120	1224.66	466.40	42	54	-1	10.28	10.28
Saccade L	1	6	8142741853	8142761727	19874	1258.76	438.46	1269.96	373.50	0.57	66.68	1.00	28.82	1620.37	-1365.65	1263.24
Saccade R	1	6	8142741853	8142761727	19874	1258.76	438.46	1269.96	373.50	0.57	66.68	1.00	28.82	1620.37	-1365.65	1263.24
Fixation L	1	8	8142761727	8143338441	576714	1290.00	353.99	27	61	-1	11.13	11.13
Fixation R	1	8	8142761727	8143338441	576714	1290.00	353.99	27	61	-1	9.61	9.61
Saccade L	1	7	8143338441	8143378319	39878	1295.34	342.74	569.01	264.11	6.00	399.41	0.50	150.50	9800.22	-9898.86	9075.97
Saccade R	1	7	8143338441	8143378319	39878	1295.34	342.74	569.01	264.11	6.00	399.41	0.50	150.50	9800.22	-9898.86	9075.97
Fixation L	1	9	8143378319	8143656677	278358	581.00	255.97	32	16	-1	10.52	10.52
Fixation R	1	9	8143378319	8143656677	278358	581.00	255.97	32	16	-1	9.22	9.22
Saccade L	1	8	8143656677	8143676675	19998	601.96	254.67	712.60	243.14	0.69	112.52	1.00	34.25	2773.58	-2784.01	1894.16
Saccade R	1	8	8143656677	8143676675	19998	601.96	254.67	712.60	243.14	0.69	112.52	1.00	34.25	2773.58	-2784.01	1894.16
Fixation L	1	10	8143676675	8144034658	357983	722.95	260.98	13	40	-1	10.49	10.49
Fixation R	1	10	8143676675	8144034658	357983	722.95	260.98	13	40	-1	9.59	9.59
Saccade L	1	9	8144034658	8144173910	139252	724.10	272.71	394.10	155.76	9.47	306.76	0.14	67.99	7576.20	-7017.38	2775.58
Saccade R	1	9	8144034658	8144173910	139252	724.10	272.71	394.10	155.76	9.47	306.76	0.14	67.99	7576.20	-7017.38	2775.58
