[BeGaze]
Converted from:	C:\Documents and Settings\iViewX\Desktop\EXPERIMENTATIONS\Experiments\results\finaleart\S15H25531-finaleart-1.idf
Date:	27.03.2019 15:45:19
Version:	BeGaze 2.5.77
Sample Rate:	50
Subject:	S15H25531
Description:	Mikail Demirdelen

Table Header for Fixations:
Event Type	Trial	Number	Start	End	Duration	Location X	Location Y	Dispersion X	Dispersion Y	Plane	Avg. Pupil Size X	Avg. Pupil Size Y

Table Header for Saccades:
Event Type	Trial	Number	Start	End	Duration	Start Loc.X	Start Loc.Y	End Loc.X	End Loc.Y	Amplitude	Peak Speed	Peak Speed At	Average Speed	Peak Accel.	Peak Decel.	Average Accel.

Table Header for Blinks:
Event Type	Trial	Number	Start	End	Duration

Table Header for User Events:
Event Type	Trial	Number	Start	Description

UserEvent	1	1	4258125716	# Message: dead_hare_ward.jpg
Fixation L	1	1	4258134987	4258552706	417719	889.31	596.27	12	44	-1	14.43	14.43
Fixation R	1	1	4258134987	4258552706	417719	889.31	596.27	12	44	-1	16.23	16.23
Saccade L	1	1	4258552706	4258572587	19881	895.64	574.24	1157.35	566.21	1.48	264.69	1.00	74.29	6384.11	-6078.28	4179.25
Saccade R	1	1	4258552706	4258572587	19881	895.64	574.24	1157.35	566.21	1.48	264.69	1.00	74.29	6384.11	-6078.28	4179.25
Fixation L	1	2	4258572587	4258751566	178979	1156.46	563.86	22	48	-1	14.58	14.58
Fixation R	1	2	4258572587	4258751566	178979	1156.46	563.86	22	48	-1	16.16	16.16
Saccade L	1	2	4258751566	4258791435	39869	1139.47	590.24	638.93	897.34	5.32	435.77	0.50	133.43	10732.90	-10411.60	6958.14
Saccade R	1	2	4258751566	4258791435	39869	1139.47	590.24	638.93	897.34	5.32	435.77	0.50	133.43	10732.90	-10411.60	6958.14
Fixation L	1	3	4258791435	4258930693	139258	641.11	871.67	9	34	-1	14.98	14.98
Fixation R	1	3	4258791435	4258930693	139258	641.11	871.67	9	34	-1	16.65	16.65
Saccade L	1	3	4258930693	4258950558	19865	641.42	868.12	556.58	918.37	0.78	99.74	1.00	39.09	2405.72	-1833.27	1834.18
Saccade R	1	3	4258930693	4258950558	19865	641.42	868.12	556.58	918.37	0.78	99.74	1.00	39.09	2405.72	-1833.27	1834.18
Fixation L	1	4	4258950558	4259109680	159122	572.09	946.65	46	38	-1	14.89	14.89
Fixation R	1	4	4258950558	4259109680	159122	572.09	946.65	46	38	-1	16.68	16.68
Saccade L	1	4	4259109680	4259169305	59625	562.05	952.82	655.65	610.45	3.80	160.52	0.67	63.75	3919.35	-3808.35	2572.36
Saccade R	1	4	4259109680	4259169305	59625	562.05	952.82	655.65	610.45	3.80	160.52	0.67	63.75	3919.35	-3808.35	2572.36
Fixation L	1	5	4259169305	4259308542	139237	651.90	598.20	11	27	-1	13.98	13.98
Fixation R	1	5	4259169305	4259308542	139237	651.90	598.20	11	27	-1	16.52	16.52
Saccade L	1	5	4259308542	4259368166	59624	655.40	588.57	1278.01	284.30	7.48	397.76	0.67	125.43	9906.58	-9348.84	6132.09
Saccade R	1	5	4259308542	4259368166	59624	655.40	588.57	1278.01	284.30	7.48	397.76	0.67	125.43	9906.58	-9348.84	6132.09
Fixation L	1	6	4259368166	4259726270	358104	1299.53	295.56	38	57	-1	13.56	13.56
Fixation R	1	6	4259368166	4259726270	358104	1299.53	295.56	38	57	-1	15.72	15.72
Saccade L	1	6	4259726270	4259746148	19878	1316.18	262.45	1317.67	258.91	0.06	6.01	0.00	3.08	69.44	-117.51	89.89
Saccade R	1	6	4259726270	4259746148	19878	1316.18	262.45	1317.67	258.91	0.06	6.01	0.00	3.08	69.44	-117.51	89.89
Fixation L	1	7	4259746148	4260084252	338104	1332.66	232.86	37	62	-1	13.36	13.36
Fixation R	1	7	4259746148	4260084252	338104	1332.66	232.86	37	62	-1	15.35	15.35
Saccade L	1	7	4260084252	4260163878	79626	1354.69	197.93	1356.55	197.88	0.73	39.83	1.00	9.21	914.85	-205.65	337.53
Saccade R	1	7	4260084252	4260104134	19882	1354.69	197.93	1355.81	199.10	0.08	9.63	0.00	3.98	39.90	-205.65	95.25
Fixation R	1	8	4260104134	4260203629	99495	1350.00	216.01	30	61	-1	15.17	15.17
Blink L	1	1	4260163878	4260302990	139112
Saccade R	1	8	4260203629	4260422375	218746	1326.21	259.23	849.68	764.12	13.46	119.96	0.36	61.55	2506.74	-2039.76	1023.93
Saccade L	1	8	4260302990	4260422375	119385	1136.26	496.03	849.68	764.12	7.81	119.96	1.00	65.40	2506.74	-2039.76	1059.01
Fixation L	1	8	4260422375	4260561601	139226	816.75	771.43	50	16	-1	12.54	12.54
Fixation R	1	9	4260422375	4260561601	139226	816.75	771.43	50	16	-1	16.20	16.20
Saccade L	1	9	4260561601	4260601356	39755	799.44	771.65	535.56	913.55	2.55	260.36	1.00	64.20	6480.30	-6241.10	3647.66
Saccade R	1	9	4260561601	4260601356	39755	799.44	771.65	535.56	913.55	2.55	260.36	1.00	64.20	6480.30	-6241.10	3647.66
Fixation L	1	9	4260601356	4260780345	178989	534.40	934.81	3	28	-1	13.59	13.59
Fixation R	1	10	4260601356	4260780345	178989	534.40	934.81	3	28	-1	15.87	15.87
Saccade L	1	10	4260780345	4260800352	20007	534.71	941.51	586.49	772.72	1.10	178.55	1.00	55.06	4435.97	-4017.04	3149.45
Saccade R	1	10	4260780345	4260800352	20007	534.71	941.51	586.49	772.72	1.10	178.55	1.00	55.06	4435.97	-4017.04	3149.45
Fixation L	1	10	4260800352	4260939590	139238	605.33	727.99	29	60	-1	13.30	13.30
Fixation R	1	11	4260800352	4260939590	139238	605.33	727.99	29	60	-1	15.82	15.82
Blink L	1	2	4260939590	4261138460	198870
Blink R	1	1	4260939590	4261138460	198870
Saccade L	1	11	4261138460	4261237825	99365	536.03	739.78	702.36	607.56	3.72	221.53	1.00	37.47	5455.94	-5493.13	1731.68
Saccade R	1	11	4261138460	4261237825	99365	536.03	739.78	702.36	607.56	3.72	221.53	1.00	37.47	5455.94	-5493.13	1731.68
Fixation L	1	11	4261237825	4261436812	198987	701.25	617.09	6	25	-1	14.53	14.53
Fixation R	1	12	4261237825	4261436812	198987	701.25	617.09	6	25	-1	15.45	15.45
Saccade L	1	12	4261436812	4261456691	19879	703.68	632.59	874.32	781.52	1.27	229.01	1.00	63.70	5607.33	-5076.22	3597.36
Saccade R	1	12	4261436812	4261456691	19879	703.68	632.59	874.32	781.52	1.27	229.01	1.00	63.70	5607.33	-5076.22	3597.36
Fixation L	1	12	4261456691	4261715304	258613	866.04	800.85	11	54	-1	14.87	14.87
Fixation R	1	13	4261456691	4261715304	258613	866.04	800.85	11	54	-1	15.93	15.93
Saccade L	1	13	4261715304	4261735181	19877	868.70	830.16	650.41	934.80	1.34	244.73	1.00	67.46	5964.55	-5904.34	4080.31
Saccade R	1	13	4261715304	4261735181	19877	868.70	830.16	650.41	934.80	1.34	244.73	1.00	67.46	5964.55	-5904.34	4080.31
Fixation L	1	13	4261735181	4261894300	159119	641.97	940.48	13	9	-1	14.93	14.93
Fixation R	1	14	4261735181	4261894300	159119	641.97	940.48	13	9	-1	15.69	15.69
Saccade L	1	14	4261894300	4261914164	19864	637.84	944.80	553.50	949.78	0.67	85.46	1.00	33.70	2076.17	-1831.66	1659.09
Saccade R	1	14	4261894300	4261914164	19864	637.84	944.80	553.50	949.78	0.67	85.46	1.00	33.70	2076.17	-1831.66	1659.09
Fixation L	1	14	4261914164	4262113044	198880	579.56	967.76	44	33	-1	14.61	14.61
Fixation R	1	15	4261914164	4262113044	198880	579.56	967.76	44	33	-1	15.67	15.67
