[BeGaze]
Converted from:	C:\Documents and Settings\iViewX\Desktop\EXPERIMENTATIONS\Experiments\results\finaleart\S13H22431-finaleart-1.idf
Date:	27.03.2019 15:41:27
Version:	BeGaze 2.5.77
Sample Rate:	50
Subject:	S13H22431
Description:	Jimmy Petit

Table Header for Fixations:
Event Type	Trial	Number	Start	End	Duration	Location X	Location Y	Dispersion X	Dispersion Y	Plane	Avg. Pupil Size X	Avg. Pupil Size Y

Table Header for Saccades:
Event Type	Trial	Number	Start	End	Duration	Start Loc.X	Start Loc.Y	End Loc.X	End Loc.Y	Amplitude	Peak Speed	Peak Speed At	Average Speed	Peak Accel.	Peak Decel.	Average Accel.

Table Header for Blinks:
Event Type	Trial	Number	Start	End	Duration

Table Header for User Events:
Event Type	Trial	Number	Start	Description

UserEvent	1	1	27319781202	# Message: void.jpg
Fixation L	1	1	27319799597	27319958707	159110	765.82	449.06	35	21	-1	17.92	17.92
Fixation R	1	1	27319799597	27319958707	159110	765.82	449.06	35	21	-1	18.07	18.07
Saccade L	1	1	27319958707	27319978576	19869	756.83	453.00	627.78	523.28	0.87	148.63	1.00	43.83	3598.58	-3061.73	2354.49
Saccade R	1	1	27319958707	27319978576	19869	756.83	453.00	627.78	523.28	0.87	148.63	1.00	43.83	3598.58	-3061.73	2354.49
Fixation L	1	2	27319978576	27320276932	298356	620.46	541.27	17	30	-1	18.65	18.65
Fixation R	1	2	27319978576	27320276932	298356	620.46	541.27	17	30	-1	18.76	18.76
Blink L	1	1	27320276932	27320475813	198881
Blink R	1	1	27320276932	27320475813	198881
Fixation L	1	3	27320475813	27320615052	139239	705.54	309.33	15	42	-1	16.27	16.27
Fixation R	1	3	27320475813	27320615052	139239	705.54	309.33	15	42	-1	16.13	16.13
Saccade L	1	2	27320615052	27320674799	59747	705.32	320.65	1143.61	316.22	4.54	191.23	0.33	75.97	4703.75	-3418.89	3260.25
Saccade R	1	2	27320615052	27320674799	59747	705.32	320.65	1143.61	316.22	4.54	191.23	0.33	75.97	4703.75	-3418.89	3260.25
Fixation L	1	4	27320674799	27320893541	218742	1146.38	323.99	32	11	-1	16.15	16.15
Fixation R	1	4	27320674799	27320893541	218742	1146.38	323.99	32	11	-1	15.99	15.99
Saccade L	1	3	27320893541	27320913407	19866	1172.17	327.61	1281.33	334.50	0.92	110.63	1.00	46.26	2726.14	-2164.38	1718.69
Saccade R	1	3	27320893541	27320913407	19866	1172.17	327.61	1281.33	334.50	0.92	110.63	1.00	46.26	2726.14	-2164.38	1718.69
Fixation L	1	5	27320913407	27321032776	119369	1305.20	373.38	36	60	-1	16.98	16.98
Fixation R	1	5	27320913407	27321032776	119369	1305.20	373.38	36	60	-1	16.77	16.77
Saccade L	1	4	27321032776	27321052654	19878	1304.64	394.54	1301.48	400.04	0.12	13.53	1.00	5.96	48.97	-177.60	111.67
Saccade R	1	4	27321032776	27321052654	19878	1304.64	394.54	1301.48	400.04	0.12	13.53	1.00	5.96	48.97	-177.60	111.67
Fixation L	1	6	27321052654	27321231644	178990	1302.84	398.77	5	3	-1	17.38	17.38
Fixation R	1	6	27321052654	27321231644	178990	1302.84	398.77	5	3	-1	17.01	17.01
Saccade L	1	5	27321231644	27321271402	39758	1300.99	400.02	1035.13	400.09	2.27	149.53	1.00	57.07	3715.14	-3699.22	3248.74
Saccade R	1	5	27321231644	27321271402	39758	1300.99	400.02	1035.13	400.09	2.27	149.53	1.00	57.07	3715.14	-3699.22	3248.74
Fixation L	1	7	27321271402	27321490265	218863	1019.79	392.04	19	14	-1	17.16	17.16
Fixation R	1	7	27321271402	27321490265	218863	1019.79	392.04	19	14	-1	16.71	16.71
Saccade L	1	6	27321490265	27321569753	79488	1015.83	385.90	461.40	475.24	6.98	199.56	0.75	87.86	3893.73	-4102.04	2631.35
Saccade R	1	6	27321490265	27321569753	79488	1015.83	385.90	461.40	475.24	6.98	199.56	0.75	87.86	3893.73	-4102.04	2631.35
Fixation L	1	8	27321569753	27321768753	199000	432.47	495.10	44	29	-1	16.72	16.72
Fixation R	1	8	27321569753	27321768753	199000	432.47	495.10	44	29	-1	16.88	16.88
