[BeGaze]
Converted from:	C:\Documents and Settings\iViewX\Desktop\EXPERIMENTATIONS\Experiments\results\finaleart\S18F56223-finaleart-1.idf
Date:	27.03.2019 15:48:56
Version:	BeGaze 2.5.77
Sample Rate:	50
Subject:	S18F56223
Description:	Pascale Sebillot

Table Header for Fixations:
Event Type	Trial	Number	Start	End	Duration	Location X	Location Y	Dispersion X	Dispersion Y	Plane	Avg. Pupil Size X	Avg. Pupil Size Y

Table Header for Saccades:
Event Type	Trial	Number	Start	End	Duration	Start Loc.X	Start Loc.Y	End Loc.X	End Loc.Y	Amplitude	Peak Speed	Peak Speed At	Average Speed	Peak Accel.	Peak Decel.	Average Accel.

Table Header for Blinks:
Event Type	Trial	Number	Start	End	Duration

Table Header for User Events:
Event Type	Trial	Number	Start	Description

UserEvent	1	1	2635571414	# Message: goya-still-life-plucked-turkey-and-pan-with-fish-1812.jpg
Fixation L	1	1	2635583108	2636020695	437587	743.02	730.53	17	37	-1	11.91	11.91
Fixation R	1	1	2635583108	2636020695	437587	743.02	730.53	17	37	-1	12.33	12.33
Saccade L	1	1	2636020695	2636060448	39753	738.41	734.36	1171.90	745.20	3.99	231.70	0.50	100.46	5697.78	-4793.30	5017.35
Saccade R	1	1	2636020695	2636060448	39753	738.41	734.36	1171.90	745.20	3.99	231.70	0.50	100.46	5697.78	-4793.30	5017.35
Fixation L	1	2	2636060448	2636458170	397722	1132.77	728.57	58	30	-1	12.75	12.75
Fixation R	1	2	2636060448	2636458170	397722	1132.77	728.57	58	30	-1	12.53	12.53
Saccade L	1	2	2636458170	2636517921	59751	1118.57	724.17	1224.04	364.95	4.90	225.17	0.67	81.93	5442.52	-5210.35	3821.91
Saccade R	1	2	2636458170	2636517921	59751	1118.57	724.17	1224.04	364.95	4.90	225.17	0.67	81.93	5442.52	-5210.35	3821.91
Fixation L	1	3	2636517921	2636796414	278493	1226.48	396.05	17	65	-1	12.91	12.91
Fixation R	1	3	2636517921	2636796414	278493	1226.48	396.05	17	65	-1	12.79	12.79
Saccade L	1	3	2636796414	2636836158	39744	1228.79	420.85	1524.10	271.32	3.21	238.20	0.50	80.81	5862.85	-4532.34	3687.63
Saccade R	1	3	2636796414	2636836158	39744	1228.79	420.85	1524.10	271.32	3.21	238.20	0.50	80.81	5862.85	-4532.34	3687.63
Fixation L	1	4	2636836158	2636975395	139237	1487.47	271.73	55	43	-1	12.62	12.62
Fixation R	1	4	2636836158	2636975395	139237	1487.47	271.73	55	43	-1	12.59	12.59
Saccade L	1	4	2636975395	2636995278	19883	1493.62	250.72	1487.27	235.91	0.24	16.30	1.00	12.03	72.15	-320.97	143.24
Saccade R	1	4	2636975395	2636995278	19883	1493.62	250.72	1487.27	235.91	0.24	16.30	1.00	12.03	72.15	-320.97	143.24
Fixation L	1	5	2636995278	2637214019	218741	1506.37	224.72	33	51	-1	12.38	12.38
Fixation R	1	5	2636995278	2637214019	218741	1506.37	224.72	33	51	-1	12.48	12.48
Saccade L	1	5	2637214019	2637273778	59759	1490.48	251.40	1000.91	799.04	8.39	448.39	0.33	140.46	11043.75	-8756.24	5858.42
Saccade R	1	5	2637214019	2637273778	59759	1490.48	251.40	1000.91	799.04	8.39	448.39	0.33	140.46	11043.75	-8756.24	5858.42
Fixation L	1	6	2637273778	2637592007	318229	1005.69	812.98	40	33	-1	13.31	13.31
Fixation R	1	6	2637273778	2637592007	318229	1005.69	812.98	40	33	-1	13.00	13.00
Saccade L	1	6	2637592007	2637631742	39735	1006.38	826.49	895.21	912.61	2.41	143.98	0.50	60.57	3337.91	-2097.33	1929.34
Saccade R	1	6	2637592007	2637631742	39735	1006.38	826.49	895.21	912.61	2.41	143.98	0.50	60.57	3337.91	-2097.33	1929.34
Fixation L	1	7	2637631742	2637770994	139252	881.44	898.30	24	58	-1	13.62	13.62
Fixation R	1	7	2637631742	2637770994	139252	881.44	898.30	24	58	-1	13.63	13.63
Saccade L	1	7	2637770994	2637830607	59613	871.13	903.17	693.16	980.14	4.21	258.34	0.67	70.66	6372.15	-6191.62	3333.29
Saccade R	1	7	2637770994	2637830607	59613	871.13	903.17	693.16	980.14	4.21	258.34	0.67	70.66	6372.15	-6191.62	3333.29
Fixation L	1	8	2637830607	2638089233	258626	679.52	994.04	27	25	-1	14.33	14.33
Fixation R	1	8	2637830607	2638089233	258626	679.52	994.04	27	25	-1	14.54	14.54
Saccade L	1	8	2638089233	2638128980	39747	676.80	992.16	983.46	994.86	2.63	197.47	1.00	66.18	4656.94	-4811.63	3727.01
Saccade R	1	8	2638089233	2638128980	39747	676.80	992.16	983.46	994.86	2.63	197.47	1.00	66.18	4656.94	-4811.63	3727.01
Fixation L	1	9	2638128980	2638407473	278493	986.40	986.08	25	26	-1	14.80	14.80
Fixation R	1	9	2638128980	2638407473	278493	986.40	986.08	25	26	-1	15.43	15.43
Saccade L	1	9	2638407473	2638447210	39737	967.29	975.54	463.43	794.27	5.00	331.89	0.50	125.91	8270.45	-6837.60	5875.09
Saccade R	1	9	2638407473	2638447210	39737	967.29	975.54	463.43	794.27	5.00	331.89	0.50	125.91	8270.45	-6837.60	5875.09
Fixation L	1	10	2638447210	2638845075	397865	464.68	811.81	55	40	-1	14.30	14.30
Fixation R	1	10	2638447210	2638845075	397865	464.68	811.81	55	40	-1	14.61	14.61
Saccade L	1	10	2638845075	2638944445	99370	454.90	805.38	659.22	811.66	4.48	180.52	1.00	45.05	3723.68	-4412.39	1390.87
Saccade R	1	10	2638845075	2638944445	99370	454.90	805.38	659.22	811.66	4.48	180.52	1.00	45.05	3723.68	-4412.39	1390.87
Fixation L	1	11	2638944445	2639123554	179109	692.75	791.63	50	35	-1	14.40	14.40
Fixation R	1	11	2638944445	2639123554	179109	692.75	791.63	50	35	-1	14.89	14.89
Saccade L	1	11	2639123554	2639262676	139122	692.77	775.91	1064.36	462.48	12.08	306.81	1.00	86.86	7611.09	-6791.97	3742.06
Saccade R	1	11	2639123554	2639262676	139122	692.77	775.91	1064.36	462.48	12.08	306.81	1.00	86.86	7611.09	-6791.97	3742.06
Fixation L	1	12	2639262676	2639561037	298361	1061.17	484.06	34	32	-1	14.60	14.60
Fixation R	1	12	2639262676	2639561037	298361	1061.17	484.06	34	32	-1	14.52	14.52
