[BeGaze]
Converted from:	C:\Documents and Settings\iViewX\Desktop\EXPERIMENTATIONS\Experiments\results\finaleart\S15H25531-finaleart-1.idf
Date:	27.03.2019 15:45:54
Version:	BeGaze 2.5.77
Sample Rate:	50
Subject:	S15H25531
Description:	Mikail Demirdelen

Table Header for Fixations:
Event Type	Trial	Number	Start	End	Duration	Location X	Location Y	Dispersion X	Dispersion Y	Plane	Avg. Pupil Size X	Avg. Pupil Size Y

Table Header for Saccades:
Event Type	Trial	Number	Start	End	Duration	Start Loc.X	Start Loc.Y	End Loc.X	End Loc.Y	Amplitude	Peak Speed	Peak Speed At	Average Speed	Peak Accel.	Peak Decel.	Average Accel.

Table Header for Blinks:
Event Type	Trial	Number	Start	End	Duration

Table Header for User Events:
Event Type	Trial	Number	Start	Description

UserEvent	1	1	4723187327	# Message: void.jpg
Fixation L	1	1	4723197382	4723813848	616466	1294.28	711.03	5	10	-1	15.90	15.90
Fixation R	1	1	4723197382	4723813848	616466	1294.28	711.03	5	10	-1	16.27	16.27
Saccade L	1	1	4723813848	4724012835	198987	1297.29	708.04	446.04	518.50	15.31	204.00	0.30	76.92	4679.76	-3693.40	1872.42
Saccade R	1	1	4723813848	4724012835	198987	1297.29	708.04	446.04	518.50	15.31	204.00	0.30	76.92	4679.76	-3693.40	1872.42
Blink L	1	1	4724012835	4724231575	218740
Blink R	1	1	4724012835	4724231575	218740
Fixation L	1	2	4724231575	4724549812	318237	422.40	520.60	21	21	-1	13.48	13.48
Fixation R	1	2	4724231575	4724549812	318237	422.40	520.60	21	21	-1	15.43	15.43
Saccade L	1	2	4724549812	4724589570	39758	426.64	530.92	113.47	530.38	2.79	189.84	1.00	70.20	4656.56	-4288.07	3762.31
Saccade R	1	2	4724549812	4724589570	39758	426.64	530.92	113.47	530.38	2.79	189.84	1.00	70.20	4656.56	-4288.07	3762.31
Fixation L	1	3	4724589570	4724808427	218857	108.41	576.68	25	70	-1	13.53	13.53
Fixation R	1	3	4724589570	4724808427	218857	108.41	576.68	25	70	-1	15.67	15.67
Saccade L	1	3	4724808427	4724868044	59617	123.65	595.78	684.84	492.12	5.98	252.45	0.67	100.35	6175.44	-6015.25	4115.01
Saccade R	1	3	4724808427	4724868044	59617	123.65	595.78	684.84	492.12	5.98	252.45	0.67	100.35	6175.44	-6015.25	4115.01
Fixation L	1	4	4724868044	4725186283	318239	667.17	471.76	22	41	-1	13.87	13.87
Fixation R	1	4	4724868044	4725186283	318239	667.17	471.76	22	41	-1	16.11	16.11
