[BeGaze]
Converted from:	C:\Documents and Settings\iViewX\Desktop\EXPERIMENTATIONS\Experiments\results\finaleart\S9H29221-finaleart-1.idf
Date:	27.03.2019 16:02:27
Version:	BeGaze 2.5.77
Sample Rate:	50
Subject:	S9H29221
Description:	steven

Table Header for Fixations:
Event Type	Trial	Number	Start	End	Duration	Location X	Location Y	Dispersion X	Dispersion Y	Plane	Avg. Pupil Size X	Avg. Pupil Size Y

Table Header for Saccades:
Event Type	Trial	Number	Start	End	Duration	Start Loc.X	Start Loc.Y	End Loc.X	End Loc.Y	Amplitude	Peak Speed	Peak Speed At	Average Speed	Peak Accel.	Peak Decel.	Average Accel.

Table Header for Blinks:
Event Type	Trial	Number	Start	End	Duration

Table Header for User Events:
Event Type	Trial	Number	Start	Description

UserEvent	1	1	5801474558	# Message: nasturtiums-dahlias-in-a-basket_gauguin_1884.jpg
Fixation L	1	1	5801476107	5801754603	278496	1259.01	419.86	85	13	-1	13.71	13.71
Fixation R	1	1	5801476107	5801754603	278496	1259.01	419.86	85	13	-1	12.56	12.56
Saccade L	1	1	5801754603	5801774466	19863	1224.91	419.92	1205.72	419.32	0.59	51.74	0.00	29.56	-39.27	-641.83	334.67
Saccade R	1	1	5801754603	5801774466	19863	1224.91	419.92	1205.72	419.32	0.59	51.74	0.00	29.56	-39.27	-641.83	334.67
Fixation L	1	2	5801774466	5802033091	258625	1215.03	437.86	60	29	-1	14.10	14.10
Fixation R	1	2	5801774466	5802033091	258625	1215.03	437.86	60	29	-1	12.63	12.63
Saccade L	1	2	5802033091	5802072831	39740	1226.42	448.68	984.03	463.29	2.17	152.01	0.50	54.61	3781.06	-3558.82	2855.75
Saccade R	1	2	5802033091	5802072831	39740	1226.42	448.68	984.03	463.29	2.17	152.01	0.50	54.61	3781.06	-3558.82	2855.75
Fixation L	1	3	5802072831	5802450692	377861	958.35	475.28	47	28	-1	14.07	14.07
Fixation R	1	3	5802072831	5802450692	377861	958.35	475.28	47	28	-1	12.59	12.59
Saccade L	1	3	5802450692	5802470567	19875	937.49	453.46	935.17	420.56	0.41	33.36	1.00	20.65	593.09	-764.67	562.64
Saccade R	1	3	5802450692	5802470567	19875	937.49	453.46	935.17	420.56	0.41	33.36	1.00	20.65	593.09	-764.67	562.64
Fixation L	1	4	5802470567	5802570057	99490	913.40	396.64	42	57	-1	13.36	13.36
Fixation R	1	4	5802470567	5802570057	99490	913.40	396.64	42	57	-1	12.36	12.36
Saccade L	1	4	5802570057	5802589922	19865	893.04	362.70	890.47	358.80	0.32	33.22	1.00	16.28	427.43	-158.49	242.18
Saccade R	1	4	5802570057	5802589922	19865	893.04	362.70	890.47	358.80	0.32	33.22	1.00	16.28	427.43	-158.49	242.18
Fixation L	1	5	5802589922	5802788799	198877	874.06	392.43	45	47	-1	13.21	13.21
Fixation R	1	5	5802589922	5802788799	198877	874.06	392.43	45	47	-1	12.22	12.22
Saccade L	1	5	5802788799	5802967908	179109	844.74	393.81	626.51	217.96	5.23	68.19	0.56	29.22	1481.21	-1186.59	608.99
Saccade R	1	5	5802788799	5802967908	179109	844.74	393.81	626.51	217.96	5.23	68.19	0.56	29.22	1481.21	-1186.59	608.99
Fixation L	1	6	5802967908	5803107031	139123	583.30	210.62	59	12	-1	12.57	12.57
Fixation R	1	6	5802967908	5803107031	139123	583.30	210.62	59	12	-1	11.76	11.76
Saccade L	1	6	5803107031	5803166772	59741	567.08	211.53	473.95	149.06	1.46	58.72	1.00	24.42	710.78	-1064.74	633.31
Saccade R	1	6	5803107031	5803166772	59741	567.08	211.53	473.95	149.06	1.46	58.72	1.00	24.42	710.78	-1064.74	633.31
Fixation L	1	7	5803166772	5803365647	198875	427.92	131.57	68	28	-1	11.89	11.89
Fixation R	1	7	5803166772	5803365647	198875	427.92	131.57	68	28	-1	11.08	11.08
Saccade L	1	7	5803365647	5803445258	79611	405.79	122.19	412.19	152.62	1.37	67.86	1.00	17.24	1329.38	106.94	432.23
Saccade R	1	7	5803365647	5803445258	79611	405.79	122.19	412.19	152.62	1.37	67.86	1.00	17.24	1329.38	106.94	432.23
Blink L	1	1	5803445258	5803524764	79506
Blink R	1	1	5803445258	5803524764	79506
Blink L	1	2	5803584381	5803942486	358105
Blink R	1	2	5803584381	5803942486	358105
Fixation L	1	8	5803942486	5804598834	656348	1000.54	448.90	44	54	-1	11.89	11.89
Fixation R	1	8	5803942486	5804598834	656348	1000.54	448.90	44	54	-1	11.42	11.42
Saccade L	1	8	5804598834	5804618698	19864	1025.79	471.95	1029.55	478.20	0.08	7.38	1.00	3.95	80.98	-99.47	63.23
Saccade R	1	8	5804598834	5804618698	19864	1025.79	471.95	1029.55	478.20	0.08	7.38	1.00	3.95	80.98	-99.47	63.23
Fixation L	1	9	5804618698	5805016552	397854	1034.71	488.25	82	14	-1	12.68	12.68
Fixation R	1	9	5804618698	5805016552	397854	1034.71	488.25	82	14	-1	12.15	12.15
Saccade L	1	9	5805016552	5805036446	19894	961.26	490.21	947.23	493.18	0.48	68.65	0.00	24.19	93.89	-1645.80	659.91
Saccade R	1	9	5805016552	5805036446	19894	961.26	490.21	947.23	493.18	0.48	68.65	0.00	24.19	93.89	-1645.80	659.91
Fixation L	1	10	5805036446	5805275046	238600	941.45	497.04	12	8	-1	13.63	13.63
Fixation R	1	10	5805036446	5805275046	238600	941.45	497.04	12	8	-1	13.01	13.01
Saccade L	1	10	5805275046	5805314795	39749	936.50	497.40	937.85	489.50	1.74	95.88	0.50	43.66	2333.86	-1647.99	1907.65
Saccade R	1	10	5805275046	5805314795	39749	936.50	497.40	937.85	489.50	1.74	95.88	0.50	43.66	2333.86	-1647.99	1907.65
Fixation L	1	11	5805314795	5805533658	218863	880.30	486.75	68	5	-1	14.29	14.29
Fixation R	1	11	5805314795	5805533658	218863	880.30	486.75	68	5	-1	13.90	13.90
