[BeGaze]
Converted from:	C:\Documents and Settings\iViewX\Desktop\EXPERIMENTATIONS\Experiments\results\finaleart\S5121332-finaleart-1.idf
Date:	27.03.2019 15:35:07
Version:	BeGaze 2.5.77
Sample Rate:	50
Subject:	S5121332
Description:	Dylan Marinho

Table Header for Fixations:
Event Type	Trial	Number	Start	End	Duration	Location X	Location Y	Dispersion X	Dispersion Y	Plane	Avg. Pupil Size X	Avg. Pupil Size Y

Table Header for Saccades:
Event Type	Trial	Number	Start	End	Duration	Start Loc.X	Start Loc.Y	End Loc.X	End Loc.Y	Amplitude	Peak Speed	Peak Speed At	Average Speed	Peak Accel.	Peak Decel.	Average Accel.

Table Header for Blinks:
Event Type	Trial	Number	Start	End	Duration

Table Header for User Events:
Event Type	Trial	Number	Start	Description

UserEvent	1	1	9360149070	# Message: void.jpg
Fixation L	1	1	9360149541	9360706373	556832	1042.51	494.73	13	14	-1	12.74	12.74
Fixation R	1	1	9360149541	9360706373	556832	1042.51	494.73	13	14	-1	12.36	12.36
Blink L	1	1	9360706373	9360984869	278496
Blink R	1	1	9360706373	9360984869	278496
Fixation L	1	2	9360984869	9361104232	119363	994.45	520.68	8	30	-1	14.50	14.50
Fixation R	1	2	9360984869	9361104232	119363	994.45	520.68	8	30	-1	14.40	14.40
Blink L	1	2	9361104232	9361243476	139244
Blink R	1	2	9361104232	9361243476	139244
Fixation L	1	3	9361243476	9361541705	298229	1040.64	531.85	19	36	-1	14.78	14.78
Fixation R	1	3	9361243476	9361541705	298229	1040.64	531.85	19	36	-1	14.51	14.51
Saccade L	1	1	9361541705	9361561695	19990	1047.33	539.14	1021.28	588.94	0.67	56.85	1.00	33.39	1343.05	-1289.81	1176.88
Saccade R	1	1	9361541705	9361561695	19990	1047.33	539.14	1021.28	588.94	0.67	56.85	1.00	33.39	1343.05	-1289.81	1176.88
Fixation L	1	4	9361561695	9361939555	377860	1038.62	553.39	35	56	-1	14.80	14.80
Fixation R	1	4	9361561695	9361939555	377860	1038.62	553.39	35	56	-1	14.68	14.68
Saccade L	1	2	9361939555	9361959418	19863	1012.93	562.33	970.47	553.26	0.44	43.92	1.00	21.92	1059.54	-815.29	836.66
Saccade R	1	2	9361939555	9361959418	19863	1012.93	562.33	970.47	553.26	0.44	43.92	1.00	21.92	1059.54	-815.29	836.66
Fixation L	1	5	9361959418	9362138414	178996	966.87	570.15	7	24	-1	14.71	14.71
Fixation R	1	5	9361959418	9362138414	178996	966.87	570.15	7	24	-1	14.66	14.66
