[BeGaze]
Converted from:	C:\Documents and Settings\iViewX\Desktop\EXPERIMENTATIONS\Experiments\results\finaleart\S1022551-finaleart-1.idf
Date:	27.03.2019 15:38:22
Version:	BeGaze 2.5.77
Sample Rate:	50
Subject:	S1022551
Description:	Alexis Nebout

Table Header for Fixations:
Event Type	Trial	Number	Start	End	Duration	Location X	Location Y	Dispersion X	Dispersion Y	Plane	Avg. Pupil Size X	Avg. Pupil Size Y

Table Header for Saccades:
Event Type	Trial	Number	Start	End	Duration	Start Loc.X	Start Loc.Y	End Loc.X	End Loc.Y	Amplitude	Peak Speed	Peak Speed At	Average Speed	Peak Accel.	Peak Decel.	Average Accel.

Table Header for Blinks:
Event Type	Trial	Number	Start	End	Duration

Table Header for User Events:
Event Type	Trial	Number	Start	Description

UserEvent	1	1	8905499850	# Message: void.jpg
Fixation L	1	1	8905514867	8905693904	179037	1301.30	445.74	2	13	-1	12.40	12.40
Fixation R	1	1	8905514867	8905693904	179037	1301.30	445.74	2	13	-1	10.50	10.50
Saccade L	1	1	8905693904	8905753470	59566	1301.80	452.58	1765.23	754.80	6.13	352.24	0.33	102.88	8779.23	-4261.94	3543.56
Saccade R	1	1	8905693904	8905753470	59566	1301.80	452.58	1765.23	754.80	6.13	352.24	0.33	102.88	8779.23	-4261.94	3543.56
Fixation L	1	2	8905753470	8906330415	576945	1753.60	762.77	17	49	-1	12.72	12.72
Fixation R	1	2	8905753470	8906330415	576945	1753.60	762.77	17	49	-1	10.52	10.52
Blink L	1	1	8906330415	8906489438	159023
Blink R	1	1	8906330415	8906489438	159023
Blink L	1	2	8906509317	8906808733	299416
Blink R	1	2	8906588830	8906808733	219903
Fixation L	1	3	8906808733	8906908014	99281	790.54	306.51	6	16	-1	12.62	12.62
Fixation R	1	3	8906808733	8906908014	99281	790.54	306.51	6	16	-1	10.82	10.82
Saccade L	1	2	8906908014	8906946920	38906	792.85	313.29	904.33	322.09	1.34	113.12	1.00	34.42	2565.49	-2445.84	1687.87
Saccade R	1	2	8906908014	8906946920	38906	792.85	313.29	904.33	322.09	1.34	113.12	1.00	34.42	2565.49	-2445.84	1687.87
Fixation L	1	4	8906946920	8907344645	397725	890.21	342.90	19	42	-1	12.47	12.47
Fixation R	1	4	8906946920	8907344645	397725	890.21	342.90	19	42	-1	10.93	10.93
Saccade L	1	3	8907344645	8907364520	19875	891.33	359.52	868.82	405.38	0.33	51.68	1.00	16.76	1236.47	-989.73	835.78
Saccade R	1	3	8907344645	8907364520	19875	891.33	359.52	868.82	405.38	0.33	51.68	1.00	16.76	1236.47	-989.73	835.78
Fixation L	1	5	8907364520	8907523635	159115	863.28	419.78	20	24	-1	11.74	11.74
Fixation R	1	5	8907364520	8907523635	159115	863.28	419.78	20	24	-1	10.52	10.52
