[BeGaze]
Converted from:	C:\Documents and Settings\iViewX\Desktop\EXPERIMENTATIONS\Experiments\results\finaleart\S13H22431-finaleart-1.idf
Date:	27.03.2019 15:41:32
Version:	BeGaze 2.5.77
Sample Rate:	50
Subject:	S13H22431
Description:	Jimmy Petit

Table Header for Fixations:
Event Type	Trial	Number	Start	End	Duration	Location X	Location Y	Dispersion X	Dispersion Y	Plane	Avg. Pupil Size X	Avg. Pupil Size Y

Table Header for Saccades:
Event Type	Trial	Number	Start	End	Duration	Start Loc.X	Start Loc.Y	End Loc.X	End Loc.Y	Amplitude	Peak Speed	Peak Speed At	Average Speed	Peak Accel.	Peak Decel.	Average Accel.

Table Header for Blinks:
Event Type	Trial	Number	Start	End	Duration

Table Header for User Events:
Event Type	Trial	Number	Start	Description

UserEvent	1	1	27401765175	# Message: The_Girl_From_Rat_Mort_Vlaminck_1905.jpg
Fixation L	1	1	27401766274	27402283376	517102	790.36	513.42	51	46	-1	15.90	15.90
Fixation R	1	1	27401766274	27402283376	517102	790.36	513.42	51	46	-1	17.60	17.60
Saccade L	1	1	27402283376	27402343121	59745	818.93	532.28	676.77	518.63	1.83	155.35	1.00	30.70	3608.80	-3642.17	1497.20
Saccade R	1	1	27402283376	27402343121	59745	818.93	532.28	676.77	518.63	1.83	155.35	1.00	30.70	3608.80	-3642.17	1497.20
Fixation L	1	2	27402343121	27402780725	437604	659.20	490.84	26	68	-1	13.89	13.89
Fixation R	1	2	27402343121	27402780725	437604	659.20	490.84	26	68	-1	15.62	15.62
Saccade L	1	2	27402780725	27402800599	19874	650.16	449.98	650.13	443.82	0.07	6.23	1.00	3.45	125.28	-83.07	109.75
Saccade R	1	2	27402780725	27402800599	19874	650.16	449.98	650.13	443.82	0.07	6.23	1.00	3.45	125.28	-83.07	109.75
Fixation L	1	3	27402800599	27403178456	377857	645.55	432.62	61	21	-1	13.53	13.53
Fixation R	1	3	27402800599	27403178456	377857	645.55	432.62	61	21	-1	14.85	14.85
Saccade L	1	3	27403178456	27403218215	39759	701.04	433.39	906.65	647.85	2.95	209.85	0.50	74.08	5209.25	-5091.69	3321.20
Saccade R	1	3	27403178456	27403218215	39759	701.04	433.39	906.65	647.85	2.95	209.85	0.50	74.08	5209.25	-5091.69	3321.20
Fixation L	1	4	27403218215	27403377325	159110	909.34	631.69	13	34	-1	14.75	14.75
Fixation R	1	4	27403218215	27403357447	139232	910.51	630.01	6	34	-1	15.58	15.58
Blink R	1	1	27403357447	27403496692	139245
Saccade L	1	4	27403377325	27403437077	59752	900.02	645.12	910.56	688.27	3.64	149.96	0.33	60.88	3687.29	-1708.08	1341.51
Fixation L	1	5	27403437077	27403695685	258608	921.35	695.63	15	61	-1	15.85	15.85
Fixation R	1	5	27403496692	27403695685	198993	923.12	692.42	8	23	-1	17.16	17.16
Saccade L	1	5	27403695685	27403755315	59630	925.27	693.02	1461.17	660.55	5.70	249.18	0.33	95.61	6203.45	-4834.16	4449.72
Saccade R	1	4	27403695685	27403755315	59630	925.27	693.02	1461.17	660.55	5.70	249.18	0.33	95.61	6203.45	-4834.16	4449.72
Fixation L	1	6	27403755315	27404053670	298355	1439.09	645.85	33	65	-1	15.43	15.43
Fixation R	1	6	27403755315	27404053670	298355	1439.09	645.85	33	65	-1	16.52	16.52
Saccade L	1	6	27404053670	27404073547	19877	1458.13	594.65	1450.54	568.34	0.56	51.25	0.00	28.18	330.79	-798.79	381.65
Saccade R	1	5	27404053670	27404073547	19877	1458.13	594.65	1450.54	568.34	0.56	51.25	0.00	28.18	330.79	-798.79	381.65
Fixation L	1	7	27404073547	27404212789	139242	1463.36	560.30	23	38	-1	14.82	14.82
Fixation R	1	7	27404073547	27404212789	139242	1463.36	560.30	23	38	-1	15.64	15.64
Saccade L	1	7	27404212789	27404252540	39751	1473.73	547.87	1473.65	284.57	2.29	153.22	0.50	57.68	3682.46	-3551.90	3038.90
Saccade R	1	6	27404212789	27404252540	39751	1473.73	547.87	1473.65	284.57	2.29	153.22	0.50	57.68	3682.46	-3551.90	3038.90
Fixation L	1	8	27404252540	27404431530	178990	1467.50	265.24	55	34	-1	13.97	13.97
Fixation R	1	8	27404252540	27404431530	178990	1467.50	265.24	55	34	-1	14.69	14.69
Saccade L	1	8	27404431530	27404451401	19871	1421.49	252.65	1410.58	185.46	0.68	68.86	1.00	34.15	1638.43	-1606.08	1507.50
Saccade R	1	7	27404431530	27404451401	19871	1421.49	252.65	1410.58	185.46	0.68	68.86	1.00	34.15	1638.43	-1606.08	1507.50
Fixation L	1	9	27404451401	27404570789	119388	1395.75	178.63	56	18	-1	13.97	13.97
Fixation R	1	9	27404451401	27404570789	119388	1395.75	178.63	56	18	-1	14.14	14.14
Saccade L	1	9	27404570789	27404590645	19856	1353.79	166.49	1184.32	140.40	1.26	173.41	1.00	63.52	4293.78	-4049.68	2881.57
Saccade R	1	8	27404570789	27404590645	19856	1353.79	166.49	1184.32	140.40	1.26	173.41	1.00	63.52	4293.78	-4049.68	2881.57
Fixation L	1	10	27404590645	27404849261	258616	1160.83	153.57	62	34	-1	14.05	14.05
Fixation R	1	10	27404590645	27404849261	258616	1160.83	153.57	62	34	-1	14.68	14.68
Saccade L	1	10	27404849261	27405048128	198867	1121.88	136.03	297.40	255.18	17.27	267.01	0.10	86.82	6366.14	-6015.64	3205.23
Saccade R	1	9	27404849261	27405048128	198867	1121.88	136.03	297.40	255.18	17.27	267.01	0.10	86.82	6366.14	-6015.64	3205.23
Fixation L	1	11	27405048128	27405147620	99492	299.79	281.33	24	41	-1	14.50	14.50
Fixation R	1	11	27405048128	27405147620	99492	299.79	281.33	24	41	-1	15.14	15.14
Saccade L	1	11	27405147620	27405207240	59620	305.92	296.41	403.35	811.66	5.52	185.83	0.33	92.54	4487.35	-4318.15	3522.78
Saccade R	1	10	27405147620	27405207240	59620	305.92	296.41	403.35	811.66	5.52	185.83	0.33	92.54	4487.35	-4318.15	3522.78
Fixation L	1	12	27405207240	27405624976	417736	385.22	792.96	46	45	-1	14.64	14.64
Fixation R	1	12	27405207240	27405624976	417736	385.22	792.96	46	45	-1	15.80	15.80
Saccade L	1	12	27405624976	27405664727	39751	378.24	787.47	722.68	844.84	3.03	212.74	0.50	76.26	5270.87	-5106.54	4305.80
Saccade R	1	11	27405624976	27405664727	39751	378.24	787.47	722.68	844.84	3.03	212.74	0.50	76.26	5270.87	-5106.54	4305.80
Fixation L	1	13	27405664727	27405764224	99497	724.85	853.37	17	14	-1	13.87	13.87
Fixation R	1	13	27405664727	27405764224	99497	724.85	853.37	17	14	-1	15.37	15.37
