[BeGaze]
Converted from:	C:\Documents and Settings\iViewX\Desktop\EXPERIMENTATIONS\Experiments\results\finaleart\S13H22431-finaleart-1.idf
Date:	27.03.2019 15:42:14
Version:	BeGaze 2.5.77
Sample Rate:	50
Subject:	S13H22431
Description:	Jimmy Petit

Table Header for Fixations:
Event Type	Trial	Number	Start	End	Duration	Location X	Location Y	Dispersion X	Dispersion Y	Plane	Avg. Pupil Size X	Avg. Pupil Size Y

Table Header for Saccades:
Event Type	Trial	Number	Start	End	Duration	Start Loc.X	Start Loc.Y	End Loc.X	End Loc.Y	Amplitude	Peak Speed	Peak Speed At	Average Speed	Peak Accel.	Peak Decel.	Average Accel.

Table Header for Blinks:
Event Type	Trial	Number	Start	End	Duration

Table Header for User Events:
Event Type	Trial	Number	Start	Description

UserEvent	1	1	28171185958	# Message: void.jpg
Fixation L	1	1	28171195837	28171573811	377974	1217.00	765.34	15	21	-1	14.72	14.72
Fixation R	1	1	28171195837	28171573811	377974	1217.00	765.34	15	21	-1	14.85	14.85
Saccade L	1	1	28171573811	28171633424	59613	1223.66	757.83	901.82	558.48	4.37	164.05	1.00	73.29	3000.61	-3848.84	2620.94
Saccade R	1	1	28171573811	28171633424	59613	1223.66	757.83	901.82	558.48	4.37	164.05	1.00	73.29	3000.61	-3848.84	2620.94
Fixation L	1	2	28171633424	28171991536	358112	909.73	578.75	42	45	-1	14.97	14.97
Fixation R	1	2	28171633424	28171991536	358112	909.73	578.75	42	45	-1	15.20	15.20
Saccade L	1	2	28171991536	28172011413	19877	884.90	554.05	822.08	531.86	0.67	67.40	1.00	33.80	1650.39	-1206.83	1038.57
Saccade R	1	2	28171991536	28172011413	19877	884.90	554.05	822.08	531.86	0.67	67.40	1.00	33.80	1650.39	-1206.83	1038.57
Fixation L	1	3	28172011413	28172369403	357990	793.32	483.73	38	59	-1	15.08	15.08
Fixation R	1	3	28172011413	28172369403	357990	793.32	483.73	38	59	-1	15.43	15.43
Saccade L	1	3	28172369403	28172409156	39753	788.20	476.69	571.84	491.55	2.12	117.32	1.00	53.21	2815.71	-2506.32	2344.88
Saccade R	1	3	28172369403	28172409156	39753	788.20	476.69	571.84	491.55	2.12	117.32	1.00	53.21	2815.71	-2506.32	2344.88
Fixation L	1	4	28172409156	28172667762	258606	584.17	539.08	33	65	-1	15.95	15.95
Fixation R	1	4	28172409156	28172667762	258606	584.17	539.08	33	65	-1	16.59	16.59
Saccade L	1	4	28172667762	28172687637	19875	577.19	555.00	578.59	561.29	0.07	6.52	1.00	3.36	100.45	-75.27	61.34
Saccade R	1	4	28172667762	28172687637	19875	577.19	555.00	578.59	561.29	0.07	6.52	1.00	3.36	100.45	-75.27	61.34
Fixation L	1	5	28172687637	28172807002	119365	587.04	566.91	42	13	-1	15.88	15.88
Fixation R	1	5	28172687637	28172807002	119365	587.04	566.91	42	13	-1	16.79	16.79
Saccade L	1	5	28172807002	28172826882	19880	618.37	574.49	765.99	561.81	1.28	149.85	1.00	64.53	3580.29	-3451.34	2741.56
Saccade R	1	5	28172807002	28172826882	19880	618.37	574.49	765.99	561.81	1.28	149.85	1.00	64.53	3580.29	-3451.34	2741.56
Fixation L	1	6	28172826882	28172926371	99489	823.52	551.80	73	18	-1	15.81	15.81
Fixation R	1	6	28172826882	28172926371	99489	823.52	551.80	73	18	-1	16.31	16.31
Saccade L	1	6	28172926371	28172946248	19877	835.34	543.77	832.45	527.11	0.16	17.10	1.00	8.26	175.66	-62.82	89.07
Saccade R	1	6	28172926371	28172946248	19877	835.34	543.77	832.45	527.11	0.16	17.10	1.00	8.26	175.66	-62.82	89.07
Fixation L	1	7	28172946248	28173184862	238614	849.02	523.56	58	33	-1	15.55	15.55
Fixation R	1	7	28172946248	28173184862	238614	849.02	523.56	58	33	-1	16.01	16.01
