[BeGaze]
Converted from:	C:\Documents and Settings\iViewX\Desktop\EXPERIMENTATIONS\Experiments\results\finaleart\S11H21112-finaleart-1.idf
Date:	27.03.2019 15:38:36
Version:	BeGaze 2.5.77
Sample Rate:	50
Subject:	S11H21112
Description:	Clement legrand-Duchenne

Table Header for Fixations:
Event Type	Trial	Number	Start	End	Duration	Location X	Location Y	Dispersion X	Dispersion Y	Plane	Avg. Pupil Size X	Avg. Pupil Size Y

Table Header for Saccades:
Event Type	Trial	Number	Start	End	Duration	Start Loc.X	Start Loc.Y	End Loc.X	End Loc.Y	Amplitude	Peak Speed	Peak Speed At	Average Speed	Peak Accel.	Peak Decel.	Average Accel.

Table Header for Blinks:
Event Type	Trial	Number	Start	End	Duration

Table Header for User Events:
Event Type	Trial	Number	Start	Description

UserEvent	1	1	3962889214	# Message: turner-waves-breaking-against-the-wind-1830.jpg
Saccade L	1	1	3962900625	3962940376	39751	1434.34	347.72	1359.00	323.27	1.13	45.75	0.50	28.37	874.48	-510.15	427.47
Saccade R	1	1	3962900625	3962940376	39751	1434.34	347.72	1359.00	323.27	1.13	45.75	0.50	28.37	874.48	-510.15	427.47
Fixation L	1	1	3962940376	3963159235	218859	1345.12	305.84	32	61	-1	17.13	17.13
Fixation R	1	1	3962940376	3963159235	218859	1345.12	305.84	32	61	-1	18.53	18.53
Saccade L	1	2	3963159235	3963318353	159118	1357.03	278.32	903.73	490.56	8.44	297.13	0.88	53.02	7194.32	-7153.91	2034.53
Saccade R	1	2	3963159235	3963318353	159118	1357.03	278.32	903.73	490.56	8.44	297.13	0.88	53.02	7194.32	-7153.91	2034.53
Fixation L	1	2	3963318353	3963457605	139252	901.51	496.10	4	22	-1	17.52	17.52
Fixation R	1	2	3963318353	3963457605	139252	901.51	496.10	4	22	-1	19.75	19.75
Saccade L	1	3	3963457605	3963497338	39733	898.91	482.95	896.16	739.45	2.32	133.22	1.00	58.40	3055.67	-3225.54	3013.39
Saccade R	1	3	3963457605	3963497338	39733	898.91	482.95	896.16	739.45	2.32	133.22	1.00	58.40	3055.67	-3225.54	3013.39
Fixation L	1	3	3963497338	3964014444	517106	896.41	695.06	4	67	-1	16.23	16.23
Fixation R	1	3	3963497338	3964014444	517106	896.41	695.06	4	67	-1	18.23	18.23
Saccade L	1	4	3964014444	3964074192	59748	895.71	675.37	615.63	666.51	3.00	158.53	0.67	50.13	3854.34	-3711.72	2364.76
Saccade R	1	4	3964014444	3964074192	59748	895.71	675.37	615.63	666.51	3.00	158.53	0.67	50.13	3854.34	-3711.72	2364.76
Fixation L	1	4	3964074192	3964571421	497229	612.48	664.45	13	10	-1	15.03	15.03
Fixation R	1	4	3964074192	3964571421	497229	612.48	664.45	13	10	-1	16.95	16.95
Saccade L	1	5	3964571421	3964611169	39748	615.51	669.20	799.07	671.87	1.52	94.77	0.50	38.28	2306.71	-2336.22	2280.49
Saccade R	1	5	3964571421	3964611169	39748	615.51	669.20	799.07	671.87	1.52	94.77	0.50	38.28	2306.71	-2336.22	2280.49
Fixation L	1	5	3964611169	3964810036	198867	801.34	669.32	4	12	-1	15.04	15.04
Fixation R	1	5	3964611169	3964810036	198867	801.34	669.32	4	12	-1	17.22	17.22
Saccade L	1	6	3964810036	3964830061	20025	801.06	664.31	890.63	670.45	0.53	90.82	1.00	26.23	2170.01	-2196.84	1481.84
Saccade R	1	6	3964810036	3964830061	20025	801.06	664.31	890.63	670.45	0.53	90.82	1.00	26.23	2170.01	-2196.84	1481.84
Fixation L	1	6	3964830061	3965148275	318214	900.89	671.93	21	17	-1	15.52	15.52
Fixation R	1	6	3964830061	3965148275	318214	900.89	671.93	21	17	-1	17.35	17.35
Saccade L	1	7	3965148275	3965168136	19861	912.58	685.78	997.18	677.88	0.69	85.95	1.00	34.71	2080.82	-1693.87	1356.76
Saccade R	1	7	3965148275	3965168136	19861	912.58	685.78	997.18	677.88	0.69	85.95	1.00	34.71	2080.82	-1693.87	1356.76
Fixation L	1	7	3965168136	3965545998	377862	982.60	719.35	30	65	-1	15.70	15.70
Fixation R	1	7	3965168136	3965545998	377862	982.60	719.35	30	65	-1	17.84	17.84
Saccade L	1	8	3965545998	3965565879	19881	974.80	742.53	974.68	748.19	0.07	5.73	1.00	3.40	59.34	-64.32	46.01
Saccade R	1	8	3965545998	3965565879	19881	974.80	742.53	974.68	748.19	0.07	5.73	1.00	3.40	59.34	-64.32	46.01
Fixation L	1	8	3965565879	3965724996	159117	978.28	738.44	14	15	-1	15.68	15.68
Fixation R	1	8	3965565879	3965724996	159117	978.28	738.44	14	15	-1	17.71	17.71
Saccade L	1	9	3965724996	3965764864	39868	988.99	733.59	1322.00	716.96	2.87	178.52	0.50	71.89	4415.39	-4227.67	4035.61
Saccade R	1	9	3965724996	3965764864	39868	988.99	733.59	1322.00	716.96	2.87	178.52	0.50	71.89	4415.39	-4227.67	4035.61
Fixation L	1	9	3965764864	3966023351	258487	1321.42	692.19	13	41	-1	15.56	15.56
Fixation R	1	9	3965764864	3966023351	258487	1321.42	692.19	13	41	-1	17.43	17.43
Saccade L	1	10	3966023351	3966043235	19884	1329.95	688.25	1423.60	687.97	0.59	94.73	1.00	29.88	2330.23	-2239.06	1531.95
Saccade R	1	10	3966023351	3966043235	19884	1329.95	688.25	1423.60	687.97	0.59	94.73	1.00	29.88	2330.23	-2239.06	1531.95
Fixation L	1	10	3966043235	3966759327	716092	1456.57	711.60	58	41	-1	15.42	15.42
Fixation R	1	10	3966043235	3966759327	716092	1456.57	711.60	58	41	-1	16.75	16.75
Saccade L	1	11	3966759327	3966799075	39748	1468.55	729.01	1285.69	719.77	1.58	93.70	0.50	39.80	2273.71	-2159.61	2196.60
Saccade R	1	11	3966759327	3966799075	39748	1468.55	729.01	1285.69	719.77	1.58	93.70	0.50	39.80	2273.71	-2159.61	2196.60
Fixation L	1	11	3966799075	3966918443	119368	1283.58	700.65	5	38	-1	15.79	15.79
Fixation R	1	11	3966799075	3966918443	119368	1283.58	700.65	5	38	-1	17.06	17.06
