[BeGaze]
Converted from:	C:\Documents and Settings\iViewX\Desktop\EXPERIMENTATIONS\Experiments\results\finaleart\S14F27123-finaleart-1.idf
Date:	27.03.2019 15:44:18
Version:	BeGaze 2.5.77
Sample Rate:	50
Subject:	S14F27123
Description:	Anne-flore Perrin

Table Header for Fixations:
Event Type	Trial	Number	Start	End	Duration	Location X	Location Y	Dispersion X	Dispersion Y	Plane	Avg. Pupil Size X	Avg. Pupil Size Y

Table Header for Saccades:
Event Type	Trial	Number	Start	End	Duration	Start Loc.X	Start Loc.Y	End Loc.X	End Loc.Y	Amplitude	Peak Speed	Peak Speed At	Average Speed	Peak Accel.	Peak Decel.	Average Accel.

Table Header for Blinks:
Event Type	Trial	Number	Start	End	Duration

Table Header for User Events:
Event Type	Trial	Number	Start	Description

UserEvent	1	1	31851585550	# Message: millet-the-bather-1848.jpg
Saccade L	1	1	31851604094	31851624101	20007	853.07	451.84	853.63	455.78	6.49	969.57	1.00	324.54	47939.11	0.00	24059.49
Saccade R	1	1	31851604094	31851624101	20007	853.07	451.84	853.63	455.78	6.49	969.57	1.00	324.54	47939.11	0.00	24059.49
Blink L	1	1	31851624101	31851703598	79497
Blink R	1	1	31851624101	31851703598	79497
Blink L	1	2	31851723452	31851942318	218866
Blink R	1	2	31851723452	31851942318	218866
Fixation L	1	1	31851942318	31852041686	99368	626.42	433.20	5	15	-1	11.50	11.50
Fixation R	1	1	31851942318	31852041686	99368	626.42	433.20	5	15	-1	11.94	11.94
Saccade L	1	2	31852041686	31852081433	39747	629.85	427.65	920.50	496.98	3.17	259.27	0.50	79.70	6323.86	-5110.58	3406.54
Saccade R	1	2	31852041686	31852081433	39747	629.85	427.65	920.50	496.98	3.17	259.27	0.50	79.70	6323.86	-5110.58	3406.54
Fixation L	1	2	31852081433	31852379812	298379	925.95	472.12	35	54	-1	12.93	12.93
Fixation R	1	2	31852081433	31852379812	298379	925.95	472.12	35	54	-1	13.25	13.25
Saccade L	1	3	31852379812	31852399675	19863	897.99	459.77	884.52	459.02	0.32	30.46	1.00	16.34	199.31	-420.18	271.02
Saccade R	1	3	31852379812	31852399675	19863	897.99	459.77	884.52	459.02	0.32	30.46	1.00	16.34	199.31	-420.18	271.02
Fixation L	1	3	31852399675	31852598674	198999	874.43	451.48	18	51	-1	13.78	13.78
Fixation R	1	3	31852399675	31852598674	198999	874.43	451.48	18	51	-1	14.02	14.02
Saccade L	1	4	31852598674	31852618542	19868	866.04	494.77	870.36	775.59	1.76	283.89	1.00	88.83	7080.21	-6952.80	4967.21
Saccade R	1	4	31852598674	31852618542	19868	866.04	494.77	870.36	775.59	1.76	283.89	1.00	88.83	7080.21	-6952.80	4967.21
Fixation L	1	4	31852618542	31852916906	298364	850.29	790.68	48	32	-1	14.12	14.12
Fixation R	1	4	31852618542	31852916906	298364	850.29	790.68	48	32	-1	14.41	14.41
Saccade L	1	5	31852916906	31852936774	19868	821.83	807.86	749.71	879.18	0.76	102.60	1.00	38.46	2533.37	-2349.70	1630.01
Saccade R	1	5	31852916906	31852936774	19868	821.83	807.86	749.71	879.18	0.76	102.60	1.00	38.46	2533.37	-2349.70	1630.01
Fixation L	1	5	31852936774	31853076019	139245	726.20	883.93	34	33	-1	14.11	14.11
Fixation R	1	5	31852936774	31853076019	139245	726.20	883.93	34	33	-1	14.33	14.33
Saccade L	1	6	31853076019	31853135648	59629	732.51	902.61	1324.78	832.20	6.50	357.00	0.67	109.05	8756.89	-8182.48	4753.69
Saccade R	1	6	31853076019	31853135648	59629	732.51	902.61	1324.78	832.20	6.50	357.00	0.67	109.05	8756.89	-8182.48	4753.69
Fixation L	1	6	31853135648	31853374385	238737	1323.45	821.58	9	47	-1	14.88	14.88
Fixation R	1	6	31853135648	31853374385	238737	1323.45	821.58	9	47	-1	14.73	14.73
Saccade L	1	7	31853374385	31853394261	19876	1325.21	825.57	1381.84	827.79	0.41	57.33	1.00	20.43	1324.89	-1178.05	884.29
Saccade R	1	7	31853374385	31853394261	19876	1325.21	825.57	1381.84	827.79	0.41	57.33	1.00	20.43	1324.89	-1178.05	884.29
Fixation L	1	7	31853394261	31853811984	417723	1395.27	822.22	19	13	-1	15.09	15.09
Fixation R	1	7	31853394261	31853811984	417723	1395.27	822.22	19	13	-1	14.87	14.87
Saccade L	1	8	31853811984	31853831856	19872	1391.03	817.24	1396.75	704.48	0.60	114.20	1.00	30.13	2772.89	-2826.53	1867.94
Saccade R	1	8	31853811984	31853831856	19872	1391.03	817.24	1396.75	704.48	0.60	114.20	1.00	30.13	2772.89	-2826.53	1867.94
Fixation L	1	8	31853831856	31853971100	139244	1395.85	707.11	13	13	-1	15.12	15.12
Fixation R	1	8	31853831856	31853971100	139244	1395.85	707.11	13	13	-1	15.04	15.04
Saccade L	1	9	31853971100	31854010850	39750	1403.44	705.39	1407.83	345.96	3.11	264.34	0.50	78.20	6473.47	-6168.00	4357.18
Saccade R	1	9	31853971100	31854010850	39750	1403.44	705.39	1407.83	345.96	3.11	264.34	0.50	78.20	6473.47	-6168.00	4357.18
Fixation L	1	9	31854010850	31854229594	218744	1401.66	360.88	9	20	-1	14.88	14.88
Fixation R	1	9	31854010850	31854229594	218744	1401.66	360.88	9	20	-1	14.90	14.90
Saccade L	1	10	31854229594	31854269469	39875	1398.15	362.83	1242.35	189.52	1.98	147.56	1.00	49.69	3675.48	-3509.25	2860.70
Saccade R	1	10	31854229594	31854269469	39875	1398.15	362.83	1242.35	189.52	1.98	147.56	1.00	49.69	3675.48	-3509.25	2860.70
Fixation L	1	10	31854269469	31854488206	218737	1231.32	172.77	16	33	-1	13.92	13.92
Fixation R	1	10	31854269469	31854488206	218737	1231.32	172.77	16	33	-1	14.02	14.02
Saccade L	1	11	31854488206	31854527955	39749	1225.93	156.42	705.57	188.71	4.40	399.30	0.50	110.76	9860.26	-9622.74	6194.77
Saccade R	1	11	31854488206	31854527955	39749	1225.93	156.42	705.57	188.71	4.40	399.30	0.50	110.76	9860.26	-9622.74	6194.77
Fixation L	1	11	31854527955	31854866086	338131	709.95	224.58	22	58	-1	13.44	13.44
Fixation R	1	11	31854527955	31854866086	338131	709.95	224.58	22	58	-1	13.98	13.98
Saccade L	1	12	31854866086	31854925815	59729	712.39	233.54	531.77	695.21	6.14	387.73	0.67	102.81	9597.73	-8920.99	4986.51
Saccade R	1	12	31854866086	31854925815	59729	712.39	233.54	531.77	695.21	6.14	387.73	0.67	102.81	9597.73	-8920.99	4986.51
Fixation L	1	12	31854925815	31855323541	397726	515.93	699.40	30	69	-1	14.42	14.42
Fixation R	1	12	31854925815	31855323541	397726	515.93	699.40	30	69	-1	14.99	14.99
Saccade L	1	13	31855323541	31855343426	19885	527.47	732.97	607.76	904.66	1.19	191.67	1.00	60.01	4723.81	-4525.35	3133.48
Saccade R	1	13	31855323541	31855343426	19885	527.47	732.97	607.76	904.66	1.19	191.67	1.00	60.01	4723.81	-4525.35	3133.48
Fixation L	1	13	31855343426	31855582159	238733	601.11	893.14	13	20	-1	14.09	14.09
Fixation R	1	13	31855343426	31855582159	238733	601.11	893.14	13	20	-1	14.93	14.93
