[BeGaze]
Converted from:	C:\Documents and Settings\iViewX\Desktop\EXPERIMENTATIONS\Experiments\results\finaleart\S12H22222-finaleart-1.idf
Date:	27.03.2019 15:40:56
Version:	BeGaze 2.5.77
Sample Rate:	50
Subject:	S12H22222
Description:	aurele barriere

Table Header for Fixations:
Event Type	Trial	Number	Start	End	Duration	Location X	Location Y	Dispersion X	Dispersion Y	Plane	Avg. Pupil Size X	Avg. Pupil Size Y

Table Header for Saccades:
Event Type	Trial	Number	Start	End	Duration	Start Loc.X	Start Loc.Y	End Loc.X	End Loc.Y	Amplitude	Peak Speed	Peak Speed At	Average Speed	Peak Accel.	Peak Decel.	Average Accel.

Table Header for Blinks:
Event Type	Trial	Number	Start	End	Duration

Table Header for User Events:
Event Type	Trial	Number	Start	Description

UserEvent	1	1	23914243490	# Message: void.jpg
Fixation L	1	1	23914256016	23914534368	278352	1187.37	882.20	43	7	-1	13.56	13.56
Fixation R	1	1	23914256016	23914534368	278352	1187.37	882.20	43	7	-1	12.56	12.56
Saccade L	1	1	23914534368	23914554243	19875	1153.58	880.75	1133.27	812.32	0.59	72.21	1.00	29.66	1799.17	-1575.43	1359.70
Saccade R	1	1	23914534368	23914554243	19875	1153.58	880.75	1133.27	812.32	0.59	72.21	1.00	29.66	1799.17	-1575.43	1359.70
Fixation L	1	2	23914554243	23914713359	159116	1119.31	818.31	27	40	-1	13.36	13.36
Fixation R	1	2	23914554243	23914713359	159116	1119.31	818.31	27	40	-1	12.55	12.55
Saccade L	1	2	23914713359	23914812858	99499	1105.93	801.06	951.04	515.89	5.11	113.05	0.40	51.37	2249.08	-2211.83	1241.18
Saccade R	1	2	23914713359	23914812858	99499	1105.93	801.06	951.04	515.89	5.11	113.05	0.40	51.37	2249.08	-2211.83	1241.18
Fixation L	1	3	23914812858	23914912410	99552	957.15	462.93	19	72	-1	12.94	12.94
Fixation R	1	3	23914812858	23914912410	99552	957.15	462.93	19	72	-1	12.32	12.32
Saccade L	1	3	23914912410	23914932251	19841	970.31	443.07	961.16	433.16	0.20	13.65	1.00	9.95	147.75	-138.42	140.59
Saccade R	1	3	23914912410	23914932251	19841	970.31	443.07	961.16	433.16	0.20	13.65	1.00	9.95	147.75	-138.42	140.59
Fixation L	1	4	23914932251	23915290208	357957	982.12	421.22	37	32	-1	13.65	13.65
Fixation R	1	4	23914932251	23915290208	357957	982.12	421.22	37	32	-1	13.09	13.09
Saccade L	1	4	23915290208	23915310090	19882	983.16	420.60	990.57	323.24	0.62	98.77	1.00	31.27	2302.23	-2308.57	1552.40
Saccade R	1	4	23915290208	23915310090	19882	983.16	420.60	990.57	323.24	0.62	98.77	1.00	31.27	2302.23	-2308.57	1552.40
Fixation L	1	5	23915310090	23915648197	338107	984.37	340.24	12	79	-1	14.07	14.07
Fixation R	1	5	23915310090	23915648197	338107	984.37	340.24	12	79	-1	13.28	13.28
Saccade L	1	5	23915648197	23915668195	19998	978.01	389.02	972.49	405.36	0.21	17.45	1.00	10.36	263.70	-258.63	233.94
Saccade R	1	5	23915648197	23915668195	19998	978.01	389.02	972.49	405.36	0.21	17.45	1.00	10.36	263.70	-258.63	233.94
Fixation L	1	6	23915668195	23916244942	576747	965.47	415.29	16	24	-1	14.26	14.26
Fixation R	1	6	23915668195	23916244942	576747	965.47	415.29	16	24	-1	13.62	13.62
