[BeGaze]
Converted from:	C:\Documents and Settings\iViewX\Desktop\EXPERIMENTATIONS\Experiments\results\finaleart\S01A22542-finaleart-1.idf
Date:	27.03.2019 15:33:16
Version:	BeGaze 2.5.77
Sample Rate:	50
Subject:	S01A22542
Description:	Thibault Seve Minnaert

Table Header for Fixations:
Event Type	Trial	Number	Start	End	Duration	Location X	Location Y	Dispersion X	Dispersion Y	Plane	Avg. Pupil Size X	Avg. Pupil Size Y

Table Header for Saccades:
Event Type	Trial	Number	Start	End	Duration	Start Loc.X	Start Loc.Y	End Loc.X	End Loc.Y	Amplitude	Peak Speed	Peak Speed At	Average Speed	Peak Accel.	Peak Decel.	Average Accel.

Table Header for Blinks:
Event Type	Trial	Number	Start	End	Duration

Table Header for User Events:
Event Type	Trial	Number	Start	Description

UserEvent	1	1	8689782191	# Message: Poppy_Fields_near_Argenteuil_Monet_1875.jpg
Fixation L	1	1	8689799320	8690217444	418124	921.31	482.93	3	32	-1	14.79	14.79
Fixation R	1	1	8689799320	8690217444	418124	921.31	482.93	3	32	-1	15.13	15.13
Saccade L	1	1	8690217444	8690237315	19871	920.34	501.13	921.75	567.49	0.42	67.14	1.00	21.07	1569.67	-1420.96	1090.81
Saccade R	1	1	8690217444	8690237315	19871	920.34	501.13	921.75	567.49	0.42	67.14	1.00	21.07	1569.67	-1420.96	1090.81
Fixation L	1	2	8690237315	8690376678	139363	922.12	571.11	6	28	-1	14.35	14.35
Fixation R	1	2	8690237315	8690376678	139363	922.12	571.11	6	28	-1	14.74	14.74
Saccade L	1	2	8690376678	8690416546	39868	925.59	584.11	1265.94	746.62	3.20	199.56	1.00	80.17	4851.07	-4765.05	4590.12
Saccade R	1	2	8690376678	8690416546	39868	925.59	584.11	1265.94	746.62	3.20	199.56	1.00	80.17	4851.07	-4765.05	4590.12
Fixation L	1	3	8690416546	8691412116	995570	1278.58	726.81	21	35	-1	12.48	12.48
Fixation R	1	3	8690416546	8691412116	995570	1278.58	726.81	21	35	-1	12.74	12.74
Saccade L	1	3	8691412116	8691431984	19868	1272.76	717.11	1354.68	668.52	0.80	96.35	1.00	40.02	2389.54	-2375.75	2092.66
Saccade R	1	3	8691412116	8691431984	19868	1272.76	717.11	1354.68	668.52	0.80	96.35	1.00	40.02	2389.54	-2375.75	2092.66
Fixation L	1	4	8691431984	8691889831	457847	1390.91	624.59	47	48	-1	12.44	12.44
Fixation R	1	4	8691431984	8691889831	457847	1390.91	624.59	47	48	-1	12.19	12.19
Saccade L	1	4	8691889831	8692009345	119514	1379.84	619.53	986.80	623.51	5.69	215.43	1.00	47.63	5263.28	-5015.99	2412.71
Saccade R	1	4	8691889831	8692009345	119514	1379.84	619.53	986.80	623.51	5.69	215.43	1.00	47.63	5263.28	-5015.99	2412.71
Fixation L	1	5	8692009345	8692507050	497705	941.44	634.41	71	20	-1	12.27	12.27
Fixation R	1	5	8692009345	8692507050	497705	941.44	634.41	71	20	-1	12.35	12.35
Saccade L	1	5	8692507050	8692527070	20020	919.30	643.55	923.71	654.36	0.12	11.82	1.00	5.82	250.21	-239.09	221.26
Saccade R	1	5	8692507050	8692527070	20020	919.30	643.55	923.71	654.36	0.12	11.82	1.00	5.82	250.21	-239.09	221.26
Fixation L	1	6	8692527070	8692925160	398090	957.69	632.05	62	36	-1	12.40	12.40
Fixation R	1	6	8692527070	8692925160	398090	957.69	632.05	62	36	-1	12.55	12.55
Saccade L	1	6	8692925160	8692945167	20007	953.60	617.81	763.35	617.92	1.24	192.39	1.00	61.94	4797.94	-4489.97	3189.57
Saccade R	1	6	8692925160	8692945167	20007	953.60	617.81	763.35	617.92	1.24	192.39	1.00	61.94	4797.94	-4489.97	3189.57
Fixation L	1	7	8692945167	8693064655	119488	731.67	610.22	47	11	-1	12.03	12.03
Fixation R	1	7	8692945167	8693064655	119488	731.67	610.22	47	11	-1	12.58	12.58
Saccade L	1	7	8693064655	8693104407	39752	718.35	607.76	602.29	268.45	3.38	231.35	1.00	84.97	5707.16	-5360.87	4194.75
Saccade R	1	7	8693064655	8693104407	39752	718.35	607.76	602.29	268.45	3.38	231.35	1.00	84.97	5707.16	-5360.87	4194.75
Fixation L	1	8	8693104407	8693263641	159234	568.67	243.06	44	35	-1	11.61	11.61
Fixation R	1	8	8693104407	8693263641	159234	568.67	243.06	44	35	-1	12.33	12.33
Saccade L	1	8	8693263641	8693303525	39884	562.45	232.52	896.33	231.89	2.87	214.94	1.00	71.90	5258.39	-5026.48	4003.04
Saccade R	1	8	8693263641	8693303525	39884	562.45	232.52	896.33	231.89	2.87	214.94	1.00	71.90	5258.39	-5026.48	4003.04
Fixation L	1	9	8693303525	8693721624	418099	933.12	219.43	69	27	-1	11.90	11.90
Fixation R	1	9	8693303525	8693721624	418099	933.12	219.43	69	27	-1	12.59	12.59
Saccade L	1	9	8693721624	8693781367	59743	965.44	206.84	970.77	207.70	0.27	11.36	0.00	4.58	58.60	-235.20	84.56
Saccade R	1	9	8693721624	8693781367	59743	965.44	206.84	970.77	207.70	0.27	11.36	0.00	4.58	58.60	-235.20	84.56
