[BeGaze]
Converted from:	C:\Documents and Settings\iViewX\Desktop\EXPERIMENTATIONS\Experiments\results\finaleart\S02123220-finaleart-1.idf
Date:	27.03.2019 15:33:43
Version:	BeGaze 2.5.77
Sample Rate:	50
Subject:	S02123220
Description:	David Xu

Table Header for Fixations:
Event Type	Trial	Number	Start	End	Duration	Location X	Location Y	Dispersion X	Dispersion Y	Plane	Avg. Pupil Size X	Avg. Pupil Size Y

Table Header for Saccades:
Event Type	Trial	Number	Start	End	Duration	Start Loc.X	Start Loc.Y	End Loc.X	End Loc.Y	Amplitude	Peak Speed	Peak Speed At	Average Speed	Peak Accel.	Peak Decel.	Average Accel.

Table Header for Blinks:
Event Type	Trial	Number	Start	End	Duration

Table Header for User Events:
Event Type	Trial	Number	Start	Description

UserEvent	1	1	1805803290	# Message: void.jpg
Fixation L	1	1	1805821927	1805941298	119371	1055.14	474.49	7	17	-1	12.33	12.33
Fixation R	1	1	1805821927	1805941298	119371	1055.14	474.49	7	17	-1	10.83	10.83
Saccade L	1	1	1805941298	1805961403	20105	1055.06	477.95	1115.09	537.85	0.58	85.79	1.00	28.76	1984.66	-1627.76	1330.89
Saccade R	1	1	1805941298	1805961403	20105	1055.06	477.95	1115.09	537.85	0.58	85.79	1.00	28.76	1984.66	-1627.76	1330.89
Fixation L	1	2	1805961403	1806180026	218623	1124.73	534.69	15	19	-1	12.82	12.82
Fixation R	1	2	1805961403	1806180026	218623	1124.73	534.69	15	19	-1	11.06	11.06
Saccade L	1	2	1806180026	1806219776	39750	1130.21	536.83	1399.50	520.68	2.57	169.24	1.00	64.77	4199.29	-3681.26	2955.25
Saccade R	1	2	1806180026	1806219776	39750	1130.21	536.83	1399.50	520.68	2.57	169.24	1.00	64.77	4199.29	-3681.26	2955.25
Fixation L	1	3	1806219776	1806359012	139236	1463.64	516.67	83	15	-1	13.26	13.26
Fixation R	1	3	1806219776	1806359012	139236	1463.64	516.67	83	15	-1	10.87	10.87
Saccade L	1	3	1806359012	1806617507	258495	1483.02	507.44	1033.22	424.16	19.38	302.18	0.92	74.98	6106.12	-7274.01	2080.10
Saccade R	1	3	1806359012	1806617507	258495	1483.02	507.44	1033.22	424.16	19.38	302.18	0.92	74.98	6106.12	-7274.01	2080.10
Fixation L	1	4	1806617507	1807273959	656452	1006.34	434.41	39	46	-1	13.64	13.64
Fixation R	1	4	1806617507	1807273959	656452	1006.34	434.41	39	46	-1	12.20	12.20
Saccade L	1	4	1807273959	1807293831	19872	1002.15	461.77	1133.83	440.82	0.82	134.86	1.00	41.30	3343.58	-3288.35	2252.85
Saccade R	1	4	1807273959	1807293831	19872	1002.15	461.77	1133.83	440.82	0.82	134.86	1.00	41.30	3343.58	-3288.35	2252.85
Fixation L	1	5	1807293831	1807552313	258482	1133.52	478.48	15	56	-1	14.58	14.58
Fixation R	1	5	1807293831	1807552313	258482	1133.52	478.48	15	56	-1	13.10	13.10
Saccade L	1	5	1807552313	1807572191	19878	1135.01	493.15	1057.80	500.46	0.66	78.45	1.00	32.97	1890.12	-1570.15	1523.79
Saccade R	1	5	1807552313	1807572191	19878	1135.01	493.15	1057.80	500.46	0.66	78.45	1.00	32.97	1890.12	-1570.15	1523.79
Fixation L	1	6	1807572191	1807810937	238746	1004.08	502.26	65	13	-1	14.93	14.93
Fixation R	1	6	1807572191	1807810937	238746	1004.08	502.26	65	13	-1	13.24	13.24
