[BeGaze]
Converted from:	C:\Documents and Settings\iViewX\Desktop\EXPERIMENTATIONS\Experiments\results\finaleart\S6124332-finaleart-1.idf
Date:	27.03.2019 15:35:45
Version:	BeGaze 2.5.77
Sample Rate:	50
Subject:	S6124332
Description:	Romain Ferrand

Table Header for Fixations:
Event Type	Trial	Number	Start	End	Duration	Location X	Location Y	Dispersion X	Dispersion Y	Plane	Avg. Pupil Size X	Avg. Pupil Size Y

Table Header for Saccades:
Event Type	Trial	Number	Start	End	Duration	Start Loc.X	Start Loc.Y	End Loc.X	End Loc.Y	Amplitude	Peak Speed	Peak Speed At	Average Speed	Peak Accel.	Peak Decel.	Average Accel.

Table Header for Blinks:
Event Type	Trial	Number	Start	End	Duration

Table Header for User Events:
Event Type	Trial	Number	Start	Description

UserEvent	1	1	11574109550	# Message: still-life-with-bottle-of-wind_cross_1904.jpg
Fixation L	1	1	11574111638	11574409973	298335	679.39	993.03	93	4	-1	19.24	19.24
Fixation R	1	1	11574111638	11574409973	298335	679.39	993.03	93	4	-1	19.28	19.28
Saccade L	1	1	11574409973	11574429856	19883	765.12	991.92	748.42	987.98	0.59	90.16	0.00	29.73	386.00	-2017.00	863.53
Saccade R	1	1	11574409973	11574429856	19883	765.12	991.92	748.42	987.98	0.59	90.16	0.00	29.73	386.00	-2017.00	863.53
Fixation L	1	2	11574429856	11574588968	159112	767.53	978.94	57	19	-1	19.39	19.39
Fixation R	1	2	11574429856	11574588968	159112	767.53	978.94	57	19	-1	19.10	19.10
Saccade L	1	2	11574588968	11574648718	59750	805.61	968.46	1104.12	622.05	5.13	199.98	0.33	85.89	4946.46	-4100.63	3416.88
Saccade R	1	2	11574588968	11574648718	59750	805.61	968.46	1104.12	622.05	5.13	199.98	0.33	85.89	4946.46	-4100.63	3416.88
Fixation L	1	3	11574648718	11574986830	338112	1100.35	633.68	18	28	-1	17.92	17.92
Fixation R	1	3	11574648718	11574986830	338112	1100.35	633.68	18	28	-1	17.13	17.13
Saccade L	1	3	11574986830	11575006679	19849	1111.45	620.70	1139.53	552.79	0.60	74.34	1.00	30.27	1789.58	-947.12	1049.49
Saccade R	1	3	11574986830	11575006679	19849	1111.45	620.70	1139.53	552.79	0.60	74.34	1.00	30.27	1789.58	-947.12	1049.49
Fixation L	1	4	11575006679	11575185678	178999	1161.93	547.08	35	40	-1	16.42	16.42
Fixation R	1	4	11575006679	11575185678	178999	1161.93	547.08	35	40	-1	15.53	15.53
Saccade L	1	4	11575185678	11575225419	39741	1165.26	540.91	1173.22	291.71	2.15	150.37	0.50	54.16	3636.67	-3661.82	3011.92
Saccade R	1	4	11575185678	11575225419	39741	1165.26	540.91	1173.22	291.71	2.15	150.37	0.50	54.16	3636.67	-3661.82	3011.92
Fixation L	1	5	11575225419	11575364668	139249	1171.79	302.65	8	29	-1	15.81	15.81
Fixation R	1	5	11575225419	11575364668	139249	1171.79	302.65	8	29	-1	15.08	15.08
Saccade L	1	5	11575364668	11575384549	19881	1167.47	292.29	1168.67	227.80	0.52	65.25	1.00	26.08	1302.18	-1400.93	942.31
Saccade R	1	5	11575364668	11575384549	19881	1167.47	292.29	1168.67	227.80	0.52	65.25	1.00	26.08	1302.18	-1400.93	942.31
Fixation L	1	6	11575384549	11575742671	358122	1170.75	219.12	7	29	-1	15.42	15.42
Fixation R	1	6	11575384549	11575742671	358122	1170.75	219.12	7	29	-1	14.91	14.91
Saccade L	1	6	11575742671	11575782391	39720	1166.43	219.26	1410.60	533.88	3.77	206.27	1.00	95.03	4960.04	-4863.26	4524.81
Saccade R	1	6	11575742671	11575782391	39720	1166.43	219.26	1410.60	533.88	3.77	206.27	1.00	95.03	4960.04	-4863.26	4524.81
Fixation L	1	7	11575782391	11576120497	338106	1419.04	590.62	13	73	-1	15.70	15.70
Fixation R	1	7	11575782391	11576120497	338106	1419.04	590.62	13	73	-1	15.45	15.45
Saccade L	1	7	11576120497	11576160237	39740	1413.48	607.21	1332.86	940.65	2.93	206.67	0.50	73.69	5110.71	-4996.44	4259.79
Saccade R	1	7	11576120497	11576160237	39740	1413.48	607.21	1332.86	940.65	2.93	206.67	0.50	73.69	5110.71	-4996.44	4259.79
Fixation L	1	8	11576160237	11576379105	218868	1328.60	947.96	8	15	-1	16.51	16.51
Fixation R	1	8	11576160237	11576379105	218868	1328.60	947.96	8	15	-1	16.32	16.32
Saccade L	1	8	11576379105	11576458605	79500	1325.43	949.86	399.53	976.25	10.81	306.63	0.75	136.03	7507.68	-7472.83	4967.13
Saccade R	1	8	11576379105	11576458605	79500	1325.43	949.86	399.53	976.25	10.81	306.63	0.75	136.03	7507.68	-7472.83	4967.13
Fixation L	1	9	11576458605	11576717219	258614	374.97	984.29	37	12	-1	17.35	17.35
Fixation R	1	9	11576458605	11576717219	258614	374.97	984.29	37	12	-1	17.53	17.53
Saccade L	1	9	11576717219	11576756956	39737	363.33	988.56	446.47	786.81	1.97	131.06	0.50	49.57	3261.46	-2753.95	2666.19
Saccade R	1	9	11576717219	11576756956	39737	363.33	988.56	446.47	786.81	1.97	131.06	0.50	49.57	3261.46	-2753.95	2666.19
Fixation L	1	10	11576756956	11577015568	258612	466.99	780.18	25	13	-1	17.15	17.15
Fixation R	1	10	11576756956	11577015568	258612	466.99	780.18	25	13	-1	17.82	17.82
Saccade L	1	10	11577015568	11577055316	39748	468.16	773.27	687.27	761.02	1.86	121.15	0.50	46.71	2966.09	-2890.61	2664.62
Saccade R	1	10	11577015568	11577055316	39748	468.16	773.27	687.27	761.02	1.86	121.15	0.50	46.71	2966.09	-2890.61	2664.62
Fixation L	1	11	11577055316	11577234313	178997	687.49	737.73	15	44	-1	17.14	17.14
Fixation R	1	11	11577055316	11577234313	178997	687.49	737.73	15	44	-1	17.65	17.65
Saccade L	1	11	11577234313	11577254182	19869	698.61	716.23	758.63	682.42	0.66	69.69	1.00	32.99	1687.01	-1454.39	1273.93
Saccade R	1	11	11577234313	11577254182	19869	698.61	716.23	758.63	682.42	0.66	69.69	1.00	32.99	1687.01	-1454.39	1273.93
Fixation L	1	12	11577254182	11577512789	258607	802.61	686.93	54	37	-1	16.65	16.65
Fixation R	1	12	11577254182	11577512789	258607	802.61	686.93	54	37	-1	17.15	17.15
Saccade L	1	12	11577512789	11577532668	19879	774.95	667.61	761.01	657.04	0.33	29.53	0.00	16.78	53.47	-629.93	319.83
Saccade R	1	12	11577512789	11577532668	19879	774.95	667.61	761.01	657.04	0.33	29.53	0.00	16.78	53.47	-629.93	319.83
Fixation L	1	13	11577532668	11578129369	596701	740.44	637.72	31	30	-1	16.38	16.38
Fixation R	1	13	11577532668	11578129369	596701	740.44	637.72	31	30	-1	16.63	16.63
