[BeGaze]
Converted from:	C:\Documents and Settings\iViewX\Desktop\EXPERIMENTATIONS\Experiments\results\finaleart\S18F56223-finaleart-1.idf
Date:	27.03.2019 15:49:45
Version:	BeGaze 2.5.77
Sample Rate:	50
Subject:	S18F56223
Description:	Pascale Sebillot

Table Header for Fixations:
Event Type	Trial	Number	Start	End	Duration	Location X	Location Y	Dispersion X	Dispersion Y	Plane	Avg. Pupil Size X	Avg. Pupil Size Y

Table Header for Saccades:
Event Type	Trial	Number	Start	End	Duration	Start Loc.X	Start Loc.Y	End Loc.X	End Loc.Y	Amplitude	Peak Speed	Peak Speed At	Average Speed	Peak Accel.	Peak Decel.	Average Accel.

Table Header for Blinks:
Event Type	Trial	Number	Start	End	Duration

Table Header for User Events:
Event Type	Trial	Number	Start	Description

UserEvent	1	1	3149774467	# Message: basket-of-fruits-Manet-1864.jpg
Fixation L	1	1	3149775087	3150053559	278472	710.12	683.35	13	47	-1	15.11	15.11
Fixation R	1	1	3149775087	3150053559	278472	710.12	683.35	13	47	-1	14.02	14.02
Saccade L	1	1	3150053559	3150073436	19877	706.50	672.19	779.24	671.47	0.83	73.59	1.00	41.82	1238.40	-1563.30	1187.03
Saccade R	1	1	3150053559	3150073436	19877	706.50	672.19	779.24	671.47	0.83	73.59	1.00	41.82	1238.40	-1563.30	1187.03
Fixation L	1	2	3150073436	3150232559	159123	823.08	653.11	56	30	-1	15.23	15.23
Fixation R	1	2	3150073436	3150232559	159123	823.08	653.11	56	30	-1	14.21	14.21
Saccade L	1	2	3150232559	3150272434	39875	834.57	649.50	849.55	436.49	2.19	114.25	0.50	55.02	2280.40	-2317.25	2273.97
Saccade R	1	2	3150232559	3150272434	39875	834.57	649.50	849.55	436.49	2.19	114.25	0.50	55.02	2280.40	-2317.25	2273.97
Fixation L	1	3	3150272434	3150431559	159125	870.31	471.10	30	68	-1	14.63	14.63
Fixation R	1	3	3150272434	3150431559	159125	870.31	471.10	30	68	-1	13.59	13.59
Saccade L	1	3	3150431559	3150530913	99354	879.92	489.65	1054.89	977.32	7.58	410.23	1.00	76.28	10149.91	-10093.33	3628.52
Saccade R	1	3	3150431559	3150530913	99354	879.92	489.65	1054.89	977.32	7.58	410.23	1.00	76.28	10149.91	-10093.33	3628.52
Fixation L	1	4	3150530913	3150769643	238730	1071.02	1004.05	47	51	-1	14.38	14.38
Fixation R	1	4	3150530913	3150769643	238730	1071.02	1004.05	47	51	-1	13.48	13.48
Saccade L	1	4	3150769643	3150789515	19872	1102.65	1004.40	1110.30	995.61	0.42	36.17	0.00	21.10	91.01	-524.86	284.43
Saccade R	1	4	3150769643	3150789515	19872	1102.65	1004.40	1110.30	995.61	0.42	36.17	0.00	21.10	91.01	-524.86	284.43
Fixation L	1	5	3150789515	3151048137	258622	1119.53	1004.69	36	25	-1	14.55	14.55
Fixation R	1	5	3150789515	3151048137	258622	1119.53	1004.69	36	25	-1	13.68	13.68
Saccade L	1	5	3151048137	3151187265	139128	1130.04	1015.46	1319.13	720.78	8.25	234.87	1.00	59.30	5255.06	-5616.13	1943.14
Saccade R	1	5	3151048137	3151187265	139128	1130.04	1015.46	1319.13	720.78	8.25	234.87	1.00	59.30	5255.06	-5616.13	1943.14
Fixation L	1	6	3151187265	3151445874	258609	1330.36	711.67	21	14	-1	14.48	14.48
Fixation R	1	6	3151187265	3151445874	258609	1330.36	711.67	21	14	-1	13.92	13.92
Saccade L	1	6	3151445874	3151465743	19869	1327.46	706.76	1272.63	515.49	1.24	201.20	1.00	62.53	4953.69	-4239.16	3369.70
Saccade R	1	6	3151445874	3151465743	19869	1327.46	706.76	1272.63	515.49	1.24	201.20	1.00	62.53	4953.69	-4239.16	3369.70
Fixation L	1	7	3151465743	3151565240	99497	1274.96	515.09	48	33	-1	15.26	15.26
Fixation R	1	7	3151465743	3151565240	99497	1274.96	515.09	48	33	-1	13.84	13.84
Saccade L	1	7	3151565240	3151585110	19870	1257.82	517.72	1252.85	543.76	0.30	26.82	1.00	15.27	397.98	118.81	246.86
Saccade R	1	7	3151565240	3151585110	19870	1257.82	517.72	1252.85	543.76	0.30	26.82	1.00	15.27	397.98	118.81	246.86
Fixation L	1	8	3151585110	3151704483	119373	1274.32	541.66	44	23	-1	14.91	14.91
Fixation R	1	8	3151585110	3151704483	119373	1274.32	541.66	44	23	-1	13.26	13.26
Saccade L	1	8	3151704483	3151744234	39751	1273.91	548.18	980.00	509.66	2.71	204.00	0.50	68.26	4931.77	-4497.09	3531.97
Saccade R	1	8	3151704483	3151744234	39751	1273.91	548.18	980.00	509.66	2.71	204.00	0.50	68.26	4931.77	-4497.09	3531.97
Fixation L	1	9	3151744234	3151962973	218739	971.02	471.59	13	66	-1	14.51	14.51
Fixation R	1	9	3151744234	3151962973	218739	971.02	471.59	13	66	-1	13.19	13.19
Saccade L	1	9	3151962973	3151982968	19995	972.79	467.75	1294.07	608.98	2.00	354.57	1.00	100.05	8617.41	-7666.30	5555.90
Saccade R	1	9	3151962973	3151982968	19995	972.79	467.75	1294.07	608.98	2.00	354.57	1.00	100.05	8617.41	-7666.30	5555.90
Fixation L	1	10	3151982968	3152122093	139125	1315.31	592.08	44	45	-1	13.97	13.97
Fixation R	1	10	3151982968	3152122093	139125	1315.31	592.08	44	45	-1	12.82	12.82
Saccade L	1	10	3152122093	3152261335	139242	1335.94	586.96	866.73	498.69	8.76	286.55	0.86	62.91	7028.88	-6058.69	2455.53
Saccade R	1	10	3152122093	3152261335	139242	1335.94	586.96	866.73	498.69	8.76	286.55	0.86	62.91	7028.88	-6058.69	2455.53
Fixation L	1	11	3152261335	3152599574	338239	870.91	479.79	23	60	-1	14.53	14.53
Fixation R	1	11	3152261335	3152599574	338239	870.91	479.79	23	60	-1	13.36	13.36
Saccade L	1	11	3152599574	3152619444	19870	867.46	501.50	854.32	345.19	0.86	158.65	1.00	43.39	3908.88	-3935.02	2615.15
Saccade R	1	11	3152599574	3152619444	19870	867.46	501.50	854.32	345.19	0.86	158.65	1.00	43.39	3908.88	-3935.02	2615.15
Fixation L	1	12	3152619444	3152957549	338105	838.85	342.88	26	18	-1	14.09	14.09
Fixation R	1	12	3152619444	3152957549	338105	838.85	342.88	26	18	-1	13.22	13.22
Saccade L	1	12	3152957549	3152977429	19880	837.17	350.10	1061.77	480.60	1.36	262.60	1.00	68.16	6543.02	-6400.50	4365.05
Saccade R	1	12	3152957549	3152977429	19880	837.17	350.10	1061.77	480.60	1.36	262.60	1.00	68.16	6543.02	-6400.50	4365.05
Fixation L	1	13	3152977429	3153236038	258609	1071.84	477.02	16	35	-1	13.73	13.73
Fixation R	1	13	3152977429	3153236038	258609	1071.84	477.02	16	35	-1	12.46	12.46
Saccade L	1	13	3153236038	3153255916	19878	1068.76	450.20	970.36	342.74	1.04	147.37	1.00	52.14	3082.52	-3629.20	2382.66
Saccade R	1	13	3153236038	3153255916	19878	1068.76	450.20	970.36	342.74	1.04	147.37	1.00	52.14	3082.52	-3629.20	2382.66
Fixation L	1	14	3153255916	3153613897	357981	938.52	317.89	46	37	-1	13.50	13.50
Fixation R	1	14	3153255916	3153613897	357981	938.52	317.89	46	37	-1	12.38	12.38
Saccade L	1	14	3153613897	3153633785	19888	926.01	309.92	655.99	308.04	1.40	272.96	1.00	70.55	6787.92	-6218.37	4354.45
Saccade R	1	14	3153613897	3153633785	19888	926.01	309.92	655.99	308.04	1.40	272.96	1.00	70.55	6787.92	-6218.37	4354.45
Fixation L	1	15	3153633785	3153773023	139238	642.38	285.78	31	46	-1	13.20	13.20
Fixation R	1	15	3153633785	3153773023	139238	642.38	285.78	31	46	-1	12.34	12.34
