[BeGaze]
Converted from:	C:\Documents and Settings\iViewX\Desktop\EXPERIMENTATIONS\Experiments\results\finaleart\S21F22332-finaleart-1.idf
Date:	27.03.2019 15:55:10
Version:	BeGaze 2.5.77
Sample Rate:	50
Subject:	S21F22332
Description:	Cyrielle Mailart

Table Header for Fixations:
Event Type	Trial	Number	Start	End	Duration	Location X	Location Y	Dispersion X	Dispersion Y	Plane	Avg. Pupil Size X	Avg. Pupil Size Y

Table Header for Saccades:
Event Type	Trial	Number	Start	End	Duration	Start Loc.X	Start Loc.Y	End Loc.X	End Loc.Y	Amplitude	Peak Speed	Peak Speed At	Average Speed	Peak Accel.	Peak Decel.	Average Accel.

Table Header for Blinks:
Event Type	Trial	Number	Start	End	Duration

Table Header for User Events:
Event Type	Trial	Number	Start	Description

UserEvent	1	1	2488279793	# Message: goya-Bodegón-con-salmón-1812.jpg
Fixation L	1	1	2488285981	2488703699	417718	927.78	441.04	9	9	-1	14.85	14.85
Fixation R	1	1	2488285981	2488703699	417718	927.78	441.04	9	9	-1	13.61	13.61
Saccade L	1	1	2488703699	2488723573	19874	922.89	441.18	812.64	620.87	1.36	213.17	1.00	68.34	5264.05	-5120.98	3918.07
Saccade R	1	1	2488703699	2488723573	19874	922.89	441.18	812.64	620.87	1.36	213.17	1.00	68.34	5264.05	-5120.98	3918.07
Fixation L	1	2	2488723573	2489021939	298366	808.63	685.79	7	79	-1	14.93	14.93
Fixation R	1	2	2488723573	2489021939	298366	808.63	685.79	7	79	-1	13.63	13.63
Saccade L	1	2	2489021939	2489061687	39748	805.12	699.92	1084.27	717.58	2.40	150.36	1.00	60.36	3543.95	-3694.53	3403.88
Saccade R	1	2	2489021939	2489061687	39748	805.12	699.92	1084.27	717.58	2.40	150.36	1.00	60.36	3543.95	-3694.53	3403.88
Fixation L	1	3	2489061687	2489240672	178985	1075.43	725.94	12	18	-1	15.14	15.14
Fixation R	1	3	2489061687	2489240672	178985	1075.43	725.94	12	18	-1	14.38	14.38
Saccade L	1	3	2489240672	2489260548	19876	1080.55	735.34	1267.20	734.37	1.12	188.75	1.00	56.18	4640.16	-4454.14	3185.82
Saccade R	1	3	2489240672	2489260548	19876	1080.55	735.34	1267.20	734.37	1.12	188.75	1.00	56.18	4640.16	-4454.14	3185.82
Fixation L	1	4	2489260548	2489578783	318235	1261.03	722.94	53	45	-1	15.47	15.47
Fixation R	1	4	2489260548	2489578783	318235	1261.03	722.94	53	45	-1	14.24	14.24
Saccade L	1	4	2489578783	2489598658	19875	1294.95	688.41	1299.15	689.28	0.18	16.70	0.00	9.07	98.72	-307.30	189.44
Saccade R	1	4	2489578783	2489598658	19875	1294.95	688.41	1299.15	689.28	0.18	16.70	0.00	9.07	98.72	-307.30	189.44
Fixation L	1	5	2489598658	2489777768	179110	1301.75	689.78	9	5	-1	15.41	15.41
Fixation R	1	5	2489598658	2489777768	179110	1301.75	689.78	9	5	-1	14.16	14.16
Saccade L	1	5	2489777768	2489817516	39748	1304.80	691.41	1515.33	712.56	2.06	163.42	0.50	51.72	4062.83	-3114.86	2328.10
Saccade R	1	5	2489777768	2489817516	39748	1304.80	691.41	1515.33	712.56	2.06	163.42	0.50	51.72	4062.83	-3114.86	2328.10
Fixation L	1	6	2489817516	2490294870	477354	1542.41	743.70	43	53	-1	15.40	15.40
Fixation R	1	6	2489817516	2490294870	477354	1542.41	743.70	43	53	-1	13.73	13.73
Saccade L	1	6	2490294870	2490314738	19868	1558.79	758.54	1530.67	858.60	0.60	105.13	1.00	30.41	2600.68	-1996.85	1624.17
Saccade R	1	6	2490294870	2490314738	19868	1558.79	758.54	1530.67	858.60	0.60	105.13	1.00	30.41	2600.68	-1996.85	1624.17
Fixation L	1	7	2490314738	2490513605	198867	1508.15	885.99	44	38	-1	16.19	16.19
Fixation R	1	7	2490314738	2490513605	198867	1508.15	885.99	44	38	-1	14.36	14.36
Saccade L	1	7	2490513605	2490573361	59756	1490.91	897.32	941.16	784.65	5.88	276.98	0.67	98.42	6821.04	-6676.96	4718.02
Saccade R	1	7	2490513605	2490573361	59756	1490.91	897.32	941.16	784.65	5.88	276.98	0.67	98.42	6821.04	-6676.96	4718.02
Fixation L	1	8	2490573361	2490752344	178983	923.26	766.14	34	25	-1	16.78	16.78
Fixation R	1	8	2490573361	2490752344	178983	923.26	766.14	34	25	-1	14.82	14.82
Saccade L	1	8	2490752344	2490772227	19883	911.19	762.18	731.77	768.44	1.05	181.55	1.00	52.82	4383.50	-4510.99	3109.91
Saccade R	1	8	2490752344	2490772227	19883	911.19	762.18	731.77	768.44	1.05	181.55	1.00	52.82	4383.50	-4510.99	3109.91
Fixation L	1	9	2490772227	2490931335	159108	750.74	767.78	24	6	-1	15.93	15.93
Fixation R	1	9	2490772227	2490931335	159108	750.74	767.78	24	6	-1	14.69	14.69
Saccade L	1	9	2490931335	2490990964	59629	753.70	770.47	471.63	230.07	6.35	294.80	0.67	106.51	7324.68	-6902.98	5435.79
Saccade R	1	9	2490931335	2490990964	59629	753.70	770.47	471.63	230.07	6.35	294.80	0.67	106.51	7324.68	-6902.98	5435.79
Fixation L	1	10	2490990964	2491130192	139228	466.39	205.15	12	34	-1	14.75	14.75
Fixation R	1	10	2490990964	2491130192	139228	466.39	205.15	12	34	-1	14.06	14.06
Saccade L	1	10	2491130192	2491209812	79620	464.85	211.76	0.00	-3.88	9.73	303.74	0.25	122.24	7513.57	-7298.49	4892.55
Saccade R	1	10	2491130192	2491209812	79620	464.85	211.76	0.00	-3.88	9.73	303.74	0.25	122.24	7513.57	-7298.49	4892.55
Fixation L	1	11	2491209812	2491388810	178998	0.00	-1.27	0	5	-1	14.92	14.92
Fixation R	1	11	2491209812	2491388810	178998	0.00	-1.27	0	5	-1	14.13	14.13
Saccade L	1	11	2491388810	2491468311	79501	0.00	1.44	1305.33	192.19	15.50	506.96	0.50	194.94	12639.86	-8322.39	7143.16
Saccade R	1	11	2491388810	2491468311	79501	0.00	1.44	1305.33	192.19	15.50	506.96	0.50	194.94	12639.86	-8322.39	7143.16
Fixation L	1	12	2491468311	2491587675	119364	1314.08	169.13	19	34	-1	15.40	15.40
Fixation R	1	12	2491468311	2491587675	119364	1314.08	169.13	19	34	-1	14.37	14.37
Saccade L	1	12	2491587675	2491667297	79622	1324.82	176.94	1615.10	171.86	6.12	276.95	0.50	76.87	6463.61	-6309.98	3044.31
Saccade R	1	12	2491587675	2491667297	79622	1324.82	176.94	1615.10	171.86	6.12	276.95	0.50	76.87	6463.61	-6309.98	3044.31
Fixation L	1	13	2491667297	2491806540	139243	1596.63	203.41	32	62	-1	15.35	15.35
Fixation R	1	13	2491667297	2491806540	139243	1596.63	203.41	32	62	-1	14.71	14.71
Saccade L	1	13	2491806540	2491886034	79494	1582.62	234.12	1472.77	208.90	2.52	89.06	0.75	31.65	2055.10	-1316.36	990.60
Saccade R	1	13	2491806540	2491886034	79494	1582.62	234.12	1472.77	208.90	2.52	89.06	0.75	31.65	2055.10	-1316.36	990.60
Fixation L	1	14	2491886034	2492084901	198867	1472.87	177.40	15	63	-1	15.76	15.76
Fixation R	1	14	2491886034	2492084901	198867	1472.87	177.40	15	63	-1	14.53	14.53
Saccade L	1	14	2492084901	2492144643	59742	1469.12	179.19	890.83	602.98	7.57	353.22	0.67	126.65	8657.64	-8272.70	5248.66
Saccade R	1	14	2492084901	2492144643	59742	1469.12	179.19	890.83	602.98	7.57	353.22	0.67	126.65	8657.64	-8272.70	5248.66
Fixation L	1	15	2492144643	2492283886	139243	898.88	579.98	13	39	-1	16.71	16.71
Fixation R	1	15	2492144643	2492283886	139243	898.88	579.98	13	39	-1	15.19	15.19
