[BeGaze]
Converted from:	C:\Documents and Settings\iViewX\Desktop\EXPERIMENTATIONS\Experiments\results\finaleart\S20H24222-finaleart-1.idf
Date:	27.03.2019 15:53:38
Version:	BeGaze 2.5.77
Sample Rate:	50
Subject:	S20H24222
Description:	Hugo Brument

Table Header for Fixations:
Event Type	Trial	Number	Start	End	Duration	Location X	Location Y	Dispersion X	Dispersion Y	Plane	Avg. Pupil Size X	Avg. Pupil Size Y

Table Header for Saccades:
Event Type	Trial	Number	Start	End	Duration	Start Loc.X	Start Loc.Y	End Loc.X	End Loc.Y	Amplitude	Peak Speed	Peak Speed At	Average Speed	Peak Accel.	Peak Decel.	Average Accel.

Table Header for Blinks:
Event Type	Trial	Number	Start	End	Duration

Table Header for User Events:
Event Type	Trial	Number	Start	Description

UserEvent	1	1	12108401281	# Message: metzinger-nature-morte-1905.jpg
Fixation L	1	1	12108416505	12109331436	914931	901.84	544.46	62	18	-1	12.93	12.93
Fixation R	1	1	12108416505	12109331436	914931	901.84	544.46	62	18	-1	12.04	12.04
Saccade L	1	1	12109331436	12109430941	99505	862.36	547.05	702.28	950.39	5.88	183.92	0.20	59.09	4566.89	-4484.51	2710.10
Saccade R	1	1	12109331436	12109430941	99505	862.36	547.05	702.28	950.39	5.88	183.92	0.20	59.09	4566.89	-4484.51	2710.10
Fixation L	1	2	12109430941	12109729168	298227	702.51	963.03	23	24	-1	11.40	11.40
Fixation R	1	2	12109430941	12109729168	298227	702.51	963.03	23	24	-1	10.33	10.33
Saccade L	1	2	12109729168	12109749186	20018	720.10	974.66	1005.27	981.93	1.87	288.34	1.00	93.17	7058.94	-7071.33	5138.12
Saccade R	1	2	12109729168	12109749186	20018	720.10	974.66	1005.27	981.93	1.87	288.34	1.00	93.17	7058.94	-7071.33	5138.12
Fixation L	1	3	12109749186	12110047534	298348	1064.98	995.48	76	23	-1	11.91	11.91
Fixation R	1	3	12109749186	12110047534	298348	1064.98	995.48	76	23	-1	10.83	10.83
Saccade L	1	3	12110047534	12110067401	19867	1081.60	994.55	1120.30	900.48	0.69	102.89	1.00	34.91	2443.46	-2275.12	1607.41
Saccade R	1	3	12110047534	12110067401	19867	1081.60	994.55	1120.30	900.48	0.69	102.89	1.00	34.91	2443.46	-2275.12	1607.41
Fixation L	1	4	12110067401	12110306021	238620	1123.11	884.30	23	22	-1	12.11	12.11
Fixation R	1	4	12110067401	12110306021	238620	1123.11	884.30	23	22	-1	10.91	10.91
Saccade L	1	4	12110306021	12110345760	39739	1128.02	885.76	1376.08	1014.47	2.49	167.49	1.00	62.73	4003.11	-4060.30	3654.24
Saccade R	1	4	12110306021	12110345760	39739	1128.02	885.76	1376.08	1014.47	2.49	167.49	1.00	62.73	4003.11	-4060.30	3654.24
Fixation L	1	5	12110345760	12110584507	238747	1373.07	1011.73	13	4	-1	12.19	12.19
Fixation R	1	5	12110345760	12110584507	238747	1373.07	1011.73	13	4	-1	10.90	10.90
Saccade L	1	5	12110584507	12110644132	59625	1365.87	1012.15	1304.00	438.55	5.97	248.36	0.67	100.10	6141.73	-5885.40	4137.40
Saccade R	1	5	12110584507	12110644132	59625	1365.87	1012.15	1304.00	438.55	5.97	248.36	0.67	100.10	6141.73	-5885.40	4137.40
Fixation L	1	6	12110644132	12110823242	179110	1287.71	443.01	23	7	-1	12.38	12.38
Fixation R	1	6	12110644132	12110823242	179110	1287.71	443.01	23	7	-1	10.94	10.94
Saccade L	1	6	12110823242	12110862991	39749	1280.54	439.42	1149.60	162.17	2.80	187.08	0.50	70.40	4624.74	-4002.53	3683.42
Saccade R	1	6	12110823242	12110862991	39749	1280.54	439.42	1149.60	162.17	2.80	187.08	0.50	70.40	4624.74	-4002.53	3683.42
Fixation L	1	7	12110862991	12111022119	159128	1153.51	187.52	12	34	-1	11.73	11.73
Fixation R	1	7	12110862991	12111022119	159128	1153.51	187.52	12	34	-1	10.57	10.57
Saccade L	1	7	12111022119	12111061865	39746	1147.07	188.53	756.60	187.08	3.29	285.47	0.50	82.89	7047.31	-6960.07	4800.28
Saccade R	1	7	12111022119	12111061865	39746	1147.07	188.53	756.60	187.08	3.29	285.47	0.50	82.89	7047.31	-6960.07	4800.28
Fixation L	1	8	12111061865	12111320495	258630	763.02	196.09	10	16	-1	11.36	11.36
Fixation R	1	8	12111061865	12111320495	258630	763.02	196.09	10	16	-1	10.77	10.77
Saccade L	1	8	12111320495	12111360218	39723	764.16	196.72	553.29	290.07	2.22	181.55	0.50	55.78	4439.78	-3851.60	2842.82
Saccade R	1	8	12111320495	12111360218	39723	764.16	196.72	553.29	290.07	2.22	181.55	0.50	55.78	4439.78	-3851.60	2842.82
Fixation L	1	9	12111360218	12111777956	417738	539.69	316.42	19	31	-1	11.83	11.83
Fixation R	1	9	12111360218	12111777956	417738	539.69	316.42	19	31	-1	11.53	11.53
Saccade L	1	9	12111777956	12111817708	39752	542.12	320.03	779.96	305.06	1.97	165.95	0.50	49.60	4117.72	-4086.19	2960.05
Saccade R	1	9	12111777956	12111817708	39752	542.12	320.03	779.96	305.06	1.97	165.95	0.50	49.60	4117.72	-4086.19	2960.05
Fixation L	1	10	12111817708	12111996693	178985	780.33	291.10	2	24	-1	12.18	12.18
Fixation R	1	10	12111817708	12111996693	178985	780.33	291.10	2	24	-1	11.61	11.61
Saccade L	1	10	12111996693	12112036448	39755	780.04	280.34	1062.60	287.81	2.38	198.85	1.00	59.93	4935.79	-4680.50	3414.40
Saccade R	1	10	12111996693	12112036448	39755	780.04	280.34	1062.60	287.81	2.38	198.85	1.00	59.93	4935.79	-4680.50	3414.40
Fixation L	1	11	12112036448	12112394553	358105	1059.60	319.48	10	41	-1	12.25	12.25
Fixation R	1	11	12112036448	12112394553	358105	1059.60	319.48	10	41	-1	11.55	11.55
