[BeGaze]
Converted from:	C:\Documents and Settings\iViewX\Desktop\EXPERIMENTATIONS\Experiments\results\finaleart\S02123220-finaleart-1.idf
Date:	27.03.2019 15:33:41
Version:	BeGaze 2.5.77
Sample Rate:	50
Subject:	S02123220
Description:	David Xu

Table Header for Fixations:
Event Type	Trial	Number	Start	End	Duration	Location X	Location Y	Dispersion X	Dispersion Y	Plane	Avg. Pupil Size X	Avg. Pupil Size Y

Table Header for Saccades:
Event Type	Trial	Number	Start	End	Duration	Start Loc.X	Start Loc.Y	End Loc.X	End Loc.Y	Amplitude	Peak Speed	Peak Speed At	Average Speed	Peak Accel.	Peak Decel.	Average Accel.

Table Header for Blinks:
Event Type	Trial	Number	Start	End	Duration

Table Header for User Events:
Event Type	Trial	Number	Start	Description

UserEvent	1	1	1720224098	# Message: void.jpg
Saccade L	1	1	1720236242	1720335725	99483	1073.11	587.03	1191.08	513.26	2.70	104.58	1.00	27.14	2431.49	-2335.24	955.56
Saccade R	1	1	1720236242	1720335725	99483	1073.11	587.03	1191.08	513.26	2.70	104.58	1.00	27.14	2431.49	-2335.24	955.56
Fixation L	1	1	1720335725	1720534592	198867	1198.78	492.66	16	32	-1	14.57	14.57
Fixation R	1	1	1720335725	1720534592	198867	1198.78	492.66	16	32	-1	12.88	12.88
Saccade L	1	2	1720534592	1720554476	19884	1189.08	511.81	1063.65	555.07	0.99	134.20	1.00	49.94	3177.09	-3092.79	2150.10
Saccade R	1	2	1720534592	1720554476	19884	1189.08	511.81	1063.65	555.07	0.99	134.20	1.00	49.94	3177.09	-3092.79	2150.10
Fixation L	1	2	1720554476	1720773325	218849	1085.51	558.51	50	27	-1	13.91	13.91
Fixation R	1	2	1720554476	1720773325	218849	1085.51	558.51	50	27	-1	12.50	12.50
Saccade L	1	3	1720773325	1720932441	159116	1114.53	544.29	828.80	475.16	7.47	147.20	0.87	46.92	3494.35	-2845.05	1361.59
Saccade R	1	3	1720773325	1720932441	159116	1114.53	544.29	828.80	475.16	7.47	147.20	0.87	46.92	3494.35	-2845.05	1361.59
Fixation L	1	3	1720932441	1721867255	934814	831.94	458.27	38	46	-1	13.28	13.28
Fixation R	1	3	1720932441	1721867255	934814	831.94	458.27	38	46	-1	13.19	13.19
Saccade L	1	4	1721867255	1721887137	19882	833.33	479.13	913.80	470.06	0.99	96.38	1.00	49.88	2203.80	-1594.08	1840.14
Saccade R	1	4	1721867255	1721887137	19882	833.33	479.13	913.80	470.06	0.99	96.38	1.00	49.88	2203.80	-1594.08	1840.14
Fixation L	1	4	1721887137	1721986505	99368	987.91	470.01	95	3	-1	14.16	14.16
Fixation R	1	4	1721887137	1721986505	99368	987.91	470.01	95	3	-1	13.53	13.53
Saccade L	1	5	1721986505	1722006372	19867	1007.47	471.52	1012.51	472.61	0.10	6.81	0.00	5.13	25.84	-62.15	38.59
Saccade R	1	5	1721986505	1722006372	19867	1007.47	471.52	1012.51	472.61	0.10	6.81	0.00	5.13	25.84	-62.15	38.59
Fixation L	1	5	1722006372	1722225230	218858	1010.33	462.89	12	19	-1	14.16	14.16
Fixation R	1	5	1722006372	1722225230	218858	1010.33	462.89	12	19	-1	13.62	13.62
