[BeGaze]
Converted from:	C:\Documents and Settings\iViewX\Desktop\EXPERIMENTATIONS\Experiments\results\finaleart\S19F21442-finaleart-1.idf
Date:	27.03.2019 15:51:02
Version:	BeGaze 2.5.77
Sample Rate:	50
Subject:	S19F21442
Description:	Juliette Veuillez

Table Header for Fixations:
Event Type	Trial	Number	Start	End	Duration	Location X	Location Y	Dispersion X	Dispersion Y	Plane	Avg. Pupil Size X	Avg. Pupil Size Y

Table Header for Saccades:
Event Type	Trial	Number	Start	End	Duration	Start Loc.X	Start Loc.Y	End Loc.X	End Loc.Y	Amplitude	Peak Speed	Peak Speed At	Average Speed	Peak Accel.	Peak Decel.	Average Accel.

Table Header for Blinks:
Event Type	Trial	Number	Start	End	Duration

Table Header for User Events:
Event Type	Trial	Number	Start	Description

UserEvent	1	1	7093859569	# Message: REJECTED_rose_in_a_bowl_fantin_latour_1883.jpg
Fixation L	1	1	7093874674	7094272534	397860	861.78	582.69	19	53	-1	11.55	11.55
Fixation R	1	1	7093874674	7094272534	397860	861.78	582.69	19	53	-1	14.26	14.26
Saccade L	1	1	7094272534	7094292408	19874	873.66	615.14	770.99	625.78	0.88	104.41	1.00	44.43	2525.84	-2441.88	2179.77
Saccade R	1	1	7094272534	7094292408	19874	873.66	615.14	770.99	625.78	0.88	104.41	1.00	44.43	2525.84	-2441.88	2179.77
Fixation L	1	2	7094292408	7094431642	139234	717.37	648.30	64	35	-1	11.25	11.25
Fixation R	1	2	7094292408	7094431642	139234	717.37	648.30	64	35	-1	14.28	14.28
Saccade L	1	2	7094431642	7094451516	19874	712.27	656.82	713.04	662.57	0.09	5.87	1.00	4.58	46.88	-118.39	59.32
Saccade R	1	2	7094431642	7094451516	19874	712.27	656.82	713.04	662.57	0.09	5.87	1.00	4.58	46.88	-118.39	59.32
Fixation L	1	3	7094451516	7094570890	119374	724.85	667.71	87	7	-1	11.16	11.16
Fixation R	1	3	7094451516	7094570890	119374	724.85	667.71	87	7	-1	14.24	14.24
Saccade L	1	3	7094570890	7094590759	19869	798.81	669.07	883.05	634.86	0.97	91.96	1.00	48.83	2258.61	-1710.27	1672.86
Saccade R	1	3	7094570890	7094590759	19869	798.81	669.07	883.05	634.86	0.97	91.96	1.00	48.83	2258.61	-1710.27	1672.86
Fixation L	1	4	7094590759	7094789623	198864	875.76	606.23	15	63	-1	11.10	11.10
Fixation R	1	4	7094590759	7094789623	198864	875.76	606.23	15	63	-1	13.80	13.80
Saccade L	1	4	7094789623	7094829372	39749	870.58	588.19	1336.76	619.26	4.10	249.75	1.00	103.10	6238.19	-6014.57	5579.71
Saccade R	1	4	7094789623	7094829372	39749	870.58	588.19	1336.76	619.26	4.10	249.75	1.00	103.10	6238.19	-6014.57	5579.71
Fixation L	1	5	7094829372	7095167605	338233	1372.57	644.95	47	40	-1	11.20	11.20
Fixation R	1	5	7094829372	7095167605	338233	1372.57	644.95	47	40	-1	13.61	13.61
Saccade L	1	5	7095167605	7095207354	39749	1367.47	656.72	1286.19	622.57	1.21	71.40	1.00	30.51	1695.75	-1297.13	1421.86
Saccade R	1	5	7095167605	7095207354	39749	1367.47	656.72	1286.19	622.57	1.21	71.40	1.00	30.51	1695.75	-1297.13	1421.86
Fixation L	1	6	7095207354	7096261570	1054216	1275.59	585.38	17	54	-1	11.80	11.80
Fixation R	1	6	7095207354	7096261570	1054216	1275.59	585.38	17	54	-1	13.92	13.92
Saccade L	1	6	7096261570	7096281438	19868	1277.75	599.36	1314.88	587.34	0.52	39.48	1.00	26.01	410.79	-481.77	394.44
Saccade R	1	6	7096261570	7096281438	19868	1277.75	599.36	1314.88	587.34	0.52	39.48	1.00	26.01	410.79	-481.77	394.44
Fixation L	1	7	7096281438	7096460433	178995	1341.41	608.01	41	35	-1	11.35	11.35
Fixation R	1	7	7096281438	7096460433	178995	1341.41	608.01	41	35	-1	13.75	13.75
Saccade L	1	7	7096460433	7096520056	59623	1348.92	608.45	748.73	628.72	6.30	282.81	0.67	105.61	6804.71	-6750.73	4863.01
Saccade R	1	7	7096460433	7096520056	59623	1348.92	608.45	748.73	628.72	6.30	282.81	0.67	105.61	6804.71	-6750.73	4863.01
Fixation L	1	8	7096520056	7096977655	457599	743.11	636.20	23	56	-1	11.03	11.03
Fixation R	1	8	7096520056	7096977655	457599	743.11	636.20	23	56	-1	14.11	14.11
Saccade L	1	8	7096977655	7096997533	19878	725.61	650.06	551.49	648.42	1.02	176.10	1.00	51.36	4317.53	-4134.55	2917.18
Saccade R	1	8	7096977655	7096997533	19878	725.61	650.06	551.49	648.42	1.02	176.10	1.00	51.36	4317.53	-4134.55	2917.18
Fixation L	1	9	7096997533	7097534507	536974	533.74	633.00	50	44	-1	10.76	10.76
Fixation R	1	9	7096997533	7097534507	536974	533.74	633.00	50	44	-1	14.03	14.03
Saccade L	1	9	7097534507	7097594257	59750	501.21	620.17	452.28	624.59	1.53	50.67	1.00	25.62	19898.06	-1065.19	4730.31
Saccade R	1	9	7097534507	7097594257	59750	501.21	620.17	452.28	624.59	1.53	50.67	1.00	25.62	19898.06	-1065.19	4730.31
Blink L	1	1	7097594257	7097812996	218739
Blink R	1	1	7097594257	7097812996	218739
Saccade L	1	10	7097812996	7097852740	39744	476.29	585.43	481.55	587.27	0.52	27.51	1.00	13.18	0.00	-529.50	265.15
Saccade R	1	10	7097812996	7097852740	39744	476.29	585.43	481.55	587.27	0.52	27.51	1.00	13.18	0.00	-529.50	265.15
