[BeGaze]
Converted from:	C:\Documents and Settings\iViewX\Desktop\EXPERIMENTATIONS\Experiments\results\finaleart\S9H29221-finaleart-1.idf
Date:	27.03.2019 16:02:01
Version:	BeGaze 2.5.77
Sample Rate:	50
Subject:	S9H29221
Description:	steven

Table Header for Fixations:
Event Type	Trial	Number	Start	End	Duration	Location X	Location Y	Dispersion X	Dispersion Y	Plane	Avg. Pupil Size X	Avg. Pupil Size Y

Table Header for Saccades:
Event Type	Trial	Number	Start	End	Duration	Start Loc.X	Start Loc.Y	End Loc.X	End Loc.Y	Amplitude	Peak Speed	Peak Speed At	Average Speed	Peak Accel.	Peak Decel.	Average Accel.

Table Header for Blinks:
Event Type	Trial	Number	Start	End	Duration

Table Header for User Events:
Event Type	Trial	Number	Start	Description

UserEvent	1	1	5566216325	# Message: ronde_cross_1905.jpg
Fixation L	1	1	5566231630	5566370870	139240	1244.83	488.06	9	22	-1	13.07	13.07
Fixation R	1	1	5566231630	5566370870	139240	1244.83	488.06	9	22	-1	12.76	12.76
Blink L	1	1	5566370870	5566630853	259983
Blink R	1	1	5566370870	5566630853	259983
Fixation L	1	2	5566630853	5566868105	237252	1142.81	519.05	32	28	-1	13.49	13.49
Fixation R	1	2	5566630853	5566868105	237252	1142.81	519.05	32	28	-1	13.02	13.02
Saccade L	1	1	5566868105	5566907838	39733	1149.94	527.86	932.67	527.68	2.03	134.85	1.00	51.07	3269.82	-3200.69	2483.91
Saccade R	1	1	5566868105	5566907838	39733	1149.94	527.86	932.67	527.68	2.03	134.85	1.00	51.07	3269.82	-3200.69	2483.91
Fixation L	1	3	5566907838	5567158995	251157	903.97	547.23	37	31	-1	13.28	13.28
Fixation R	1	3	5566907838	5567158995	251157	903.97	547.23	37	31	-1	12.64	12.64
Saccade L	1	2	5567158995	5567186343	27348	897.41	559.44	849.05	558.56	0.48	48.93	1.00	17.37	1072.79	-974.50	760.80
Saccade R	1	2	5567158995	5567186343	27348	897.41	559.44	849.05	558.56	0.48	48.93	1.00	17.37	1072.79	-974.50	760.80
Fixation L	1	4	5567186343	5567385192	198849	823.75	562.40	38	29	-1	11.94	11.94
Fixation R	1	4	5567186343	5567385192	198849	823.75	562.40	38	29	-1	11.55	11.55
Saccade L	1	3	5567385192	5567405215	20023	810.28	585.71	808.73	634.50	0.45	49.38	1.00	22.34	1164.63	-1117.64	932.53
Saccade R	1	3	5567385192	5567405215	20023	810.28	585.71	808.73	634.50	0.45	49.38	1.00	22.34	1164.63	-1117.64	932.53
Fixation L	1	5	5567405215	5567643809	238594	795.81	631.93	19	18	-1	11.38	11.38
Fixation R	1	5	5567405215	5567643809	238594	795.81	631.93	19	18	-1	11.15	11.15
Saccade L	1	4	5567643809	5567663679	19870	790.42	622.43	781.11	539.86	0.81	84.06	1.00	40.61	2046.00	-1859.17	1869.82
Saccade R	1	4	5567643809	5567663679	19870	790.42	622.43	781.11	539.86	0.81	84.06	1.00	40.61	2046.00	-1859.17	1869.82
Fixation L	1	6	5567663679	5567922286	258607	772.30	479.07	24	71	-1	11.05	11.05
Fixation R	1	6	5567663679	5567922286	258607	772.30	479.07	24	71	-1	10.90	10.90
Saccade L	1	5	5567922286	5567942180	19894	760.62	475.04	755.19	476.33	0.06	5.65	1.00	3.08	47.02	-109.09	63.36
Saccade R	1	5	5567922286	5567942180	19894	760.62	475.04	755.19	476.33	0.06	5.65	1.00	3.08	47.02	-109.09	63.36
Fixation L	1	7	5567942180	5568101302	159122	742.94	479.99	76	15	-1	10.67	10.67
Fixation R	1	7	5567942180	5568101302	159122	742.94	479.99	76	15	-1	10.76	10.76
Saccade L	1	6	5568101302	5568121162	19860	678.79	491.31	549.04	515.50	1.17	133.50	1.00	58.89	3218.14	-3253.09	2485.87
Saccade R	1	6	5568101302	5568121162	19860	678.79	491.31	549.04	515.50	1.17	133.50	1.00	58.89	3218.14	-3253.09	2485.87
Fixation L	1	8	5568121162	5568379781	258619	523.65	549.54	55	40	-1	10.55	10.55
Fixation R	1	8	5568121162	5568379781	258619	523.65	549.54	55	40	-1	10.50	10.50
Saccade L	1	7	5568379781	5568399641	19860	493.49	554.71	480.67	549.84	0.24	16.17	1.00	12.26	-57.46	-152.03	89.33
Saccade R	1	7	5568379781	5568399641	19860	493.49	554.71	480.67	549.84	0.24	16.17	1.00	12.26	-57.46	-152.03	89.33
Fixation L	1	9	5568399641	5569254856	855215	455.79	527.91	31	44	-1	10.26	10.26
Fixation R	1	9	5568399641	5569254856	855215	455.79	527.91	31	44	-1	10.36	10.36
Saccade L	1	8	5569254856	5569314608	59752	461.30	538.92	1006.57	535.09	5.84	197.59	0.67	97.73	4699.10	-4479.59	3705.88
Saccade R	1	8	5569254856	5569314608	59752	461.30	538.92	1006.57	535.09	5.84	197.59	0.67	97.73	4699.10	-4479.59	3705.88
Fixation L	1	10	5569314608	5569632840	318232	1045.93	537.15	77	21	-1	10.23	10.23
Fixation R	1	10	5569314608	5569632840	318232	1045.93	537.15	77	21	-1	10.36	10.36
Saccade L	1	9	5569632840	5569652705	19865	1081.81	522.43	1083.99	516.44	0.13	8.56	1.00	6.54	78.47	-52.80	46.18
Saccade R	1	9	5569632840	5569652705	19865	1081.81	522.43	1083.99	516.44	0.13	8.56	1.00	6.54	78.47	-52.80	46.18
Fixation L	1	11	5569652705	5570110198	457493	1121.56	522.53	70	28	-1	10.24	10.24
Fixation R	1	11	5569652705	5570110198	457493	1121.56	522.53	70	28	-1	10.20	10.20
Saccade L	1	10	5570110198	5570130057	19859	1154.12	534.79	1163.39	540.48	0.14	12.81	1.00	6.96	276.17	-201.42	231.93
Saccade R	1	10	5570110198	5570130057	19859	1154.12	534.79	1163.39	540.48	0.14	12.81	1.00	6.96	276.17	-201.42	231.93
Fixation L	1	12	5570130057	5570229560	99503	1179.44	544.36	27	13	-1	10.49	10.49
Fixation R	1	12	5570130057	5570229560	99503	1179.44	544.36	27	13	-1	10.40	10.40
