[BeGaze]
Converted from:	C:\Documents and Settings\iViewX\Desktop\EXPERIMENTATIONS\Experiments\results\finaleart\S19F21442-finaleart-1.idf
Date:	27.03.2019 15:51:38
Version:	BeGaze 2.5.77
Sample Rate:	50
Subject:	S19F21442
Description:	Juliette Veuillez

Table Header for Fixations:
Event Type	Trial	Number	Start	End	Duration	Location X	Location Y	Dispersion X	Dispersion Y	Plane	Avg. Pupil Size X	Avg. Pupil Size Y

Table Header for Saccades:
Event Type	Trial	Number	Start	End	Duration	Start Loc.X	Start Loc.Y	End Loc.X	End Loc.Y	Amplitude	Peak Speed	Peak Speed At	Average Speed	Peak Accel.	Peak Decel.	Average Accel.

Table Header for Blinks:
Event Type	Trial	Number	Start	End	Duration

Table Header for User Events:
Event Type	Trial	Number	Start	Description

UserEvent	1	1	7734239652	# Message: The_Two_Models_Dufy_1930.jpg
Fixation L	1	1	7734243251	7734481976	238725	909.31	461.78	22	21	-1	11.77	11.77
Fixation R	1	1	7734243251	7734481976	238725	909.31	461.78	22	21	-1	12.61	12.61
Saccade L	1	1	7734481976	7734501855	19879	898.80	471.28	825.59	594.85	0.86	145.27	1.00	43.40	3586.00	-3545.27	2496.55
Saccade R	1	1	7734481976	7734501855	19879	898.80	471.28	825.59	594.85	0.86	145.27	1.00	43.40	3586.00	-3545.27	2496.55
Fixation L	1	2	7734501855	7734700734	198879	823.48	612.47	15	62	-1	11.66	11.66
Fixation R	1	2	7734501855	7734700734	198879	823.48	612.47	15	62	-1	12.80	12.80
Saccade L	1	2	7734700734	7734720605	19871	831.10	645.38	716.01	760.53	1.33	164.65	1.00	67.13	3499.23	-3942.34	3029.15
Saccade R	1	2	7734700734	7734720605	19871	831.10	645.38	716.01	760.53	1.33	164.65	1.00	67.13	3499.23	-3942.34	3029.15
Fixation L	1	3	7734720605	7734919591	198986	655.40	772.07	73	22	-1	10.85	10.85
Fixation R	1	3	7734720605	7734919591	198986	655.40	772.07	73	22	-1	12.09	12.09
Saccade L	1	3	7734919591	7734939459	19868	645.90	773.50	657.27	986.09	1.21	215.27	1.00	60.70	5327.55	-5157.82	3542.10
Saccade R	1	3	7734919591	7734939459	19868	645.90	773.50	657.27	986.09	1.21	215.27	1.00	60.70	5327.55	-5157.82	3542.10
Fixation L	1	4	7734939459	7735197954	258495	668.01	987.48	26	66	-1	9.30	9.30
Fixation R	1	4	7734939459	7735197954	258495	668.01	987.48	26	66	-1	10.05	10.05
Saccade L	1	4	7735197954	7735217824	19870	674.33	1007.90	683.93	1017.22	0.33	28.26	0.00	16.49	209.85	-230.86	168.10
Saccade R	1	4	7735197954	7735217824	19870	674.33	1007.90	683.93	1017.22	0.33	28.26	0.00	16.49	209.85	-230.86	168.10
Fixation L	1	5	7735217824	7735357073	139249	688.14	1000.75	30	28	-1	8.92	8.92
Fixation R	1	5	7735217824	7735357073	139249	688.14	1000.75	30	28	-1	9.67	9.67
Saccade L	1	5	7735357073	7735416822	59749	704.03	994.88	1315.78	582.01	8.07	301.86	0.67	135.05	7217.17	-7203.67	5688.40
Saccade R	1	5	7735357073	7735416822	59749	704.03	994.88	1315.78	582.01	8.07	301.86	0.67	135.05	7217.17	-7203.67	5688.40
Fixation L	1	6	7735416822	7735536067	119245	1307.59	561.71	14	58	-1	9.66	9.66
Fixation R	1	6	7735416822	7735536067	119245	1307.59	561.71	14	58	-1	9.70	9.70
Saccade L	1	6	7735536067	7735556082	20015	1312.77	538.43	1316.57	444.72	1.07	94.87	1.00	53.25	1327.32	-1874.30	1453.88
Saccade R	1	6	7735536067	7735556082	20015	1312.77	538.43	1316.57	444.72	1.07	94.87	1.00	53.25	1327.32	-1874.30	1453.88
Fixation L	1	7	7735556082	7735655432	99350	1328.43	388.55	21	77	-1	9.45	9.45
Fixation R	1	7	7735556082	7735655432	99350	1328.43	388.55	21	77	-1	9.41	9.41
Saccade L	1	7	7735655432	7735675309	19877	1335.22	387.63	1342.73	385.59	0.19	15.36	1.00	9.53	25.65	-187.22	98.93
Saccade R	1	7	7735655432	7735675309	19877	1335.22	387.63	1342.73	385.59	0.19	15.36	1.00	9.53	25.65	-187.22	98.93
Fixation L	1	8	7735675309	7735854427	179118	1341.63	388.49	4	25	-1	9.40	9.40
Fixation R	1	8	7735675309	7735854427	179118	1341.63	388.49	4	25	-1	9.22	9.22
Saccade L	1	8	7735854427	7735894176	39749	1340.41	375.06	1011.66	446.90	2.99	217.05	0.50	75.27	5247.13	-4896.97	4011.35
Saccade R	1	8	7735854427	7735894176	39749	1340.41	375.06	1011.66	446.90	2.99	217.05	0.50	75.27	5247.13	-4896.97	4011.35
Fixation L	1	9	7735894176	7736093039	198863	1019.05	481.66	15	71	-1	10.05	10.05
Fixation R	1	9	7735894176	7736093039	198863	1019.05	481.66	15	71	-1	10.02	10.02
Saccade L	1	9	7736093039	7736112914	19875	1026.81	518.13	1095.83	555.74	0.62	79.52	1.00	31.18	1685.49	-1969.64	1320.96
Saccade R	1	9	7736093039	7736112914	19875	1026.81	518.13	1095.83	555.74	0.62	79.52	1.00	31.18	1685.49	-1969.64	1320.96
Fixation L	1	10	7736112914	7736570391	457477	1101.28	582.94	12	67	-1	10.64	10.64
Fixation R	1	10	7736112914	7736570391	457477	1101.28	582.94	12	67	-1	10.40	10.40
Saccade L	1	10	7736570391	7736689792	119401	1093.80	593.81	720.75	836.50	6.89	211.29	1.00	57.69	4989.83	-5033.66	2507.32
Saccade R	1	10	7736570391	7736689792	119401	1093.80	593.81	720.75	836.50	6.89	211.29	1.00	57.69	4989.83	-5033.66	2507.32
Fixation L	1	11	7736689792	7736968269	278477	731.94	850.81	43	42	-1	9.96	9.96
Fixation R	1	11	7736689792	7736968269	278477	731.94	850.81	43	42	-1	10.89	10.89
Saccade L	1	11	7736968269	7736988124	19855	695.85	826.21	689.83	810.15	0.47	48.55	0.00	23.92	364.19	-538.66	399.52
Saccade R	1	11	7736968269	7736988124	19855	695.85	826.21	689.83	810.15	0.47	48.55	0.00	23.92	364.19	-538.66	399.52
Fixation L	1	12	7736988124	7737186995	198871	680.84	797.65	30	26	-1	10.31	10.31
Fixation R	1	12	7736988124	7737186995	198871	680.84	797.65	30	26	-1	11.33	11.33
Saccade L	1	12	7737186995	7737206862	19867	670.37	786.86	666.80	861.09	0.55	75.18	1.00	27.92	1727.40	-1557.85	1281.14
Saccade R	1	12	7737186995	7737206862	19867	670.37	786.86	666.80	861.09	0.55	75.18	1.00	27.92	1727.40	-1557.85	1281.14
Fixation L	1	13	7737206862	7737505228	298366	653.58	885.58	30	47	-1	10.13	10.13
Fixation R	1	13	7737206862	7737505228	298366	653.58	885.58	30	47	-1	11.40	11.40
Saccade L	1	13	7737505228	7737525104	19876	641.96	884.09	653.06	936.18	0.46	53.88	1.00	23.19	1077.96	-997.04	805.86
Saccade R	1	13	7737505228	7737525104	19876	641.96	884.09	653.06	936.18	0.46	53.88	1.00	23.19	1077.96	-997.04	805.86
Fixation L	1	14	7737525104	7737724097	198993	686.57	963.91	50	37	-1	10.62	10.62
Fixation R	1	14	7737525104	7737724097	198993	686.57	963.91	50	37	-1	11.52	11.52
Saccade L	1	14	7737724097	7737783717	59620	703.67	973.32	901.38	447.56	6.03	248.17	0.33	101.06	6113.68	-5236.83	4594.08
Saccade R	1	14	7737724097	7737783717	59620	703.67	973.32	901.38	447.56	6.03	248.17	0.33	101.06	6113.68	-5236.83	4594.08
Fixation L	1	15	7737783717	7738002454	218737	922.18	447.57	31	60	-1	10.71	10.71
Fixation R	1	15	7737783717	7738002454	218737	922.18	447.57	31	60	-1	11.44	11.44
Saccade L	1	15	7738002454	7738042329	39875	931.36	421.30	983.63	147.55	2.46	157.02	0.50	61.71	3844.26	-3587.74	3325.15
Saccade R	1	15	7738002454	7738042329	39875	931.36	421.30	983.63	147.55	2.46	157.02	0.50	61.71	3844.26	-3587.74	3325.15
Fixation L	1	16	7738042329	7738241197	198868	1006.29	153.96	28	28	-1	10.51	10.51
Fixation R	1	16	7738042329	7738241197	198868	1006.29	153.96	28	28	-1	10.98	10.98
