[BeGaze]
Converted from:	C:\Documents and Settings\iViewX\Desktop\EXPERIMENTATIONS\Experiments\results\finaleart\S6124332-finaleart-1.idf
Date:	27.03.2019 15:36:12
Version:	BeGaze 2.5.77
Sample Rate:	50
Subject:	S6124332
Description:	Romain Ferrand

Table Header for Fixations:
Event Type	Trial	Number	Start	End	Duration	Location X	Location Y	Dispersion X	Dispersion Y	Plane	Avg. Pupil Size X	Avg. Pupil Size Y

Table Header for Saccades:
Event Type	Trial	Number	Start	End	Duration	Start Loc.X	Start Loc.Y	End Loc.X	End Loc.Y	Amplitude	Peak Speed	Peak Speed At	Average Speed	Peak Accel.	Peak Decel.	Average Accel.

Table Header for Blinks:
Event Type	Trial	Number	Start	End	Duration

Table Header for User Events:
Event Type	Trial	Number	Start	Description

UserEvent	1	1	12452029687	# Message: void.jpg
Fixation L	1	1	12452037302	12452275915	238613	1234.22	862.21	63	12	-1	17.64	17.64
Fixation R	1	1	12452037302	12452275915	238613	1234.22	862.21	63	12	-1	16.71	16.71
Saccade L	1	1	12452275915	12452295912	19997	1187.70	868.58	1161.85	869.44	0.40	42.65	0.00	19.78	504.02	-958.31	661.00
Saccade R	1	1	12452275915	12452295912	19997	1187.70	868.58	1161.85	869.44	0.40	42.65	0.00	19.78	504.02	-958.31	661.00
Fixation L	1	2	12452295912	12452534524	238612	1151.23	881.68	15	24	-1	18.40	18.40
Fixation R	1	2	12452295912	12452534524	238612	1151.23	881.68	15	24	-1	17.14	17.14
Saccade L	1	2	12452534524	12452634028	99504	1146.62	889.40	888.25	552.30	6.00	137.24	0.40	60.29	3412.97	-2818.70	1409.51
Saccade R	1	2	12452534524	12452634028	99504	1146.62	889.40	888.25	552.30	6.00	137.24	0.40	60.29	3412.97	-2818.70	1409.51
Fixation L	1	3	12452634028	12453509105	875077	856.39	549.81	50	44	-1	18.77	18.77
Fixation R	1	3	12452634028	12453509105	875077	856.39	549.81	50	44	-1	17.94	17.94
Saccade L	1	3	12453509105	12453529085	19980	895.77	578.17	901.62	564.30	0.23	15.23	1.00	11.73	102.00	-266.76	179.46
Saccade R	1	3	12453509105	12453529085	19980	895.77	578.17	901.62	564.30	0.23	15.23	1.00	11.73	102.00	-266.76	179.46
Fixation L	1	4	12453529085	12454066059	536974	898.93	573.12	14	75	-1	19.67	19.67
Fixation R	1	4	12453529085	12454066059	536974	898.93	573.12	14	75	-1	19.09	19.09
