[BeGaze]
Converted from:	C:\Documents and Settings\iViewX\Desktop\EXPERIMENTATIONS\Experiments\results\finaleart\S02123220-finaleart-1.idf
Date:	27.03.2019 15:33:37
Version:	BeGaze 2.5.77
Sample Rate:	50
Subject:	S02123220
Description:	David Xu

Table Header for Fixations:
Event Type	Trial	Number	Start	End	Duration	Location X	Location Y	Dispersion X	Dispersion Y	Plane	Avg. Pupil Size X	Avg. Pupil Size Y

Table Header for Saccades:
Event Type	Trial	Number	Start	End	Duration	Start Loc.X	Start Loc.Y	End Loc.X	End Loc.Y	Amplitude	Peak Speed	Peak Speed At	Average Speed	Peak Accel.	Peak Decel.	Average Accel.

Table Header for Blinks:
Event Type	Trial	Number	Start	End	Duration

Table Header for User Events:
Event Type	Trial	Number	Start	Description

UserEvent	1	1	1192640319	# Message: morning_in_a_pine_forest_Ivan_Shishkin_1889.jpg
Fixation L	1	1	1192659706	1193057573	397867	955.76	359.42	11	71	-1	13.99	13.99
Fixation R	1	1	1192659706	1193057573	397867	955.76	359.42	11	71	-1	13.15	13.15
Saccade L	1	1	1193057573	1193077439	19866	950.48	410.65	942.04	622.53	1.38	214.41	1.00	69.23	5141.63	-4836.29	3328.66
Saccade R	1	1	1193057573	1193077439	19866	950.48	410.65	942.04	622.53	1.38	214.41	1.00	69.23	5141.63	-4836.29	3328.66
Fixation L	1	2	1193077439	1193316164	238725	910.49	615.79	41	44	-1	14.30	14.30
Fixation R	1	2	1193077439	1193316164	238725	910.49	615.79	41	44	-1	12.99	12.99
Saccade L	1	2	1193316164	1193336042	19878	901.14	604.02	763.70	601.15	0.87	139.04	1.00	43.90	3151.18	-2639.68	2035.19
Saccade R	1	2	1193316164	1193336042	19878	901.14	604.02	763.70	601.15	0.87	139.04	1.00	43.90	3151.18	-2639.68	2035.19
Fixation L	1	3	1193336042	1193495155	159113	757.87	571.34	11	52	-1	12.50	12.50
Fixation R	1	3	1193336042	1193495155	159113	757.87	571.34	11	52	-1	11.66	11.66
Saccade L	1	3	1193495155	1193515039	19884	763.54	565.63	885.29	457.03	0.95	165.00	1.00	47.80	3997.50	-3758.69	2612.53
Saccade R	1	3	1193495155	1193515039	19884	763.54	565.63	885.29	457.03	0.95	165.00	1.00	47.80	3997.50	-3758.69	2612.53
Fixation L	1	4	1193515039	1193833262	318223	903.50	446.08	26	25	-1	12.74	12.74
Fixation R	1	4	1193515039	1193833262	318223	903.50	446.08	26	25	-1	11.84	11.84
Saccade L	1	4	1193833262	1193853138	19876	904.69	453.39	878.22	517.12	0.52	69.80	1.00	25.94	1692.88	-1119.45	1092.00
Saccade R	1	4	1193833262	1193853138	19876	904.69	453.39	878.22	517.12	0.52	69.80	1.00	25.94	1692.88	-1119.45	1092.00
Fixation L	1	5	1193853138	1193992374	139236	856.74	533.46	33	23	-1	13.07	13.07
Fixation R	1	5	1193853138	1193992374	139236	856.74	533.46	33	23	-1	12.26	12.26
Saccade L	1	5	1193992374	1194032122	39748	845.18	540.48	828.88	715.38	1.70	105.01	1.00	42.65	2497.61	-2491.47	2057.97
Saccade R	1	5	1193992374	1194032122	39748	845.18	540.48	828.88	715.38	1.70	105.01	1.00	42.65	2497.61	-2491.47	2057.97
Fixation L	1	6	1194032122	1194509487	477365	794.12	728.85	45	24	-1	13.72	13.72
Fixation R	1	6	1194032122	1194509487	477365	794.12	728.85	45	24	-1	12.58	12.58
Saccade L	1	6	1194509487	1194549341	39854	788.17	734.74	788.91	568.17	1.53	105.41	1.00	38.39	2517.87	-2550.56	1939.27
Saccade R	1	6	1194509487	1194549341	39854	788.17	734.74	788.91	568.17	1.53	105.41	1.00	38.39	2517.87	-2550.56	1939.27
Fixation L	1	7	1194549341	1194787952	238611	784.16	560.01	8	43	-1	13.90	13.90
Fixation R	1	7	1194549341	1194787952	238611	784.16	560.01	8	43	-1	13.03	13.03
Saccade L	1	7	1194787952	1194807821	19869	781.36	551.92	856.82	485.83	0.62	101.47	1.00	31.35	2439.61	-2285.46	1714.97
Saccade R	1	7	1194787952	1194807821	19869	781.36	551.92	856.82	485.83	0.62	101.47	1.00	31.35	2439.61	-2285.46	1714.97
Fixation L	1	8	1194807821	1195026685	218864	887.36	494.20	38	14	-1	14.24	14.24
Fixation R	1	8	1194807821	1195026685	218864	887.36	494.20	38	14	-1	13.10	13.10
Saccade L	1	8	1195026685	1195066431	39746	894.61	498.90	1248.57	777.32	4.36	245.82	1.00	109.78	6078.06	-5176.15	4906.53
Saccade R	1	8	1195026685	1195066431	39746	894.61	498.90	1248.57	777.32	4.36	245.82	1.00	109.78	6078.06	-5176.15	4906.53
Fixation L	1	9	1195066431	1195225549	159118	1256.95	837.61	12	85	-1	14.87	14.87
Fixation R	1	9	1195066431	1195225549	159118	1256.95	837.61	12	85	-1	12.77	12.77
Saccade L	1	9	1195225549	1195245428	19879	1260.38	841.99	1266.94	850.91	0.14	11.20	1.00	7.02	141.56	-148.95	104.77
Saccade R	1	9	1195225549	1195245428	19879	1260.38	841.99	1266.94	850.91	0.14	11.20	1.00	7.02	141.56	-148.95	104.77
Fixation L	1	10	1195245428	1195464161	218733	1253.54	817.22	32	64	-1	14.49	14.49
Fixation R	1	10	1195245428	1195464161	218733	1253.54	817.22	32	64	-1	12.33	12.33
Saccade L	1	10	1195464161	1195583533	119372	1237.00	788.86	1245.22	936.38	2.90	110.73	1.00	24.31	2723.25	-2317.93	1007.01
Saccade R	1	10	1195464161	1195583533	119372	1237.00	788.86	1245.22	936.38	2.90	110.73	1.00	24.31	2723.25	-2317.93	1007.01
Fixation L	1	11	1195583533	1195742647	159114	1245.54	925.67	11	27	-1	13.27	13.27
Fixation R	1	11	1195583533	1195742647	159114	1245.54	925.67	11	27	-1	11.05	11.05
Saccade L	1	11	1195742647	1195762505	19858	1246.27	927.62	1245.72	809.81	0.80	119.16	1.00	40.39	2795.49	-2820.59	2065.29
Saccade R	1	11	1195742647	1195762505	19858	1246.27	927.62	1245.72	809.81	0.80	119.16	1.00	40.39	2795.49	-2820.59	2065.29
Fixation L	1	12	1195762505	1196040990	278485	1230.94	791.34	35	57	-1	13.80	13.80
Fixation R	1	12	1195762505	1196040990	278485	1230.94	791.34	35	57	-1	11.56	11.56
Saccade L	1	12	1196040990	1196140498	99508	1210.07	832.53	950.61	464.99	6.77	299.17	0.80	68.04	7249.64	-7085.73	2789.85
Saccade R	1	12	1196040990	1196140498	99508	1210.07	832.53	950.61	464.99	6.77	299.17	0.80	68.04	7249.64	-7085.73	2789.85
Fixation L	1	13	1196140498	1196339379	198881	949.36	481.25	68	26	-1	13.76	13.76
Fixation R	1	13	1196140498	1196339379	198881	949.36	481.25	68	26	-1	12.17	12.17
Saccade L	1	13	1196339379	1196359230	19851	890.57	480.44	876.49	480.26	0.44	68.97	0.00	22.29	254.68	-1676.78	753.84
Saccade R	1	13	1196339379	1196359230	19851	890.57	480.44	876.49	480.26	0.44	68.97	0.00	22.29	254.68	-1676.78	753.84
Fixation L	1	14	1196359230	1196597970	238740	870.38	479.64	20	10	-1	13.43	13.43
Fixation R	1	14	1196359230	1196597970	238740	870.38	479.64	20	10	-1	11.89	11.89
Saccade L	1	14	1196597970	1196637727	39757	857.28	479.93	656.53	357.62	2.92	144.90	0.50	73.42	3553.76	0.00	2264.89
Saccade R	1	14	1196597970	1196637727	39757	857.28	479.93	656.53	357.62	2.92	144.90	0.50	73.42	3553.76	0.00	2264.89
