[BeGaze]
Converted from:	C:\Documents and Settings\iViewX\Desktop\EXPERIMENTATIONS\Experiments\results\finaleart\S15H25531-finaleart-1.idf
Date:	27.03.2019 15:45:15
Version:	BeGaze 2.5.77
Sample Rate:	50
Subject:	S15H25531
Description:	Mikail Demirdelen

Table Header for Fixations:
Event Type	Trial	Number	Start	End	Duration	Location X	Location Y	Dispersion X	Dispersion Y	Plane	Avg. Pupil Size X	Avg. Pupil Size Y

Table Header for Saccades:
Event Type	Trial	Number	Start	End	Duration	Start Loc.X	Start Loc.Y	End Loc.X	End Loc.Y	Amplitude	Peak Speed	Peak Speed At	Average Speed	Peak Accel.	Peak Decel.	Average Accel.

Table Header for Blinks:
Event Type	Trial	Number	Start	End	Duration

Table Header for User Events:
Event Type	Trial	Number	Start	Description

UserEvent	1	1	4225573426	# Message: void.jpg
Saccade L	1	1	4225575036	4225714373	139337	1036.29	346.64	1549.72	991.22	14.11	430.62	0.71	101.27	10741.74	-7992.18	3906.15
Saccade R	1	1	4225575036	4225714373	139337	1036.29	346.64	1549.72	991.22	14.11	430.62	0.71	101.27	10741.74	-7992.18	3906.15
Fixation L	1	1	4225714373	4225833656	119283	1540.42	998.61	19	15	-1	11.82	11.82
Fixation R	1	1	4225714373	4225833656	119283	1540.42	998.61	19	15	-1	11.83	11.83
Saccade L	1	2	4225833656	4225873387	39731	1538.54	1006.83	1531.06	1019.75	2.22	104.35	0.50	55.97	2421.54	-2196.77	1894.27
Saccade R	1	2	4225833656	4225873387	39731	1538.54	1006.83	1531.06	1019.75	2.22	104.35	0.50	55.97	2421.54	-2196.77	1894.27
Fixation L	1	2	4225873387	4226112134	238747	1521.68	1070.07	14	77	-1	12.26	12.26
Fixation R	1	2	4225873387	4226112134	238747	1521.68	1070.07	14	77	-1	12.01	12.01
Saccade L	1	3	4226112134	4226211510	99376	1527.58	1055.16	467.05	1145.73	13.92	323.50	0.40	140.08	7699.61	-5077.50	4086.54
Saccade R	1	3	4226112134	4226211510	99376	1527.58	1055.16	467.05	1145.73	13.92	323.50	0.40	140.08	7699.61	-5077.50	4086.54
Fixation L	1	3	4226211510	4226489995	278485	448.10	1152.78	30	13	-1	12.44	12.44
Fixation R	1	3	4226211510	4226489995	278485	448.10	1152.78	30	13	-1	12.98	12.98
Saccade L	1	4	4226489995	4226529729	39734	438.01	1155.42	108.50	1147.91	2.91	253.18	1.00	73.26	6280.19	-5422.23	3736.39
Saccade R	1	4	4226489995	4226529729	39734	438.01	1155.42	108.50	1147.91	2.91	253.18	1.00	73.26	6280.19	-5422.23	3736.39
Fixation L	1	4	4226529729	4226808217	278488	83.49	1150.85	61	13	-1	12.75	12.75
Fixation R	1	4	4226529729	4226808217	278488	83.49	1150.85	61	13	-1	14.04	14.04
Saccade L	1	5	4226808217	4226867964	59747	99.71	1158.13	904.95	966.45	8.68	290.52	0.67	145.35	7170.69	-6654.69	5573.64
Saccade R	1	5	4226808217	4226867964	59747	99.71	1158.13	904.95	966.45	8.68	290.52	0.67	145.35	7170.69	-6654.69	5573.64
Fixation L	1	5	4226867964	4227046963	178999	882.38	968.67	27	20	-1	13.36	13.36
Fixation R	1	5	4226867964	4227046963	178999	882.38	968.67	27	20	-1	14.82	14.82
Saccade L	1	6	4227046963	4227106580	59617	878.62	957.95	930.54	300.32	7.18	281.11	0.33	120.35	6950.41	-4323.58	4478.72
Saccade R	1	6	4227046963	4227106580	59617	878.62	957.95	930.54	300.32	7.18	281.11	0.33	120.35	6950.41	-4323.58	4478.72
Fixation L	1	6	4227106580	4227345315	238735	949.89	263.83	40	50	-1	13.66	13.66
Fixation R	1	6	4227106580	4227345315	238735	949.89	263.83	40	50	-1	14.52	14.52
Saccade L	1	7	4227345315	4227365202	19887	919.73	289.60	745.42	441.78	1.83	233.95	1.00	91.95	5715.80	-5769.55	3965.36
Saccade R	1	7	4227345315	4227365202	19887	919.73	289.60	745.42	441.78	1.83	233.95	1.00	91.95	5715.80	-5769.55	3965.36
Fixation L	1	7	4227365202	4227464694	99492	717.83	489.18	36	63	-1	13.53	13.53
Fixation R	1	7	4227365202	4227464694	99492	717.83	489.18	36	63	-1	14.63	14.63
Saccade L	1	8	4227464694	4227564061	99367	714.98	498.13	701.82	494.55	0.63	20.18	1.00	6.38	48.90	-308.19	103.00
Saccade R	1	8	4227464694	4227564061	99367	714.98	498.13	701.82	494.55	0.63	20.18	1.00	6.38	48.90	-308.19	103.00
