[BeGaze]
Converted from:	C:\Documents and Settings\iViewX\Desktop\EXPERIMENTATIONS\Experiments\results\finaleart\S6124332-finaleart-1.idf
Date:	27.03.2019 15:35:50
Version:	BeGaze 2.5.77
Sample Rate:	50
Subject:	S6124332
Description:	Romain Ferrand

Table Header for Fixations:
Event Type	Trial	Number	Start	End	Duration	Location X	Location Y	Dispersion X	Dispersion Y	Plane	Avg. Pupil Size X	Avg. Pupil Size Y

Table Header for Saccades:
Event Type	Trial	Number	Start	End	Duration	Start Loc.X	Start Loc.Y	End Loc.X	End Loc.Y	Amplitude	Peak Speed	Peak Speed At	Average Speed	Peak Accel.	Peak Decel.	Average Accel.

Table Header for Blinks:
Event Type	Trial	Number	Start	End	Duration

Table Header for User Events:
Event Type	Trial	Number	Start	Description

UserEvent	1	1	11764866269	# Message: void.jpg
Fixation L	1	1	11764883743	11765003132	119389	474.97	662.01	4	65	-1	16.64	16.64
Fixation R	1	1	11764883743	11765003132	119389	474.97	662.01	4	65	-1	16.88	16.88
Saccade L	1	1	11765003132	11765023122	19990	477.37	609.37	476.69	569.67	0.52	57.46	0.00	26.15	866.08	-1400.13	1002.18
Saccade R	1	1	11765003132	11765023122	19990	477.37	609.37	476.69	569.67	0.52	57.46	0.00	26.15	866.08	-1400.13	1002.18
Fixation L	1	2	11765023122	11765400954	377832	476.79	578.57	5	17	-1	16.46	16.46
Fixation R	1	2	11765023122	11765400954	377832	476.79	578.57	5	17	-1	16.76	16.76
Blink L	1	1	11765400954	11765540191	139237
Blink R	1	1	11765400954	11765619704	218750
Blink L	1	2	11765619704	11765898172	278468
Blink R	1	2	11765619704	11765898172	278468
Blink L	1	3	11765918047	11766461889	543842
Blink R	1	3	11765918047	11766461889	543842
Fixation L	1	3	11766461889	11766660757	198868	919.70	674.04	4	14	-1	16.07	16.07
Fixation R	1	3	11766461889	11766660757	198868	919.70	674.04	4	14	-1	14.07	14.07
Saccade L	1	2	11766660757	11766700509	39752	917.21	669.53	915.48	671.87	1.78	107.48	1.00	44.69	2622.49	-2584.37	2555.07
Fixation L	1	4	11766700509	11766859613	159104	915.41	677.02	2	10	-1	15.64	15.64
Fixation R	1	4	11766720373	11766859613	139240	915.40	677.67	2	10	-1	14.74	14.74
