[BeGaze]
Converted from:	C:\Documents and Settings\iViewX\Desktop\EXPERIMENTATIONS\Experiments\results\finaleart\S12H22222-finaleart-1.idf
Date:	27.03.2019 15:40:56
Version:	BeGaze 2.5.77
Sample Rate:	50
Subject:	S12H22222
Description:	aurele barriere

Table Header for Fixations:
Event Type	Trial	Number	Start	End	Duration	Location X	Location Y	Dispersion X	Dispersion Y	Plane	Avg. Pupil Size X	Avg. Pupil Size Y

Table Header for Saccades:
Event Type	Trial	Number	Start	End	Duration	Start Loc.X	Start Loc.Y	End Loc.X	End Loc.Y	Amplitude	Peak Speed	Peak Speed At	Average Speed	Peak Accel.	Peak Decel.	Average Accel.

Table Header for Blinks:
Event Type	Trial	Number	Start	End	Duration

Table Header for User Events:
Event Type	Trial	Number	Start	Description

UserEvent	1	1	23910174207	# Message: Kiprensky-standing-sitter-with-a-stick-sitter-on-a-rock-1801.jpg
Fixation L	1	1	23910178442	23910635917	457475	962.68	520.81	9	23	-1	13.14	13.14
Fixation R	1	1	23910178442	23910635917	457475	962.68	520.81	9	23	-1	12.54	12.54
Saccade L	1	1	23910635917	23910695657	59740	966.12	519.75	663.94	312.56	4.74	203.75	0.33	79.42	5076.30	-2430.04	3022.18
Saccade R	1	1	23910635917	23910695657	59740	966.12	519.75	663.94	312.56	4.74	203.75	0.33	79.42	5076.30	-2430.04	3022.18
Fixation L	1	2	23910695657	23910994033	298376	650.69	352.61	20	62	-1	11.11	11.11
Fixation R	1	2	23910695657	23910994033	298376	650.69	352.61	20	62	-1	10.55	10.55
Saccade L	1	2	23910994033	23911013905	19872	648.35	341.59	544.55	430.43	0.84	138.19	1.00	42.12	3400.52	-3252.28	2372.21
Saccade R	1	2	23910994033	23911013905	19872	648.35	341.59	544.55	430.43	0.84	138.19	1.00	42.12	3400.52	-3252.28	2372.21
Fixation L	1	3	23911013905	23911232645	218740	558.91	458.72	55	41	-1	10.32	10.32
Fixation R	1	3	23911013905	23911232645	218740	558.91	458.72	55	41	-1	10.00	10.00
Saccade L	1	3	23911232645	23911252513	19868	565.52	471.56	575.77	479.84	0.47	41.55	1.00	23.84	-24.15	-773.62	501.03
Saccade R	1	3	23911232645	23911252513	19868	565.52	471.56	575.77	479.84	0.47	41.55	1.00	23.84	-24.15	-773.62	501.03
Fixation L	1	4	23911252513	23911371903	119390	585.71	487.44	17	24	-1	10.96	10.96
Fixation R	1	4	23911252513	23911371903	119390	585.71	487.44	17	24	-1	10.96	10.96
Saccade L	1	4	23911371903	23911411633	39730	592.20	495.66	624.64	139.79	3.33	225.45	0.50	83.72	5309.78	-4667.09	4007.68
Saccade R	1	4	23911371903	23911411633	39730	592.20	495.66	624.64	139.79	3.33	225.45	0.50	83.72	5309.78	-4667.09	4007.68
Fixation L	1	5	23911411633	23911709992	298359	680.77	154.19	65	30	-1	11.52	11.52
Fixation R	1	5	23911411633	23911709992	298359	680.77	154.19	65	30	-1	11.20	11.20
Saccade L	1	5	23911709992	23911729860	19868	688.59	170.20	691.16	175.24	0.10	5.72	1.00	4.92	40.80	-20.75	32.47
Saccade R	1	5	23911709992	23911729860	19868	688.59	170.20	691.16	175.24	0.10	5.72	1.00	4.92	40.80	-20.75	32.47
Fixation L	1	6	23911729860	23912008364	278504	658.65	195.83	67	31	-1	12.43	12.43
Fixation R	1	6	23911729860	23912008364	278504	658.65	195.83	67	31	-1	12.19	12.19
Saccade L	1	6	23912008364	23912067999	59635	635.25	207.17	497.92	206.43	1.60	75.42	1.00	26.84	1807.44	-1693.06	1309.75
Saccade R	1	6	23912008364	23912067999	59635	635.25	207.17	497.92	206.43	1.60	75.42	1.00	26.84	1807.44	-1693.06	1309.75
Fixation L	1	7	23912067999	23912286844	218845	503.94	185.24	61	35	-1	13.08	13.08
Fixation R	1	7	23912067999	23912286844	218845	503.94	185.24	61	35	-1	12.48	12.48
Saccade L	1	7	23912286844	23912346470	59626	538.53	182.45	1340.78	321.55	8.95	416.82	0.33	150.05	10357.69	-7192.02	6682.91
Saccade R	1	7	23912286844	23912346470	59626	538.53	182.45	1340.78	321.55	8.95	416.82	0.33	150.05	10357.69	-7192.02	6682.91
Fixation L	1	8	23912346470	23912545461	198991	1358.69	289.86	24	43	-1	13.59	13.59
Fixation R	1	8	23912346470	23912545461	198991	1358.69	289.86	24	43	-1	13.11	13.11
Saccade L	1	8	23912545461	23912565327	19866	1365.28	296.05	1435.42	269.95	0.51	75.70	1.00	25.90	1638.93	-1732.03	1126.35
Saccade R	1	8	23912545461	23912565327	19866	1365.28	296.05	1435.42	269.95	0.51	75.70	1.00	25.90	1638.93	-1732.03	1126.35
Fixation L	1	9	23912565327	23912803942	238615	1446.72	238.41	17	49	-1	13.18	13.18
Fixation R	1	9	23912565327	23912803942	238615	1446.72	238.41	17	49	-1	12.66	12.66
Saccade L	1	9	23912803942	23912823833	19891	1448.83	220.58	1430.85	361.26	0.89	143.45	1.00	44.69	3561.93	-3386.22	2488.20
Saccade R	1	9	23912803942	23912823833	19891	1448.83	220.58	1430.85	361.26	0.89	143.45	1.00	44.69	3561.93	-3386.22	2488.20
Fixation L	1	10	23912823833	23912982941	159108	1417.19	404.40	31	67	-1	13.19	13.19
Fixation R	1	10	23912823833	23912982941	159108	1417.19	404.40	31	67	-1	12.28	12.28
Saccade L	1	10	23912982941	23913002808	19867	1401.88	429.14	1395.78	432.70	0.12	10.57	1.00	5.83	171.76	-90.29	130.98
Saccade R	1	10	23912982941	23913002808	19867	1401.88	429.14	1395.78	432.70	0.12	10.57	1.00	5.83	171.76	-90.29	130.98
Fixation L	1	11	23913002808	23913181925	179117	1394.01	434.89	19	14	-1	13.01	13.01
Fixation R	1	11	23913002808	23913181925	179117	1394.01	434.89	19	14	-1	12.06	12.06
Saccade L	1	11	23913181925	23913201800	19875	1409.23	443.23	1417.52	532.03	0.67	90.22	1.00	33.70	2183.17	-1965.72	1385.34
Saccade R	1	11	23913181925	23913201800	19875	1409.23	443.23	1417.52	532.03	0.67	90.22	1.00	33.70	2183.17	-1965.72	1385.34
Fixation L	1	12	23913201800	23913460295	258495	1428.36	559.20	26	35	-1	12.62	12.62
Fixation R	1	12	23913201800	23913460295	258495	1428.36	559.20	26	35	-1	12.19	12.19
Saccade L	1	12	23913460295	23913500164	39869	1430.10	567.17	1446.89	739.78	1.67	118.98	1.00	41.94	2896.15	-2628.30	1916.36
Saccade R	1	12	23913460295	23913500164	39869	1430.10	567.17	1446.89	739.78	1.67	118.98	1.00	41.94	2896.15	-2628.30	1916.36
Fixation L	1	13	23913500164	23913758654	258490	1463.01	736.52	23	25	-1	12.85	12.85
Fixation R	1	13	23913500164	23913758654	258490	1463.01	736.52	23	25	-1	11.86	11.86
Saccade L	1	13	23913758654	23913778522	19868	1466.57	744.01	1465.32	894.05	0.90	151.75	1.00	45.43	3712.33	-3607.34	2628.75
Saccade R	1	13	23913758654	23913778522	19868	1466.57	744.01	1465.32	894.05	0.90	151.75	1.00	45.43	3712.33	-3607.34	2628.75
Fixation L	1	14	23913778522	23914156507	377985	1467.37	870.38	7	29	-1	13.26	13.26
Fixation R	1	14	23913778522	23914156507	377985	1467.37	870.38	7	29	-1	12.14	12.14
