[BeGaze]
Converted from:	C:\Documents and Settings\iViewX\Desktop\EXPERIMENTATIONS\Experiments\results\finaleart\S4120113-finaleart-1.idf
Date:	27.03.2019 15:34:44
Version:	BeGaze 2.5.77
Sample Rate:	50
Subject:	S4120113
Description:	Vidal Attias

Table Header for Fixations:
Event Type	Trial	Number	Start	End	Duration	Location X	Location Y	Dispersion X	Dispersion Y	Plane	Avg. Pupil Size X	Avg. Pupil Size Y

Table Header for Saccades:
Event Type	Trial	Number	Start	End	Duration	Start Loc.X	Start Loc.Y	End Loc.X	End Loc.Y	Amplitude	Peak Speed	Peak Speed At	Average Speed	Peak Accel.	Peak Decel.	Average Accel.

Table Header for Blinks:
Event Type	Trial	Number	Start	End	Duration

Table Header for User Events:
Event Type	Trial	Number	Start	Description

UserEvent	1	1	7758939910	# Message: les_poseuses_seurat_1888.jpg
Fixation L	1	1	7758953281	7759470515	517234	1019.30	549.98	41	47	-1	12.35	12.35
Fixation R	1	1	7758953281	7759470515	517234	1019.30	549.98	41	47	-1	11.96	11.96
Saccade L	1	1	7759470515	7759490408	19893	993.05	573.46	971.68	547.30	0.40	34.17	1.00	20.27	685.80	-507.56	399.59
Saccade R	1	1	7759470515	7759490408	19893	993.05	573.46	971.68	547.30	0.40	34.17	1.00	20.27	685.80	-507.56	399.59
Fixation L	1	2	7759490408	7759629610	139202	970.98	545.69	32	16	-1	10.45	10.45
Fixation R	1	2	7759490408	7759629610	139202	970.98	545.69	32	16	-1	9.87	9.87
Saccade L	1	2	7759629610	7759649484	19874	958.64	535.45	958.67	456.53	0.56	79.83	1.00	27.94	1917.88	-1634.29	1257.35
Saccade R	1	2	7759629610	7759649484	19874	958.64	535.45	958.67	456.53	0.56	79.83	1.00	27.94	1917.88	-1634.29	1257.35
Fixation L	1	3	7759649484	7759888092	238608	959.73	438.30	17	50	-1	9.24	9.24
Fixation R	1	3	7759649484	7759888092	238608	959.73	438.30	17	50	-1	8.68	8.68
Saccade L	1	3	7759888092	7759927970	39878	973.10	455.41	1400.24	647.38	4.01	324.10	0.50	100.51	7971.89	-7950.85	5596.30
Saccade R	1	3	7759888092	7759927970	39878	973.10	455.41	1400.24	647.38	4.01	324.10	0.50	100.51	7971.89	-7950.85	5596.30
Fixation L	1	4	7759927970	7760266073	338103	1384.78	646.00	32	50	-1	10.23	10.23
Fixation R	1	4	7759927970	7760266073	338103	1384.78	646.00	32	50	-1	9.48	9.48
Saccade L	1	4	7760266073	7760325693	59620	1381.88	648.62	1522.72	826.15	2.94	186.57	0.33	49.38	4530.60	-4146.75	1966.32
Saccade R	1	4	7760266073	7760325693	59620	1381.88	648.62	1522.72	826.15	2.94	186.57	0.33	49.38	4530.60	-4146.75	1966.32
Fixation L	1	5	7760325693	7760445062	119369	1503.25	866.80	32	62	-1	11.31	11.31
Fixation R	1	5	7760325693	7760445062	119369	1503.25	866.80	32	62	-1	10.25	10.25
Saccade L	1	5	7760445062	7760464942	19880	1492.12	885.45	1480.67	896.26	0.17	15.93	1.00	8.80	281.87	-93.14	195.95
Saccade R	1	5	7760445062	7760464942	19880	1492.12	885.45	1480.67	896.26	0.17	15.93	1.00	8.80	281.87	-93.14	195.95
Fixation L	1	6	7760464942	7760723543	258601	1471.12	881.18	44	40	-1	11.72	11.72
Fixation R	1	6	7760464942	7760723543	258601	1471.12	881.18	44	40	-1	10.60	10.60
Saccade L	1	6	7760723543	7760743425	19882	1447.36	855.34	1440.49	843.82	0.22	19.38	1.00	11.10	443.59	-127.55	221.57
Saccade R	1	6	7760723543	7760743425	19882	1447.36	855.34	1440.49	843.82	0.22	19.38	1.00	11.10	443.59	-127.55	221.57
Fixation L	1	7	7760743425	7760982026	238601	1447.61	816.89	20	63	-1	11.80	11.80
Fixation R	1	7	7760743425	7760982026	238601	1447.61	816.89	20	63	-1	10.25	10.25
Saccade L	1	7	7760982026	7761021900	39874	1435.53	780.49	1379.14	516.72	2.86	228.29	0.50	71.82	4904.56	-5513.85	2863.99
Saccade R	1	7	7760982026	7761021900	39874	1435.53	780.49	1379.14	516.72	2.86	228.29	0.50	71.82	4904.56	-5513.85	2863.99
Fixation L	1	8	7761021900	7761161023	139123	1368.81	492.06	18	51	-1	11.67	11.67
Fixation R	1	8	7761021900	7761161023	139123	1368.81	492.06	18	51	-1	10.68	10.68
Saccade L	1	8	7761161023	7761200882	39859	1361.18	484.52	1388.27	488.41	1.22	61.06	0.50	30.59	1285.83	-1125.83	1013.04
Saccade R	1	8	7761161023	7761200882	39859	1361.18	484.52	1388.27	488.41	1.22	61.06	0.50	30.59	1285.83	-1125.83	1013.04
Fixation L	1	9	7761200882	7761360003	159121	1397.47	485.81	40	53	-1	11.94	11.94
Fixation R	1	9	7761200882	7761360003	159121	1397.47	485.81	40	53	-1	11.05	11.05
Saccade L	1	9	7761360003	7761499254	139251	1380.62	506.40	669.33	802.09	17.90	355.59	0.29	128.56	8020.15	-6207.85	3506.42
Saccade R	1	9	7761360003	7761499254	139251	1380.62	506.40	669.33	802.09	17.90	355.59	0.29	128.56	8020.15	-6207.85	3506.42
Fixation L	1	10	7761499254	7761698117	198863	659.56	793.84	23	54	-1	11.00	11.00
Fixation R	1	10	7761499254	7761698117	198863	659.56	793.84	23	54	-1	11.98	11.98
Saccade L	1	10	7761698117	7761737870	39753	652.35	770.96	930.66	603.13	3.07	216.32	1.00	77.27	4625.51	-5084.03	3859.80
Saccade R	1	10	7761698117	7761737870	39753	652.35	770.96	930.66	603.13	3.07	216.32	1.00	77.27	4625.51	-5084.03	3859.80
Fixation L	1	11	7761737870	7761896965	159095	942.08	599.38	16	29	-1	11.22	11.22
Fixation R	1	11	7761737870	7761896965	159095	942.08	599.38	16	29	-1	10.50	10.50
Saccade L	1	11	7761896965	7761936721	39756	944.50	593.74	943.34	391.93	2.18	104.44	0.50	54.81	2225.30	-2145.76	2028.23
Saccade R	1	11	7761896965	7761936721	39756	944.50	593.74	943.34	391.93	2.18	104.44	0.50	54.81	2225.30	-2145.76	2028.23
Fixation L	1	12	7761936721	7762056085	119364	946.43	351.79	5	56	-1	10.65	10.65
Fixation R	1	12	7761936721	7762056085	119364	946.43	351.79	5	56	-1	10.59	10.59
Saccade L	1	12	7762056085	7762075966	19881	946.28	343.26	942.04	278.81	0.70	65.34	1.00	35.32	1153.25	-1347.07	1176.67
Saccade R	1	12	7762056085	7762075966	19881	946.28	343.26	942.04	278.81	0.70	65.34	1.00	35.32	1153.25	-1347.07	1176.67
Fixation L	1	13	7762075966	7762255073	179107	943.38	296.84	6	54	-1	10.62	10.62
Fixation R	1	13	7762075966	7762255073	179107	943.38	296.84	6	54	-1	10.55	10.55
Saccade L	1	13	7762255073	7762294829	39756	939.79	272.21	945.13	666.99	3.53	254.84	1.00	88.73	5796.66	-6239.01	4679.51
Saccade R	1	13	7762255073	7762294829	39756	939.79	272.21	945.13	666.99	3.53	254.84	1.00	88.73	5796.66	-6239.01	4679.51
Fixation L	1	14	7762294829	7762652806	357977	954.37	641.20	16	45	-1	11.46	11.46
Fixation R	1	14	7762294829	7762652806	357977	954.37	641.20	16	45	-1	11.04	11.04
Saccade L	1	14	7762652806	7762712428	59622	951.37	644.78	649.55	756.28	3.90	163.56	0.33	65.33	3987.18	-2511.40	2691.24
Saccade R	1	14	7762652806	7762712428	59622	951.37	644.78	649.55	756.28	3.90	163.56	0.33	65.33	3987.18	-2511.40	2691.24
Fixation L	1	15	7762712428	7762931290	218862	657.86	786.21	14	61	-1	10.54	10.54
Fixation R	1	15	7762712428	7762931290	218862	657.86	786.21	14	61	-1	11.20	11.20
