[BeGaze]
Converted from:	C:\Documents and Settings\iViewX\Desktop\EXPERIMENTATIONS\Experiments\results\finaleart\S11H21112-finaleart-1.idf
Date:	27.03.2019 15:38:38
Version:	BeGaze 2.5.77
Sample Rate:	50
Subject:	S11H21112
Description:	Clement legrand-Duchenne

Table Header for Fixations:
Event Type	Trial	Number	Start	End	Duration	Location X	Location Y	Dispersion X	Dispersion Y	Plane	Avg. Pupil Size X	Avg. Pupil Size Y

Table Header for Saccades:
Event Type	Trial	Number	Start	End	Duration	Start Loc.X	Start Loc.Y	End Loc.X	End Loc.Y	Amplitude	Peak Speed	Peak Speed At	Average Speed	Peak Accel.	Peak Decel.	Average Accel.

Table Header for Blinks:
Event Type	Trial	Number	Start	End	Duration

Table Header for User Events:
Event Type	Trial	Number	Start	Description

UserEvent	1	1	3988603447	# Message: after_a_rain_country_road_Vasilyev_1869.jpg
Saccade L	1	1	3988678244	3988757913	79669	517.35	1292.46	522.13	1304.07	32.35	1392.94	1.00	406.02	34658.38	-34535.09	17495.79
Saccade R	1	1	3988678244	3988757913	79669	517.35	1292.46	522.13	1304.07	32.35	1392.94	1.00	406.02	34658.38	-34535.09	17495.79
Fixation L	1	1	3988817479	3989036240	218761	524.30	1301.95	5	7	-1	16.47	16.47
Fixation R	1	1	3988817479	3989036240	218761	524.30	1301.95	5	7	-1	17.62	17.62
Saccade L	1	2	3989036240	3989075977	39737	523.52	1297.45	787.93	814.80	4.85	429.94	1.00	122.07	10705.97	-10448.83	6763.56
Saccade R	1	2	3989036240	3989075977	39737	523.52	1297.45	787.93	814.80	4.85	429.94	1.00	122.07	10705.97	-10448.83	6763.56
Fixation L	1	2	3989075977	3989971059	895082	817.87	798.53	56	41	-1	16.08	16.08
Fixation R	1	2	3989075977	3989971059	895082	817.87	798.53	56	41	-1	17.18	17.18
Saccade L	1	3	3989971059	3989990938	19879	841.48	786.30	850.76	787.52	0.15	13.97	1.00	7.39	-47.38	-132.50	97.40
Saccade R	1	3	3989971059	3989990938	19879	841.48	786.30	850.76	787.52	0.15	13.97	1.00	7.39	-47.38	-132.50	97.40
Fixation L	1	3	3989990938	3990388787	397849	873.66	786.60	42	11	-1	14.73	14.73
Fixation R	1	3	3989990938	3990388787	397849	873.66	786.60	42	11	-1	15.84	15.84
Saccade L	1	4	3990388787	3990428542	39755	892.65	782.14	572.03	642.80	3.05	262.85	1.00	76.77	6398.61	-6422.47	4230.30
Saccade R	1	4	3990388787	3990428542	39755	892.65	782.14	572.03	642.80	3.05	262.85	1.00	76.77	6398.61	-6422.47	4230.30
Fixation L	1	4	3990428542	3990866145	437603	541.65	644.59	39	20	-1	14.54	14.54
Fixation R	1	4	3990428542	3990866145	437603	541.65	644.59	39	20	-1	15.40	15.40
Saccade L	1	5	3990866145	3990886012	19867	546.98	657.17	644.10	669.03	0.57	98.97	1.00	28.91	2358.92	-2382.12	1629.96
Saccade R	1	5	3990866145	3990886012	19867	546.98	657.17	644.10	669.03	0.57	98.97	1.00	28.91	2358.92	-2382.12	1629.96
Fixation L	1	5	3990886012	3991124757	238745	644.76	695.19	4	37	-1	13.94	13.94
Fixation R	1	5	3990886012	3991124757	238745	644.76	695.19	4	37	-1	14.85	14.85
Saccade L	1	6	3991124757	3991164508	39751	643.96	704.09	957.45	701.83	2.57	181.45	0.50	64.68	4487.16	-4494.53	3884.74
Saccade R	1	6	3991124757	3991164508	39751	643.96	704.09	957.45	701.83	2.57	181.45	0.50	64.68	4487.16	-4494.53	3884.74
Fixation L	1	6	3991164508	3991323639	159131	947.14	693.33	20	23	-1	13.98	13.98
Fixation R	1	6	3991164508	3991323639	159131	947.14	693.33	20	23	-1	14.37	14.37
Saccade L	1	7	3991323639	3991363382	39743	946.24	695.15	1274.23	718.56	2.89	212.30	0.50	72.69	5035.07	-5097.03	3926.99
Saccade R	1	7	3991323639	3991363382	39743	946.24	695.15	1274.23	718.56	2.89	212.30	0.50	72.69	5035.07	-5097.03	3926.99
Fixation L	1	7	3991363382	3992397703	1034321	1257.82	749.62	24	57	-1	13.77	13.77
Fixation R	1	7	3991363382	3992397703	1034321	1257.82	749.62	24	57	-1	14.52	14.52
Saccade L	1	8	3992397703	3992417576	19873	1250.17	776.28	1154.04	784.08	0.71	97.56	1.00	35.78	2287.61	-2244.56	1566.63
Saccade R	1	8	3992397703	3992417576	19873	1250.17	776.28	1154.04	784.08	0.71	97.56	1.00	35.78	2287.61	-2244.56	1566.63
Fixation L	1	8	3992417576	3992596573	178997	1139.04	809.13	22	36	-1	14.54	14.54
Fixation R	1	8	3992417576	3992596573	178997	1139.04	809.13	22	36	-1	15.14	15.14
