[BeGaze]
Converted from:	C:\Documents and Settings\iViewX\Desktop\EXPERIMENTATIONS\Experiments\results\finaleart\S22H22551-finaleart-1.idf
Date:	27.03.2019 15:59:02
Version:	BeGaze 2.5.77
Sample Rate:	50
Subject:	S22H22551
Description:	Mathieu Chambre

Table Header for Fixations:
Event Type	Trial	Number	Start	End	Duration	Location X	Location Y	Dispersion X	Dispersion Y	Plane	Avg. Pupil Size X	Avg. Pupil Size Y

Table Header for Saccades:
Event Type	Trial	Number	Start	End	Duration	Start Loc.X	Start Loc.Y	End Loc.X	End Loc.Y	Amplitude	Peak Speed	Peak Speed At	Average Speed	Peak Accel.	Peak Decel.	Average Accel.

Table Header for Blinks:
Event Type	Trial	Number	Start	End	Duration

Table Header for User Events:
Event Type	Trial	Number	Start	Description

UserEvent	1	1	5837196508	# Message: void.jpg
Fixation L	1	1	5837196740	5837296206	99466	1157.09	389.87	6	4	-1	16.33	16.33
Fixation R	1	1	5837196740	5837296206	99466	1157.09	389.87	6	4	-1	15.39	15.39
Saccade L	1	1	5837296206	5837335948	39742	1154.42	391.98	925.85	454.06	2.01	123.99	0.50	50.49	3065.43	-2864.74	2790.64
Saccade R	1	1	5837296206	5837335948	39742	1154.42	391.98	925.85	454.06	2.01	123.99	0.50	50.49	3065.43	-2864.74	2790.64
Fixation L	1	2	5837335948	5837674057	338109	930.37	455.89	58	22	-1	16.34	16.34
Fixation R	1	2	5837335948	5837674057	338109	930.37	455.89	58	22	-1	15.84	15.84
Saccade L	1	2	5837674057	5837693927	19870	984.48	444.81	1027.26	439.80	0.53	58.98	0.00	26.71	1063.53	-1392.42	1174.45
Saccade R	1	2	5837674057	5837693927	19870	984.48	444.81	1027.26	439.80	0.53	58.98	0.00	26.71	1063.53	-1392.42	1174.45
Fixation L	1	3	5837693927	5837833176	139249	1030.90	438.41	6	17	-1	15.92	15.92
Fixation R	1	3	5837693927	5837833176	139249	1030.90	438.41	6	17	-1	15.58	15.58
Blink L	1	1	5837833176	5837972416	139240
Blink R	1	1	5837833176	5837972416	139240
Fixation L	1	4	5837972416	5839106109	1133693	1048.65	415.95	53	37	-1	17.67	17.67
Fixation R	1	4	5837972416	5839106109	1133693	1048.65	415.95	53	37	-1	17.39	17.39
Saccade L	1	3	5839106109	5839185730	79621	1013.77	409.17	1008.14	407.28	0.55	12.57	0.25	6.90	206.55	-197.90	110.10
Saccade R	1	3	5839106109	5839185730	79621	1013.77	409.17	1008.14	407.28	0.55	12.57	0.25	6.90	206.55	-197.90	110.10
