[BeGaze]
Converted from:	C:\Documents and Settings\iViewX\Desktop\EXPERIMENTATIONS\Experiments\results\finaleart\S01A22542-finaleart-1.idf
Date:	27.03.2019 15:33:15
Version:	BeGaze 2.5.77
Sample Rate:	50
Subject:	S01A22542
Description:	Thibault Seve Minnaert

Table Header for Fixations:
Event Type	Trial	Number	Start	End	Duration	Location X	Location Y	Dispersion X	Dispersion Y	Plane	Avg. Pupil Size X	Avg. Pupil Size Y

Table Header for Saccades:
Event Type	Trial	Number	Start	End	Duration	Start Loc.X	Start Loc.Y	End Loc.X	End Loc.Y	Amplitude	Peak Speed	Peak Speed At	Average Speed	Peak Accel.	Peak Decel.	Average Accel.

Table Header for Blinks:
Event Type	Trial	Number	Start	End	Duration

Table Header for User Events:
Event Type	Trial	Number	Start	Description

UserEvent	1	1	8638866631	# Message: void.jpg
Fixation L	1	1	8638871507	8639309230	437723	950.40	155.39	21	56	-1	13.44	13.44
Fixation R	1	1	8638871507	8639309230	437723	950.40	155.39	21	56	-1	13.56	13.56
Saccade L	1	1	8639309230	8639348981	39751	962.19	188.57	998.22	383.44	2.11	168.84	0.50	53.08	4062.45	-3077.04	1938.81
Saccade R	1	1	8639309230	8639348981	39751	962.19	188.57	998.22	383.44	2.11	168.84	0.50	53.08	4062.45	-3077.04	1938.81
Fixation L	1	2	8639348981	8639488261	139280	1020.38	433.53	33	65	-1	14.08	14.08
Fixation R	1	2	8639348981	8639488261	139280	1020.38	433.53	33	65	-1	14.38	14.38
Saccade L	1	2	8639488261	8639508147	19886	1031.69	443.77	1034.53	440.56	0.06	4.71	0.00	3.15	70.32	-66.69	64.44
Saccade R	1	2	8639488261	8639508147	19886	1031.69	443.77	1034.53	440.56	0.06	4.71	0.00	3.15	70.32	-66.69	64.44
Fixation L	1	3	8639508147	8640323803	815656	1035.61	455.27	31	63	-1	15.03	15.03
Fixation R	1	3	8639508147	8640323803	815656	1035.61	455.27	31	63	-1	15.25	15.25
Saccade L	1	3	8640323803	8640343802	19999	1008.75	496.39	951.61	496.91	0.48	57.80	1.00	23.87	1389.30	-1283.40	1035.05
Saccade R	1	3	8640323803	8640343802	19999	1008.75	496.39	951.61	496.91	0.48	57.80	1.00	23.87	1389.30	-1283.40	1035.05
Fixation L	1	4	8640343802	8640861032	517230	937.94	503.98	40	13	-1	15.44	15.44
Fixation R	1	4	8640343802	8640861032	517230	937.94	503.98	40	13	-1	16.03	16.03
