[BeGaze]
Converted from:	C:\Documents and Settings\iViewX\Desktop\EXPERIMENTATIONS\Experiments\results\finaleart\S7121223-finaleart-1.idf
Date:	27.03.2019 15:37:07
Version:	BeGaze 2.5.77
Sample Rate:	50
Subject:	S7121223
Description:	Gregoire pacreau

Table Header for Fixations:
Event Type	Trial	Number	Start	End	Duration	Location X	Location Y	Dispersion X	Dispersion Y	Plane	Avg. Pupil Size X	Avg. Pupil Size Y

Table Header for Saccades:
Event Type	Trial	Number	Start	End	Duration	Start Loc.X	Start Loc.Y	End Loc.X	End Loc.Y	Amplitude	Peak Speed	Peak Speed At	Average Speed	Peak Accel.	Peak Decel.	Average Accel.

Table Header for Blinks:
Event Type	Trial	Number	Start	End	Duration

Table Header for User Events:
Event Type	Trial	Number	Start	Description

UserEvent	1	1	4877151688	# Message: goya-Bodegones-con-pargos-dorados-1812.jpg
Fixation L	1	1	4877162580	4877540927	378347	845.25	509.33	14	72	-1	14.89	14.89
Fixation R	1	1	4877162580	4877540927	378347	845.25	509.33	14	72	-1	15.11	15.11
Saccade L	1	1	4877540927	4877560850	19923	857.42	574.43	871.58	583.66	0.49	72.03	0.00	24.78	370.96	-1606.85	763.34
Saccade R	1	1	4877540927	4877560850	19923	857.42	574.43	871.58	583.66	0.49	72.03	0.00	24.78	370.96	-1606.85	763.34
Fixation L	1	2	4877560850	4877939162	378312	884.54	584.47	40	56	-1	15.05	15.05
Fixation R	1	2	4877560850	4877939162	378312	884.54	584.47	40	56	-1	15.76	15.76
Saccade L	1	2	4877939162	4878018782	79620	864.83	594.99	580.48	604.78	3.49	151.41	1.00	43.83	3631.50	-3691.84	2336.51
Saccade R	1	2	4877939162	4878018782	79620	864.83	594.99	580.48	604.78	3.49	151.41	1.00	43.83	3631.50	-3691.84	2336.51
Fixation L	1	3	4878018782	4878596241	577459	578.62	621.08	6	27	-1	15.40	15.40
Fixation R	1	3	4878018782	4878596241	577459	578.62	621.08	6	27	-1	16.21	16.21
Saccade L	1	3	4878596241	4878636117	39876	576.40	632.13	587.09	843.99	1.82	113.75	1.00	45.73	2787.42	-2552.55	2522.47
Saccade R	1	3	4878596241	4878636117	39876	576.40	632.13	587.09	843.99	1.82	113.75	1.00	45.73	2787.42	-2552.55	2522.47
Fixation L	1	4	4878636117	4878934737	298620	612.43	826.78	38	25	-1	15.32	15.32
Fixation R	1	4	4878636117	4878934737	298620	612.43	826.78	38	25	-1	16.71	16.71
Saccade L	1	4	4878934737	4878974607	39870	625.70	832.17	1008.35	845.39	3.29	243.05	1.00	82.57	6047.40	-5754.14	4602.69
Saccade R	1	4	4878934737	4878974607	39870	625.70	832.17	1008.35	845.39	3.29	243.05	1.00	82.57	6047.40	-5754.14	4602.69
Fixation L	1	5	4878974607	4879273342	298735	1043.95	857.84	59	19	-1	14.98	14.98
Fixation R	1	5	4878974607	4879273342	298735	1043.95	857.84	59	19	-1	15.45	15.45
Saccade L	1	5	4879273342	4879293207	19865	1068.27	862.07	1105.15	865.38	0.36	37.46	1.00	17.92	906.13	-902.96	656.27
Saccade R	1	5	4879273342	4879293207	19865	1068.27	862.07	1105.15	865.38	0.36	37.46	1.00	17.92	906.13	-902.96	656.27
Fixation L	1	6	4879293207	4879472452	179245	1123.81	860.22	36	14	-1	14.11	14.11
Fixation R	1	6	4879293207	4879472452	179245	1123.81	860.22	36	14	-1	14.02	14.02
Saccade L	1	6	4879472452	4879492329	19877	1141.88	850.78	1262.37	735.17	1.13	168.88	1.00	57.09	4152.75	-4096.21	3002.94
Saccade R	1	6	4879472452	4879492329	19877	1141.88	850.78	1262.37	735.17	1.13	168.88	1.00	57.09	4152.75	-4096.21	3002.94
Fixation L	1	7	4879492329	4879671566	179237	1308.27	733.32	57	14	-1	14.08	14.08
Fixation R	1	7	4879492329	4879671566	179237	1308.27	733.32	57	14	-1	14.02	14.02
Saccade L	1	7	4879671566	4879691443	19877	1319.94	724.47	1336.30	701.86	0.21	28.23	1.00	10.51	624.38	-487.61	400.22
Saccade R	1	7	4879671566	4879691443	19877	1319.94	724.47	1336.30	701.86	0.21	28.23	1.00	10.51	624.38	-487.61	400.22
Fixation L	1	8	4879691443	4880089672	398229	1354.56	682.46	25	32	-1	14.55	14.55
Fixation R	1	8	4879691443	4880089672	398229	1354.56	682.46	25	32	-1	14.55	14.55
Saccade L	1	8	4880089672	4880129540	39868	1352.56	671.82	1350.48	828.43	1.38	81.13	1.00	34.49	1932.46	-1796.62	1770.97
Saccade R	1	8	4880089672	4880129540	39868	1352.56	671.82	1350.48	828.43	1.38	81.13	1.00	34.49	1932.46	-1796.62	1770.97
Fixation L	1	9	4880129540	4880886254	756714	1343.92	843.68	18	41	-1	15.94	15.94
Fixation R	1	9	4880129540	4880886254	756714	1343.92	843.68	18	41	-1	15.51	15.51
Saccade L	1	9	4880886254	4880925995	39741	1338.92	822.92	1092.85	823.69	2.11	147.73	1.00	53.00	3647.65	-3529.17	2994.16
Saccade R	1	9	4880886254	4880925995	39741	1338.92	822.92	1092.85	823.69	2.11	147.73	1.00	53.00	3647.65	-3529.17	2994.16
Fixation L	1	10	4880925995	4881145119	219124	1072.72	818.88	28	10	-1	16.26	16.26
Fixation R	1	10	4880925995	4881145119	219124	1072.72	818.88	28	10	-1	16.47	16.47
