[BeGaze]
Converted from:	C:\Documents and Settings\iViewX\Desktop\EXPERIMENTATIONS\Experiments\results\finaleart\S18F56223-finaleart-1.idf
Date:	27.03.2019 15:48:40
Version:	BeGaze 2.5.77
Sample Rate:	50
Subject:	S18F56223
Description:	Pascale Sebillot

Table Header for Fixations:
Event Type	Trial	Number	Start	End	Duration	Location X	Location Y	Dispersion X	Dispersion Y	Plane	Avg. Pupil Size X	Avg. Pupil Size Y

Table Header for Saccades:
Event Type	Trial	Number	Start	End	Duration	Start Loc.X	Start Loc.Y	End Loc.X	End Loc.Y	Amplitude	Peak Speed	Peak Speed At	Average Speed	Peak Accel.	Peak Decel.	Average Accel.

Table Header for Blinks:
Event Type	Trial	Number	Start	End	Duration

Table Header for User Events:
Event Type	Trial	Number	Start	Description

UserEvent	1	1	2507248815	# Message: madrazo-y-kuntz-Man-Holding-a-Dagger-1850.jpg
Fixation L	1	1	2507252093	2507689700	437607	936.50	637.01	25	33	-1	16.17	16.17
Fixation R	1	1	2507252093	2507689700	437607	936.50	637.01	25	33	-1	14.65	14.65
Saccade L	1	1	2507689700	2507709573	19873	955.11	619.13	1223.40	421.74	1.84	336.56	1.00	92.69	8278.04	-7594.51	5429.93
Saccade R	1	1	2507689700	2507709573	19873	955.11	619.13	1223.40	421.74	1.84	336.56	1.00	92.69	8278.04	-7594.51	5429.93
Fixation L	1	2	2507709573	2507968178	258605	1245.44	396.27	29	41	-1	15.71	15.71
Fixation R	1	2	2507709573	2507968178	258605	1245.44	396.27	29	41	-1	14.10	14.10
Saccade L	1	2	2507968178	2508007920	39742	1251.37	395.41	1123.96	726.51	3.42	225.41	1.00	86.17	5444.87	-4958.18	4020.03
Saccade R	1	2	2507968178	2508007920	39742	1251.37	395.41	1123.96	726.51	3.42	225.41	1.00	86.17	5444.87	-4958.18	4020.03
Fixation L	1	3	2508007920	2508167047	159127	1124.55	696.83	7	49	-1	14.16	14.16
Fixation R	1	3	2508007920	2508167047	159127	1124.55	696.83	7	49	-1	12.50	12.50
Saccade L	1	3	2508167047	2508206792	39745	1122.48	697.50	777.44	777.49	3.07	218.36	0.50	77.28	5401.74	-4861.42	4271.80
Saccade R	1	3	2508167047	2508206792	39745	1122.48	697.50	777.44	777.49	3.07	218.36	0.50	77.28	5401.74	-4861.42	4271.80
Fixation L	1	4	2508206792	2508485284	278492	793.26	774.11	28	41	-1	14.41	14.41
Fixation R	1	4	2508206792	2508485284	278492	793.26	774.11	28	41	-1	12.78	12.78
Saccade L	1	4	2508485284	2508505156	19872	806.07	769.15	1111.74	862.21	1.84	322.90	1.00	92.59	7968.20	-7758.43	5393.22
Saccade R	1	4	2508485284	2508505156	19872	806.07	769.15	1111.74	862.21	1.84	322.90	1.00	92.59	7968.20	-7758.43	5393.22
Fixation L	1	5	2508505156	2508843262	338106	1093.39	839.57	30	53	-1	14.11	14.11
Fixation R	1	5	2508505156	2508843262	338106	1093.39	839.57	30	53	-1	12.80	12.80
Saccade L	1	5	2508843262	2508863142	19880	1111.97	825.07	1162.14	824.21	0.39	50.77	1.00	19.42	1244.81	-925.50	907.03
Saccade R	1	5	2508843262	2508863142	19880	1111.97	825.07	1162.14	824.21	0.39	50.77	1.00	19.42	1244.81	-925.50	907.03
Fixation L	1	6	2508863142	2509280875	417733	1158.26	824.85	48	29	-1	13.87	13.87
Fixation R	1	6	2508863142	2509280875	417733	1158.26	824.85	48	29	-1	12.91	12.91
Saccade L	1	6	2509280875	2509340492	59617	1122.88	835.59	797.53	353.74	6.55	284.90	0.33	109.94	7074.03	-4447.54	4375.91
Saccade R	1	6	2509280875	2509340492	59617	1122.88	835.59	797.53	353.74	6.55	284.90	0.33	109.94	7074.03	-4447.54	4375.91
Fixation L	1	7	2509340492	2509439987	99495	785.89	357.86	21	26	-1	14.00	14.00
Fixation R	1	7	2509340492	2509439987	99495	785.89	357.86	21	26	-1	12.51	12.51
Saccade L	1	7	2509439987	2509459876	19889	796.35	341.56	756.89	276.48	0.62	76.99	1.00	31.23	1762.57	-1117.54	1143.17
Saccade R	1	7	2509439987	2509459876	19889	796.35	341.56	756.89	276.48	0.62	76.99	1.00	31.23	1762.57	-1117.54	1143.17
Fixation L	1	8	2509459876	2509837850	377974	740.81	255.53	27	51	-1	13.20	13.20
Fixation R	1	8	2509459876	2509837850	377974	740.81	255.53	27	51	-1	12.21	12.21
Saccade L	1	8	2509837850	2509877593	39743	743.32	287.35	432.11	641.56	4.38	247.51	1.00	110.24	5724.21	-5756.55	5414.27
Saccade R	1	8	2509837850	2509877593	39743	743.32	287.35	432.11	641.56	4.38	247.51	1.00	110.24	5724.21	-5756.55	5414.27
Fixation L	1	9	2509877593	2510056591	178998	434.91	666.17	31	42	-1	13.16	13.16
Fixation R	1	9	2509877593	2510056591	178998	434.91	666.17	31	42	-1	12.66	12.66
Saccade L	1	9	2510056591	2510076459	19868	424.16	656.61	401.89	626.74	0.32	37.69	1.00	15.89	616.74	-687.04	441.38
Saccade R	1	9	2510056591	2510076459	19868	424.16	656.61	401.89	626.74	0.32	37.69	1.00	15.89	616.74	-687.04	441.38
Fixation L	1	10	2510076459	2510235579	159120	408.50	626.00	15	11	-1	13.42	13.42
Fixation R	1	10	2510076459	2510235579	159120	408.50	626.00	15	11	-1	13.04	13.04
Saccade L	1	10	2510235579	2510275331	39752	409.61	626.76	355.71	738.07	1.75	136.18	0.50	43.95	3331.45	-2137.38	1543.86
Saccade R	1	10	2510235579	2510275331	39752	409.61	626.76	355.71	738.07	1.75	136.18	0.50	43.95	3331.45	-2137.38	1543.86
Fixation L	1	11	2510275331	2510394700	119369	313.41	728.82	56	24	-1	13.52	13.52
Fixation R	1	11	2510275331	2510394700	119369	313.41	728.82	56	24	-1	13.29	13.29
Saccade L	1	11	2510394700	2510414569	19869	300.97	717.28	281.82	687.58	0.50	35.75	1.00	25.01	436.82	-15.81	233.72
Saccade R	1	11	2510394700	2510414569	19869	300.97	717.28	281.82	687.58	0.50	35.75	1.00	25.01	436.82	-15.81	233.72
Fixation L	1	12	2510414569	2510514071	99502	285.49	687.47	35	37	-1	14.00	14.00
Fixation R	1	12	2510414569	2510514071	99502	285.49	687.47	35	37	-1	13.54	13.54
Saccade L	1	12	2510514071	2510553822	39751	291.24	688.55	282.68	690.26	1.58	83.92	1.00	39.82	1971.14	-2037.86	1767.96
Saccade R	1	12	2510514071	2510553822	39751	291.24	688.55	282.68	690.26	1.58	83.92	1.00	39.82	1971.14	-2037.86	1767.96
Fixation L	1	13	2510553822	2510911939	358117	285.15	685.99	56	35	-1	14.51	14.51
Fixation R	1	13	2510553822	2510911939	358117	285.15	685.99	56	35	-1	14.13	14.13
Saccade L	1	13	2510911939	2511031177	119238	326.51	708.40	327.78	371.60	6.11	181.78	0.83	51.24	4238.49	-4004.53	2064.64
Saccade R	1	13	2510911939	2511031177	119238	326.51	708.40	327.78	371.60	6.11	181.78	0.83	51.24	4238.49	-4004.53	2064.64
Fixation L	1	14	2511031177	2511250059	218882	336.72	414.50	15	67	-1	15.23	15.23
Fixation R	1	14	2511031177	2511250059	218882	336.72	414.50	15	67	-1	14.64	14.64
