[BeGaze]
Converted from:	C:\Documents and Settings\iViewX\Desktop\EXPERIMENTATIONS\Experiments\results\finaleart\S22H22551-finaleart-1.idf
Date:	27.03.2019 15:59:08
Version:	BeGaze 2.5.77
Sample Rate:	50
Subject:	S22H22551
Description:	Mathieu Chambre

Table Header for Fixations:
Event Type	Trial	Number	Start	End	Duration	Location X	Location Y	Dispersion X	Dispersion Y	Plane	Avg. Pupil Size X	Avg. Pupil Size Y

Table Header for Saccades:
Event Type	Trial	Number	Start	End	Duration	Start Loc.X	Start Loc.Y	End Loc.X	End Loc.Y	Amplitude	Peak Speed	Peak Speed At	Average Speed	Peak Accel.	Peak Decel.	Average Accel.

Table Header for Blinks:
Event Type	Trial	Number	Start	End	Duration

Table Header for User Events:
Event Type	Trial	Number	Start	Description

UserEvent	1	1	5880079096	# Message: void.jpg
Fixation L	1	1	5880079355	5880556827	477472	1306.25	278.26	17	66	-1	14.99	14.99
Fixation R	1	1	5880079355	5880556827	477472	1306.25	278.26	17	66	-1	14.41	14.41
Blink L	1	1	5880556827	5880755688	198861
Blink R	1	1	5880556827	5880755688	198861
Saccade L	1	1	5880755688	5880835200	79512	1232.77	191.21	1222.76	213.96	2.04	91.49	1.00	25.72	30781.31	-1129.78	5757.18
Saccade R	1	1	5880755688	5880835200	79512	1232.77	191.21	1222.76	213.96	2.04	91.49	1.00	25.72	30781.31	-1129.78	5757.18
Blink L	1	2	5880835200	5881113677	278477
Blink R	1	2	5880835200	5881034174	198974
Saccade R	1	2	5881034174	5881054044	19870	1113.17	178.05	1162.42	197.41	6.15	1125.60	1.00	309.48	651.41	-26801.73	9415.66
Fixation R	1	2	5881054044	5881332407	278363	1147.39	249.15	23	75	-1	15.55	15.55
Fixation L	1	2	5881113677	5881869509	755832	1136.54	270.25	48	43	-1	16.10	16.10
Saccade R	1	3	5881332407	5881352403	19996	1142.31	273.11	1141.57	274.85	0.06	6.13	0.00	2.82	47.38	-75.50	55.66
Fixation R	1	3	5881352403	5882068376	715973	1119.21	272.67	62	27	-1	15.00	15.00
Saccade L	1	2	5881869509	5881889382	19873	1104.00	260.90	1094.08	261.08	0.15	13.05	1.00	7.44	-50.75	-75.19	59.43
Fixation L	1	3	5881889382	5882068376	178994	1084.68	260.64	15	5	-1	14.63	14.63
