[BeGaze]
Converted from:	C:\Documents and Settings\iViewX\Desktop\EXPERIMENTATIONS\Experiments\results\finaleart\S7121223-finaleart-1.idf
Date:	27.03.2019 15:37:00
Version:	BeGaze 2.5.77
Sample Rate:	50
Subject:	S7121223
Description:	Gregoire pacreau

Table Header for Fixations:
Event Type	Trial	Number	Start	End	Duration	Location X	Location Y	Dispersion X	Dispersion Y	Plane	Avg. Pupil Size X	Avg. Pupil Size Y

Table Header for Saccades:
Event Type	Trial	Number	Start	End	Duration	Start Loc.X	Start Loc.Y	End Loc.X	End Loc.Y	Amplitude	Peak Speed	Peak Speed At	Average Speed	Peak Accel.	Peak Decel.	Average Accel.

Table Header for Blinks:
Event Type	Trial	Number	Start	End	Duration

Table Header for User Events:
Event Type	Trial	Number	Start	Description

UserEvent	1	1	4767295305	# Message: REJECTED_cezanne-still-life-with-green-pot-and-pewter-1870.jpg
Fixation L	1	1	4767305039	4767723308	418269	915.97	593.18	12	28	-1	14.56	14.56
Fixation R	1	1	4767305039	4767723308	418269	915.97	593.18	12	28	-1	14.54	14.54
Saccade L	1	1	4767723308	4767743176	19868	921.88	606.87	924.68	670.56	0.42	64.49	1.00	21.21	1513.58	-845.23	886.44
Saccade R	1	1	4767723308	4767743176	19868	921.88	606.87	924.68	670.56	0.42	64.49	1.00	21.21	1513.58	-845.23	886.44
Fixation L	1	2	4767743176	4767862648	119472	914.63	699.80	23	70	-1	14.98	14.98
Fixation R	1	2	4767743176	4767862648	119472	914.63	699.80	23	70	-1	15.11	15.11
Saccade L	1	2	4767862648	4767882515	19867	903.05	727.11	902.83	734.16	0.17	16.00	1.00	8.35	196.30	125.79	151.34
Saccade R	1	2	4767862648	4767882515	19867	903.05	727.11	902.83	734.16	0.17	16.00	1.00	8.35	196.30	125.79	151.34
Fixation L	1	3	4767882515	4768499848	617333	899.83	721.73	71	26	-1	13.74	13.74
Fixation R	1	3	4767882515	4768499848	617333	899.83	721.73	71	26	-1	13.36	13.36
Saccade L	1	3	4768499848	4768539711	39863	935.02	721.12	1098.19	706.00	1.36	161.80	1.00	34.04	4033.14	-3860.29	2007.67
Saccade R	1	3	4768499848	4768539711	39863	935.02	721.12	1098.19	706.00	1.36	161.80	1.00	34.04	4033.14	-3860.29	2007.67
Fixation L	1	4	4768539711	4769077313	537602	1100.13	693.53	30	50	-1	12.98	12.98
Fixation R	1	4	4768539711	4769077313	537602	1100.13	693.53	30	50	-1	12.38	12.38
Saccade L	1	4	4769077313	4769097190	19877	1074.36	683.67	985.69	682.90	0.65	89.70	1.00	32.88	2203.27	-2122.86	1492.74
Saccade R	1	4	4769077313	4769097190	19877	1074.36	683.67	985.69	682.90	0.65	89.70	1.00	32.88	2203.27	-2122.86	1492.74
Fixation L	1	5	4769097190	4769296300	199110	993.59	691.33	15	13	-1	13.87	13.87
Fixation R	1	5	4769097190	4769296300	199110	993.59	691.33	15	13	-1	13.43	13.43
Saccade L	1	5	4769296300	4769316301	20001	990.07	694.50	910.84	686.67	0.50	80.53	1.00	25.18	2008.03	-1914.11	1440.60
Saccade R	1	5	4769296300	4769316301	20001	990.07	694.50	910.84	686.67	0.50	80.53	1.00	25.18	2008.03	-1914.11	1440.60
Fixation L	1	6	4769316301	4769595038	278737	905.17	674.57	18	21	-1	13.93	13.93
Fixation R	1	6	4769316301	4769595038	278737	905.17	674.57	18	21	-1	13.49	13.49
Saccade L	1	6	4769595038	4769634905	39867	899.60	665.90	1024.29	421.30	2.35	186.39	1.00	58.99	4479.45	-4596.70	3431.58
Saccade R	1	6	4769595038	4769634905	39867	899.60	665.90	1024.29	421.30	2.35	186.39	1.00	58.99	4479.45	-4596.70	3431.58
Fixation L	1	7	4769634905	4769913645	278740	1022.06	418.58	8	9	-1	13.39	13.39
Fixation R	1	7	4769634905	4769913645	278740	1022.06	418.58	8	9	-1	13.02	13.02
Saccade L	1	7	4769913645	4769953515	39870	1018.57	423.92	1266.02	425.83	2.22	161.13	0.50	55.75	3984.78	-3465.18	2917.51
Saccade R	1	7	4769913645	4769953515	39870	1018.57	423.92	1266.02	425.83	2.22	161.13	0.50	55.75	3984.78	-3465.18	2917.51
Fixation L	1	8	4769953515	4770491123	537608	1295.78	439.02	34	56	-1	13.51	13.51
Fixation R	1	8	4769953515	4770491123	537608	1295.78	439.02	34	56	-1	13.32	13.32
Saccade L	1	8	4770491123	4770510987	19864	1298.15	481.47	1295.49	497.12	0.14	16.07	1.00	7.15	167.74	-186.41	129.18
Saccade R	1	8	4770491123	4770510987	19864	1298.15	481.47	1295.49	497.12	0.14	16.07	1.00	7.15	167.74	-186.41	129.18
Fixation L	1	9	4770510987	4770929226	418239	1306.11	524.30	37	54	-1	14.32	14.32
Fixation R	1	9	4770510987	4770929226	418239	1306.11	524.30	37	54	-1	13.90	13.90
Saccade L	1	9	4770929226	4770968970	39744	1329.45	540.79	1426.47	522.07	1.14	60.06	0.50	28.72	1416.53	-762.96	935.40
Saccade R	1	9	4770929226	4770968970	39744	1329.45	540.79	1426.47	522.07	1.14	60.06	0.50	28.72	1416.53	-762.96	935.40
Fixation L	1	10	4770968970	4771128332	159362	1440.98	491.40	23	55	-1	15.09	15.09
Fixation R	1	10	4770968970	4771128332	159362	1440.98	491.40	23	55	-1	14.34	14.34
Saccade L	1	10	4771128332	4771148209	19877	1449.74	466.18	1457.76	423.58	0.54	43.86	1.00	27.28	1039.77	-907.28	726.74
Saccade R	1	10	4771128332	4771148209	19877	1449.74	466.18	1457.76	423.58	0.54	43.86	1.00	27.28	1039.77	-907.28	726.74
Fixation L	1	11	4771148209	4771287567	139358	1460.72	447.15	15	35	-1	14.70	14.70
Fixation R	1	11	4771148209	4771287567	139358	1460.72	447.15	15	35	-1	14.21	14.21
