[BeGaze]
Converted from:	C:\Documents and Settings\iViewX\Desktop\EXPERIMENTATIONS\Experiments\results\finaleart\S5121332-finaleart-1.idf
Date:	27.03.2019 15:35:21
Version:	BeGaze 2.5.77
Sample Rate:	50
Subject:	S5121332
Description:	Dylan Marinho

Table Header for Fixations:
Event Type	Trial	Number	Start	End	Duration	Location X	Location Y	Dispersion X	Dispersion Y	Plane	Avg. Pupil Size X	Avg. Pupil Size Y

Table Header for Saccades:
Event Type	Trial	Number	Start	End	Duration	Start Loc.X	Start Loc.Y	End Loc.X	End Loc.Y	Amplitude	Peak Speed	Peak Speed At	Average Speed	Peak Accel.	Peak Decel.	Average Accel.

Table Header for Blinks:
Event Type	Trial	Number	Start	End	Duration

Table Header for User Events:
Event Type	Trial	Number	Start	Description

UserEvent	1	1	9901046887	# Message: Courbet-Femme-nue-couchee-1862.jpg
Fixation L	1	1	9901054905	9901512371	457466	1016.56	500.37	46	24	-1	16.76	16.76
Fixation R	1	1	9901054905	9901512371	457466	1016.56	500.37	46	24	-1	16.67	16.67
Saccade L	1	1	9901512371	9901552119	39748	1009.46	500.55	1214.80	607.94	2.04	119.39	1.00	51.23	2930.70	-2889.03	2771.83
Saccade R	1	1	9901512371	9901552119	39748	1009.46	500.55	1214.80	607.94	2.04	119.39	1.00	51.23	2930.70	-2889.03	2771.83
Fixation L	1	2	9901552119	9901770861	218742	1212.35	601.04	12	13	-1	15.93	15.93
Fixation R	1	2	9901552119	9901770861	218742	1212.35	601.04	12	13	-1	15.84	15.84
Saccade L	1	2	9901770861	9901810740	39879	1210.22	603.08	946.73	779.53	3.03	206.30	1.00	75.98	5090.14	-5085.39	3670.80
Saccade R	1	2	9901770861	9901810740	39879	1210.22	603.08	946.73	779.53	3.03	206.30	1.00	75.98	5090.14	-5085.39	3670.80
Fixation L	1	3	9901810740	9902347691	536951	912.67	789.99	48	49	-1	15.89	15.89
Fixation R	1	3	9901810740	9902347691	536951	912.67	789.99	48	49	-1	15.91	15.91
Saccade L	1	3	9902347691	9902367575	19884	948.47	775.87	953.05	776.08	0.10	7.71	0.00	5.14	-14.41	-118.12	69.27
Saccade R	1	3	9902347691	9902367575	19884	948.47	775.87	953.05	776.08	0.10	7.71	0.00	5.14	-14.41	-118.12	69.27
Fixation L	1	4	9902367575	9902705802	338227	996.38	785.23	78	18	-1	16.14	16.14
Fixation R	1	4	9902367575	9902705802	338227	996.38	785.23	78	18	-1	16.39	16.39
Saccade L	1	4	9902705802	9902745549	39747	1031.35	793.18	1272.94	668.52	2.35	191.31	0.50	59.08	4720.67	-4702.98	3333.98
Saccade R	1	4	9902705802	9902745549	39747	1031.35	793.18	1272.94	668.52	2.35	191.31	0.50	59.08	4720.67	-4702.98	3333.98
Fixation L	1	5	9902745549	9902924528	178979	1267.33	672.23	10	39	-1	16.22	16.22
Fixation R	1	5	9902745549	9902924528	178979	1267.33	672.23	10	39	-1	16.30	16.30
Saccade L	1	5	9902924528	9902944408	19880	1269.98	642.41	1294.34	545.53	0.71	101.05	1.00	35.95	2497.13	-2414.89	1925.41
Saccade R	1	5	9902924528	9902944408	19880	1269.98	642.41	1294.34	545.53	0.71	101.05	1.00	35.95	2497.13	-2414.89	1925.41
Fixation L	1	6	9902944408	9903262647	318239	1301.65	549.62	14	12	-1	16.02	16.02
Fixation R	1	6	9902944408	9903262647	318239	1301.65	549.62	14	12	-1	16.16	16.16
Blink L	1	1	9903262647	9903342260	79613
Blink R	1	1	9903262647	9903382014	119367
Fixation L	1	7	9903362130	9903541129	178999	891.43	254.44	39	55	-1	15.98	15.98
Fixation R	1	7	9903382014	9903739980	357966	886.79	272.52	20	72	-1	15.44	15.44
Saccade L	1	6	9903541129	9903560998	19869	885.45	272.58	885.86	279.28	0.08	6.78	1.00	3.92	86.91	-134.53	73.82
Fixation L	1	8	9903560998	9903739980	178982	885.69	285.06	5	14	-1	16.15	16.15
Saccade L	1	7	9903739980	9903779726	39746	886.31	292.10	716.26	484.88	2.38	196.76	1.00	59.80	4895.69	-4654.20	2944.97
Saccade R	1	6	9903739980	9903779726	39746	886.31	292.10	716.26	484.88	2.38	196.76	1.00	59.80	4895.69	-4654.20	2944.97
Fixation L	1	9	9903779726	9904336699	556973	709.89	496.87	33	44	-1	16.88	16.88
Fixation R	1	8	9903779726	9904336699	556973	709.89	496.87	33	44	-1	16.22	16.22
Saccade L	1	8	9904336699	9904356579	19880	684.85	511.44	558.16	521.49	0.89	128.54	1.00	44.90	3144.74	-2811.53	2044.29
Saccade R	1	7	9904336699	9904356579	19880	684.85	511.44	558.16	521.49	0.89	128.54	1.00	44.90	3144.74	-2811.53	2044.29
Fixation L	1	10	9904356579	9904575428	218849	549.53	563.82	14	66	-1	16.75	16.75
Fixation R	1	9	9904356579	9904575428	218849	549.53	563.82	14	66	-1	15.92	15.92
Saccade L	1	9	9904575428	9904595305	19877	548.39	588.08	683.72	602.60	0.87	137.66	1.00	44.02	3323.20	-3389.31	2438.46
Saccade R	1	8	9904575428	9904595305	19877	548.39	588.08	683.72	602.60	0.87	137.66	1.00	44.02	3323.20	-3389.31	2438.46
Fixation L	1	11	9904595305	9904814038	218733	711.16	610.51	56	27	-1	16.69	16.69
Fixation R	1	10	9904595305	9904814038	218733	711.16	610.51	56	27	-1	16.08	16.08
Saccade L	1	10	9904814038	9904853792	39754	740.01	624.65	954.77	831.44	2.74	237.89	0.50	68.98	5882.70	-5655.09	3474.87
Saccade R	1	9	9904814038	9904853792	39754	740.01	624.65	954.77	831.44	2.74	237.89	0.50	68.98	5882.70	-5655.09	3474.87
Fixation L	1	12	9904853792	9905072656	218864	961.90	833.65	9	13	-1	17.09	17.09
Fixation R	1	11	9904853792	9905072656	218864	961.90	833.65	9	13	-1	16.27	16.27
