[BeGaze]
Converted from:	C:\Documents and Settings\iViewX\Desktop\EXPERIMENTATIONS\Experiments\results\finaleart\S14F27123-finaleart-1.idf
Date:	27.03.2019 15:44:11
Version:	BeGaze 2.5.77
Sample Rate:	50
Subject:	S14F27123
Description:	Anne-flore Perrin

Table Header for Fixations:
Event Type	Trial	Number	Start	End	Duration	Location X	Location Y	Dispersion X	Dispersion Y	Plane	Avg. Pupil Size X	Avg. Pupil Size Y

Table Header for Saccades:
Event Type	Trial	Number	Start	End	Duration	Start Loc.X	Start Loc.Y	End Loc.X	End Loc.Y	Amplitude	Peak Speed	Peak Speed At	Average Speed	Peak Accel.	Peak Decel.	Average Accel.

Table Header for Blinks:
Event Type	Trial	Number	Start	End	Duration

Table Header for User Events:
Event Type	Trial	Number	Start	Description

UserEvent	1	1	31776281577	# Message: void.jpg
Fixation L	1	1	31776282993	31776442290	159297	976.65	468.58	3	31	-1	13.38	13.38
Fixation R	1	1	31776282993	31776442290	159297	976.65	468.58	3	31	-1	14.07	14.07
Saccade L	1	1	31776442290	31776461999	19709	978.57	460.75	731.72	473.07	1.42	249.87	1.00	71.90	6038.84	-5630.28	4092.77
Saccade R	1	1	31776442290	31776461999	19709	978.57	460.75	731.72	473.07	1.42	249.87	1.00	71.90	6038.84	-5630.28	4092.77
Fixation L	1	2	31776461999	31776760326	298327	745.15	479.27	23	19	-1	13.66	13.66
Fixation R	1	2	31776461999	31776760326	298327	745.15	479.27	23	19	-1	14.37	14.37
Blink L	1	1	31776760326	31776859823	99497
Blink R	1	1	31776760326	31776859823	99497
Blink L	1	2	31776879705	31777237687	357982
Blink R	1	2	31776879705	31777237687	357982
Blink L	1	3	31777257558	31777416677	159119
Blink R	1	3	31777257558	31777416677	159119
Fixation L	1	3	31777476441	31777635545	159104	754.41	716.31	9	19	-1	12.23	12.23
Fixation R	1	3	31777476441	31777635545	159104	754.41	716.31	9	19	-1	12.62	12.62
Blink L	1	4	31777635545	31777774781	139236
Blink R	1	4	31777635545	31777774781	139236
Saccade L	1	2	31777774781	31777834412	59631	653.35	1014.93	657.63	1022.12	24.25	1211.16	1.00	406.73	30146.34	-29774.28	12050.23
Saccade R	1	2	31777774781	31777834412	59631	653.35	1014.93	657.63	1022.12	24.25	1211.16	1.00	406.73	30146.34	-29774.28	12050.23
Blink L	1	5	31777834412	31777933904	99492
Blink R	1	5	31777834412	31777933904	99492
Blink L	1	6	31777933904	31778013403	79499
Blink R	1	6	31777933904	31778013403	79499
