[BeGaze]
Converted from:	C:\Documents and Settings\iViewX\Desktop\EXPERIMENTATIONS\Experiments\results\finaleart\S12H22222-finaleart-1.idf
Date:	27.03.2019 15:40:04
Version:	BeGaze 2.5.77
Sample Rate:	50
Subject:	S12H22222
Description:	aurele barriere

Table Header for Fixations:
Event Type	Trial	Number	Start	End	Duration	Location X	Location Y	Dispersion X	Dispersion Y	Plane	Avg. Pupil Size X	Avg. Pupil Size Y

Table Header for Saccades:
Event Type	Trial	Number	Start	End	Duration	Start Loc.X	Start Loc.Y	End Loc.X	End Loc.Y	Amplitude	Peak Speed	Peak Speed At	Average Speed	Peak Accel.	Peak Decel.	Average Accel.

Table Header for Blinks:
Event Type	Trial	Number	Start	End	Duration

Table Header for User Events:
Event Type	Trial	Number	Start	Description

UserEvent	1	1	23103397934	# Message: courbet_Femme_nue_et_dormant_1858.jpg
Fixation L	1	1	23103414787	23103753070	338283	925.85	503.47	5	18	-1	15.36	15.36
Fixation R	1	1	23103414787	23103753070	338283	925.85	503.47	5	18	-1	15.15	15.15
Saccade L	1	1	23103753070	23103792780	39710	927.07	516.10	1231.69	599.22	2.73	166.47	1.00	68.86	4065.23	-4040.96	3942.51
Saccade R	1	1	23103753070	23103792780	39710	927.07	516.10	1231.69	599.22	2.73	166.47	1.00	68.86	4065.23	-4040.96	3942.51
Fixation L	1	2	23103792780	23104091117	298337	1223.68	605.41	63	35	-1	15.65	15.65
Fixation R	1	2	23103792780	23104091117	298337	1223.68	605.41	63	35	-1	15.21	15.21
Saccade L	1	2	23104091117	23104110985	19868	1178.48	611.98	1176.57	616.30	0.19	13.56	1.00	9.53	-56.73	-219.39	119.36
Saccade R	1	2	23104091117	23104110985	19868	1178.48	611.98	1176.57	616.30	0.19	13.56	1.00	9.53	-56.73	-219.39	119.36
Fixation L	1	3	23104110985	23104270104	159119	1165.15	626.11	50	24	-1	15.57	15.57
Fixation R	1	3	23104110985	23104270104	159119	1165.15	626.11	50	24	-1	15.14	15.14
Saccade L	1	3	23104270104	23104290001	19897	1126.28	640.37	1074.11	647.82	0.51	53.31	1.00	25.87	1275.08	-1224.94	1153.47
Saccade R	1	3	23104270104	23104290001	19897	1126.28	640.37	1074.11	647.82	0.51	53.31	1.00	25.87	1275.08	-1224.94	1153.47
Fixation L	1	4	23104290001	23104429223	139222	1066.91	657.61	10	17	-1	15.42	15.42
Fixation R	1	4	23104290001	23104429223	139222	1066.91	657.61	10	17	-1	15.12	15.12
Saccade L	1	4	23104429223	23104468976	39753	1063.22	665.15	1407.66	466.91	3.49	244.51	1.00	87.74	6018.00	-6015.21	5206.03
Saccade R	1	4	23104429223	23104468976	39753	1063.22	665.15	1407.66	466.91	3.49	244.51	1.00	87.74	6018.00	-6015.21	5206.03
Fixation L	1	5	23104468976	23105443558	974582	1368.24	474.29	64	29	-1	16.05	16.05
Fixation R	1	5	23104468976	23105443558	974582	1368.24	474.29	64	29	-1	15.56	15.56
Saccade L	1	5	23105443558	23105503299	59741	1348.63	489.23	700.64	438.73	6.71	269.30	0.33	112.30	6656.30	-6061.94	5080.13
Saccade R	1	5	23105443558	23105503299	59741	1348.63	489.23	700.64	438.73	6.71	269.30	0.33	112.30	6656.30	-6061.94	5080.13
Fixation L	1	6	23105503299	23105761791	258492	704.88	414.08	6	36	-1	17.82	17.82
Fixation R	1	6	23105503299	23105761791	258492	704.88	414.08	6	36	-1	17.10	17.10
Saccade L	1	6	23105761791	23105781785	19994	705.61	405.20	577.12	352.76	0.73	140.36	1.00	36.45	3475.95	-2965.68	2168.49
Saccade R	1	6	23105761791	23105781785	19994	705.61	405.20	577.12	352.76	0.73	140.36	1.00	36.45	3475.95	-2965.68	2168.49
Fixation L	1	7	23105781785	23106139776	357991	578.28	329.28	7	32	-1	17.80	17.80
Fixation R	1	7	23105781785	23106139776	357991	578.28	329.28	7	32	-1	17.31	17.31
Saccade L	1	7	23106139776	23106159646	19870	578.91	328.60	572.35	160.88	1.18	169.75	1.00	59.28	4172.58	-3620.28	3074.36
Saccade R	1	7	23106139776	23106159646	19870	578.91	328.60	572.35	160.88	1.18	169.75	1.00	59.28	4172.58	-3620.28	3074.36
Fixation L	1	8	23106159646	23106259145	99499	575.79	133.81	40	57	-1	17.22	17.22
Fixation R	1	8	23106159646	23106259145	99499	575.79	133.81	40	57	-1	16.90	16.90
Saccade L	1	8	23106259145	23106279029	19884	596.42	157.85	584.72	179.59	0.54	38.17	1.00	27.37	277.09	-329.85	225.21
Saccade R	1	8	23106259145	23106279029	19884	596.42	157.85	584.72	179.59	0.54	38.17	1.00	27.37	277.09	-329.85	225.21
Fixation L	1	9	23106279029	23106617132	338103	606.85	162.61	32	26	-1	17.91	17.91
Fixation R	1	9	23106279029	23106617132	338103	606.85	162.61	32	26	-1	17.50	17.50
Saccade L	1	9	23106617132	23106736500	119368	617.38	161.02	1474.08	311.58	15.21	385.57	0.17	127.39	9619.21	-7434.41	4911.64
Saccade R	1	9	23106617132	23106736500	119368	617.38	161.02	1474.08	311.58	15.21	385.57	0.17	127.39	9619.21	-7434.41	4911.64
Fixation L	1	10	23106736500	23106955237	218737	1475.78	278.62	38	60	-1	18.36	18.36
Fixation R	1	10	23106736500	23106955237	218737	1475.78	278.62	38	60	-1	18.15	18.15
Saccade L	1	10	23106955237	23107094492	139255	1494.89	280.13	1340.49	743.08	8.47	290.43	0.86	60.83	7181.16	-6258.53	2766.00
Saccade R	1	10	23106955237	23107094492	139255	1494.89	280.13	1340.49	743.08	8.47	290.43	0.86	60.83	7181.16	-6258.53	2766.00
Fixation L	1	11	23107094492	23107213863	119371	1372.37	742.76	39	13	-1	18.98	18.98
Fixation R	1	11	23107094492	23107213863	119371	1372.37	742.76	39	13	-1	17.90	17.90
Saccade L	1	11	23107213863	23107233725	19862	1379.65	735.36	1189.41	723.30	1.19	192.76	1.00	59.71	4715.50	-4032.67	3206.76
Saccade R	1	11	23107213863	23107233725	19862	1379.65	735.36	1189.41	723.30	1.19	192.76	1.00	59.71	4715.50	-4032.67	3206.76
Fixation L	1	12	23107233725	23107392844	159119	1195.62	701.75	9	40	-1	19.11	19.11
Fixation R	1	12	23107233725	23107392844	159119	1195.62	701.75	9	40	-1	17.88	17.88
