[BeGaze]
Converted from:	C:\Documents and Settings\iViewX\Desktop\EXPERIMENTATIONS\Experiments\results\finaleart\S5121332-finaleart-1.idf
Date:	27.03.2019 15:35:12
Version:	BeGaze 2.5.77
Sample Rate:	50
Subject:	S5121332
Description:	Dylan Marinho

Table Header for Fixations:
Event Type	Trial	Number	Start	End	Duration	Location X	Location Y	Dispersion X	Dispersion Y	Plane	Avg. Pupil Size X	Avg. Pupil Size Y

Table Header for Saccades:
Event Type	Trial	Number	Start	End	Duration	Start Loc.X	Start Loc.Y	End Loc.X	End Loc.Y	Amplitude	Peak Speed	Peak Speed At	Average Speed	Peak Accel.	Peak Decel.	Average Accel.

Table Header for Blinks:
Event Type	Trial	Number	Start	End	Duration

Table Header for User Events:
Event Type	Trial	Number	Start	Description

UserEvent	1	1	9580817731	# Message: Le-Restaurant-de-la-machine-a-Bougival-vlaminck-1905.jpg
Fixation L	1	1	9580825857	9581522062	696205	966.12	512.54	23	63	-1	15.00	15.00
Fixation R	1	1	9580825857	9581522062	696205	966.12	512.54	23	63	-1	14.81	14.81
Saccade L	1	1	9581522062	9581561800	39738	972.24	510.98	622.95	517.53	3.48	227.76	1.00	87.45	5529.94	-5262.33	3783.90
Saccade R	1	1	9581522062	9581561800	39738	972.24	510.98	622.95	517.53	3.48	227.76	1.00	87.45	5529.94	-5262.33	3783.90
Fixation L	1	2	9581561800	9581780532	218732	575.93	531.47	61	25	-1	14.67	14.67
Fixation R	1	2	9581561800	9581780532	218732	575.93	531.47	61	25	-1	14.80	14.80
Saccade L	1	2	9581780532	9581800407	19875	580.80	541.73	698.22	555.30	0.78	119.55	1.00	39.32	2722.41	-2762.54	1854.23
Saccade R	1	2	9581780532	9581800407	19875	580.80	541.73	698.22	555.30	0.78	119.55	1.00	39.32	2722.41	-2762.54	1854.23
Fixation L	1	3	9581800407	9581999398	198991	715.91	569.99	27	20	-1	15.14	15.14
Fixation R	1	3	9581800407	9581999398	198991	715.91	569.99	27	20	-1	15.35	15.35
Saccade L	1	3	9581999398	9582019279	19881	709.77	576.27	617.33	438.25	1.19	168.00	1.00	59.70	4143.93	-3842.21	2962.41
Saccade R	1	3	9581999398	9582019279	19881	709.77	576.27	617.33	438.25	1.19	168.00	1.00	59.70	4143.93	-3842.21	2962.41
Fixation L	1	4	9582019279	9582257888	238609	596.73	387.33	31	65	-1	15.50	15.50
Fixation R	1	4	9582019279	9582257888	238609	596.73	387.33	31	65	-1	15.89	15.89
Saccade L	1	4	9582257888	9582277762	19874	586.20	385.00	484.08	378.04	0.64	103.54	1.00	32.39	2449.33	-2393.53	1667.30
Saccade R	1	4	9582257888	9582277762	19874	586.20	385.00	484.08	378.04	0.64	103.54	1.00	32.39	2449.33	-2393.53	1667.30
Fixation L	1	5	9582277762	9582536355	258593	469.99	380.52	19	7	-1	15.96	15.96
Fixation R	1	5	9582277762	9582536355	258593	469.99	380.52	19	7	-1	16.22	16.22
Blink L	1	1	9582536355	9582735234	198879
Blink R	1	1	9582536355	9582735234	198879
Fixation L	1	6	9582735234	9583232572	497338	649.65	403.13	51	47	-1	16.34	16.34
Fixation R	1	6	9582735234	9583232572	497338	649.65	403.13	51	47	-1	16.15	16.15
Saccade L	1	5	9583232572	9583292183	59611	676.86	421.39	1026.22	607.79	4.39	215.60	0.67	73.64	5037.39	-5070.07	3806.79
Saccade R	1	5	9583232572	9583292183	59611	676.86	421.39	1026.22	607.79	4.39	215.60	0.67	73.64	5037.39	-5070.07	3806.79
Fixation L	1	7	9583292183	9583709910	417727	1033.46	603.71	32	67	-1	15.44	15.44
Fixation R	1	7	9583292183	9583709910	417727	1033.46	603.71	32	67	-1	15.26	15.26
Saccade L	1	6	9583709910	9583729799	19889	1058.29	546.37	1090.35	441.27	0.90	111.15	1.00	45.05	2748.85	-2298.79	2148.07
Saccade R	1	6	9583709910	9583729799	19889	1058.29	546.37	1090.35	441.27	0.90	111.15	1.00	45.05	2748.85	-2298.79	2148.07
Fixation L	1	8	9583729799	9583869054	139255	1091.66	461.98	11	32	-1	15.17	15.17
Fixation R	1	8	9583729799	9583869054	139255	1091.66	461.98	11	32	-1	14.82	14.82
Saccade L	1	7	9583869054	9583908786	39732	1094.20	469.56	1256.13	291.16	2.14	138.14	1.00	53.94	3325.83	-3339.61	2990.82
Saccade R	1	7	9583869054	9583908786	39732	1094.20	469.56	1256.13	291.16	2.14	138.14	1.00	53.94	3325.83	-3339.61	2990.82
Fixation L	1	9	9583908786	9584227019	318233	1251.55	300.89	34	38	-1	14.80	14.80
Fixation R	1	9	9583908786	9584227019	318233	1251.55	300.89	34	38	-1	14.34	14.34
Saccade L	1	8	9584227019	9584246892	19873	1231.65	275.67	1222.79	251.50	0.40	31.66	0.00	19.98	408.49	-555.63	480.97
Saccade R	1	8	9584227019	9584246892	19873	1231.65	275.67	1222.79	251.50	0.40	31.66	0.00	19.98	408.49	-555.63	480.97
Fixation L	1	10	9584246892	9584604868	357976	1203.37	241.40	26	21	-1	14.43	14.43
Fixation R	1	10	9584246892	9584604868	357976	1203.37	241.40	26	21	-1	14.02	14.02
Blink L	1	2	9584604868	9584763993	159125
Blink R	1	2	9584604868	9584763993	159125
Saccade L	1	9	9584763993	9584823729	59736	1326.69	727.46	1326.91	726.11	0.65	29.76	1.00	10.92	39.32	-642.38	241.03
Saccade R	1	9	9584763993	9584823729	59736	1326.69	727.46	1326.91	726.11	0.65	29.76	1.00	10.92	39.32	-642.38	241.03
