[BeGaze]
Converted from:	C:\Documents and Settings\iViewX\Desktop\EXPERIMENTATIONS\Experiments\results\finaleart\S9H29221-finaleart-1.idf
Date:	27.03.2019 16:03:04
Version:	BeGaze 2.5.77
Sample Rate:	50
Subject:	S9H29221
Description:	steven

Table Header for Fixations:
Event Type	Trial	Number	Start	End	Duration	Location X	Location Y	Dispersion X	Dispersion Y	Plane	Avg. Pupil Size X	Avg. Pupil Size Y

Table Header for Saccades:
Event Type	Trial	Number	Start	End	Duration	Start Loc.X	Start Loc.Y	End Loc.X	End Loc.Y	Amplitude	Peak Speed	Peak Speed At	Average Speed	Peak Accel.	Peak Decel.	Average Accel.

Table Header for Blinks:
Event Type	Trial	Number	Start	End	Duration

Table Header for User Events:
Event Type	Trial	Number	Start	Description

UserEvent	1	1	6115757282	# Message: void.jpg
Fixation L	1	1	6115765569	6116581030	815461	1328.07	339.37	29	63	-1	11.41	11.41
Fixation R	1	1	6115765569	6116581030	815461	1328.07	339.37	29	63	-1	10.21	10.21
Saccade L	1	1	6116581030	6116640772	59742	1318.29	362.85	917.74	383.35	4.32	209.52	0.67	72.29	5179.28	-4634.64	3135.26
Saccade R	1	1	6116581030	6116640772	59742	1318.29	362.85	917.74	383.35	4.32	209.52	0.67	72.29	5179.28	-4634.64	3135.26
Fixation L	1	2	6116640772	6116913237	272465	883.28	395.59	66	17	-1	12.10	12.10
Fixation R	1	2	6116640772	6116913237	272465	883.28	395.59	66	17	-1	11.05	11.05
Saccade L	1	2	6116913237	6116939009	25772	851.05	399.04	829.44	401.14	0.37	24.76	0.00	14.40	459.90	-436.85	422.99
Saccade R	1	2	6116913237	6116939009	25772	851.05	399.04	829.44	401.14	0.37	24.76	0.00	14.40	459.90	-436.85	422.99
Fixation L	1	3	6116939009	6117177740	238731	785.06	415.83	65	34	-1	13.16	13.16
Fixation R	1	3	6116939009	6117177740	238731	785.06	415.83	65	34	-1	12.23	12.23
Saccade L	1	3	6117177740	6117197615	19875	779.31	434.78	775.21	443.23	0.16	14.32	1.00	8.02	112.96	-120.48	90.69
Saccade R	1	3	6117177740	6117197615	19875	779.31	434.78	775.21	443.23	0.16	14.32	1.00	8.02	112.96	-120.48	90.69
Fixation L	1	4	6117197615	6117356740	159125	771.46	452.47	45	18	-1	13.61	13.61
Fixation R	1	4	6117197615	6117356740	159125	771.46	452.47	45	18	-1	12.56	12.56
Saccade L	1	4	6117356740	6117635209	278469	736.17	461.40	110.42	508.07	11.89	78.03	0.93	42.72	1162.94	-1024.47	592.35
Saccade R	1	4	6117356740	6117635209	278469	736.17	461.40	110.42	508.07	11.89	78.03	0.93	42.72	1162.94	-1024.47	592.35
Fixation L	1	5	6117635209	6117754584	119375	74.35	533.09	53	45	-1	13.58	13.58
Fixation R	1	5	6117635209	6117754584	119375	74.35	533.09	53	45	-1	12.56	12.56
Saccade L	1	5	6117754584	6117794339	39755	65.71	553.45	68.58	552.16	0.54	18.71	1.00	13.46	313.37	0.00	135.36
Saccade R	1	5	6117754584	6117794339	39755	65.71	553.45	68.58	552.16	0.54	18.71	1.00	13.46	313.37	0.00	135.36
