[BeGaze]
Converted from:	C:\Documents and Settings\iViewX\Desktop\EXPERIMENTATIONS\Experiments\results\finaleart\S20H24222-finaleart-1.idf
Date:	27.03.2019 15:53:00
Version:	BeGaze 2.5.77
Sample Rate:	50
Subject:	S20H24222
Description:	Hugo Brument

Table Header for Fixations:
Event Type	Trial	Number	Start	End	Duration	Location X	Location Y	Dispersion X	Dispersion Y	Plane	Avg. Pupil Size X	Avg. Pupil Size Y

Table Header for Saccades:
Event Type	Trial	Number	Start	End	Duration	Start Loc.X	Start Loc.Y	End Loc.X	End Loc.Y	Amplitude	Peak Speed	Peak Speed At	Average Speed	Peak Accel.	Peak Decel.	Average Accel.

Table Header for Blinks:
Event Type	Trial	Number	Start	End	Duration

Table Header for User Events:
Event Type	Trial	Number	Start	Description

UserEvent	1	1	11662412673	# Message: void.jpg
Saccade L	1	1	11662423789	11662503425	79636	1292.57	1041.78	735.37	1041.29	7.74	292.63	1.00	97.23	7245.29	-7154.75	4564.42
Saccade R	1	1	11662423789	11662503425	79636	1292.57	1041.78	735.37	1041.29	7.74	292.63	1.00	97.23	7245.29	-7154.75	4564.42
Fixation L	1	1	11662503425	11662742021	238596	704.39	1020.02	43	54	-1	10.54	10.54
Fixation R	1	1	11662503425	11662742021	238596	704.39	1020.02	43	54	-1	11.17	11.17
Saccade L	1	2	11662742021	11662762047	20026	691.83	1017.53	689.95	1019.71	0.16	16.64	1.00	8.11	367.29	-200.82	257.31
Saccade R	1	2	11662742021	11662762047	20026	691.83	1017.53	689.95	1019.71	0.16	16.64	1.00	8.11	367.29	-200.82	257.31
Fixation L	1	2	11662762047	11662901140	139093	689.58	1016.73	6	38	-1	10.35	10.35
Fixation R	1	2	11662762047	11662901140	139093	689.58	1016.73	6	38	-1	11.41	11.41
Saccade L	1	3	11662901140	11662960897	59757	694.56	1041.86	958.13	1255.88	4.64	167.22	0.67	77.67	3627.88	-4021.73	2952.01
Saccade R	1	3	11662901140	11662960897	59757	694.56	1041.86	958.13	1255.88	4.64	167.22	0.67	77.67	3627.88	-4021.73	2952.01
Fixation L	1	3	11662960897	11663179626	218729	968.47	1247.50	16	13	-1	11.38	11.38
Fixation R	1	3	11662960897	11663179626	218729	968.47	1247.50	16	13	-1	12.15	12.15
Blink L	1	1	11663179626	11663358621	178995
Blink R	1	1	11663179626	11663358621	178995
Blink L	1	2	11663378510	11664114466	735956
Blink R	1	2	11663378510	11664114466	735956
Fixation L	1	4	11664114466	11664412831	298365	795.34	550.06	12	8	-1	11.43	11.43
Fixation R	1	4	11664114466	11664412831	298365	795.34	550.06	12	8	-1	12.82	12.82
