[BeGaze]
Converted from:	C:\Documents and Settings\iViewX\Desktop\EXPERIMENTATIONS\Experiments\results\finaleart\S01A22542-finaleart-1.idf
Date:	27.03.2019 15:33:24
Version:	BeGaze 2.5.77
Sample Rate:	50
Subject:	S01A22542
Description:	Thibault Seve Minnaert

Table Header for Fixations:
Event Type	Trial	Number	Start	End	Duration	Location X	Location Y	Dispersion X	Dispersion Y	Plane	Avg. Pupil Size X	Avg. Pupil Size Y

Table Header for Saccades:
Event Type	Trial	Number	Start	End	Duration	Start Loc.X	Start Loc.Y	End Loc.X	End Loc.Y	Amplitude	Peak Speed	Peak Speed At	Average Speed	Peak Accel.	Peak Decel.	Average Accel.

Table Header for Blinks:
Event Type	Trial	Number	Start	End	Duration

Table Header for User Events:
Event Type	Trial	Number	Start	Description

UserEvent	1	1	9818083211	# Message: void.jpg
Fixation L	1	1	9818084459	9818343198	258739	1435.28	404.83	21	15	-1	15.41	15.41
Fixation R	1	1	9818084459	9818343198	258739	1435.28	404.83	21	15	-1	13.56	13.56
Saccade L	1	1	9818343198	9818383057	39859	1434.04	400.49	1198.03	421.04	2.05	130.17	0.50	51.38	3195.89	-3193.33	2861.45
Saccade R	1	1	9818343198	9818383057	39859	1434.04	400.49	1198.03	421.04	2.05	130.17	0.50	51.38	3195.89	-3193.33	2861.45
Fixation L	1	2	9818383057	9818502569	119512	1192.38	427.83	13	11	-1	14.92	14.92
Fixation R	1	2	9818383057	9818502569	119512	1192.38	427.83	13	11	-1	13.10	13.10
Blink L	1	1	9818502569	9818721566	218997
Blink R	1	1	9818502569	9818721566	218997
Fixation L	1	3	9818721566	9818999910	278344	1098.46	689.39	4	50	-1	14.16	14.16
Fixation R	1	3	9818721566	9818999910	278344	1098.46	689.39	4	50	-1	14.26	14.26
Saccade L	1	2	9818999910	9819039776	39866	1097.57	712.61	1324.48	911.57	2.95	186.74	0.50	73.88	4560.99	-3529.18	3437.07
Saccade R	1	2	9818999910	9819039776	39866	1097.57	712.61	1324.48	911.57	2.95	186.74	0.50	73.88	4560.99	-3529.18	3437.07
Fixation L	1	4	9819039776	9819238666	198890	1344.83	945.67	25	51	-1	14.76	14.76
Fixation R	1	4	9819039776	9819238666	198890	1344.83	945.67	25	51	-1	14.79	14.79
Saccade L	1	3	9819238666	9819278394	39728	1342.15	963.38	1043.95	977.13	2.67	215.25	0.50	67.21	5228.84	-4890.43	3515.24
Saccade R	1	3	9819238666	9819278394	39728	1342.15	963.38	1043.95	977.13	2.67	215.25	0.50	67.21	5228.84	-4890.43	3515.24
Fixation L	1	5	9819278394	9819497268	218874	1032.07	984.39	18	16	-1	14.46	14.46
Fixation R	1	5	9819278394	9819497268	218874	1032.07	984.39	18	16	-1	14.55	14.55
Saccade L	1	4	9819497268	9819517141	19873	1025.87	986.11	1037.16	782.71	1.38	206.00	1.00	69.52	5066.78	-5110.39	3878.64
Saccade R	1	4	9819497268	9819517141	19873	1025.87	986.11	1037.16	782.71	1.38	206.00	1.00	69.52	5066.78	-5110.39	3878.64
Fixation L	1	6	9819517141	9819696123	178982	1051.09	725.49	25	68	-1	14.00	14.00
Fixation R	1	6	9819517141	9819696123	178982	1051.09	725.49	25	68	-1	14.22	14.22
Saccade L	1	5	9819696123	9819716007	19884	1062.35	713.82	1062.96	614.35	0.77	100.61	1.00	38.70	2419.76	-2348.32	1935.59
Saccade R	1	5	9819696123	9819716007	19884	1062.35	713.82	1062.96	614.35	0.77	100.61	1.00	38.70	2419.76	-2348.32	1935.59
Fixation L	1	7	9819716007	9819954618	238611	1047.43	568.41	25	65	-1	13.37	13.37
Fixation R	1	7	9819716007	9819954618	238611	1047.43	568.41	25	65	-1	13.74	13.74
Saccade L	1	6	9819954618	9819974605	19987	1037.21	548.66	1034.99	508.79	0.43	40.39	1.00	21.54	956.59	-740.55	725.51
Saccade R	1	6	9819954618	9819974605	19987	1037.21	548.66	1034.99	508.79	0.43	40.39	1.00	21.54	956.59	-740.55	725.51
Fixation L	1	8	9819974605	9820073975	99370	1030.39	483.36	9	35	-1	12.89	12.89
Fixation R	1	8	9819974605	9820073975	99370	1030.39	483.36	9	35	-1	13.33	13.33
