[BeGaze]
Converted from:	C:\Documents and Settings\iViewX\Desktop\EXPERIMENTATIONS\Experiments\results\finaleart\S13H22431-finaleart-1.idf
Date:	27.03.2019 15:41:36
Version:	BeGaze 2.5.77
Sample Rate:	50
Subject:	S13H22431
Description:	Jimmy Petit

Table Header for Fixations:
Event Type	Trial	Number	Start	End	Duration	Location X	Location Y	Dispersion X	Dispersion Y	Plane	Avg. Pupil Size X	Avg. Pupil Size Y

Table Header for Saccades:
Event Type	Trial	Number	Start	End	Duration	Start Loc.X	Start Loc.Y	End Loc.X	End Loc.Y	Amplitude	Peak Speed	Peak Speed At	Average Speed	Peak Accel.	Peak Decel.	Average Accel.

Table Header for Blinks:
Event Type	Trial	Number	Start	End	Duration

Table Header for User Events:
Event Type	Trial	Number	Start	Description

UserEvent	1	1	27450686998	# Message: The_Two_Models_Dufy_1930.jpg
Fixation L	1	1	27450695896	27450934642	238746	701.10	250.38	58	39	-1	16.85	16.85
Fixation R	1	1	27450695896	27450934642	238746	701.10	250.38	58	39	-1	18.12	18.12
Saccade L	1	1	27450934642	27450954506	19864	735.58	271.85	748.59	266.99	0.24	16.55	1.00	11.95	-29.06	-62.72	46.82
Saccade R	1	1	27450934642	27450954506	19864	735.58	271.85	748.59	266.99	0.24	16.55	1.00	11.95	-29.06	-62.72	46.82
Fixation L	1	2	27450954506	27451054005	99499	749.74	262.60	12	23	-1	16.19	16.19
Fixation R	1	2	27450954506	27451054005	99499	749.74	262.60	12	23	-1	18.18	18.18
Saccade L	1	2	27451054005	27451093748	39743	758.53	274.42	1019.80	468.77	3.30	251.18	0.50	83.08	6226.67	-5545.50	4103.09
Saccade R	1	2	27451054005	27451093748	39743	758.53	274.42	1019.80	468.77	3.30	251.18	0.50	83.08	6226.67	-5545.50	4103.09
Fixation L	1	3	27451093748	27451193241	99493	1026.42	449.51	13	28	-1	16.23	16.23
Fixation R	1	3	27451093748	27451193241	99493	1026.42	449.51	13	28	-1	17.86	17.86
Saccade L	1	3	27451193241	27451232997	39756	1032.91	442.18	1324.90	445.57	2.75	199.75	1.00	69.18	4595.57	-4782.07	3322.37
Saccade R	1	3	27451193241	27451232997	39756	1032.91	442.18	1324.90	445.57	2.75	199.75	1.00	69.18	4595.57	-4782.07	3322.37
Fixation L	1	4	27451232997	27451431860	198863	1316.09	444.61	25	11	-1	14.22	14.22
Fixation R	1	4	27451232997	27451431860	198863	1316.09	444.61	25	11	-1	15.75	15.75
Saccade L	1	4	27451431860	27451451733	19873	1323.45	439.08	1288.16	581.82	0.79	148.72	1.00	39.58	3639.33	-3671.43	2461.86
Saccade R	1	4	27451431860	27451451733	19873	1323.45	439.08	1288.16	581.82	0.79	148.72	1.00	39.58	3639.33	-3671.43	2461.86
Fixation L	1	5	27451451733	27451730219	278486	1268.00	573.99	32	17	-1	13.00	13.00
Fixation R	1	5	27451451733	27451730219	278486	1268.00	573.99	32	17	-1	14.09	14.09
Saccade L	1	5	27451730219	27451750093	19874	1256.10	564.34	1329.89	449.70	0.84	137.89	1.00	42.36	3346.03	-3096.41	2223.26
Saccade R	1	5	27451730219	27451750093	19874	1256.10	564.34	1329.89	449.70	0.84	137.89	1.00	42.36	3346.03	-3096.41	2223.26
Fixation L	1	6	27451750093	27452505936	755843	1330.56	452.06	27	35	-1	13.11	13.11
Fixation R	1	6	27451750093	27452505936	755843	1330.56	452.06	27	35	-1	13.66	13.66
Saccade L	1	6	27452505936	27452525817	19881	1311.15	479.74	1301.75	567.95	0.82	89.73	1.00	41.40	2111.74	-2024.54	1531.33
Saccade R	1	6	27452505936	27452525817	19881	1311.15	479.74	1301.75	567.95	0.82	89.73	1.00	41.40	2111.74	-2024.54	1531.33
Fixation L	1	7	27452525817	27452844053	318236	1286.16	606.06	22	61	-1	14.80	14.80
Fixation R	1	7	27452525817	27452844053	318236	1286.16	606.06	22	61	-1	15.20	15.20
Saccade L	1	7	27452844053	27453062919	218866	1278.99	627.74	645.26	788.04	15.91	287.97	0.91	72.70	6677.80	-6859.35	2822.34
Saccade R	1	7	27452844053	27453062919	218866	1278.99	627.74	645.26	788.04	15.91	287.97	0.91	72.70	6677.80	-6859.35	2822.34
Fixation L	1	8	27453062919	27453241911	178992	647.24	799.61	16	32	-1	14.98	14.98
Fixation R	1	8	27453062919	27453241911	178992	647.24	799.61	16	32	-1	15.69	15.69
Saccade L	1	8	27453241911	27453261797	19886	648.66	820.63	658.98	949.49	0.86	130.76	1.00	43.35	3230.65	-3111.90	2127.03
Saccade R	1	8	27453241911	27453261797	19886	648.66	820.63	658.98	949.49	0.86	130.76	1.00	43.35	3230.65	-3111.90	2127.03
Fixation L	1	9	27453261797	27453699381	437584	683.39	931.59	45	43	-1	14.57	14.57
Fixation R	1	9	27453261797	27453699381	437584	683.39	931.59	45	43	-1	15.61	15.61
Saccade L	1	9	27453699381	27453719263	19882	695.43	946.92	707.24	964.16	0.33	25.36	1.00	16.36	93.17	-256.31	151.63
Saccade R	1	9	27453699381	27453719263	19882	695.43	946.92	707.24	964.16	0.33	25.36	1.00	16.36	93.17	-256.31	151.63
Fixation L	1	10	27453719263	27454216488	497225	711.12	1002.36	22	71	-1	14.28	14.28
Fixation R	1	10	27453719263	27454216488	497225	711.12	1002.36	22	71	-1	15.60	15.60
Saccade L	1	10	27454216488	27454236363	19875	698.67	999.00	688.93	804.84	1.19	196.59	1.00	59.88	4858.28	-4347.24	3185.38
Saccade R	1	10	27454216488	27454236363	19875	698.67	999.00	688.93	804.84	1.19	196.59	1.00	59.88	4858.28	-4347.24	3185.38
Fixation L	1	11	27454236363	27454673974	437611	677.21	809.18	17	21	-1	14.55	14.55
Fixation R	1	11	27454236363	27454673974	437611	677.21	809.18	17	21	-1	15.95	15.95
