[BeGaze]
Converted from:	C:\Documents and Settings\iViewX\Desktop\EXPERIMENTATIONS\Experiments\results\finaleart\S19F21442-finaleart-1.idf
Date:	27.03.2019 15:50:07
Version:	BeGaze 2.5.77
Sample Rate:	50
Subject:	S19F21442
Description:	Juliette Veuillez

Table Header for Fixations:
Event Type	Trial	Number	Start	End	Duration	Location X	Location Y	Dispersion X	Dispersion Y	Plane	Avg. Pupil Size X	Avg. Pupil Size Y

Table Header for Saccades:
Event Type	Trial	Number	Start	End	Duration	Start Loc.X	Start Loc.Y	End Loc.X	End Loc.Y	Amplitude	Peak Speed	Peak Speed At	Average Speed	Peak Accel.	Peak Decel.	Average Accel.

Table Header for Blinks:
Event Type	Trial	Number	Start	End	Duration

Table Header for User Events:
Event Type	Trial	Number	Start	Description

UserEvent	1	1	5514850459	# Message: avenue_of_trees_in_a_small_town_sisley_1866.jpg
Fixation L	1	1	5514861999	5515418962	556963	792.55	644.08	10	37	-1	16.21	16.21
Fixation R	1	1	5514861999	5515418962	556963	792.55	644.08	10	37	-1	18.15	18.15
Saccade L	1	1	5515418962	5515458710	39748	792.31	663.96	972.35	455.49	2.38	188.92	1.00	59.99	4705.13	-4056.22	3186.30
Saccade R	1	1	5515418962	5515458710	39748	792.31	663.96	972.35	455.49	2.38	188.92	1.00	59.99	4705.13	-4056.22	3186.30
Fixation L	1	2	5515458710	5516075295	616585	968.94	486.21	20	63	-1	14.18	14.18
Fixation R	1	2	5515458710	5516075295	616585	968.94	486.21	20	63	-1	15.66	15.66
Saccade L	1	2	5516075295	5516115050	39755	967.48	488.86	838.22	596.69	1.69	144.25	0.50	42.53	3534.95	-2837.02	1950.59
Saccade R	1	2	5516075295	5516115050	39755	967.48	488.86	838.22	596.69	1.69	144.25	0.50	42.53	3534.95	-2837.02	1950.59
Fixation L	1	3	5516115050	5516413424	298374	815.36	622.85	31	51	-1	15.11	15.11
Fixation R	1	3	5516115050	5516413424	298374	815.36	622.85	31	51	-1	17.35	17.35
Saccade L	1	3	5516413424	5516433277	19853	811.26	630.42	808.69	534.73	0.80	96.83	1.00	40.39	2303.14	-1924.64	1727.17
Saccade R	1	3	5516413424	5516433277	19853	811.26	630.42	808.69	534.73	0.80	96.83	1.00	40.39	2303.14	-1924.64	1727.17
Fixation L	1	4	5516433277	5516890764	457487	807.31	538.48	14	63	-1	15.77	15.77
Fixation R	1	4	5516433277	5516890764	457487	807.31	538.48	14	63	-1	17.93	17.93
Saccade L	1	4	5516890764	5516930508	39744	814.35	541.38	724.86	334.33	2.05	159.01	1.00	51.58	3937.15	-3597.72	2608.80
Saccade R	1	4	5516890764	5516930508	39744	814.35	541.38	724.86	334.33	2.05	159.01	1.00	51.58	3937.15	-3597.72	2608.80
Fixation L	1	5	5516930508	5517328392	397884	736.33	325.97	30	18	-1	16.39	16.39
Fixation R	1	5	5516930508	5517328392	397884	736.33	325.97	30	18	-1	18.01	18.01
Saccade L	1	5	5517328392	5517387997	59605	731.71	331.36	1458.54	297.93	7.68	329.31	0.67	128.84	8108.78	-7736.66	5295.63
Saccade R	1	5	5517328392	5517387997	59605	731.71	331.36	1458.54	297.93	7.68	329.31	0.67	128.84	8108.78	-7736.66	5295.63
Fixation L	1	6	5517387997	5517726096	338099	1437.40	309.89	26	22	-1	16.22	16.22
Fixation R	1	6	5517387997	5517726096	338099	1437.40	309.89	26	22	-1	17.44	17.44
Saccade L	1	6	5517726096	5517746102	20006	1433.81	315.14	1252.60	331.04	1.11	183.96	1.00	55.24	4465.76	-4154.34	3053.93
Saccade R	1	6	5517726096	5517746102	20006	1433.81	315.14	1252.60	331.04	1.11	183.96	1.00	55.24	4465.76	-4154.34	3053.93
Fixation L	1	7	5517746102	5518840052	1093950	1265.78	340.16	29	29	-1	16.45	16.45
Fixation R	1	7	5517746102	5518840052	1093950	1265.78	340.16	29	29	-1	17.79	17.79
