[BeGaze]
Converted from:	C:\Documents and Settings\iViewX\Desktop\EXPERIMENTATIONS\Experiments\results\finaleart\S1022551-finaleart-1.idf
Date:	27.03.2019 15:37:29
Version:	BeGaze 2.5.77
Sample Rate:	50
Subject:	S1022551
Description:	Alexis Nebout

Table Header for Fixations:
Event Type	Trial	Number	Start	End	Duration	Location X	Location Y	Dispersion X	Dispersion Y	Plane	Avg. Pupil Size X	Avg. Pupil Size Y

Table Header for Saccades:
Event Type	Trial	Number	Start	End	Duration	Start Loc.X	Start Loc.Y	End Loc.X	End Loc.Y	Amplitude	Peak Speed	Peak Speed At	Average Speed	Peak Accel.	Peak Decel.	Average Accel.

Table Header for Blinks:
Event Type	Trial	Number	Start	End	Duration

Table Header for User Events:
Event Type	Trial	Number	Start	Description

UserEvent	1	1	7570287958	# Message: REJECTED_rose_in_a_bowl_fantin_latour_1883.jpg
Fixation L	1	1	7570292252	7570689969	397717	899.52	462.22	6	12	-1	11.73	11.73
Fixation R	1	1	7570292252	7570689969	397717	899.52	462.22	6	12	-1	11.75	11.75
Blink L	1	1	7570689969	7570849092	159123
Blink R	1	1	7570689969	7570849092	159123
Fixation L	1	2	7570849092	7571843672	994580	912.47	514.04	63	26	-1	14.27	14.27
Fixation R	1	2	7570849092	7571843672	994580	912.47	514.04	63	26	-1	13.58	13.58
Saccade L	1	1	7571843672	7571863568	19896	951.05	510.62	805.06	518.39	0.78	147.86	1.00	39.14	3679.64	-3610.92	2474.40
Saccade R	1	1	7571843672	7571863568	19896	951.05	510.62	805.06	518.39	0.78	147.86	1.00	39.14	3679.64	-3610.92	2474.40
Fixation L	1	3	7571863568	7572102164	238596	799.84	526.67	13	13	-1	14.18	14.18
Fixation R	1	3	7571863568	7572102164	238596	799.84	526.67	13	13	-1	13.80	13.80
Saccade L	1	2	7572102164	7572142042	39878	793.83	529.43	1044.62	524.98	2.11	145.96	1.00	52.93	3616.04	-3620.36	3095.64
Saccade R	1	2	7572102164	7572142042	39878	793.83	529.43	1044.62	524.98	2.11	145.96	1.00	52.93	3616.04	-3620.36	3095.64
Fixation L	1	4	7572142042	7572559647	417605	1033.48	525.54	14	17	-1	14.53	14.53
Fixation R	1	4	7572142042	7572559647	417605	1033.48	525.54	14	17	-1	14.16	14.16
Saccade L	1	3	7572559647	7572599505	39858	1032.34	515.43	811.40	513.48	1.84	134.32	1.00	46.28	3280.30	-3315.27	2737.35
Saccade R	1	3	7572559647	7572599505	39858	1032.34	515.43	811.40	513.48	1.84	134.32	1.00	46.28	3280.30	-3315.27	2737.35
Fixation L	1	5	7572599505	7572957504	357999	813.84	525.15	3	31	-1	14.12	14.12
Fixation R	1	5	7572599505	7572957504	357999	813.84	525.15	3	31	-1	13.82	13.82
Saccade L	1	4	7572957504	7572977370	19866	812.78	545.32	889.31	539.66	0.64	77.62	1.00	32.30	1890.75	-1822.45	1594.51
Saccade R	1	4	7572957504	7572977370	19866	812.78	545.32	889.31	539.66	0.64	77.62	1.00	32.30	1890.75	-1822.45	1594.51
Fixation L	1	6	7572977370	7573275737	298367	934.38	546.88	56	12	-1	14.50	14.50
Fixation R	1	6	7572977370	7573275737	298367	934.38	546.88	56	12	-1	14.43	14.43
Saccade L	1	5	7573275737	7573315483	39746	945.71	544.19	1364.50	660.27	3.70	232.06	1.00	93.14	5670.02	-5442.77	5386.16
Saccade R	1	5	7573275737	7573315483	39746	945.71	544.19	1364.50	660.27	3.70	232.06	1.00	93.14	5670.02	-5442.77	5386.16
Fixation L	1	7	7573315483	7573613831	298348	1363.76	655.69	5	13	-1	15.06	15.06
Fixation R	1	7	7573315483	7573613831	298348	1363.76	655.69	5	13	-1	14.81	14.81
Saccade L	1	6	7573613831	7573653589	39758	1365.20	658.03	972.99	562.12	3.69	324.14	1.00	92.76	8041.08	-7745.67	4708.54
Saccade R	1	6	7573613831	7573653589	39758	1365.20	658.03	972.99	562.12	3.69	324.14	1.00	92.76	8041.08	-7745.67	4708.54
Fixation L	1	8	7573653589	7573991814	338225	919.90	560.63	61	15	-1	15.05	15.05
Fixation R	1	8	7573653589	7573991814	338225	919.90	560.63	61	15	-1	14.71	14.71
Saccade L	1	7	7573991814	7574011708	19894	919.80	565.61	798.91	558.74	0.67	122.48	1.00	33.67	3036.21	-2833.89	2027.88
Saccade R	1	7	7573991814	7574011708	19894	919.80	565.61	798.91	558.74	0.67	122.48	1.00	33.67	3036.21	-2833.89	2027.88
Fixation L	1	9	7574011708	7574329923	318215	783.93	534.52	20	32	-1	14.91	14.91
Fixation R	1	9	7574011708	7574329923	318215	783.93	534.52	20	32	-1	15.13	15.13
