[BeGaze]
Converted from:	C:\Documents and Settings\iViewX\Desktop\EXPERIMENTATIONS\Experiments\results\finaleart\S11H21112-finaleart-1.idf
Date:	27.03.2019 15:39:17
Version:	BeGaze 2.5.77
Sample Rate:	50
Subject:	S11H21112
Description:	Clement legrand-Duchenne

Table Header for Fixations:
Event Type	Trial	Number	Start	End	Duration	Location X	Location Y	Dispersion X	Dispersion Y	Plane	Avg. Pupil Size X	Avg. Pupil Size Y

Table Header for Saccades:
Event Type	Trial	Number	Start	End	Duration	Start Loc.X	Start Loc.Y	End Loc.X	End Loc.Y	Amplitude	Peak Speed	Peak Speed At	Average Speed	Peak Accel.	Peak Decel.	Average Accel.

Table Header for Blinks:
Event Type	Trial	Number	Start	End	Duration

Table Header for User Events:
Event Type	Trial	Number	Start	Description

UserEvent	1	1	5291203805	# Message: void.jpg
Saccade L	1	1	5291208670	5291228539	19869	1008.17	818.39	1022.69	751.71	0.65	69.03	1.00	32.72	728.15	-1155.43	627.86
Saccade R	1	1	5291208670	5291228539	19869	1008.17	818.39	1022.69	751.71	0.65	69.03	1.00	32.72	728.15	-1155.43	627.86
Fixation L	1	1	5291228539	5291845510	616971	1052.68	742.58	40	52	-1	13.46	13.46
Fixation R	1	1	5291228539	5291845510	616971	1052.68	742.58	40	52	-1	14.51	14.51
Blink L	1	1	5291845510	5292044627	199117
Blink R	1	1	5291845510	5292044627	199117
Blink L	1	2	5292064506	5292303487	238981
Blink R	1	2	5292064506	5292303487	238981
Fixation L	1	2	5292303487	5292641976	338489	1748.59	120.30	45	49	-1	13.06	13.06
Fixation R	1	2	5292303487	5292641976	338489	1748.59	120.30	45	49	-1	13.94	13.94
Saccade L	1	2	5292641976	5292681725	39749	1745.27	129.80	1744.54	131.16	3.16	167.19	1.00	79.42	4092.42	-3205.16	3523.56
Blink R	1	3	5292641976	5292741472	99496
Fixation L	1	3	5292681725	5292801222	119497	1751.28	148.86	31	63	-1	11.80	11.80
Saccade R	1	2	5292741472	5292801222	59750	1745.64	143.97	1749.08	146.97	1.85	52.01	1.00	31.01	778.16	-570.64	545.40
Saccade L	1	3	5292801222	5292821219	19997	1749.08	146.97	1739.14	197.41	0.91	57.38	1.00	45.32	589.68	112.64	349.98
Fixation R	1	3	5292801222	5292960591	159369	1739.69	165.70	28	55	-1	15.41	15.41
Fixation L	1	4	5292821219	5292960591	139372	1738.52	168.04	28	55	-1	11.78	11.78
Saccade L	1	4	5292960591	5292980461	19870	1722.62	158.60	1741.96	110.85	0.67	61.41	1.00	33.62	1239.96	-1172.35	1162.30
Saccade R	1	3	5292960591	5292980461	19870	1722.62	158.60	1741.96	110.85	0.67	61.41	1.00	33.62	1239.96	-1172.35	1162.30
Fixation L	1	5	5292980461	5293099955	119494	1734.06	136.99	22	67	-1	11.77	11.77
Fixation R	1	4	5292980461	5293099955	119494	1734.06	136.99	22	67	-1	15.43	15.43
Saccade L	1	5	5293099955	5293199452	99497	1739.46	144.92	1745.85	176.58	3.32	53.74	0.20	33.40	127.95	-679.23	295.80
Saccade R	1	4	5293099955	5293199452	99497	1739.46	144.92	1745.85	176.58	3.32	53.74	0.20	33.40	127.95	-679.23	295.80
