[BeGaze]
Converted from:	C:\Documents and Settings\iViewX\Desktop\EXPERIMENTATIONS\Experiments\results\finaleart\S6124332-finaleart-1.idf
Date:	27.03.2019 15:36:26
Version:	BeGaze 2.5.77
Sample Rate:	50
Subject:	S6124332
Description:	Romain Ferrand

Table Header for Fixations:
Event Type	Trial	Number	Start	End	Duration	Location X	Location Y	Dispersion X	Dispersion Y	Plane	Avg. Pupil Size X	Avg. Pupil Size Y

Table Header for Saccades:
Event Type	Trial	Number	Start	End	Duration	Start Loc.X	Start Loc.Y	End Loc.X	End Loc.Y	Amplitude	Peak Speed	Peak Speed At	Average Speed	Peak Accel.	Peak Decel.	Average Accel.

Table Header for Blinks:
Event Type	Trial	Number	Start	End	Duration

Table Header for User Events:
Event Type	Trial	Number	Start	Description

UserEvent	1	1	12835188594	# Message: the_three_skulls_gericault_1814.jpg
Fixation L	1	1	12835199328	12835676672	477344	865.68	651.67	45	50	-1	18.69	18.69
Fixation R	1	1	12835199328	12835676672	477344	865.68	651.67	45	50	-1	16.49	16.49
Saccade L	1	1	12835676672	12835696550	19878	896.18	615.45	901.16	616.17	0.44	49.32	0.00	22.38	58.90	-693.84	321.42
Saccade R	1	1	12835676672	12835696550	19878	896.18	615.45	901.16	616.17	0.44	49.32	0.00	22.38	58.90	-693.84	321.42
Fixation L	1	2	12835696550	12835875516	178966	918.24	597.96	22	27	-1	19.31	19.31
Fixation R	1	2	12835696550	12835875516	178966	918.24	597.96	22	27	-1	17.20	17.20
Saccade L	1	2	12835875516	12835915269	39753	915.92	588.33	448.69	467.47	4.20	260.70	0.50	105.62	6398.12	-5965.41	5677.46
Saccade R	1	2	12835875516	12835915269	39753	915.92	588.33	448.69	467.47	4.20	260.70	0.50	105.62	6398.12	-5965.41	5677.46
Fixation L	1	3	12835915269	12836293252	377983	401.66	478.52	57	32	-1	19.05	19.05
Fixation R	1	3	12835915269	12836293252	377983	401.66	478.52	57	32	-1	17.38	17.38
Saccade L	1	3	12836293252	12836313120	19868	401.80	486.72	407.26	374.00	0.79	114.15	1.00	39.66	2730.37	-2702.64	1983.43
Saccade R	1	3	12836293252	12836313120	19868	401.80	486.72	407.26	374.00	0.79	114.15	1.00	39.66	2730.37	-2702.64	1983.43
Fixation L	1	4	12836313120	12836631358	318238	414.77	369.22	27	39	-1	19.31	19.31
Fixation R	1	4	12836313120	12836631358	318238	414.77	369.22	27	39	-1	17.94	17.94
Saccade L	1	4	12836631358	12836730721	99363	424.61	365.24	1382.92	489.28	12.54	282.61	0.80	126.19	5336.57	-6544.50	3840.87
Saccade R	1	4	12836631358	12836730721	99363	424.61	365.24	1382.92	489.28	12.54	282.61	0.80	126.19	5336.57	-6544.50	3840.87
Fixation L	1	5	12836730721	12836850084	119363	1412.07	491.81	49	43	-1	20.20	20.20
Fixation R	1	5	12836730721	12836850084	119363	1412.07	491.81	49	43	-1	17.16	17.16
Saccade L	1	5	12836850084	12836869971	19887	1423.80	522.83	1417.25	562.69	0.48	40.86	1.00	24.06	981.59	-656.29	661.40
Saccade R	1	5	12836850084	12836869971	19887	1423.80	522.83	1417.25	562.69	0.48	40.86	1.00	24.06	981.59	-656.29	661.40
Fixation L	1	6	12836869971	12836989333	119362	1415.55	570.95	24	59	-1	20.82	20.82
Fixation R	1	6	12836869971	12836989333	119362	1415.55	570.95	24	59	-1	17.46	17.46
Saccade L	1	6	12836989333	12837029087	39754	1400.22	588.24	1116.92	695.75	2.99	215.75	0.50	75.14	4902.12	-4911.84	3540.14
Saccade R	1	6	12836989333	12837029087	39754	1400.22	588.24	1116.92	695.75	2.99	215.75	0.50	75.14	4902.12	-4911.84	3540.14
Fixation L	1	7	12837029087	12837188191	159104	1115.43	672.13	3	32	-1	20.89	20.89
Fixation R	1	7	12837029087	12837188191	159104	1115.43	672.13	3	32	-1	18.16	18.16
Saccade L	1	7	12837188191	12837208070	19879	1115.20	663.17	1017.23	574.38	0.76	133.74	1.00	38.00	3279.68	-3078.01	2209.92
Saccade R	1	7	12837188191	12837208070	19879	1115.20	663.17	1017.23	574.38	0.76	133.74	1.00	38.00	3279.68	-3078.01	2209.92
Fixation L	1	8	12837208070	12837546292	338222	992.25	571.08	33	55	-1	20.84	20.84
Fixation R	1	8	12837208070	12837546292	338222	992.25	571.08	33	55	-1	18.23	18.23
Saccade L	1	8	12837546292	12837566191	19899	1017.62	618.98	1038.85	783.27	1.25	167.54	1.00	63.03	4120.24	-3971.30	3027.92
Saccade R	1	8	12837546292	12837566191	19899	1017.62	618.98	1038.85	783.27	1.25	167.54	1.00	63.03	4120.24	-3971.30	3027.92
Fixation L	1	9	12837566191	12837784928	218737	1045.62	765.41	25	68	-1	20.92	20.92
Fixation R	1	9	12837566191	12837784928	218737	1045.62	765.41	25	68	-1	18.71	18.71
Saccade L	1	9	12837784928	12837804789	19861	1052.69	811.27	1054.80	828.15	0.42	60.35	1.00	21.37	-31.43	-1078.57	485.24
Saccade R	1	9	12837784928	12837804789	19861	1052.69	811.27	1054.80	828.15	0.42	60.35	1.00	21.37	-31.43	-1078.57	485.24
Fixation L	1	10	12837804789	12838301996	497207	1067.27	834.72	40	15	-1	21.27	21.27
Fixation R	1	10	12837804789	12838301996	497207	1067.27	834.72	40	15	-1	19.18	19.18
Saccade L	1	10	12838301996	12838361738	59742	1068.21	843.55	467.98	1030.93	6.83	308.42	0.33	114.27	7642.20	-5675.31	5265.88
Saccade R	1	10	12838301996	12838361738	59742	1068.21	843.55	467.98	1030.93	6.83	308.42	0.33	114.27	7642.20	-5675.31	5265.88
Fixation L	1	11	12838361738	12838679977	318239	455.63	1047.75	15	25	-1	21.13	21.13
Fixation R	1	11	12838361738	12838679977	318239	455.63	1047.75	15	25	-1	19.32	19.32
Saccade L	1	11	12838679977	12838699879	19902	455.53	1046.09	543.81	1041.88	0.61	89.40	1.00	30.80	2202.81	-1860.29	1572.54
Saccade R	1	11	12838679977	12838699879	19902	455.53	1046.09	543.81	1041.88	0.61	89.40	1.00	30.80	2202.81	-1860.29	1572.54
Fixation L	1	12	12838699879	12838918603	218724	570.69	1018.48	33	42	-1	20.71	20.71
Fixation R	1	12	12838699879	12838918603	218724	570.69	1018.48	33	42	-1	19.20	19.20
Saccade L	1	12	12838918603	12838938592	19989	576.14	999.87	580.07	974.56	0.24	25.91	1.00	11.90	581.95	70.66	245.05
Saccade R	1	12	12838918603	12838938592	19989	576.14	999.87	580.07	974.56	0.24	25.91	1.00	11.90	581.95	70.66	245.05
Fixation L	1	13	12838938592	12839117581	178989	552.19	941.20	43	47	-1	20.97	20.97
Fixation R	1	13	12838938592	12839117581	178989	552.19	941.20	43	47	-1	19.40	19.40
Saccade L	1	13	12839117581	12839177210	59629	536.84	932.21	536.12	869.72	1.05	60.36	1.00	17.59	1171.60	0.00	415.98
Saccade R	1	13	12839117581	12839177210	59629	536.84	932.21	536.12	869.72	1.05	60.36	1.00	17.59	1171.60	0.00	415.98
