[BeGaze]
Converted from:	C:\Documents and Settings\iViewX\Desktop\EXPERIMENTATIONS\Experiments\results\finaleart\S11H21112-finaleart-1.idf
Date:	27.03.2019 15:39:35
Version:	BeGaze 2.5.77
Sample Rate:	50
Subject:	S11H21112
Description:	Clement legrand-Duchenne

Table Header for Fixations:
Event Type	Trial	Number	Start	End	Duration	Location X	Location Y	Dispersion X	Dispersion Y	Plane	Avg. Pupil Size X	Avg. Pupil Size Y

Table Header for Saccades:
Event Type	Trial	Number	Start	End	Duration	Start Loc.X	Start Loc.Y	End Loc.X	End Loc.Y	Amplitude	Peak Speed	Peak Speed At	Average Speed	Peak Accel.	Peak Decel.	Average Accel.

Table Header for Blinks:
Event Type	Trial	Number	Start	End	Duration

Table Header for User Events:
Event Type	Trial	Number	Start	Description

UserEvent	1	1	5629336286	# Message: void.jpg
Saccade L	1	1	5629344524	5629384385	39861	966.63	425.33	1078.13	421.09	1.16	98.65	1.00	29.05	2466.18	-2398.96	1284.79
Saccade R	1	1	5629344524	5629384385	39861	966.63	425.33	1078.13	421.09	1.16	98.65	1.00	29.05	2466.18	-2398.96	1284.79
Fixation L	1	1	5629384385	5629603248	218863	1076.74	413.26	9	13	-1	14.41	14.41
Fixation R	1	1	5629384385	5629603248	218863	1076.74	413.26	9	13	-1	16.50	16.50
Saccade L	1	2	5629603248	5629623133	19885	1077.56	412.13	1078.14	502.05	0.54	90.95	1.00	26.96	2217.01	-2199.73	1554.65
Saccade R	1	2	5629603248	5629623133	19885	1077.56	412.13	1078.14	502.05	0.54	90.95	1.00	26.96	2217.01	-2199.73	1554.65
Fixation L	1	2	5629623133	5629841996	218863	1082.47	518.56	8	22	-1	14.22	14.22
Fixation R	1	2	5629623133	5629841996	218863	1082.47	518.56	8	22	-1	16.29	16.29
Saccade L	1	3	5629841996	5629881740	39744	1085.77	506.23	1097.75	374.30	1.87	144.25	0.50	46.94	29661.91	-2104.98	8850.13
Saccade R	1	3	5629841996	5629881740	39744	1085.77	506.23	1097.75	374.30	1.87	144.25	0.50	46.94	29661.91	-2104.98	8850.13
Blink L	1	1	5629881740	5630379220	497480
Blink R	1	1	5629881740	5630379220	497480
Fixation L	1	3	5630379220	5630478841	99621	1543.38	162.36	21	40	-1	13.03	13.03
Fixation R	1	3	5630379220	5630478841	99621	1543.38	162.36	21	40	-1	15.14	15.14
Saccade L	1	4	5630478841	5630717698	238857	1544.74	164.78	1188.56	527.61	12.69	171.39	0.08	53.11	3976.58	-2181.36	1577.69
Saccade R	1	4	5630478841	5630757460	278619	1544.74	164.78	957.00	521.60	15.39	171.39	0.07	55.23	3976.58	-2781.07	1698.32
Blink L	1	2	5630717698	5630797328	79630
Fixation R	1	4	5630757460	5630956570	199110	963.79	524.28	71	9	-1	12.75	12.75
Fixation L	1	4	5630797328	5630956570	159242	962.90	524.35	70	9	-1	12.98	12.98
Saccade L	1	5	5630956570	5630976446	19876	907.26	518.89	888.48	516.43	0.43	51.43	0.00	21.83	213.49	-1133.51	580.39
Saccade R	1	5	5630956570	5631056065	99495	907.26	518.89	877.93	515.19	1.56	51.43	0.00	15.63	505.34	-1133.51	364.22
Fixation L	1	5	5630976446	5631334676	358230	894.90	521.09	28	15	-1	12.53	12.53
Fixation R	1	5	5631095941	5631334676	238735	898.47	523.02	17	15	-1	14.10	14.10
