[BeGaze]
Converted from:	C:\Documents and Settings\iViewX\Desktop\EXPERIMENTATIONS\Experiments\results\finaleart\S22H22551-finaleart-1.idf
Date:	27.03.2019 15:57:56
Version:	BeGaze 2.5.77
Sample Rate:	50
Subject:	S22H22551
Description:	Mathieu Chambre

Table Header for Fixations:
Event Type	Trial	Number	Start	End	Duration	Location X	Location Y	Dispersion X	Dispersion Y	Plane	Avg. Pupil Size X	Avg. Pupil Size Y

Table Header for Saccades:
Event Type	Trial	Number	Start	End	Duration	Start Loc.X	Start Loc.Y	End Loc.X	End Loc.Y	Amplitude	Peak Speed	Peak Speed At	Average Speed	Peak Accel.	Peak Decel.	Average Accel.

Table Header for Blinks:
Event Type	Trial	Number	Start	End	Duration

Table Header for User Events:
Event Type	Trial	Number	Start	Description

UserEvent	1	1	5245807861	# Message: void.jpg
Fixation L	1	1	5245824861	5245944222	119361	1082.83	469.81	4	5	-1	13.95	13.95
Fixation R	1	1	5245824861	5245944222	119361	1082.83	469.81	4	5	-1	14.11	14.11
Saccade L	1	1	5245944222	5245964102	19880	1080.85	467.50	1197.81	464.92	0.61	118.34	1.00	30.49	2944.80	-2751.85	1914.26
Saccade R	1	1	5245944222	5245964102	19880	1080.85	467.50	1197.81	464.92	0.61	118.34	1.00	30.49	2944.80	-2751.85	1914.26
Fixation L	1	2	5245964102	5246222711	258609	1201.96	456.27	10	19	-1	14.14	14.14
Fixation R	1	2	5245964102	5246222711	258609	1201.96	456.27	10	19	-1	14.03	14.03
Blink L	1	1	5246222711	5246381822	159111
Blink R	1	1	5246222711	5246381822	159111
Fixation L	1	3	5246381822	5247018289	636467	1216.60	333.00	34	63	-1	16.05	16.05
Fixation R	1	3	5246381822	5247018289	636467	1216.60	333.00	34	63	-1	16.09	16.09
Saccade L	1	2	5247018289	5247038158	19869	1197.27	361.82	1195.53	362.72	0.08	9.49	1.00	4.11	464.21	-6.72	213.37
Saccade R	1	2	5247018289	5247038158	19869	1197.27	361.82	1195.53	362.72	0.08	9.49	1.00	4.11	464.21	-6.72	213.37
Fixation L	1	4	5247038158	5247256902	218744	1162.36	364.72	50	14	-1	16.83	16.83
Fixation R	1	4	5247038158	5247256902	218744	1162.36	364.72	50	14	-1	17.17	17.17
Blink L	1	2	5247256902	5247475760	218858
Blink R	1	2	5247256902	5247475760	218858
Fixation L	1	5	5247475760	5247674623	198863	983.43	381.26	11	37	-1	18.56	18.56
Fixation R	1	5	5247475760	5247674623	198863	983.43	381.26	11	37	-1	18.49	18.49
Saccade L	1	3	5247674623	5247694501	19878	977.97	397.40	1068.48	393.59	0.52	91.64	1.00	26.31	2226.32	-2211.06	1526.65
Saccade R	1	3	5247674623	5247694501	19878	977.97	397.40	1068.48	393.59	0.52	91.64	1.00	26.31	2226.32	-2211.06	1526.65
Fixation L	1	6	5247694501	5247793987	99486	1060.99	394.98	10	3	-1	18.44	18.44
Fixation R	1	6	5247694501	5247793987	99486	1060.99	394.98	10	3	-1	19.15	19.15
