[BeGaze]
Converted from:	C:\Documents and Settings\iViewX\Desktop\EXPERIMENTATIONS\Experiments\results\finaleart\S21F22332-finaleart-1.idf
Date:	27.03.2019 15:56:22
Version:	BeGaze 2.5.77
Sample Rate:	50
Subject:	S21F22332
Description:	Cyrielle Mailart

Table Header for Fixations:
Event Type	Trial	Number	Start	End	Duration	Location X	Location Y	Dispersion X	Dispersion Y	Plane	Avg. Pupil Size X	Avg. Pupil Size Y

Table Header for Saccades:
Event Type	Trial	Number	Start	End	Duration	Start Loc.X	Start Loc.Y	End Loc.X	End Loc.Y	Amplitude	Peak Speed	Peak Speed At	Average Speed	Peak Accel.	Peak Decel.	Average Accel.

Table Header for Blinks:
Event Type	Trial	Number	Start	End	Duration

Table Header for User Events:
Event Type	Trial	Number	Start	Description

UserEvent	1	1	3158535282	# Message: plage-de-la-vignassa_cross_1892.jpg
Fixation L	1	1	3158546576	3158984171	437595	963.72	521.98	8	13	-1	13.29	13.29
Fixation R	1	1	3158546576	3158984171	437595	963.72	521.98	8	13	-1	12.85	12.85
Saccade L	1	1	3158984171	3159023925	39754	968.09	523.70	736.85	526.73	1.91	142.54	1.00	47.94	3545.04	-3420.79	2854.83
Saccade R	1	1	3158984171	3159023925	39754	968.09	523.70	736.85	526.73	1.91	142.54	1.00	47.94	3545.04	-3420.79	2854.83
Fixation L	1	2	3159023925	3159143286	119361	736.25	519.22	4	14	-1	13.16	13.16
Fixation R	1	2	3159023925	3159143286	119361	736.25	519.22	4	14	-1	12.78	12.78
Saccade L	1	2	3159143286	3159183032	39746	734.88	512.00	677.04	172.51	3.07	300.06	0.50	77.27	7398.82	-6877.13	4052.60
Saccade R	1	2	3159143286	3159183032	39746	734.88	512.00	677.04	172.51	3.07	300.06	0.50	77.27	7398.82	-6877.13	4052.60
Fixation L	1	3	3159183032	3159342149	159117	658.43	148.30	30	43	-1	11.93	11.93
Fixation R	1	3	3159183032	3159342149	159117	658.43	148.30	30	43	-1	11.62	11.62
Saccade L	1	3	3159342149	3159381897	39748	646.82	139.31	1096.31	23.15	4.25	265.21	1.00	106.97	6361.68	-6340.59	5385.61
Saccade R	1	3	3159342149	3159381897	39748	646.82	139.31	1096.31	23.15	4.25	265.21	1.00	106.97	6361.68	-6340.59	5385.61
Fixation L	1	4	3159381897	3159660378	278481	1120.84	42.27	32	56	-1	11.42	11.42
Fixation R	1	4	3159381897	3159660378	278481	1120.84	42.27	32	56	-1	10.92	10.92
Saccade L	1	4	3159660378	3159700132	39754	1129.05	44.27	1428.15	38.10	2.67	234.86	0.50	67.21	5763.71	-5441.38	3549.85
Saccade R	1	4	3159660378	3159700132	39754	1129.05	44.27	1428.15	38.10	2.67	234.86	0.50	67.21	5763.71	-5441.38	3549.85
Fixation L	1	5	3159700132	3159898999	198867	1433.40	47.94	12	48	-1	10.60	10.60
Fixation R	1	5	3159700132	3159898999	198867	1433.40	47.94	12	48	-1	10.65	10.65
Saccade L	1	5	3159898999	3159918997	19998	1428.49	75.89	1223.85	29.49	1.56	212.17	1.00	78.18	4999.15	-5073.64	3785.57
Saccade R	1	5	3159898999	3159918997	19998	1428.49	75.89	1223.85	29.49	1.56	212.17	1.00	78.18	4999.15	-5073.64	3785.57
Fixation L	1	6	3159918997	3160058118	139121	1170.49	47.62	62	35	-1	10.40	10.40
Fixation R	1	6	3159918997	3160058118	139121	1170.49	47.62	62	35	-1	10.27	10.27
Saccade L	1	6	3160058118	3160097989	39871	1161.08	40.59	1050.29	572.65	4.71	392.48	1.00	118.11	9754.43	-9469.43	6538.66
Saccade R	1	6	3160058118	3160097989	39871	1161.08	40.59	1050.29	572.65	4.71	392.48	1.00	118.11	9754.43	-9469.43	6538.66
Fixation L	1	7	3160097989	3160276976	178987	1028.00	611.00	27	50	-1	11.07	11.07
Fixation R	1	7	3160097989	3160276976	178987	1028.00	611.00	27	50	-1	10.85	10.85
Saccade L	1	7	3160276976	3160316729	39753	1023.33	623.04	831.14	786.53	2.18	235.83	1.00	54.81	5852.27	-5768.02	3065.11
Saccade R	1	7	3160276976	3160316729	39753	1023.33	623.04	831.14	786.53	2.18	235.83	1.00	54.81	5852.27	-5768.02	3065.11
Fixation L	1	8	3160316729	3160495720	178991	831.39	775.74	7	16	-1	11.08	11.08
Fixation R	1	8	3160316729	3160495720	178991	831.39	775.74	7	16	-1	11.30	11.30
Saccade L	1	8	3160495720	3160535464	39744	830.58	775.26	417.07	871.91	3.74	281.64	1.00	94.11	7018.19	-6968.00	5501.69
Saccade R	1	8	3160495720	3160535464	39744	830.58	775.26	417.07	871.91	3.74	281.64	1.00	94.11	7018.19	-6968.00	5501.69
Fixation L	1	9	3160535464	3160714582	179118	428.47	893.14	14	32	-1	11.34	11.34
Fixation R	1	9	3160535464	3160714582	179118	428.47	893.14	14	32	-1	11.40	11.40
Saccade L	1	9	3160714582	3160754339	39757	428.90	903.97	400.67	517.27	3.34	246.10	1.00	84.01	6113.34	-6007.21	4690.25
Saccade R	1	9	3160714582	3160754339	39757	428.90	903.97	400.67	517.27	3.34	246.10	1.00	84.01	6113.34	-6007.21	4690.25
Fixation L	1	10	3160754339	3160933314	178975	391.71	488.97	17	49	-1	11.37	11.37
Fixation R	1	10	3160754339	3160933314	178975	391.71	488.97	17	49	-1	11.34	11.34
Saccade L	1	10	3160933314	3160953186	19872	385.18	490.87	378.10	179.88	1.89	314.37	1.00	94.95	7599.08	-7456.27	5094.45
Saccade R	1	10	3160933314	3160953186	19872	385.18	490.87	378.10	179.88	1.89	314.37	1.00	94.95	7599.08	-7456.27	5094.45
Fixation L	1	11	3160953186	3161152051	198865	391.10	167.90	23	30	-1	11.00	11.00
Fixation R	1	11	3160953186	3161152051	198865	391.10	167.90	23	30	-1	11.08	11.08
Saccade L	1	11	3161152051	3161211804	59753	401.21	170.26	1053.96	27.06	8.06	423.98	0.33	134.97	10467.94	-7675.26	6451.81
Saccade R	1	11	3161152051	3161211804	59753	401.21	170.26	1053.96	27.06	8.06	423.98	0.33	134.97	10467.94	-7675.26	6451.81
Fixation L	1	12	3161211804	3161390788	178984	1071.12	27.16	24	15	-1	11.64	11.64
Fixation R	1	12	3161211804	3161390788	178984	1071.12	27.16	24	15	-1	11.62	11.62
Saccade L	1	12	3161390788	3161430539	39751	1078.04	26.80	1398.86	33.27	3.19	222.69	1.00	80.22	5357.00	-4658.52	3370.73
Saccade R	1	12	3161390788	3161430539	39751	1078.04	26.80	1398.86	33.27	3.19	222.69	1.00	80.22	5357.00	-4658.52	3370.73
Fixation L	1	13	3161430539	3161629529	198990	1374.65	41.58	44	31	-1	11.03	11.03
Fixation R	1	13	3161430539	3161629529	198990	1374.65	41.58	44	31	-1	11.00	11.00
Saccade L	1	13	3161629529	3161649405	19876	1367.28	39.01	1176.06	-56.55	1.24	216.15	1.00	62.17	5213.01	-4944.59	3437.64
Saccade R	1	13	3161629529	3161649405	19876	1367.28	39.01	1176.06	-56.55	1.24	216.15	1.00	62.17	5213.01	-4944.59	3437.64
Fixation L	1	14	3161649405	3161967638	318233	1176.94	-64.70	13	79	-1	10.16	10.16
Fixation R	1	14	3161649405	3161967638	318233	1176.94	-64.70	13	79	-1	10.53	10.53
Saccade L	1	14	3161967638	3162007389	39751	1174.38	-64.88	1422.17	64.16	2.71	223.28	0.50	68.17	5024.00	-5183.77	3267.99
Saccade R	1	14	3161967638	3162007389	39751	1174.38	-64.88	1422.17	64.16	2.71	223.28	0.50	68.17	5024.00	-5183.77	3267.99
Fixation L	1	15	3162007389	3162206257	198868	1433.19	65.81	13	23	-1	10.60	10.60
Fixation R	1	15	3162007389	3162206257	198868	1433.19	65.81	13	23	-1	10.59	10.59
Saccade L	1	15	3162206257	3162226125	19868	1435.92	66.88	1651.96	75.06	1.18	218.59	1.00	59.23	5230.24	-5355.00	3563.15
Saccade R	1	15	3162206257	3162226125	19868	1435.92	66.88	1651.96	75.06	1.18	218.59	1.00	59.23	5230.24	-5355.00	3563.15
Fixation L	1	16	3162226125	3162504615	278490	1643.96	107.00	21	71	-1	10.79	10.79
Fixation R	1	16	3162226125	3162504615	278490	1643.96	107.00	21	71	-1	10.52	10.52
Saccade L	1	16	3162504615	3162524487	19872	1631.89	138.37	1337.61	149.87	2.15	297.67	1.00	108.21	7345.81	0.00	3672.91
Saccade R	1	16	3162504615	3162524487	19872	1631.89	138.37	1337.61	149.87	2.15	297.67	1.00	108.21	7345.81	0.00	3672.91
