[BeGaze]
Converted from:	C:\Documents and Settings\iViewX\Desktop\EXPERIMENTATIONS\Experiments\results\finaleart\S02123220-finaleart-1.idf
Date:	27.03.2019 15:33:44
Version:	BeGaze 2.5.77
Sample Rate:	50
Subject:	S02123220
Description:	David Xu

Table Header for Fixations:
Event Type	Trial	Number	Start	End	Duration	Location X	Location Y	Dispersion X	Dispersion Y	Plane	Avg. Pupil Size X	Avg. Pupil Size Y

Table Header for Saccades:
Event Type	Trial	Number	Start	End	Duration	Start Loc.X	Start Loc.Y	End Loc.X	End Loc.Y	Amplitude	Peak Speed	Peak Speed At	Average Speed	Peak Accel.	Peak Decel.	Average Accel.

Table Header for Blinks:
Event Type	Trial	Number	Start	End	Duration

Table Header for User Events:
Event Type	Trial	Number	Start	Description

UserEvent	1	1	2151706035	# Message: void.jpg
Saccade L	1	1	2151710993	2151750868	39875	753.64	595.40	747.35	573.58	2.02	102.21	1.00	50.66	2555.35	-2325.85	1659.78
Saccade R	1	1	2151710993	2151750868	39875	753.64	595.40	747.35	573.58	2.02	102.21	1.00	50.66	2555.35	-2325.85	1659.78
Fixation L	1	1	2151750868	2151870139	119271	757.43	577.28	21	35	-1	13.34	13.34
Fixation R	1	1	2151750868	2151870139	119271	757.43	577.28	21	35	-1	13.48	13.48
Saccade L	1	2	2151870139	2151889975	19836	746.29	592.15	625.59	593.93	1.06	122.09	1.00	53.63	2379.61	-2857.13	1960.64
Saccade R	1	2	2151870139	2151889975	19836	746.29	592.15	625.59	593.93	1.06	122.09	1.00	53.63	2379.61	-2857.13	1960.64
Fixation L	1	2	2151889975	2152009338	119363	589.54	581.55	46	28	-1	13.28	13.28
Fixation R	1	2	2151889975	2152009338	119363	589.54	581.55	46	28	-1	13.53	13.53
Saccade L	1	3	2152009338	2152188338	179000	581.59	592.64	1067.91	445.86	9.32	186.47	0.89	52.09	4531.38	-4230.92	1844.58
Saccade R	1	3	2152009338	2152188338	179000	581.59	592.64	1067.91	445.86	9.32	186.47	0.89	52.09	4531.38	-4230.92	1844.58
Fixation L	1	3	2152188338	2152526584	338246	1077.98	424.66	29	46	-1	11.54	11.54
Fixation R	1	3	2152188338	2152526584	338246	1077.98	424.66	29	46	-1	11.53	11.53
Saccade L	1	4	2152526584	2152606058	79474	1058.56	399.64	938.93	393.10	1.71	59.89	1.00	21.49	1050.33	-1135.65	696.07
Saccade R	1	4	2152526584	2152606058	79474	1058.56	399.64	938.93	393.10	1.71	59.89	1.00	21.49	1050.33	-1135.65	696.07
Fixation L	1	4	2152606058	2153083405	477347	937.82	435.32	25	66	-1	11.10	11.10
Fixation R	1	4	2152606058	2153083405	477347	937.82	435.32	25	66	-1	11.20	11.20
Saccade L	1	5	2153083405	2153103273	19868	949.84	454.57	949.06	465.87	0.12	11.46	1.00	5.87	165.85	-139.42	113.75
Saccade R	1	5	2153083405	2153103273	19868	949.84	454.57	949.06	465.87	0.12	11.46	1.00	5.87	165.85	-139.42	113.75
Fixation L	1	5	2153103273	2153719863	616590	939.21	478.03	17	31	-1	12.51	12.51
Fixation R	1	5	2153103273	2153719863	616590	939.21	478.03	17	31	-1	12.50	12.50
