[BeGaze]
Converted from:	C:\Documents and Settings\iViewX\Desktop\EXPERIMENTATIONS\Experiments\results\finaleart\S01A22542-finaleart-1.idf
Date:	27.03.2019 15:33:20
Version:	BeGaze 2.5.77
Sample Rate:	50
Subject:	S01A22542
Description:	Thibault Seve Minnaert

Table Header for Fixations:
Event Type	Trial	Number	Start	End	Duration	Location X	Location Y	Dispersion X	Dispersion Y	Plane	Avg. Pupil Size X	Avg. Pupil Size Y

Table Header for Saccades:
Event Type	Trial	Number	Start	End	Duration	Start Loc.X	Start Loc.Y	End Loc.X	End Loc.Y	Amplitude	Peak Speed	Peak Speed At	Average Speed	Peak Accel.	Peak Decel.	Average Accel.

Table Header for Blinks:
Event Type	Trial	Number	Start	End	Duration

Table Header for User Events:
Event Type	Trial	Number	Start	Description

UserEvent	1	1	9175484958	# Message: void.jpg
Saccade L	1	1	9175486947	9175546686	59739	646.33	704.45	607.62	859.83	2.46	139.47	1.00	41.19	3234.12	-3201.91	1534.00
Saccade R	1	1	9175486947	9175546686	59739	646.33	704.45	607.62	859.83	2.46	139.47	1.00	41.19	3234.12	-3201.91	1534.00
Fixation L	1	1	9175546686	9175924916	378230	595.01	841.54	17	35	-1	13.60	13.60
Fixation R	1	1	9175546686	9175924916	378230	595.01	841.54	17	35	-1	15.04	15.04
Blink L	1	1	9175924916	9176203666	278750
Blink R	1	1	9175924916	9176203666	278750
Fixation L	1	2	9176203666	9176482392	278726	1133.10	396.80	9	57	-1	13.52	13.52
Fixation R	1	2	9176203666	9176482392	278726	1133.10	396.80	9	57	-1	14.88	14.88
Saccade L	1	2	9176482392	9176502257	19865	1128.92	415.80	1126.44	276.38	0.76	141.04	1.00	38.28	3470.53	-3343.19	2279.67
Saccade R	1	2	9176482392	9176502257	19865	1128.92	415.80	1126.44	276.38	0.76	141.04	1.00	38.28	3470.53	-3343.19	2279.67
Fixation L	1	3	9176502257	9176681389	179132	1124.34	268.91	7	68	-1	13.90	13.90
Fixation R	1	3	9176502257	9176681389	179132	1124.34	268.91	7	68	-1	15.23	15.23
Saccade L	1	3	9176681389	9176701376	19987	1120.71	216.95	1122.26	118.37	0.90	99.72	1.00	45.26	2284.58	-2421.30	2116.58
Saccade R	1	3	9176681389	9176701376	19987	1120.71	216.95	1122.26	118.37	0.90	99.72	1.00	45.26	2284.58	-2421.30	2116.58
Fixation L	1	4	9176701376	9176840748	139372	1126.52	107.64	8	40	-1	13.24	13.24
Fixation R	1	4	9176701376	9176840748	139372	1126.52	107.64	8	40	-1	14.48	14.48
Saccade L	1	4	9176840748	9176860624	19876	1130.78	79.50	1143.31	33.19	0.50	48.53	1.00	25.10	1096.98	-950.52	729.44
Saccade R	1	4	9176840748	9176860624	19876	1130.78	79.50	1143.31	33.19	0.50	48.53	1.00	25.10	1096.98	-950.52	729.44
Fixation L	1	5	9176860624	9177139368	278744	1171.55	23.14	38	43	-1	12.38	12.38
Fixation R	1	5	9176860624	9177139368	278744	1171.55	23.14	38	43	-1	13.72	13.72
Saccade L	1	5	9177139368	9177199113	59745	1179.57	52.90	973.49	510.88	5.67	215.15	0.67	94.84	4280.06	-5151.33	3512.12
Saccade R	1	5	9177139368	9177199113	59745	1179.57	52.90	973.49	510.88	5.67	215.15	0.67	94.84	4280.06	-5151.33	3512.12
Fixation L	1	6	9177199113	9177477843	278730	962.55	523.66	15	17	-1	13.65	13.65
Fixation R	1	6	9177199113	9177477843	278730	962.55	523.66	15	17	-1	14.68	14.68
