[BeGaze]
Converted from:	C:\Documents and Settings\iViewX\Desktop\EXPERIMENTATIONS\Experiments\results\finaleart\S20H24222-finaleart-1.idf
Date:	27.03.2019 15:54:15
Version:	BeGaze 2.5.77
Sample Rate:	50
Subject:	S20H24222
Description:	Hugo Brument

Table Header for Fixations:
Event Type	Trial	Number	Start	End	Duration	Location X	Location Y	Dispersion X	Dispersion Y	Plane	Avg. Pupil Size X	Avg. Pupil Size Y

Table Header for Saccades:
Event Type	Trial	Number	Start	End	Duration	Start Loc.X	Start Loc.Y	End Loc.X	End Loc.Y	Amplitude	Peak Speed	Peak Speed At	Average Speed	Peak Accel.	Peak Decel.	Average Accel.

Table Header for Blinks:
Event Type	Trial	Number	Start	End	Duration

Table Header for User Events:
Event Type	Trial	Number	Start	Description

UserEvent	1	1	12397030804	# Message: Delacroix-odalisque-1825.jpg
Fixation L	1	1	12397043154	12397759122	715968	875.43	606.91	37	61	-1	13.71	13.71
Fixation R	1	1	12397043154	12397759122	715968	875.43	606.91	37	61	-1	14.23	14.23
Saccade L	1	1	12397759122	12397779120	19998	885.69	572.27	885.29	565.94	0.10	6.42	1.00	4.77	89.26	-78.78	72.67
Saccade R	1	1	12397759122	12397779120	19998	885.69	572.27	885.29	565.94	0.10	6.42	1.00	4.77	89.26	-78.78	72.67
Fixation L	1	2	12397779120	12397977988	198868	891.15	556.24	8	48	-1	12.86	12.86
Fixation R	1	2	12397779120	12397977988	198868	891.15	556.24	8	48	-1	13.51	13.51
Saccade L	1	2	12397977988	12397997858	19870	892.96	517.56	894.24	441.76	0.65	76.69	1.00	32.57	1849.73	-1792.70	1505.88
Saccade R	1	2	12397977988	12397997858	19870	892.96	517.56	894.24	441.76	0.65	76.69	1.00	32.57	1849.73	-1792.70	1505.88
Fixation L	1	3	12397997858	12398216603	218745	893.45	441.92	5	16	-1	12.77	12.77
Fixation R	1	3	12397997858	12398216603	218745	893.45	441.92	5	16	-1	13.44	13.44
Saccade L	1	3	12398216603	12398256480	39877	891.60	435.55	476.51	433.98	3.60	272.53	1.00	90.19	6774.76	-6674.30	5015.76
Saccade R	1	3	12398216603	12398256480	39877	891.60	435.55	476.51	433.98	3.60	272.53	1.00	90.19	6774.76	-6674.30	5015.76
Fixation L	1	4	12398256480	12398892950	636470	425.44	437.83	62	16	-1	13.37	13.37
Fixation R	1	4	12398256480	12398892950	636470	425.44	437.83	62	16	-1	14.08	14.08
Saccade L	1	4	12398892950	12398952579	59629	419.67	436.99	461.15	959.69	5.65	242.53	0.33	94.77	6037.25	-4316.60	4197.74
Saccade R	1	4	12398892950	12398952579	59629	419.67	436.99	461.15	959.69	5.65	242.53	0.33	94.77	6037.25	-4316.60	4197.74
Fixation L	1	5	12398952579	12399429950	477371	495.32	986.03	40	40	-1	14.02	14.02
Fixation R	1	5	12398952579	12399429950	477371	495.32	986.03	40	40	-1	14.98	14.98
Saccade L	1	5	12399429950	12399489676	59726	498.05	975.12	1202.47	911.01	7.42	358.81	0.67	124.19	8805.46	-8585.92	5542.50
Saccade R	1	5	12399429950	12399489676	59726	498.05	975.12	1202.47	911.01	7.42	358.81	0.67	124.19	8805.46	-8585.92	5542.50
Fixation L	1	6	12399489676	12399708419	218743	1201.99	894.15	13	23	-1	14.37	14.37
Fixation R	1	6	12399489676	12399708419	218743	1201.99	894.15	13	23	-1	14.94	14.94
Saccade L	1	6	12399708419	12399768037	59618	1209.27	887.83	1301.40	315.21	6.12	234.44	0.33	102.72	5803.44	-4738.65	4287.95
Saccade R	1	6	12399708419	12399768037	59618	1209.27	887.83	1301.40	315.21	6.12	234.44	0.33	102.72	5803.44	-4738.65	4287.95
Fixation L	1	7	12399768037	12400146019	377982	1308.25	338.74	14	37	-1	13.53	13.53
Fixation R	1	7	12399768037	12400146019	377982	1308.25	338.74	14	37	-1	13.77	13.77
Saccade L	1	7	12400146019	12400185774	39755	1306.00	345.23	1075.86	299.06	2.11	130.97	0.50	53.08	3092.14	-2875.64	2740.05
Saccade R	1	7	12400146019	12400185774	39755	1306.00	345.23	1075.86	299.06	2.11	130.97	0.50	53.08	3092.14	-2875.64	2740.05
Fixation L	1	8	12400185774	12400344896	159122	1096.53	296.33	30	18	-1	13.65	13.65
Fixation R	1	8	12400185774	12400344896	159122	1096.53	296.33	30	18	-1	13.72	13.72
Saccade L	1	8	12400344896	12400404520	59624	1097.30	287.05	497.38	304.06	6.40	325.83	0.67	107.34	8065.00	-7423.28	5010.13
Saccade R	1	8	12400344896	12400404520	59624	1097.30	287.05	497.38	304.06	6.40	325.83	0.67	107.34	8065.00	-7423.28	5010.13
Fixation L	1	9	12400404520	12400643244	238724	503.12	329.83	20	36	-1	13.90	13.90
Fixation R	1	9	12400404520	12400643244	238724	503.12	329.83	20	36	-1	14.67	14.67
Saccade L	1	9	12400643244	12400663124	19880	501.40	340.26	476.83	476.44	0.99	139.96	1.00	49.91	3327.88	-3022.51	2510.76
Saccade R	1	9	12400643244	12400663124	19880	501.40	340.26	476.83	476.44	0.99	139.96	1.00	49.91	3327.88	-3022.51	2510.76
Fixation L	1	10	12400663124	12400881867	218743	443.80	442.51	46	47	-1	14.32	14.32
Fixation R	1	10	12400663124	12400881867	218743	443.80	442.51	46	47	-1	15.13	15.13
Saccade L	1	10	12400881867	12400921730	39863	435.45	451.45	951.82	441.49	4.31	412.26	0.50	108.13	10218.79	-10119.97	6356.65
Saccade R	1	10	12400881867	12400921730	39863	435.45	451.45	951.82	441.49	4.31	412.26	0.50	108.13	10218.79	-10119.97	6356.65
Fixation L	1	11	12400921730	12401021101	99371	959.22	437.58	12	6	-1	14.68	14.68
Fixation R	1	11	12400921730	12401021101	99371	959.22	437.58	12	6	-1	15.63	15.63
