[BeGaze]
Converted from:	C:\Documents and Settings\iViewX\Desktop\EXPERIMENTATIONS\Experiments\results\finaleart\S19F21442-finaleart-1.idf
Date:	27.03.2019 15:50:58
Version:	BeGaze 2.5.77
Sample Rate:	50
Subject:	S19F21442
Description:	Juliette Veuillez

Table Header for Fixations:
Event Type	Trial	Number	Start	End	Duration	Location X	Location Y	Dispersion X	Dispersion Y	Plane	Avg. Pupil Size X	Avg. Pupil Size Y

Table Header for Saccades:
Event Type	Trial	Number	Start	End	Duration	Start Loc.X	Start Loc.Y	End Loc.X	End Loc.Y	Amplitude	Peak Speed	Peak Speed At	Average Speed	Peak Accel.	Peak Decel.	Average Accel.

Table Header for Blinks:
Event Type	Trial	Number	Start	End	Duration

Table Header for User Events:
Event Type	Trial	Number	Start	Description

UserEvent	1	1	6751714370	# Message: bathers_cross_1902.jpg
Fixation L	1	1	6751726852	6752144466	417614	705.22	474.32	18	38	-1	11.62	11.62
Fixation R	1	1	6751726852	6752144466	417614	705.22	474.32	18	38	-1	13.33	13.33
Saccade L	1	1	6752144466	6752184192	39726	701.28	486.24	830.73	314.75	2.25	127.69	1.00	56.58	3099.01	-3043.13	2950.89
Saccade R	1	1	6752144466	6752184192	39726	701.28	486.24	830.73	314.75	2.25	127.69	1.00	56.58	3099.01	-3043.13	2950.89
Fixation L	1	2	6752184192	6752363318	179126	833.20	300.39	4	24	-1	11.16	11.16
Fixation R	1	2	6752184192	6752363318	179126	833.20	300.39	4	24	-1	12.38	12.38
Saccade L	1	2	6752363318	6752403063	39745	834.76	290.52	906.04	111.80	1.80	112.33	0.50	45.26	2784.55	-2408.13	2067.39
Saccade R	1	2	6752363318	6752403063	39745	834.76	290.52	906.04	111.80	1.80	112.33	0.50	45.26	2784.55	-2408.13	2067.39
Fixation L	1	3	6752403063	6752621801	218738	917.43	133.01	16	35	-1	9.95	9.95
Fixation R	1	3	6752403063	6752621801	218738	917.43	133.01	16	35	-1	10.57	10.57
Saccade L	1	3	6752621801	6752681551	59750	919.75	138.19	1291.77	472.14	5.43	244.46	0.67	90.87	6029.01	-5355.80	4268.04
Saccade R	1	3	6752621801	6752681551	59750	919.75	138.19	1291.77	472.14	5.43	244.46	0.67	90.87	6029.01	-5355.80	4268.04
Fixation L	1	4	6752681551	6752840673	159122	1316.95	493.57	31	31	-1	10.58	10.58
Fixation R	1	4	6752681551	6752840673	159122	1316.95	493.57	31	31	-1	10.41	10.41
Saccade L	1	4	6752840673	6752860537	19864	1318.42	503.98	1364.96	582.89	0.57	92.67	1.00	28.63	2082.90	-1720.88	1311.11
Saccade R	1	4	6752840673	6752860537	19864	1318.42	503.98	1364.96	582.89	0.57	92.67	1.00	28.63	2082.90	-1720.88	1311.11
Fixation L	1	5	6752860537	6753337896	477359	1370.72	609.76	35	45	-1	10.81	10.81
Fixation R	1	5	6752860537	6753337896	477359	1370.72	609.76	35	45	-1	10.78	10.78
Saccade L	1	5	6753337896	6753397514	59618	1371.79	606.84	929.84	200.93	6.56	246.24	1.00	110.00	5810.44	-6045.89	4541.15
Saccade R	1	5	6753337896	6753397514	59618	1371.79	606.84	929.84	200.93	6.56	246.24	1.00	110.00	5810.44	-6045.89	4541.15
Fixation L	1	6	6753397514	6753636271	238757	901.69	225.97	34	36	-1	10.49	10.49
Fixation R	1	6	6753397514	6753636271	238757	901.69	225.97	34	36	-1	11.10	11.10
Saccade L	1	6	6753636271	6753656133	19862	900.89	208.98	905.60	115.83	0.65	94.35	1.00	32.90	2315.62	-1999.66	1495.59
Saccade R	1	6	6753636271	6753656133	19862	900.89	208.98	905.60	115.83	0.65	94.35	1.00	32.90	2315.62	-1999.66	1495.59
Fixation L	1	7	6753656133	6753934617	278484	934.07	109.96	41	44	-1	10.26	10.26
Fixation R	1	7	6753656133	6753934617	278484	934.07	109.96	41	44	-1	11.21	11.21
Saccade L	1	7	6753934617	6753974365	39748	944.22	140.99	564.38	495.05	4.55	289.19	1.00	114.45	6901.77	-6990.82	6266.75
Saccade R	1	7	6753934617	6753974365	39748	944.22	140.99	564.38	495.05	4.55	289.19	1.00	114.45	6901.77	-6990.82	6266.75
Fixation L	1	8	6753974365	6754232984	258619	535.82	527.43	36	52	-1	10.80	10.80
Fixation R	1	8	6753974365	6754232984	258619	535.82	527.43	36	52	-1	12.18	12.18
Saccade L	1	8	6754232984	6754272760	39776	532.56	542.93	849.77	393.36	3.24	197.78	0.50	81.34	4849.74	-3818.92	3986.63
Saccade R	1	8	6754232984	6754272760	39776	532.56	542.93	849.77	393.36	3.24	197.78	0.50	81.34	4849.74	-3818.92	3986.63
Fixation L	1	9	6754272760	6754471604	198844	854.70	412.85	8	44	-1	10.62	10.62
Fixation R	1	9	6754272760	6754471604	198844	854.70	412.85	8	44	-1	12.06	12.06
Saccade L	1	9	6754471604	6754491494	19890	855.51	401.02	849.44	334.07	0.60	68.00	1.00	30.08	1596.77	-891.63	1044.56
Saccade R	1	9	6754471604	6754491494	19890	855.51	401.02	849.44	334.07	0.60	68.00	1.00	30.08	1596.77	-891.63	1044.56
Fixation L	1	10	6754491494	6754929084	437590	823.87	351.28	34	36	-1	10.41	10.41
Fixation R	1	10	6754491494	6754929084	437590	823.87	351.28	34	36	-1	11.55	11.55
Saccade L	1	10	6754929084	6754968827	39743	817.07	359.50	816.00	690.62	2.87	184.41	0.50	72.18	4458.47	-4145.19	3994.32
Saccade R	1	10	6754929084	6754968827	39743	817.07	359.50	816.00	690.62	2.87	184.41	0.50	72.18	4458.47	-4145.19	3994.32
Fixation L	1	11	6754968827	6755147949	179122	818.06	678.04	11	25	-1	10.75	10.75
Fixation R	1	11	6754968827	6755147949	179122	818.06	678.04	11	25	-1	12.20	12.20
Saccade L	1	11	6755147949	6755187701	39752	823.50	680.81	830.24	337.48	2.88	260.30	1.00	72.41	6389.71	-6400.31	4220.41
Saccade R	1	11	6755147949	6755187701	39752	823.50	680.81	830.24	337.48	2.88	260.30	1.00	72.41	6389.71	-6400.31	4220.41
Fixation L	1	12	6755187701	6755486062	298361	844.06	337.84	25	30	-1	10.46	10.46
Fixation R	1	12	6755187701	6755486062	298361	844.06	337.84	25	30	-1	11.53	11.53
Saccade L	1	12	6755486062	6755525806	39744	855.32	321.11	797.67	272.93	1.10	60.82	0.50	27.58	1320.00	-718.96	763.24
Saccade R	1	12	6755486062	6755525806	39744	855.32	321.11	797.67	272.93	1.10	60.82	0.50	27.58	1320.00	-718.96	763.24
Fixation L	1	13	6755525806	6755665045	139239	779.28	242.61	24	47	-1	10.24	10.24
Fixation R	1	13	6755525806	6755665045	139239	779.28	242.61	24	47	-1	11.35	11.35
Saccade L	1	13	6755665045	6755704798	39753	776.04	237.62	478.93	542.56	4.40	226.08	1.00	110.72	5593.04	0.00	3484.17
Saccade R	1	13	6755665045	6755704798	39753	776.04	237.62	478.93	542.56	4.40	226.08	1.00	110.72	5593.04	0.00	3484.17
