finaleart	S20H24222	00:00:00:000	Calibration	
finaleart	S20H24222	00:00:37:953	The deviations of the calibration are DevX = 0,3825 DevY = 1,2875
finaleart	S20H24222	00:00:38:187	Image	REJECTED_olympia_manet_1863.jpg
finaleart	S20H24222	00:00:42:250	Image	void.png
finaleart	S20H24222	00:00:44:296	Image	REJECTED_rose_in_a_bowl_fantin_latour_1883.jpg
finaleart	S20H24222	00:00:48:328	Image	void.png
finaleart	S20H24222	00:00:50:390	Calibration	
finaleart	S20H24222	00:01:17:968	The deviations of the calibration are DevX = 0,755 DevY = 0,7875
finaleart	S20H24222	00:01:18:218	Image	REJECTED_Volga_Lagoon_Vassiliev_1870.jpg
finaleart	S20H24222	00:01:22:328	Image	void.png
finaleart	S20H24222	00:01:24:375	Image	marquet-fruit-knife-and-napkin-1898.jpg
finaleart	S20H24222	00:01:28:437	Image	void.png
finaleart	S20H24222	00:01:30:484	Image	plage-de-la-vignassa_cross_1892.jpg
finaleart	S20H24222	00:01:34:531	Image	void.png
finaleart	S20H24222	00:01:36:593	Image	venice_from_porche_of_madonna_turner_1835.jpg
finaleart	S20H24222	00:01:40:640	Image	void.png
finaleart	S20H24222	00:01:42:687	Image	Nature_morte_au_panier_Derain_1927.jpg
finaleart	S20H24222	00:01:46:750	Image	void.png
finaleart	S20H24222	00:01:48:796	Image	the-large-bathers_renoir_1887.jpg
finaleart	S20H24222	00:01:52:875	Image	void.png
finaleart	S20H24222	00:01:54:921	Image	morning_Daubigny_1858.jpg
finaleart	S20H24222	00:01:58:968	Image	void.png
finaleart	S20H24222	00:02:01:046	Image	the-wood_cross_907.jpg
finaleart	S20H24222	00:02:05:093	Image	void.png
finaleart	S20H24222	00:02:07:156	Image	the_model's_siesta_Rysselberghe_1920.jpg
finaleart	S20H24222	00:02:11:218	Image	void.png
finaleart	S20H24222	00:02:13:281	Image	La_Ferme_des_Collettes_Renoir_1908.jpg
finaleart	S20H24222	00:02:17:328	Image	void.png
finaleart	S20H24222	00:02:19:390	Image	Morning,_An_Overcast_Day_Rouen_Pissaro_1896.jpg
finaleart	S20H24222	00:02:23:437	Image	void.png
finaleart	S20H24222	00:02:25:484	Image	Niagara_Falls_Hale_1902.jpg
finaleart	S20H24222	00:02:29:531	Image	void.png
finaleart	S20H24222	00:02:31:593	Image	Turner-snow-storm-boat-off-a-harbours-mouth-1842.jpg
finaleart	S20H24222	00:02:35:671	Image	void.png
finaleart	S20H24222	00:02:37:718	Image	cows_at_a_pond_Bilders_1856.jpg
finaleart	S20H24222	00:02:41:765	Image	void.png
finaleart	S20H24222	00:02:43:828	Image	courbet-the-sleepers-1866.jpg
finaleart	S20H24222	00:02:47:875	Image	void.png
finaleart	S20H24222	00:02:49:937	Image	Le_Puy_In_The_Snow_Dubois-Pillet_1889.jpg
finaleart	S20H24222	00:02:54:000	Image	void.png
finaleart	S20H24222	00:02:56:046	Image	L-Heure_Embrasee_Rysselberghe_1897.jpg
finaleart	S20H24222	00:03:00:125	Image	void.png
finaleart	S20H24222	00:03:02:171	Image	The_Joy_Of_Life_Matisse_1906.jpg
finaleart	S20H24222	00:03:06:218	Image	void.png
finaleart	S20H24222	00:03:08:281	Image	lying-nude_ury_1889.JPG
finaleart	S20H24222	00:03:12:328	Image	void.png
finaleart	S20H24222	00:03:14:390	Image	resting-bacchante_sorolla_1887.jpg
finaleart	S20H24222	00:03:18:437	Image	void.png
finaleart	S20H24222	00:03:20:500	Image	oysters_manet_1862.jpg
finaleart	S20H24222	00:03:24:546	Image	void.png
finaleart	S20H24222	00:03:26:625	Image	The_Augustan_Bridge_at_Narni_Corot_1826.jpg
finaleart	S20H24222	00:03:30:687	Image	void.png
finaleart	S20H24222	00:03:32:734	Image	Le_Chemin_De_Fer_Berlin_Potsdam_Menzel_1847.jpg
finaleart	S20H24222	00:03:36:765	Image	void.png
finaleart	S20H24222	00:03:38:828	Image	The_Orchard_Vlaminck_1905.jpg
finaleart	S20H24222	00:03:42:875	Image	void.png
finaleart	S20H24222	00:03:44:953	Image	still-life_pissarro_1867.Jpg
finaleart	S20H24222	00:03:49:031	Image	void.png
finaleart	S20H24222	00:03:51:093	Image	avenue_of_trees_in_a_small_town_sisley_1866.jpg
finaleart	S20H24222	00:03:55:140	Image	void.png
finaleart	S20H24222	00:03:57:171	Calibration	
finaleart	S20H24222	00:04:55:593	The deviations of the calibration are DevX = 1,575 DevY = 0,415
finaleart	S20H24222	00:04:55:843	Image	REJECTED_landscape_cross_0.jpg
finaleart	S20H24222	00:04:59:906	Image	void.png
finaleart	S20H24222	00:05:01:968	Image	bowl_of_fruits_Fantin-Latour_1857.jpg
finaleart	S20H24222	00:05:06:015	Image	void.png
finaleart	S20H24222	00:05:08:093	Image	basket-of-fruits-Manet-1864.jpg
finaleart	S20H24222	00:05:12:140	Image	void.png
finaleart	S20H24222	00:05:14:187	Image	Nature-morte-Maurice-de-Vlaminck.jpg
finaleart	S20H24222	00:05:18:234	Image	void.png
finaleart	S20H24222	00:05:20:296	Image	the_forest_Cross_1907.jpg
finaleart	S20H24222	00:05:24:328	Image	void.png
finaleart	S20H24222	00:05:26:406	Image	Rochers_Sur_La_Cote_A_Agay_Guillaumin_1907.jpg
finaleart	S20H24222	00:05:30:453	Image	void.png
finaleart	S20H24222	00:05:32:484	Image	Paysage_a_La_Ciotat_(La_Pointe_du-Capucin)_friesz_1907.jpg
finaleart	S20H24222	00:05:36:562	Image	void.png
finaleart	S20H24222	00:05:38:609	Image	Girtin-Kirkstall-Abbey-Yorkshire-1801.jpg
finaleart	S20H24222	00:05:42:656	Image	void.png
finaleart	S20H24222	00:05:44:734	Image	landschaft_mit_dem_ondregenbogen_caspar_david_friedrich_1810.jpg
finaleart	S20H24222	00:05:48:765	Image	void.png
finaleart	S20H24222	00:05:50:859	Image	Trouville_Black_Rocks_Boudin_1863.jpg
finaleart	S20H24222	00:05:54:906	Image	void.png
finaleart	S20H24222	00:05:56:953	Image	La_Danse_Matisse_1909.jpg
finaleart	S20H24222	00:06:01:015	Image	void.png
finaleart	S20H24222	00:06:03:062	Image	Fleurs_et_fruits_camoin_1942.jpg
finaleart	S20H24222	00:06:07:109	Image	void.png
finaleart	S20H24222	00:06:09:171	Image	dead_hare_ward.jpg
finaleart	S20H24222	00:06:13:218	Image	void.png
finaleart	S20H24222	00:06:15:296	Image	the-pointe-de-per-kiridec-at-roscoff_Rysselberghe_0.jpg
finaleart	S20H24222	00:06:19:328	Image	void.png
finaleart	S20H24222	00:06:21:390	Image	sargent-reclining-nude.JPG
finaleart	S20H24222	00:06:25:437	Image	void.png
finaleart	S20H24222	00:06:27:500	Image	turner-waves-breaking-against-the-wind-1830.jpg
finaleart	S20H24222	00:06:31:562	Image	void.png
finaleart	S20H24222	00:06:33:625	Image	kneeling-nude_degas_1888.jpg
finaleart	S20H24222	00:06:37:687	Image	void.png
finaleart	S20H24222	00:06:39:750	Image	woman-at-her-toilette_degas_1877.jpg
finaleart	S20H24222	00:06:43:781	Image	void.png
finaleart	S20H24222	00:06:45:875	Image	storm_off_normandy_cost_isabey_1850.jpg
finaleart	S20H24222	00:06:49:921	Image	void.png
finaleart	S20H24222	00:06:51:968	Image	renoir-still-life-with-peaches-and-grapes-1881.jpg
finaleart	S20H24222	00:06:56:015	Image	void.png
finaleart	S20H24222	00:06:58:078	Image	still-life-with-skate_Boudin_1861.jpg
finaleart	S20H24222	00:07:02:109	Image	void.png
finaleart	S20H24222	00:07:04:187	Image	Rysselberghe-Vase-of-flowers-1907.Jpg
finaleart	S20H24222	00:07:08:218	Image	void.png
finaleart	S20H24222	00:07:10:281	Image	martin-vase-of-flowers-in-a-window.jpg
finaleart	S20H24222	00:07:14:343	Image	void.png
finaleart	S20H24222	00:07:16:406	Image	the-tea-set_monet_1871.jpg
finaleart	S20H24222	00:07:20:453	Image	void.png
finaleart	S20H24222	00:07:22:515	Image	still-life_matisse_0.jpg
finaleart	S20H24222	00:07:26:562	Image	void.png
finaleart	S20H24222	00:07:28:609	Image	Rapids_on_the_Petite_Creuse_at_Fresselines_Monet_1889.jpg
finaleart	S20H24222	00:07:32:656	Image	void.png
finaleart	S20H24222	00:07:34:718	Calibration	
finaleart	S20H24222	00:10:18:437	The deviations of the calibration are DevX = 0,415 DevY = 0,5425
finaleart	S20H24222	00:10:18:656	Image	REJECTED_after-the-bath_degas_1885.jpg
finaleart	S20H24222	00:10:22:703	Image	void.png
finaleart	S20H24222	00:10:24:734	Image	still-life-with-pumpkin-plums-cherries-figs-and-jug-Ribot-1860.jpg
finaleart	S20H24222	00:10:28:796	Image	void.png
finaleart	S20H24222	00:10:30:843	Image	Nu_Couche_Vlaminck_1905.jpg
finaleart	S20H24222	00:10:34:875	Image	void.png
finaleart	S20H24222	00:10:36:937	Image	the_three_skulls_gericault_1814.jpg
finaleart	S20H24222	00:10:40:984	Image	void.png
finaleart	S20H24222	00:10:43:046	Image	courbet-the-bathers-1858.jpg
finaleart	S20H24222	00:10:47:093	Image	void.png
finaleart	S20H24222	00:10:49:156	Image	luxe-calme-et-volupté_matisse_1905.jpg
finaleart	S20H24222	00:10:53:187	Image	void.png
finaleart	S20H24222	00:10:55:250	Image	paysage_avec_du_betail_au_limousin_jules-dupre_1837.jpg
finaleart	S20H24222	00:10:59:312	Image	void.png
finaleart	S20H24222	00:11:01:375	Image	goya-still-life-plucked-turkey-and-pan-with-fish-1812.jpg
finaleart	S20H24222	00:11:05:421	Image	void.png
finaleart	S20H24222	00:11:07:468	Image	manet-the-salmon-1868.jpg
finaleart	S20H24222	00:11:11:515	Image	void.png
finaleart	S20H24222	00:11:13:578	Image	The_Two_Models_Dufy_1930.jpg
finaleart	S20H24222	00:11:17:625	Image	void.png
finaleart	S20H24222	00:11:19:687	Image	Kiprensky-two-sitters-1800.jpg
finaleart	S20H24222	00:11:23:750	Image	void.png
finaleart	S20H24222	00:11:25:796	Image	naked-woman-lying-on-a-couch_caillebotte_1873.jpg
finaleart	S20H24222	00:11:29:843	Image	void.png
finaleart	S20H24222	00:11:31:937	Image	Still-life-of-Sheep-s-Ribs-and-Head-The-Butchers-conter_Goya_1812.jpg
finaleart	S20H24222	00:11:35:968	Image	void.png
finaleart	S20H24222	00:11:38:046	Image	bacchante_sorolla_1886.Jpg
finaleart	S20H24222	00:11:42:109	Image	void.png
finaleart	S20H24222	00:11:44:171	Image	reclining-nude_bazille_1860.png
finaleart	S20H24222	00:11:48:203	Image	void.png
finaleart	S20H24222	00:11:50:265	Image	Le_port_d-Anvers_Braque_1906.jpg
finaleart	S20H24222	00:11:54:312	Image	void.png
finaleart	S20H24222	00:11:56:375	Image	the_rainbow__moore_henry_1865.jpg
finaleart	S20H24222	00:12:00:421	Image	void.png
finaleart	S20H24222	00:12:02:484	Image	chestnut_avenue_in_la_celle_saint_cloud_sisley_1865.jpg
finaleart	S20H24222	00:12:06:531	Image	void.png
finaleart	S20H24222	00:12:08:593	Image	les_poseuses_seurat_1888.Jpg
finaleart	S20H24222	00:12:12:640	Image	void.png
finaleart	S20H24222	00:12:14:718	Image	Un_Jardin_Maison_Baptiste_Butler_1895.jpg
finaleart	S20H24222	00:12:18:750	Image	void.png
finaleart	S20H24222	00:12:20:812	Image	red-mullets_monet_1869.jpg
finaleart	S20H24222	00:12:24:875	Image	void.png
finaleart	S20H24222	00:12:26:937	Image	huisje_aan_een_sloot_mauve_1888.jpg
finaleart	S20H24222	00:12:30:984	Image	void.png
finaleart	S20H24222	00:12:33:062	Image	sisley-still-life-heron-with-spread-wings-1867.jpg
finaleart	S20H24222	00:12:37:125	Image	void.png
finaleart	S20H24222	00:12:39:187	Image	still-life-fruits-on-a-table_manet_1864.jpg
finaleart	S20H24222	00:12:43:250	Image	void.png
finaleart	S20H24222	00:12:45:296	Image	cross-La-fuite-des-nymphes-1906.jpg
finaleart	S20H24222	00:12:49:359	Image	void.png
finaleart	S20H24222	00:12:51:437	Image	parrot-tulips-(II)_matisse_1905.jpg
finaleart	S20H24222	00:12:55:468	Image	void.png
finaleart	S20H24222	00:12:57:515	Calibration	
finaleart	S20H24222	00:13:38:750	The deviations of the calibration are DevX = 0,5175 DevY = 0,42
finaleart	S20H24222	00:13:39:000	Image	REJECTED_cezanne-still-life-with-bread-and-eggs-1865.jpg
finaleart	S20H24222	00:13:43:046	Image	void.png
finaleart	S20H24222	00:13:45:093	Image	Automne_En_France_Carr_1911.jpg
finaleart	S20H24222	00:13:49:140	Image	void.png
finaleart	S20H24222	00:13:51:187	Image	courbet_Femme_nue_et_dormant_1858.jpg
finaleart	S20H24222	00:13:55:234	Image	void.png
finaleart	S20H24222	00:13:57:296	Image	Nature_Morte_Aux_Raisins_Sur_Un_Plat_Derain_1944.jpg
finaleart	S20H24222	00:14:01:359	Image	void.png
finaleart	S20H24222	00:14:03:406	Image	Pots_Et_Fruits_Matisse_1901.jpg
finaleart	S20H24222	00:14:07:453	Image	void.png
finaleart	S20H24222	00:14:09:515	Image	Upper_Mississippi_Kensett_1855.jpg
finaleart	S20H24222	00:14:13:578	Image	void.png
finaleart	S20H24222	00:14:15:656	Image	goya-Bodegones-con-pargos-dorados-1812.jpg
finaleart	S20H24222	00:14:19:703	Image	void.png
finaleart	S20H24222	00:14:21:765	Image	Georges-braque-still-life-with-jugs-and-pipe-1906.png
finaleart	S20H24222	00:14:25:828	Image	void.png
finaleart	S20H24222	00:14:27:890	Image	wright-vesuvius-from-posillipo-1774.jpg
finaleart	S20H24222	00:14:31:953	Image	void.png
finaleart	S20H24222	00:14:34:000	Image	still-life-with-bottle-of-wind_cross_1904.Jpg
finaleart	S20H24222	00:14:38:062	Image	void.png
finaleart	S20H24222	00:14:40:093	Image	madrazo-y-kuntz-Man-Holding-a-Dagger-1850.jpg
finaleart	S20H24222	00:14:44:156	Image	void.png
finaleart	S20H24222	00:14:46:218	Image	Odalisque_Matisse.jpg
finaleart	S20H24222	00:14:50:281	Image	void.png
finaleart	S20H24222	00:14:52:343	Image	sargent-male-model-resting.jpg
finaleart	S20H24222	00:14:56:390	Image	void.png
finaleart	S20H24222	00:14:58:453	Image	the-banks-of-the-marne-at-dawn_dubois-pillet_1888.jpg
finaleart	S20H24222	00:15:02:500	Image	void.png
finaleart	S20H24222	00:15:04:578	Image	Hayet-Nature-morte-1888.jpg
finaleart	S20H24222	00:15:08:625	Image	void.png
finaleart	S20H24222	00:15:10:671	Image	Landscape_at_L-Estaque_Braque-1906.jpg
finaleart	S20H24222	00:15:14:718	Image	void.png
finaleart	S20H24222	00:15:16:781	Image	female_nude_reclining_on-a_divan_delacroix_1826.jpg
finaleart	S20H24222	00:15:20:828	Image	void.png
finaleart	S20H24222	00:15:22:890	Image	flowers-and-fruit-a-melon_fantin-latour_1865.jpg
finaleart	S20H24222	00:15:26:968	Image	void.png
finaleart	S20H24222	00:15:29:015	Image	The_Girl_From_Rat_Mort_Vlaminck_1905.jpg
finaleart	S20H24222	00:15:33:062	Image	void.png
finaleart	S20H24222	00:15:35:125	Image	mother_and_child_by_the_sea_dahl_1830.jpg
finaleart	S20H24222	00:15:39:171	Image	void.png
finaleart	S20H24222	00:15:41:250	Image	Le_Pin_A_St-Tropez_Signac_1909.jpg
finaleart	S20H24222	00:15:45:296	Image	void.png
finaleart	S20H24222	00:15:47:343	Image	millet-the-bather-1848.jpg
finaleart	S20H24222	00:15:51:406	Image	void.png
finaleart	S20H24222	00:15:53:468	Image	study_of_a_reclining_nude_Delacroix_1824.jpg
finaleart	S20H24222	00:15:57:593	Image	void.png
finaleart	S20H24222	00:15:59:656	Image	plate-of-peaches-Fantin-Latour-1862.jpg
finaleart	S20H24222	00:16:03:718	Image	void.png
finaleart	S20H24222	00:16:05:781	Image	courbet-female-nude-with-a-dog-portrait-of-leotine-renaude-1866.jpg
finaleart	S20H24222	00:16:09:812	Image	void.png
finaleart	S20H24222	00:16:11:875	Image	The_Gardener_Vlaminck_1904.jpg
finaleart	S20H24222	00:16:15:921	Image	void.png
finaleart	S20H24222	00:16:17:984	Calibration	
finaleart	S20H24222	00:18:25:015	The deviations of the calibration are DevX = 0,38 DevY = 0,6575
finaleart	S20H24222	00:18:25:250	Image	REJECTED_rose_in_a_bowl_fantin_latour_1883.jpg
finaleart	S20H24222	00:18:29:312	Image	void.png
finaleart	S20H24222	00:18:31:359	Image	The_Luxembourg_Gardens_Matisse_1901.jpg
finaleart	S20H24222	00:18:35:421	Image	void.png
finaleart	S20H24222	00:18:37:484	Image	The_Blue_Nude_Souvenir_of_Biskra_Matisse_1907.png
finaleart	S20H24222	00:18:41:546	Image	void.png
finaleart	S20H24222	00:18:43:593	Image	metzinger-nature-morte-1905.png
finaleart	S20H24222	00:18:47:656	Image	void.png
finaleart	S20H24222	00:18:49:703	Image	Houses_at_Chatou_Vlaminck_1905.jpg
finaleart	S20H24222	00:18:53:750	Image	void.png
finaleart	S20H24222	00:18:55:828	Image	Alfalfa_St-Denis_Seurat_1886.jpg
finaleart	S20H24222	00:18:59:968	Image	void.png
finaleart	S20H24222	00:19:02:031	Image	stilleven-met-vis_dubois-pillet_1885.jpg
finaleart	S20H24222	00:19:06:078	Image	void.png
finaleart	S20H24222	00:19:08:125	Image	pears-and-grapes_gauguin_1875.jpg
finaleart	S20H24222	00:19:12:171	Image	void.png
finaleart	S20H24222	00:19:14:234	Image	bathers_cross_1902.jpg
finaleart	S20H24222	00:19:18:281	Image	void.png
finaleart	S20H24222	00:19:20:343	Image	goya-Nature-morte-avec-Bouteilles-et-Pains-1826.jpg
finaleart	S20H24222	00:19:24:406	Image	void.png
finaleart	S20H24222	00:19:26:453	Image	Nature_morte_a_la_cafetiere_rouge_Vlaminck.png
finaleart	S20H24222	00:19:30:515	Image	void.png
finaleart	S20H24222	00:19:32:578	Image	les-deux-amies_marevna_0.jpg
finaleart	S20H24222	00:19:36:609	Image	void.png
finaleart	S20H24222	00:19:38:671	Image	Naked_man_reversed_on_the_ground_Gericault_1817.jpg
finaleart	S20H24222	00:19:42:718	Image	void.png
finaleart	S20H24222	00:19:44:796	Image	Ma_Maison_Martin_XXXX.jpg
finaleart	S20H24222	00:19:48:859	Image	void.png
finaleart	S20H24222	00:19:50:906	Image	Sailboats_On_The_River_Sheldt_van_Rysselberghe_1892.jpg
finaleart	S20H24222	00:19:54:953	Image	void.png
finaleart	S20H24222	00:19:57:000	Image	lair_of_the_sea_serpent_vedder_1899.jpg
finaleart	S20H24222	00:20:01:046	Image	void.png
finaleart	S20H24222	00:20:03:109	Image	reclining-nude_renoir_1883.jpg
finaleart	S20H24222	00:20:07:156	Image	void.png
finaleart	S20H24222	00:20:09:218	Image	Kiprensky-standing-sitter-with-a-stick-sitter-on-a-rock-1801.jpg
finaleart	S20H24222	00:20:13:265	Image	void.png
finaleart	S20H24222	00:20:15:312	Image	Nature_Morte_Au_Citron_Matisse_1917.jpg
finaleart	S20H24222	00:20:19:375	Image	void.png
finaleart	S20H24222	00:20:21:437	Image	morning_in_a_pine_forest_Ivan_Shishkin_1889.jpg
finaleart	S20H24222	00:20:25:500	Image	void.png
finaleart	S20H24222	00:20:27:546	Image	after_a_rain_country_road_Vasilyev_1869.jpg
finaleart	S20H24222	00:20:31:593	Image	void.png
finaleart	S20H24222	00:20:33:671	Image	Matejko-Akt-meski.jpg
finaleart	S20H24222	00:20:37:718	Image	void.png
finaleart	S20H24222	00:20:39:781	Image	Turner-chichester-canal-1828.jpg
finaleart	S20H24222	00:20:43:843	Image	void.png
finaleart	S20H24222	00:20:45:968	Image	nasturtiums-dahlias-in-a-basket_gauguin_1884.jpg
finaleart	S20H24222	00:20:50:093	Image	void.png
finaleart	S20H24222	00:20:52:140	Image	goya-Bodegón-con-salmón-1812.jpg
finaleart	S20H24222	00:20:56:187	Image	void.png
finaleart	S20H24222	00:20:58:250	Image	Le-Restaurant-de-la-machine-a-Bougival-vlaminck-1905.jpg
finaleart	S20H24222	00:21:02:312	Image	void.png
finaleart	S20H24222	00:21:04:375	Calibration	
finaleart	S20H24222	00:21:29:625	The deviations of the calibration are DevX = 0,26 DevY = 0,88
finaleart	S20H24222	00:21:29:875	Image	REJECTED_cezanne-still-life-with-green-pot-and-pewter-1870.jpg
finaleart	S20H24222	00:21:34:015	Image	void.png
finaleart	S20H24222	00:21:36:046	Image	ronde_cross_1905.jpg
finaleart	S20H24222	00:21:40:093	Image	void.png
finaleart	S20H24222	00:21:42:171	Image	the_kiss_gericault_1816.jpg
finaleart	S20H24222	00:21:46:234	Image	void.png
finaleart	S20H24222	00:21:48:296	Image	the-reclining-shepherdess_morisot_1891.jpg
finaleart	S20H24222	00:21:52:328	Image	void.png
finaleart	S20H24222	00:21:54:390	Image	The_Lying_Nude_Matisse_1906.png
finaleart	S20H24222	00:21:58:453	Image	void.png
finaleart	S20H24222	00:22:00:500	Image	Young_Girls_Playing_With_A_Lion_Club_Valtat_1905.jpg
finaleart	S20H24222	00:22:04:546	Image	void.png
finaleart	S20H24222	00:22:06:593	Image	L'Ile_de_La_Grande_Jatte_Seurat_1884.jpg
finaleart	S20H24222	00:22:10:656	Image	void.png
finaleart	S20H24222	00:22:12:718	Image	garlic-cloves-and-knife-on-the-corner-of-a-table_caillebotte_1871.jpg
finaleart	S20H24222	00:22:16:765	Image	void.png
finaleart	S20H24222	00:22:18:859	Image	chase-a-study-in-curves-1890.jpg
finaleart	S20H24222	00:22:22:906	Image	void.png
finaleart	S20H24222	00:22:24:953	Image	goya-Pavo-muerto-1812.jpg
finaleart	S20H24222	00:22:29:000	Image	void.png
finaleart	S20H24222	00:22:31:062	Image	Matisse-Nature-morte-a-la-cruche-bleue.jpg
finaleart	S20H24222	00:22:35:109	Image	void.png
finaleart	S20H24222	00:22:37:171	Image	courbet-woman-with-a-parrot-1866.jpg
finaleart	S20H24222	00:22:41:234	Image	void.png
finaleart	S20H24222	00:22:43:281	Image	still-life-with-a-puro-(II)_matisse_1904.jpg
finaleart	S20H24222	00:22:47:312	Image	void.png
finaleart	S20H24222	00:22:49:375	Image	Poppy_Fields_near_Argenteuil_Monet_1875.jpg
finaleart	S20H24222	00:22:53:421	Image	void.png
finaleart	S20H24222	00:22:55:484	Image	monticelli-still-life-with-white-pitcher-1822.jpg
finaleart	S20H24222	00:22:59:531	Image	void.png
finaleart	S20H24222	00:23:01:609	Image	Les_Bords_De_Seine_A_Neuilly_Dubois_Pillet_1886.jpg
finaleart	S20H24222	00:23:05:671	Image	void.png
finaleart	S20H24222	00:23:07:734	Image	nature_morte_aux_oranges_Vlaminck_1909.jpg
finaleart	S20H24222	00:23:11:781	Image	void.png
finaleart	S20H24222	00:23:13:859	Image	delacroix-still-life-with-lobsters-1827.jpg
finaleart	S20H24222	00:23:17:937	Image	void.png
finaleart	S20H24222	00:23:19:984	Image	A_Highland_Landscape_Landseer_1830.jpg
finaleart	S20H24222	00:23:24:031	Image	void.png
finaleart	S20H24222	00:23:26:093	Image	still-life-with-red-mullet-and-jug_gaugain_1876.jpg
finaleart	S20H24222	00:23:30:156	Image	void.png
finaleart	S20H24222	00:23:32:203	Image	Delacroix-odalisque-1825.jpg
finaleart	S20H24222	00:23:36:250	Image	void.png
finaleart	S20H24222	00:23:38:312	Image	still-life-with-fish_bazille_1866.jpg
finaleart	S20H24222	00:23:42:343	Image	void.png
finaleart	S20H24222	00:23:44:406	Image	still-life-post-bottle-cup-and-fruit_cezanne_1871.jpg
finaleart	S20H24222	00:23:48:453	Image	void.png
finaleart	S20H24222	00:23:50:500	Image	delacroix-Reclining-Odalisque-or-Woman-with-a-Parakeet-1827.jpg
finaleart	S20H24222	00:23:54:562	Image	void.png
finaleart	S20H24222	00:23:56:609	Image	Bank_Of_A_Lake_Pechstein_1910.jpg
finaleart	S20H24222	00:24:00:656	Image	void.png
finaleart	S20H24222	00:24:02:734	Image	Courbet-Femme-nue-couchee-1862.jpg
finaleart	S20H24222	00:24:06:781	Image	void.png
finaleart	S20H24222	00:24:08:937	End of Experiment
