[BeGaze]
Converted from:	C:\Documents and Settings\iViewX\Desktop\EXPERIMENTATIONS\Experiments\results\finaleart\S7121223-finaleart-1.idf
Date:	27.03.2019 15:37:25
Version:	BeGaze 2.5.77
Sample Rate:	50
Subject:	S7121223
Description:	Gregoire pacreau

Table Header for Fixations:
Event Type	Trial	Number	Start	End	Duration	Location X	Location Y	Dispersion X	Dispersion Y	Plane	Avg. Pupil Size X	Avg. Pupil Size Y

Table Header for Saccades:
Event Type	Trial	Number	Start	End	Duration	Start Loc.X	Start Loc.Y	End Loc.X	End Loc.Y	Amplitude	Peak Speed	Peak Speed At	Average Speed	Peak Accel.	Peak Decel.	Average Accel.

Table Header for Blinks:
Event Type	Trial	Number	Start	End	Duration

Table Header for User Events:
Event Type	Trial	Number	Start	Description

UserEvent	1	1	5536438871	# Message: Trouville_Black_Rocks_Boudin_1863.jpg
Fixation L	1	1	5536447300	5536904790	457490	944.33	651.37	29	32	-1	13.62	13.62
Fixation R	1	1	5536447300	5536904790	457490	944.33	651.37	29	32	-1	13.91	13.91
Saccade L	1	1	5536904790	5536924673	19883	926.78	648.45	766.76	760.10	1.17	197.31	1.00	58.60	4887.83	-4623.68	3273.30
Saccade R	1	1	5536904790	5536924673	19883	926.78	648.45	766.76	760.10	1.17	197.31	1.00	58.60	4887.83	-4623.68	3273.30
Fixation L	1	2	5536924673	5537183270	258597	747.57	773.14	27	21	-1	12.00	12.00
Fixation R	1	2	5536924673	5537183270	258597	747.57	773.14	27	21	-1	12.32	12.32
Saccade L	1	2	5537183270	5537203136	19866	739.03	778.58	575.09	774.84	0.89	165.84	1.00	45.01	4110.95	-4018.33	2725.65
Saccade R	1	2	5537183270	5537203136	19866	739.03	778.58	575.09	774.84	0.89	165.84	1.00	45.01	4110.95	-4018.33	2725.65
Fixation L	1	3	5537203136	5537620858	417722	566.37	774.50	16	14	-1	10.61	10.61
Fixation R	1	3	5537203136	5537620858	417722	566.37	774.50	16	14	-1	10.94	10.94
Saccade L	1	3	5537620858	5537660606	39748	565.76	775.15	830.22	867.33	2.64	192.96	0.50	66.35	4711.81	-4263.03	3582.41
Saccade R	1	3	5537620858	5537660606	39748	565.76	775.15	830.22	867.33	2.64	192.96	0.50	66.35	4711.81	-4263.03	3582.41
Fixation L	1	4	5537660606	5538297076	636470	853.31	868.70	40	44	-1	11.78	11.78
Fixation R	1	4	5537660606	5538297076	636470	853.31	868.70	40	44	-1	11.91	11.91
Saccade L	1	4	5538297076	5538356693	59617	861.64	882.83	1372.88	899.89	5.32	305.80	0.67	89.23	7521.91	-7470.40	4437.60
Saccade R	1	4	5538297076	5538356693	59617	861.64	882.83	1372.88	899.89	5.32	305.80	0.67	89.23	7521.91	-7470.40	4437.60
Fixation L	1	5	5538356693	5539331280	974587	1395.69	892.03	43	47	-1	11.93	11.93
Fixation R	1	5	5538356693	5539331280	974587	1395.69	892.03	43	47	-1	11.33	11.33
Saccade L	1	5	5539331280	5539371150	39870	1402.76	883.31	1715.21	882.99	2.65	162.26	0.50	66.49	4004.80	-3850.06	3807.23
Saccade R	1	5	5539331280	5539371150	39870	1402.76	883.31	1715.21	882.99	2.65	162.26	0.50	66.49	4004.80	-3850.06	3807.23
Fixation L	1	6	5539371150	5539649504	278354	1707.58	896.27	23	36	-1	11.13	11.13
Fixation R	1	6	5539371150	5539649504	278354	1707.58	896.27	23	36	-1	10.79	10.79
Saccade L	1	6	5539649504	5539669373	19869	1694.92	919.53	1657.41	1044.92	0.93	132.38	1.00	46.81	3181.72	-3150.66	2307.20
Saccade R	1	6	5539649504	5539669373	19869	1694.92	919.53	1657.41	1044.92	0.93	132.38	1.00	46.81	3181.72	-3150.66	2307.20
Fixation L	1	7	5539669373	5539848374	179001	1620.73	1048.94	58	18	-1	11.60	11.60
Fixation R	1	7	5539669373	5539848374	179001	1620.73	1048.94	58	18	-1	10.87	10.87
Saccade L	1	7	5539848374	5539868370	19996	1598.70	1044.99	1516.55	1051.49	0.55	83.36	1.00	27.31	2021.96	-1920.56	1395.74
Saccade R	1	7	5539848374	5539868370	19996	1598.70	1044.99	1516.55	1051.49	0.55	83.36	1.00	27.31	2021.96	-1920.56	1395.74
Fixation L	1	8	5539868370	5540226349	357979	1516.82	1062.82	11	18	-1	12.20	12.20
Fixation R	1	8	5539868370	5540226349	357979	1516.82	1062.82	11	18	-1	11.69	11.69
Saccade L	1	8	5540226349	5540266091	39742	1511.22	1064.36	994.23	931.02	4.68	330.28	0.50	117.72	8213.73	-7254.66	6481.15
Saccade R	1	8	5540226349	5540266091	39742	1511.22	1064.36	994.23	931.02	4.68	330.28	0.50	117.72	8213.73	-7254.66	6481.15
Fixation L	1	9	5540266091	5540425215	159124	955.80	911.35	50	25	-1	12.63	12.63
Fixation R	1	9	5540266091	5540425215	159124	955.80	911.35	50	25	-1	11.88	11.88
