[BeGaze]
Converted from:	C:\Documents and Settings\iViewX\Desktop\EXPERIMENTATIONS\Experiments\results\finaleart\S12H22222-finaleart-1.idf
Date:	27.03.2019 15:40:17
Version:	BeGaze 2.5.77
Sample Rate:	50
Subject:	S12H22222
Description:	aurele barriere

Table Header for Fixations:
Event Type	Trial	Number	Start	End	Duration	Location X	Location Y	Dispersion X	Dispersion Y	Plane	Avg. Pupil Size X	Avg. Pupil Size Y

Table Header for Saccades:
Event Type	Trial	Number	Start	End	Duration	Start Loc.X	Start Loc.Y	End Loc.X	End Loc.Y	Amplitude	Peak Speed	Peak Speed At	Average Speed	Peak Accel.	Peak Decel.	Average Accel.

Table Header for Blinks:
Event Type	Trial	Number	Start	End	Duration

Table Header for User Events:
Event Type	Trial	Number	Start	Description

UserEvent	1	1	23369023719	# Message: after_a_rain_country_road_Vasilyev_1869.jpg
Saccade L	1	1	23369027358	23369067093	39735	1037.20	463.00	935.51	527.29	1.37	83.93	0.50	34.54	1052.74	-1795.18	961.26
Saccade R	1	1	23369027358	23369067093	39735	1037.20	463.00	935.51	527.29	1.37	83.93	0.50	34.54	1052.74	-1795.18	961.26
Fixation L	1	1	23369067093	23369464832	397739	945.65	567.89	22	63	-1	16.70	16.70
Fixation R	1	1	23369067093	23369464832	397739	945.65	567.89	22	63	-1	15.88	15.88
Saccade L	1	2	23369464832	23369484707	19875	949.56	585.54	953.53	774.14	1.09	190.76	1.00	54.76	4624.65	-4404.85	3124.30
Saccade R	1	2	23369464832	23369484707	19875	949.56	585.54	953.53	774.14	1.09	190.76	1.00	54.76	4624.65	-4404.85	3124.30
Fixation L	1	2	23369484707	23369643807	159100	954.82	796.02	6	32	-1	16.27	16.27
Fixation R	1	2	23369484707	23369643807	159100	954.82	796.02	6	32	-1	15.20	15.20
Saccade L	1	3	23369643807	23369663826	20019	958.44	801.53	854.27	809.14	0.60	105.65	1.00	29.90	2586.79	-2474.26	1757.45
Saccade R	1	3	23369643807	23369663826	20019	958.44	801.53	854.27	809.14	0.60	105.65	1.00	29.90	2586.79	-2474.26	1757.45
Fixation L	1	3	23369663826	23369942173	278347	855.17	810.11	11	7	-1	13.48	13.48
Fixation R	1	3	23369663826	23369942173	278347	855.17	810.11	11	7	-1	12.88	12.88
Saccade L	1	4	23369942173	23369982040	39867	855.97	811.57	538.11	735.56	2.71	170.23	1.00	68.09	4233.64	-4208.56	4147.09
Saccade R	1	4	23369942173	23369982040	39867	855.97	811.57	538.11	735.56	2.71	170.23	1.00	68.09	4233.64	-4208.56	4147.09
Fixation L	1	4	23369982040	23370240529	258489	535.96	733.88	12	6	-1	13.03	13.03
Fixation R	1	4	23369982040	23370240529	258489	535.96	733.88	12	6	-1	12.63	12.63
Saccade L	1	5	23370240529	23370280414	39885	530.92	737.76	812.79	772.19	2.46	177.73	0.50	61.62	4370.25	-4102.29	3439.24
Saccade R	1	5	23370240529	23370280414	39885	530.92	737.76	812.79	772.19	2.46	177.73	0.50	61.62	4370.25	-4102.29	3439.24
Fixation L	1	5	23370280414	23370479277	198863	804.76	782.72	11	26	-1	14.28	14.28
Fixation R	1	5	23370280414	23370479277	198863	804.76	782.72	11	26	-1	13.84	13.84
Saccade L	1	6	23370479277	23370519026	39749	805.47	792.20	537.63	643.57	2.67	162.54	0.50	67.24	4030.16	-3774.24	3796.42
Saccade R	1	6	23370479277	23370519026	39749	805.47	792.20	537.63	643.57	2.67	162.54	0.50	67.24	4030.16	-3774.24	3796.42
Fixation L	1	6	23370519026	23370797520	278494	538.30	659.57	9	35	-1	14.92	14.92
Fixation R	1	6	23370519026	23370797520	278494	538.30	659.57	9	35	-1	14.52	14.52
Saccade L	1	7	23370797520	23370837258	39738	544.29	666.17	1270.79	724.66	6.18	421.02	0.50	155.61	10464.96	-10189.21	8989.66
Saccade R	1	7	23370797520	23370837258	39738	544.29	666.17	1270.79	724.66	6.18	421.02	0.50	155.61	10464.96	-10189.21	8989.66
Fixation L	1	7	23370837258	23371155494	318236	1289.88	748.16	30	64	-1	15.41	15.41
Fixation R	1	7	23370837258	23371155494	318236	1289.88	748.16	30	64	-1	14.64	14.64
Saccade L	1	8	23371155494	23371175381	19887	1297.64	703.78	1295.19	695.20	0.15	11.73	1.00	7.66	-67.59	-220.72	142.94
Saccade R	1	8	23371155494	23371175381	19887	1297.64	703.78	1295.19	695.20	0.15	11.73	1.00	7.66	-67.59	-220.72	142.94
Fixation L	1	8	23371175381	23371374363	198982	1294.43	691.18	6	11	-1	14.65	14.65
Fixation R	1	8	23371175381	23371374363	198982	1294.43	691.18	6	11	-1	13.90	13.90
Saccade L	1	9	23371374363	23371394240	19877	1289.78	689.35	1114.81	842.74	1.24	235.26	1.00	62.24	5858.86	-5704.50	3867.14
Saccade R	1	9	23371374363	23371394240	19877	1289.78	689.35	1114.81	842.74	1.24	235.26	1.00	62.24	5858.86	-5704.50	3867.14
Fixation L	1	9	23371394240	23371533477	139237	1116.83	842.59	5	6	-1	14.85	14.85
Fixation R	1	9	23371394240	23371533477	139237	1116.83	842.59	5	6	-1	14.02	14.02
Saccade L	1	10	23371533477	23371573228	39751	1117.85	839.43	1475.41	829.85	2.97	228.70	0.50	74.83	5698.75	-5483.99	4361.09
Saccade R	1	10	23371533477	23371573228	39751	1117.85	839.43	1475.41	829.85	2.97	228.70	0.50	74.83	5698.75	-5483.99	4361.09
Fixation L	1	10	23371573228	23371772096	198868	1461.53	826.99	21	14	-1	15.04	15.04
Fixation R	1	10	23371573228	23371772096	198868	1461.53	826.99	21	14	-1	14.06	14.06
Saccade L	1	11	23371772096	23371831843	59747	1461.93	821.12	1456.40	400.05	4.59	190.05	0.33	76.86	4721.56	-2726.47	2908.80
Saccade R	1	11	23371772096	23371831843	59747	1461.93	821.12	1456.40	400.05	4.59	190.05	0.33	76.86	4721.56	-2726.47	2908.80
Fixation L	1	11	23371831843	23371970958	139115	1447.54	428.86	35	40	-1	14.87	14.87
Fixation R	1	11	23371831843	23371970958	139115	1447.54	428.86	35	40	-1	13.97	13.97
Saccade L	1	12	23371970958	23372010831	39873	1422.36	440.78	1029.50	384.55	3.66	215.96	0.50	91.89	5263.06	-4743.71	4641.17
Saccade R	1	12	23371970958	23372010831	39873	1422.36	440.78	1029.50	384.55	3.66	215.96	0.50	91.89	5263.06	-4743.71	4641.17
Fixation L	1	12	23372010831	23372229570	218739	997.98	362.83	40	55	-1	14.50	14.50
Fixation R	1	12	23372010831	23372229570	218739	997.98	362.83	40	55	-1	13.42	13.42
Saccade L	1	13	23372229570	23372289203	59633	992.27	333.27	861.28	330.00	1.60	131.94	1.00	26.91	3164.59	-3134.78	1288.56
Saccade R	1	13	23372229570	23372289203	59633	992.27	333.27	861.28	330.00	1.60	131.94	1.00	26.91	3164.59	-3134.78	1288.56
Fixation L	1	13	23372289203	23372547815	258612	845.44	342.90	27	22	-1	13.51	13.51
Fixation R	1	13	23372289203	23372547815	258612	845.44	342.90	27	22	-1	12.58	12.58
Saccade L	1	14	23372547815	23372567681	19866	864.81	350.65	1044.37	347.74	1.09	181.62	1.00	54.96	4518.61	-4320.29	3010.05
Saccade R	1	14	23372547815	23372567681	19866	864.81	350.65	1044.37	347.74	1.09	181.62	1.00	54.96	4518.61	-4320.29	3010.05
Fixation L	1	14	23372567681	23372766679	198998	1054.60	312.47	23	52	-1	12.85	12.85
Fixation R	1	14	23372567681	23372766679	198998	1054.60	312.47	23	52	-1	12.17	12.17
Saccade L	1	15	23372766679	23372786550	19871	1066.82	297.02	1234.40	294.82	0.91	169.49	1.00	45.85	4088.43	-4064.82	2753.25
Saccade R	1	15	23372766679	23372786550	19871	1066.82	297.02	1234.40	294.82	0.91	169.49	1.00	45.85	4088.43	-4064.82	2753.25
Fixation L	1	15	23372786550	23373025167	238617	1235.32	294.73	21	17	-1	12.24	12.24
Fixation R	1	15	23372786550	23373025167	238617	1235.32	294.73	21	17	-1	11.80	11.80
