[BeGaze]
Converted from:	C:\Documents and Settings\iViewX\Desktop\EXPERIMENTATIONS\Experiments\results\finaleart\S9H29221-finaleart-1.idf
Date:	27.03.2019 16:02:31
Version:	BeGaze 2.5.77
Sample Rate:	50
Subject:	S9H29221
Description:	steven

Table Header for Fixations:
Event Type	Trial	Number	Start	End	Duration	Location X	Location Y	Dispersion X	Dispersion Y	Plane	Avg. Pupil Size X	Avg. Pupil Size Y

Table Header for Saccades:
Event Type	Trial	Number	Start	End	Duration	Start Loc.X	Start Loc.Y	End Loc.X	End Loc.Y	Amplitude	Peak Speed	Peak Speed At	Average Speed	Peak Accel.	Peak Decel.	Average Accel.

Table Header for Blinks:
Event Type	Trial	Number	Start	End	Duration

Table Header for User Events:
Event Type	Trial	Number	Start	Description

UserEvent	1	1	5824042400	# Message: void.jpg
Fixation L	1	1	5824049782	5824149281	99499	1617.31	386.41	80	7	-1	11.42	11.42
Fixation R	1	1	5824049782	5824149281	99499	1617.31	386.41	80	7	-1	9.62	9.62
Saccade L	1	1	5824149281	5824169140	19859	1650.72	385.73	1690.08	385.90	0.44	39.82	1.00	22.10	898.33	16.62	400.05
Saccade R	1	1	5824149281	5824169140	19859	1650.72	385.73	1690.08	385.90	0.44	39.82	1.00	22.10	898.33	16.62	400.05
Fixation L	1	2	5824169140	5824394644	225504	1738.83	389.23	71	24	-1	11.03	11.03
Fixation R	1	2	5824169140	5824394644	225504	1738.83	389.23	71	24	-1	9.27	9.27
Saccade L	1	2	5824394644	5824407897	13253	1744.48	402.25	1747.24	407.32	0.10	13.16	0.00	7.78	1699.41	-257.70	680.91
Saccade R	1	2	5824394644	5824407897	13253	1744.48	402.25	1747.24	407.32	0.10	13.16	0.00	7.78	1699.41	-257.70	680.91
Fixation L	1	3	5824407897	5824528307	120410	1771.63	416.13	71	24	-1	10.80	10.80
Fixation R	1	3	5824407897	5824528307	120410	1771.63	416.13	71	24	-1	8.56	8.56
Saccade L	1	3	5824528307	5824606741	78434	1818.60	431.57	1839.26	423.64	2.82	101.68	1.00	35.98	8030.90	-1580.43	2341.91
Saccade R	1	3	5824528307	5824606741	78434	1818.60	431.57	1839.26	423.64	2.82	101.68	1.00	35.98	8030.90	-1580.43	2341.91
Blink L	1	1	5824606741	5824785752	179011
Blink R	1	1	5824606741	5824765897	159156
Saccade R	1	4	5824765897	5824865371	99474	1186.06	509.65	1151.14	331.29	8.41	320.44	1.00	84.58	7184.48	-1134.60	1639.85
Saccade L	1	4	5824785752	5824865371	79619	1174.39	424.17	1151.14	331.29	6.74	320.44	1.00	84.70	7184.48	-1134.60	1898.57
Blink L	1	2	5824865371	5825004604	139233
Blink R	1	2	5824865371	5825004604	139233
Blink L	1	3	5825027111	5825302836	275725
Blink R	1	3	5825027111	5825302836	275725
Fixation L	1	4	5825382467	5825501834	119367	927.86	212.46	81	10	-1	10.18	10.18
Fixation R	1	4	5825382467	5825501834	119367	927.86	212.46	81	10	-1	10.99	10.99
Saccade L	1	5	5825501834	5825521705	19871	971.62	214.30	998.83	213.20	0.37	27.55	1.00	18.84	195.04	-364.21	207.09
Saccade R	1	5	5825501834	5825521705	19871	971.62	214.30	998.83	213.20	0.37	27.55	1.00	18.84	195.04	-364.21	207.09
Fixation L	1	5	5825521705	5825660953	139248	1031.05	213.18	61	8	-1	9.63	9.63
Fixation R	1	5	5825521705	5825660953	139248	1031.05	213.18	61	8	-1	10.26	10.26
Saccade L	1	6	5825660953	5825681719	20766	1060.18	208.36	1093.22	208.56	0.29	33.42	1.00	13.93	518.01	-464.71	333.87
Saccade R	1	6	5825660953	5825681719	20766	1060.18	208.36	1093.22	208.56	0.29	33.42	1.00	13.93	518.01	-464.71	333.87
Fixation L	1	6	5825681719	5825839933	158214	1125.46	205.14	79	16	-1	8.94	8.94
Fixation R	1	6	5825681719	5825839933	158214	1125.46	205.14	79	16	-1	9.90	9.90
Saccade L	1	7	5825839933	5826078551	238618	1168.08	209.26	1465.13	258.13	6.64	47.63	0.92	27.82	662.76	-717.54	391.44
Saccade R	1	7	5825839933	5826078551	238618	1168.08	209.26	1465.13	258.13	6.64	47.63	0.92	27.82	662.76	-717.54	391.44
