[BeGaze]
Converted from:	C:\Documents and Settings\iViewX\Desktop\EXPERIMENTATIONS\Experiments\results\finaleart\S19F21442-finaleart-1.idf
Date:	27.03.2019 15:51:42
Version:	BeGaze 2.5.77
Sample Rate:	50
Subject:	S19F21442
Description:	Juliette Veuillez

Table Header for Fixations:
Event Type	Trial	Number	Start	End	Duration	Location X	Location Y	Dispersion X	Dispersion Y	Plane	Avg. Pupil Size X	Avg. Pupil Size Y

Table Header for Saccades:
Event Type	Trial	Number	Start	End	Duration	Start Loc.X	Start Loc.Y	End Loc.X	End Loc.Y	Amplitude	Peak Speed	Peak Speed At	Average Speed	Peak Accel.	Peak Decel.	Average Accel.

Table Header for Blinks:
Event Type	Trial	Number	Start	End	Duration

Table Header for User Events:
Event Type	Trial	Number	Start	Description

UserEvent	1	1	7768899744	# Message: void.jpg
Saccade L	1	1	7768911740	7769011250	99510	1156.21	269.36	1006.67	332.42	3.36	164.11	1.00	33.74	3954.24	-3948.65	1360.45
Saccade R	1	1	7768911740	7769011250	99510	1156.21	269.36	1006.67	332.42	3.36	164.11	1.00	33.74	3954.24	-3948.65	1360.45
Fixation L	1	1	7769011250	7769349336	338086	1003.52	308.14	38	58	-1	9.38	9.38
Fixation R	1	1	7769011250	7769349336	338086	1003.52	308.14	38	58	-1	11.37	11.37
Saccade L	1	2	7769349336	7769369210	19874	983.89	332.93	983.44	346.71	0.12	13.95	1.00	5.99	295.21	-192.00	212.18
Saccade R	1	2	7769349336	7769369210	19874	983.89	332.93	983.44	346.71	0.12	13.95	1.00	5.99	295.21	-192.00	212.18
Fixation L	1	2	7769369210	7770164796	795586	981.77	379.20	12	68	-1	10.03	10.03
Fixation R	1	2	7769369210	7770164796	795586	981.77	379.20	12	68	-1	12.02	12.02
Saccade L	1	3	7770164796	7770184685	19889	973.05	402.52	855.35	423.84	0.80	120.99	1.00	40.13	2967.59	-2308.50	1938.42
Saccade R	1	3	7770164796	7770184685	19889	973.05	402.52	855.35	423.84	0.80	120.99	1.00	40.13	2967.59	-2308.50	1938.42
Fixation L	1	3	7770184685	7770383672	198987	820.27	444.23	42	55	-1	10.49	10.49
Fixation R	1	3	7770184685	7770383672	198987	820.27	444.23	42	55	-1	12.84	12.84
Saccade L	1	4	7770383672	7770403543	19871	813.58	463.00	809.97	463.40	0.11	11.62	0.00	5.31	49.63	-183.60	88.14
Saccade R	1	4	7770383672	7770403543	19871	813.58	463.00	809.97	463.40	0.11	11.62	0.00	5.31	49.63	-183.60	88.14
Fixation L	1	4	7770403543	7770880905	477362	809.38	468.42	16	23	-1	10.27	10.27
Fixation R	1	4	7770403543	7770880905	477362	809.38	468.42	16	23	-1	12.86	12.86
