[BeGaze]
Converted from:	C:\Documents and Settings\iViewX\Desktop\EXPERIMENTATIONS\Experiments\results\finaleart\S12H22222-finaleart-1.idf
Date:	27.03.2019 15:41:08
Version:	BeGaze 2.5.77
Sample Rate:	50
Subject:	S12H22222
Description:	aurele barriere

Table Header for Fixations:
Event Type	Trial	Number	Start	End	Duration	Location X	Location Y	Dispersion X	Dispersion Y	Plane	Avg. Pupil Size X	Avg. Pupil Size Y

Table Header for Saccades:
Event Type	Trial	Number	Start	End	Duration	Start Loc.X	Start Loc.Y	End Loc.X	End Loc.Y	Amplitude	Peak Speed	Peak Speed At	Average Speed	Peak Accel.	Peak Decel.	Average Accel.

Table Header for Blinks:
Event Type	Trial	Number	Start	End	Duration

Table Header for User Events:
Event Type	Trial	Number	Start	Description

UserEvent	1	1	24219810498	# Message: plage-de-la-vignassa_cross_1892.jpg
Fixation L	1	1	24219824245	24220599947	775702	1009.03	415.86	29	26	-1	12.04	12.04
Fixation R	1	1	24219824245	24220599947	775702	1009.03	415.86	29	26	-1	11.54	11.54
Saccade L	1	1	24220599947	24220619837	19890	1001.73	432.90	995.90	493.03	0.59	61.11	1.00	29.54	1494.51	-419.10	781.69
Saccade R	1	1	24220599947	24220619837	19890	1001.73	432.90	995.90	493.03	0.59	61.11	1.00	29.54	1494.51	-419.10	781.69
Fixation L	1	2	24220619837	24220838574	218737	986.43	493.97	19	53	-1	11.28	11.28
Fixation R	1	2	24220619837	24220838574	218737	986.43	493.97	19	53	-1	10.73	10.73
Saccade L	1	2	24220838574	24220878429	39855	991.54	510.32	1363.02	810.40	4.49	341.21	0.50	112.63	8481.31	-7006.86	5432.36
Saccade R	1	2	24220838574	24220878429	39855	991.54	510.32	1363.02	810.40	4.49	341.21	0.50	112.63	8481.31	-7006.86	5432.36
Fixation L	1	3	24220878429	24220997676	119247	1418.37	820.49	69	19	-1	11.10	11.10
Fixation R	1	3	24220878429	24220997676	119247	1418.37	820.49	69	19	-1	10.62	10.62
Saccade L	1	3	24220997676	24221017669	19993	1426.30	829.00	1468.35	815.15	0.38	44.79	1.00	18.98	986.63	-664.32	648.03
Saccade R	1	3	24220997676	24221017669	19993	1426.30	829.00	1468.35	815.15	0.38	44.79	1.00	18.98	986.63	-664.32	648.03
Fixation L	1	4	24221017669	24221276159	258490	1470.53	811.65	47	24	-1	11.06	11.06
Fixation R	1	4	24221017669	24221276159	258490	1470.53	811.65	47	24	-1	10.34	10.34
Saccade L	1	4	24221276159	24221355781	79622	1452.38	814.54	1119.69	627.50	5.47	182.00	0.50	68.67	4292.08	-3541.74	2425.86
Saccade R	1	4	24221276159	24221355781	79622	1452.38	814.54	1119.69	627.50	5.47	182.00	0.50	68.67	4292.08	-3541.74	2425.86
Fixation L	1	5	24221355781	24222171241	815460	1107.63	649.79	24	56	-1	11.71	11.71
Fixation R	1	5	24221355781	24222171241	815460	1107.63	649.79	24	56	-1	11.12	11.12
Saccade L	1	5	24222171241	24222230869	59628	1102.98	662.40	807.17	706.88	3.22	157.38	0.33	54.06	3757.27	-3090.49	2563.46
Saccade R	1	5	24222171241	24222230869	59628	1102.98	662.40	807.17	706.88	3.22	157.38	0.33	54.06	3757.27	-3090.49	2563.46
Fixation L	1	6	24222230869	24222449756	218887	801.92	745.35	17	51	-1	12.51	12.51
Fixation R	1	6	24222230869	24222449756	218887	801.92	745.35	17	51	-1	12.25	12.25
Saccade L	1	6	24222449756	24222469609	19853	789.75	756.06	601.96	762.37	1.13	190.01	1.00	56.87	4685.57	-4522.61	3176.46
Saccade R	1	6	24222449756	24222469609	19853	789.75	756.06	601.96	762.37	1.13	190.01	1.00	56.87	4685.57	-4522.61	3176.46
Fixation L	1	7	24222469609	24222708221	238612	574.04	781.06	34	37	-1	12.16	12.16
Fixation R	1	7	24222469609	24222708221	238612	574.04	781.06	34	37	-1	11.87	11.87
Saccade L	1	7	24222708221	24222787844	79623	571.62	799.72	922.70	254.07	8.63	218.73	0.50	108.44	5222.29	-4780.74	3356.15
Saccade R	1	7	24222708221	24222787844	79623	571.62	799.72	922.70	254.07	8.63	218.73	0.50	108.44	5222.29	-4780.74	3356.15
Fixation L	1	8	24222787844	24223046460	258616	917.81	301.38	17	64	-1	11.12	11.12
Fixation R	1	8	24222787844	24223046460	258616	917.81	301.38	17	64	-1	11.01	11.01
Saccade L	1	8	24223046460	24223066330	19870	927.93	312.45	1141.11	332.86	1.25	216.54	1.00	63.16	5374.32	-5088.74	3555.84
Saccade R	1	8	24223046460	24223066330	19870	927.93	312.45	1141.11	332.86	1.25	216.54	1.00	63.16	5374.32	-5088.74	3555.84
Fixation L	1	9	24223066330	24223285071	218741	1157.53	356.26	22	49	-1	11.42	11.42
Fixation R	1	9	24223066330	24223285071	218741	1157.53	356.26	22	49	-1	10.99	10.99
Saccade L	1	9	24223285071	24223344821	59750	1157.15	377.02	1609.52	135.42	5.41	238.96	0.67	90.55	5905.29	-5531.25	3765.10
Saccade R	1	9	24223285071	24223344821	59750	1157.15	377.02	1609.52	135.42	5.41	238.96	0.67	90.55	5905.29	-5531.25	3765.10
Fixation L	1	10	24223344821	24223483942	139121	1583.78	150.84	44	42	-1	10.70	10.70
Fixation R	1	10	24223344821	24223483942	139121	1583.78	150.84	44	42	-1	10.92	10.92
Saccade L	1	10	24223483942	24223682923	198981	1565.39	172.61	474.59	982.57	23.68	477.04	0.70	119.01	11811.67	-5786.84	3552.51
Saccade R	1	10	24223483942	24223682923	198981	1565.39	172.61	474.59	982.57	23.68	477.04	0.70	119.01	11811.67	-5786.84	3552.51
Fixation L	1	11	24223682923	24223802189	119266	449.12	991.30	38	24	-1	11.01	11.01
Fixation R	1	11	24223682923	24223802189	119266	449.12	991.30	38	24	-1	10.79	10.79
