[BeGaze]
Converted from:	C:\Documents and Settings\iViewX\Desktop\EXPERIMENTATIONS\Experiments\results\finaleart\S9H29221-finaleart-1.idf
Date:	27.03.2019 16:03:25
Version:	BeGaze 2.5.77
Sample Rate:	50
Subject:	S9H29221
Description:	steven

Table Header for Fixations:
Event Type	Trial	Number	Start	End	Duration	Location X	Location Y	Dispersion X	Dispersion Y	Plane	Avg. Pupil Size X	Avg. Pupil Size Y

Table Header for Saccades:
Event Type	Trial	Number	Start	End	Duration	Start Loc.X	Start Loc.Y	End Loc.X	End Loc.Y	Amplitude	Peak Speed	Peak Speed At	Average Speed	Peak Accel.	Peak Decel.	Average Accel.

Table Header for Blinks:
Event Type	Trial	Number	Start	End	Duration

Table Header for User Events:
Event Type	Trial	Number	Start	Description

UserEvent	1	1	6391373927	# Message: The_Orchard_Vlaminck_1905.jpg
Saccade L	1	1	6391378503	6391438120	59617	1204.00	333.92	1247.79	246.75	1.57	65.06	1.00	26.40	863.91	-1104.35	502.17
Saccade R	1	1	6391378503	6391438120	59617	1204.00	333.92	1247.79	246.75	1.57	65.06	1.00	26.40	863.91	-1104.35	502.17
Fixation L	1	1	6391438120	6391591988	153868	1279.53	229.20	60	27	-1	11.33	11.33
Fixation R	1	1	6391438120	6391591988	153868	1279.53	229.20	60	27	-1	10.94	10.94
Saccade L	1	2	6391591988	6391597240	5252	1308.10	219.06	1330.19	200.33	0.08	29.30	1.00	15.58	359.16	-468.29	295.12
Saccade R	1	2	6391591988	6391597240	5252	1308.10	219.06	1330.19	200.33	0.08	29.30	1.00	15.58	359.16	-468.29	295.12
Fixation L	1	2	6391597240	6391811796	214556	1359.66	178.68	65	32	-1	11.44	11.44
Fixation R	1	2	6391597240	6391811796	214556	1359.66	178.68	65	32	-1	11.02	11.02
Saccade L	1	3	6391811796	6391823594	11798	1395.31	167.46	1403.53	164.70	0.15	25.08	0.00	12.46	104.83	-418.39	184.00
Saccade R	1	3	6391811796	6391823594	11798	1395.31	167.46	1403.53	164.70	0.15	25.08	0.00	12.46	104.83	-418.39	184.00
Fixation L	1	3	6391823594	6392054715	231121	1426.57	172.32	39	22	-1	11.91	11.91
Fixation R	1	3	6391823594	6392054715	231121	1426.57	172.32	39	22	-1	11.33	11.33
Saccade L	1	4	6392054715	6392094458	39743	1442.87	185.00	1207.40	305.94	2.26	191.45	1.00	56.80	4653.27	-4731.80	3262.59
Saccade R	1	4	6392054715	6392094458	39743	1442.87	185.00	1207.40	305.94	2.26	191.45	1.00	56.80	4653.27	-4731.80	3262.59
Fixation L	1	4	6392094458	6392353965	259507	1197.33	307.39	68	7	-1	12.54	12.54
Fixation R	1	4	6392094458	6392353965	259507	1197.33	307.39	68	7	-1	11.91	11.91
Saccade L	1	5	6392353965	6392392815	38850	1144.23	310.32	1037.51	377.23	1.95	127.40	1.00	50.13	2851.75	-2931.62	2251.43
Saccade R	1	5	6392353965	6392392815	38850	1144.23	310.32	1037.51	377.23	1.95	127.40	1.00	50.13	2851.75	-2931.62	2251.43
Fixation L	1	5	6392392815	6392691176	298361	1025.74	373.30	18	25	-1	11.59	11.59
Fixation R	1	5	6392392815	6392691176	298361	1025.74	373.30	18	25	-1	11.37	11.37
Saccade L	1	6	6392691176	6392730926	39750	1018.67	378.26	805.10	671.03	3.03	184.08	0.50	76.12	4523.00	-4551.88	4484.76
Saccade R	1	6	6392691176	6392730926	39750	1018.67	378.26	805.10	671.03	3.03	184.08	0.50	76.12	4523.00	-4551.88	4484.76
Fixation L	1	6	6392730926	6393148664	417738	810.68	669.48	52	31	-1	11.04	11.04
Fixation R	1	6	6392730926	6393148664	417738	810.68	669.48	52	31	-1	11.01	11.01
Saccade L	1	7	6393148664	6393168532	19868	767.29	691.59	759.75	701.50	0.28	22.07	1.00	14.17	-84.78	-236.93	161.74
Saccade R	1	7	6393148664	6393168532	19868	767.29	691.59	759.75	701.50	0.28	22.07	1.00	14.17	-84.78	-236.93	161.74
Fixation L	1	7	6393168532	6393745382	576850	744.54	702.55	19	27	-1	10.57	10.57
Fixation R	1	7	6393168532	6393745382	576850	744.54	702.55	19	27	-1	10.68	10.68
Saccade L	1	8	6393745382	6393804993	59611	749.87	690.99	1491.80	504.20	7.94	304.32	0.67	133.27	7421.71	-7458.04	5838.53
Saccade R	1	8	6393745382	6393804993	59611	749.87	690.99	1491.80	504.20	7.94	304.32	0.67	133.27	7421.71	-7458.04	5838.53
Fixation L	1	8	6393804993	6394083481	278488	1485.59	506.00	10	16	-1	10.71	10.71
Fixation R	1	8	6393804993	6394083481	278488	1485.59	506.00	10	16	-1	10.61	10.61
Saccade L	1	9	6394083481	6394123234	39753	1481.53	505.57	1286.01	865.88	3.61	299.30	1.00	90.80	7451.92	-7067.59	4873.95
Saccade R	1	9	6394083481	6394123234	39753	1481.53	505.57	1286.01	865.88	3.61	299.30	1.00	90.80	7451.92	-7067.59	4873.95
Fixation L	1	9	6394123234	6394421595	298361	1271.81	905.58	23	53	-1	11.01	11.01
Fixation R	1	9	6394123234	6394421595	298361	1271.81	905.58	23	53	-1	10.57	10.57
Saccade L	1	10	6394421595	6394481347	59752	1273.00	905.13	765.26	716.40	5.83	251.68	0.67	97.49	6170.11	-5817.99	3880.00
Saccade R	1	10	6394421595	6394481347	59752	1273.00	905.13	765.26	716.40	5.83	251.68	0.67	97.49	6170.11	-5817.99	3880.00
Fixation L	1	10	6394481347	6394879073	397726	759.87	700.39	37	33	-1	11.44	11.44
Fixation R	1	10	6394481347	6394879073	397726	759.87	700.39	37	33	-1	11.25	11.25
Saccade L	1	11	6394879073	6394918950	39877	738.27	685.08	549.39	296.82	3.69	225.37	0.50	92.47	5568.70	-5501.95	5329.47
Saccade R	1	11	6394879073	6394918950	39877	738.27	685.08	549.39	296.82	3.69	225.37	0.50	92.47	5568.70	-5501.95	5329.47
Fixation L	1	11	6394918950	6395336564	417614	545.90	323.39	23	39	-1	11.14	11.14
Fixation R	1	11	6394918950	6395336564	417614	545.90	323.39	23	39	-1	11.01	11.01
Saccade L	1	12	6395336564	6395376293	39729	553.98	335.27	801.32	330.48	2.54	191.91	1.00	63.99	4681.65	0.00	2036.73
Saccade R	1	12	6395336564	6395376293	39729	553.98	335.27	801.32	330.48	2.54	191.91	1.00	63.99	4681.65	0.00	2036.73
