[BeGaze]
Converted from:	C:\Documents and Settings\iViewX\Desktop\EXPERIMENTATIONS\Experiments\results\finaleart\S8119532-finaleart-1.idf
Date:	27.03.2019 15:59:29
Version:	BeGaze 2.5.77
Sample Rate:	50
Subject:	S8119532
Description:	Alexandre Drewery

Table Header for Fixations:
Event Type	Trial	Number	Start	End	Duration	Location X	Location Y	Dispersion X	Dispersion Y	Plane	Avg. Pupil Size X	Avg. Pupil Size Y

Table Header for Saccades:
Event Type	Trial	Number	Start	End	Duration	Start Loc.X	Start Loc.Y	End Loc.X	End Loc.Y	Amplitude	Peak Speed	Peak Speed At	Average Speed	Peak Accel.	Peak Decel.	Average Accel.

Table Header for Blinks:
Event Type	Trial	Number	Start	End	Duration

Table Header for User Events:
Event Type	Trial	Number	Start	Description

UserEvent	1	1	2546523879	# Message: void.jpg
Saccade L	1	1	2546540058	2546619688	79630	1305.17	962.69	1151.07	776.88	3.65	150.71	0.75	45.80	3613.70	-3760.46	2102.15
Saccade R	1	1	2546540058	2546619688	79630	1305.17	962.69	1151.07	776.88	3.65	150.71	0.75	45.80	3613.70	-3760.46	2102.15
Fixation L	1	1	2546619688	2546871396	251708	1149.71	780.64	22	24	-1	14.91	14.91
Fixation R	1	1	2546619688	2546871396	251708	1149.71	780.64	22	24	-1	16.43	16.43
Saccade L	1	2	2546871396	2546898162	26766	1141.24	792.98	1362.78	977.63	2.19	291.50	1.00	81.90	7160.97	-6963.72	4842.15
Saccade R	1	2	2546871396	2546898162	26766	1141.24	792.98	1362.78	977.63	2.19	291.50	1.00	81.90	7160.97	-6963.72	4842.15
Fixation L	1	2	2546898162	2547136783	238621	1341.35	993.53	53	36	-1	14.21	14.21
Fixation R	1	2	2546898162	2547136783	238621	1341.35	993.53	53	36	-1	15.14	15.14
Saccade L	1	3	2547136783	2547156648	19865	1324.24	1014.55	1323.68	1024.26	0.35	20.81	1.00	17.46	128.22	-274.30	141.55
Saccade R	1	3	2547136783	2547156648	19865	1324.24	1014.55	1323.68	1024.26	0.35	20.81	1.00	17.46	128.22	-274.30	141.55
Fixation L	1	3	2547156648	2547415289	258641	1322.18	1010.45	22	22	-1	14.20	14.20
Fixation R	1	3	2547156648	2547415289	258641	1322.18	1010.45	22	22	-1	15.26	15.26
Blink L	1	1	2547415289	2547696666	281377
Blink R	1	1	2547415289	2547673867	258578
Fixation R	1	4	2547673867	2548111483	437616	913.26	671.52	12	65	-1	15.37	15.37
Fixation L	1	4	2547696666	2548111483	414817	912.80	670.06	8	65	-1	15.29	15.29
Saccade L	1	4	2548111483	2548151255	39772	912.14	671.25	921.51	440.05	2.53	143.92	0.50	63.70	3524.33	-1902.17	2059.86
Saccade R	1	4	2548111483	2548151255	39772	912.14	671.25	921.51	440.05	2.53	143.92	0.50	63.70	3524.33	-1902.17	2059.86
Fixation L	1	5	2548151255	2548429720	278465	941.06	451.12	31	67	-1	14.92	14.92
Fixation R	1	5	2548151255	2548429720	278465	941.06	451.12	31	67	-1	14.99	14.99
Saccade L	1	5	2548429720	2548449586	19866	953.24	444.68	957.48	456.44	0.29	20.23	1.00	14.64	-131.60	-231.25	184.14
Saccade R	1	5	2548429720	2548449586	19866	953.24	444.68	957.48	456.44	0.29	20.23	1.00	14.64	-131.60	-231.25	184.14
Fixation L	1	6	2548449586	2548568832	119246	963.48	468.14	13	22	-1	14.98	14.98
Fixation R	1	6	2548449586	2548568832	119246	963.48	468.14	13	22	-1	15.48	15.48
