[BeGaze]
Converted from:	C:\Documents and Settings\iViewX\Desktop\EXPERIMENTATIONS\Experiments\results\finaleart\S02123220-finaleart-1.idf
Date:	27.03.2019 15:33:43
Version:	BeGaze 2.5.77
Sample Rate:	50
Subject:	S02123220
Description:	David Xu

Table Header for Fixations:
Event Type	Trial	Number	Start	End	Duration	Location X	Location Y	Dispersion X	Dispersion Y	Plane	Avg. Pupil Size X	Avg. Pupil Size Y

Table Header for Saccades:
Event Type	Trial	Number	Start	End	Duration	Start Loc.X	Start Loc.Y	End Loc.X	End Loc.Y	Amplitude	Peak Speed	Peak Speed At	Average Speed	Peak Accel.	Peak Decel.	Average Accel.

Table Header for Blinks:
Event Type	Trial	Number	Start	End	Duration

Table Header for User Events:
Event Type	Trial	Number	Start	Description

UserEvent	1	1	1789495641	# Message: courbet-woman-with-a-parrot-1866.jpg
Fixation L	1	1	1789512290	1789731147	218857	1001.69	576.33	48	21	-1	12.30	12.30
Fixation R	1	1	1789512290	1789731147	218857	1001.69	576.33	48	21	-1	11.89	11.89
Saccade L	1	1	1789731147	1789751020	19873	1035.72	565.37	1068.71	539.80	0.62	42.22	1.00	31.27	817.35	-888.43	582.21
Saccade R	1	1	1789731147	1789751020	19873	1035.72	565.37	1068.71	539.80	0.62	42.22	1.00	31.27	817.35	-888.43	582.21
Fixation L	1	2	1789751020	1789910159	159139	1080.51	496.95	20	70	-1	12.18	12.18
Fixation R	1	2	1789751020	1789910159	159139	1080.51	496.95	20	70	-1	11.61	11.61
Saccade L	1	2	1789910159	1789989770	79611	1075.55	469.41	723.33	554.71	5.80	240.64	0.75	72.85	5679.44	-5584.53	3096.51
Saccade R	1	2	1789910159	1789989770	79611	1075.55	469.41	723.33	554.71	5.80	240.64	0.75	72.85	5679.44	-5584.53	3096.51
Fixation L	1	3	1789989770	1790188618	198848	715.60	580.07	42	40	-1	11.25	11.25
Fixation R	1	3	1789989770	1790188618	198848	715.60	580.07	42	40	-1	11.81	11.81
Saccade L	1	3	1790188618	1790407353	218735	698.36	595.37	513.52	374.17	14.59	261.74	0.09	66.71	6450.10	-6139.39	2872.95
Saccade R	1	3	1790188618	1790407353	218735	698.36	595.37	513.52	374.17	14.59	261.74	0.09	66.71	6450.10	-6139.39	2872.95
Fixation L	1	4	1790407353	1790586352	178999	524.55	349.65	30	55	-1	11.50	11.50
Fixation R	1	4	1790407353	1790586352	178999	524.55	349.65	30	55	-1	11.80	11.80
Saccade L	1	4	1790586352	1790606216	19864	543.86	318.86	578.55	301.04	0.48	39.45	1.00	24.10	947.50	-724.12	660.01
Saccade R	1	4	1790586352	1790606216	19864	543.86	318.86	578.55	301.04	0.48	39.45	1.00	24.10	947.50	-724.12	660.01
Fixation L	1	5	1790606216	1791441672	835456	577.52	295.18	34	63	-1	12.36	12.36
Fixation R	1	5	1790606216	1791441672	835456	577.52	295.18	34	63	-1	12.77	12.77
Saccade L	1	5	1791441672	1791521167	79495	571.92	331.81	320.65	773.75	6.85	299.08	0.50	86.17	7168.13	-5937.52	3096.33
Saccade R	1	5	1791441672	1791521167	79495	571.92	331.81	320.65	773.75	6.85	299.08	0.50	86.17	7168.13	-5937.52	3096.33
Fixation L	1	6	1791521167	1791660415	139248	352.08	761.25	48	30	-1	13.76	13.76
Fixation R	1	6	1791521167	1791660415	139248	352.08	761.25	48	30	-1	14.62	14.62
Saccade L	1	6	1791660415	1791700146	39731	362.63	764.21	393.42	759.10	1.77	113.61	0.50	44.50	2679.27	-2496.03	2181.16
Saccade R	1	6	1791660415	1791700146	39731	362.63	764.21	393.42	759.10	1.77	113.61	0.50	44.50	2679.27	-2496.03	2181.16
Fixation L	1	7	1791700146	1792217373	517227	419.69	760.79	41	44	-1	12.63	12.63
Fixation R	1	7	1791700146	1792217373	517227	419.69	760.79	41	44	-1	13.73	13.73
Saccade L	1	7	1792217373	1792276994	59621	434.75	743.93	1337.26	716.13	9.61	393.42	0.67	161.16	9667.88	-8893.07	7375.14
Saccade R	1	7	1792217373	1792276994	59621	434.75	743.93	1337.26	716.13	9.61	393.42	0.67	161.16	9667.88	-8893.07	7375.14
Fixation L	1	8	1792276994	1792674859	397865	1360.80	710.97	36	16	-1	12.57	12.57
Fixation R	1	8	1792276994	1792674859	397865	1360.80	710.97	36	16	-1	11.29	11.29
Saccade L	1	8	1792674859	1792694725	19866	1354.54	709.67	1113.86	698.78	1.45	243.57	1.00	72.90	6029.48	-5910.43	4325.54
Saccade R	1	8	1792674859	1792694725	19866	1354.54	709.67	1113.86	698.78	1.45	243.57	1.00	72.90	6029.48	-5910.43	4325.54
Fixation L	1	9	1792694725	1792913461	218736	1068.79	693.69	57	15	-1	12.05	12.05
Fixation R	1	9	1792694725	1792913461	218736	1068.79	693.69	57	15	-1	11.21	11.21
Saccade L	1	9	1792913461	1792933321	19860	1065.74	692.86	1158.41	698.90	0.60	93.94	1.00	30.42	2112.93	-2218.27	1449.97
Saccade R	1	9	1792913461	1792933321	19860	1065.74	692.86	1158.41	698.90	0.60	93.94	1.00	30.42	2112.93	-2218.27	1449.97
Fixation L	1	10	1792933321	1793072583	139262	1167.82	701.93	14	7	-1	12.40	12.40
Fixation R	1	10	1792933321	1793072583	139262	1167.82	701.93	14	7	-1	11.25	11.25
Saccade L	1	10	1793072583	1793370928	298345	1173.16	702.80	1763.61	362.07	39.87	306.17	0.13	133.63	7537.11	-5879.08	2981.00
Saccade R	1	10	1793072583	1793370928	298345	1173.16	702.80	1763.61	362.07	39.87	306.17	0.13	133.63	7537.11	-5879.08	2981.00
Fixation L	1	11	1793370928	1793490298	119370	1781.82	387.95	29	39	-1	13.09	13.09
Fixation R	1	11	1793370928	1793490298	119370	1781.82	387.95	29	39	-1	9.72	9.72
