[BeGaze]
Converted from:	C:\Documents and Settings\iViewX\Desktop\EXPERIMENTATIONS\Experiments\results\finaleart\S19F21442-finaleart-1.idf
Date:	27.03.2019 15:50:02
Version:	BeGaze 2.5.77
Sample Rate:	50
Subject:	S19F21442
Description:	Juliette Veuillez

Table Header for Fixations:
Event Type	Trial	Number	Start	End	Duration	Location X	Location Y	Dispersion X	Dispersion Y	Plane	Avg. Pupil Size X	Avg. Pupil Size Y

Table Header for Saccades:
Event Type	Trial	Number	Start	End	Duration	Start Loc.X	Start Loc.Y	End Loc.X	End Loc.Y	Amplitude	Peak Speed	Peak Speed At	Average Speed	Peak Accel.	Peak Decel.	Average Accel.

Table Header for Blinks:
Event Type	Trial	Number	Start	End	Duration

Table Header for User Events:
Event Type	Trial	Number	Start	Description

UserEvent	1	1	5478192165	# Message: parrot-tulips-(II)_matisse_1905.jpg
Fixation L	1	1	5478204583	5478662057	457474	826.47	461.73	78	18	-1	17.30	17.30
Fixation R	1	1	5478204583	5478662057	457474	826.47	461.73	78	18	-1	18.17	18.17
Saccade L	1	1	5478662057	5478681926	19869	897.62	458.48	1049.41	460.10	1.18	153.53	1.00	59.43	3791.62	-3649.22	3124.43
Saccade R	1	1	5478662057	5478681926	19869	897.62	458.48	1049.41	460.10	1.18	153.53	1.00	59.43	3791.62	-3649.22	3124.43
Fixation L	1	2	5478681926	5478860927	179001	1048.72	440.82	6	29	-1	15.03	15.03
Fixation R	1	2	5478681926	5478860927	179001	1048.72	440.82	6	29	-1	16.13	16.13
Saccade L	1	2	5478860927	5478880790	19863	1051.90	431.77	1002.50	227.26	1.11	212.74	1.00	55.96	5239.22	-4704.10	3372.00
Saccade R	1	2	5478860927	5478880790	19863	1051.90	431.77	1002.50	227.26	1.11	212.74	1.00	55.96	5239.22	-4704.10	3372.00
Fixation L	1	3	5478880790	5479199041	318251	974.84	235.90	38	31	-1	12.17	12.17
Fixation R	1	3	5478880790	5479199041	318251	974.84	235.90	38	31	-1	12.79	12.79
Saccade L	1	3	5479199041	5479238908	39867	971.12	245.59	769.56	441.56	2.66	212.10	1.00	66.64	5268.02	-5106.59	3701.38
Saccade R	1	3	5479199041	5479238908	39867	971.12	245.59	769.56	441.56	2.66	212.10	1.00	66.64	5268.02	-5106.59	3701.38
Fixation L	1	4	5479238908	5479398028	159120	782.64	488.12	24	70	-1	12.59	12.59
Fixation R	1	4	5479238908	5479398028	159120	782.64	488.12	24	70	-1	13.39	13.39
Saccade L	1	4	5479398028	5479417905	19877	790.63	511.70	791.68	517.82	0.13	10.49	1.00	6.53	-59.00	-105.02	80.12
Saccade R	1	4	5479398028	5479417905	19877	790.63	511.70	791.68	517.82	0.13	10.49	1.00	6.53	-59.00	-105.02	80.12
Fixation L	1	5	5479417905	5479537279	119374	793.71	519.24	6	12	-1	13.43	13.43
Fixation R	1	5	5479417905	5479537279	119374	793.71	519.24	6	12	-1	14.31	14.31
Saccade L	1	5	5479537279	5479557139	19860	789.89	524.42	638.32	603.24	1.03	172.78	1.00	51.87	4097.27	-4209.96	2793.21
Saccade R	1	5	5479537279	5479557139	19860	789.89	524.42	638.32	603.24	1.03	172.78	1.00	51.87	4097.27	-4209.96	2793.21
Fixation L	1	6	5479557139	5479835503	278364	644.98	623.70	20	72	-1	13.84	13.84
Fixation R	1	6	5479557139	5479835503	278364	644.98	623.70	20	72	-1	15.21	15.21
Saccade L	1	6	5479835503	5479895274	59771	650.53	641.12	812.97	444.91	3.38	168.28	0.67	56.58	4150.89	-3272.05	2447.03
Saccade R	1	6	5479835503	5479895274	59771	650.53	641.12	812.97	444.91	3.38	168.28	0.67	56.58	4150.89	-3272.05	2447.03
Fixation L	1	7	5479895274	5480054383	159109	818.19	435.08	8	45	-1	14.04	14.04
Fixation R	1	7	5479895274	5480054383	159109	818.19	435.08	8	45	-1	15.13	15.13
Saccade L	1	7	5480054383	5480094124	39741	821.31	439.44	839.39	169.13	2.45	161.33	1.00	61.74	4009.60	-3802.89	3153.07
Saccade R	1	7	5480054383	5480094124	39741	821.31	439.44	839.39	169.13	2.45	161.33	1.00	61.74	4009.60	-3802.89	3153.07
Fixation L	1	8	5480094124	5480312986	218862	873.17	175.37	46	34	-1	13.08	13.08
Fixation R	1	8	5480094124	5480312986	218862	873.17	175.37	46	34	-1	13.99	13.99
Saccade L	1	8	5480312986	5480372612	59626	881.22	191.87	1275.17	410.46	4.92	232.63	0.67	82.51	5597.72	-5500.42	3827.46
Saccade R	1	8	5480312986	5480372612	59626	881.22	191.87	1275.17	410.46	4.92	232.63	0.67	82.51	5597.72	-5500.42	3827.46
Fixation L	1	9	5480372612	5480651103	278491	1282.14	429.45	26	52	-1	13.83	13.83
Fixation R	1	9	5480372612	5480651103	278491	1282.14	429.45	26	52	-1	14.10	14.10
Saccade L	1	9	5480651103	5480690847	39744	1268.05	462.01	1397.19	770.41	3.24	250.29	0.50	81.59	6073.51	-5324.54	3983.27
Saccade R	1	9	5480651103	5480690847	39744	1268.05	462.01	1397.19	770.41	3.24	250.29	0.50	81.59	6073.51	-5324.54	3983.27
Fixation L	1	10	5480690847	5480929461	238614	1403.24	795.46	13	49	-1	14.49	14.49
Fixation R	1	10	5480690847	5480929461	238614	1403.24	795.46	13	49	-1	14.25	14.25
Saccade L	1	10	5480929461	5480969336	39875	1411.08	757.17	1438.68	291.23	4.19	343.62	0.50	105.12	8513.18	-8341.36	5541.88
Saccade R	1	10	5480929461	5480969336	39875	1411.08	757.17	1438.68	291.23	4.19	343.62	0.50	105.12	8513.18	-8341.36	5541.88
Fixation L	1	11	5480969336	5481148330	178994	1436.75	304.12	14	85	-1	14.13	14.13
Fixation R	1	11	5480969336	5481148330	178994	1436.75	304.12	14	85	-1	14.18	14.18
Saccade L	1	11	5481148330	5481168200	19870	1440.80	281.07	1443.93	47.22	1.88	236.45	1.00	94.61	4716.06	-5762.27	4142.57
Saccade R	1	11	5481148330	5481168200	19870	1440.80	281.07	1443.93	47.22	1.88	236.45	1.00	94.61	4716.06	-5762.27	4142.57
Fixation L	1	12	5481168200	5481347198	178998	1434.97	50.71	17	27	-1	13.31	13.31
Fixation R	1	12	5481168200	5481347198	178998	1434.97	50.71	17	27	-1	13.32	13.32
Saccade L	1	12	5481347198	5481386940	39742	1426.92	66.80	1208.97	115.20	2.11	154.56	0.50	53.00	3727.66	-3224.44	2532.37
Saccade R	1	12	5481347198	5481386940	39742	1426.92	66.80	1208.97	115.20	2.11	154.56	0.50	53.00	3727.66	-3224.44	2532.37
Fixation L	1	13	5481386940	5481924042	537102	1184.60	114.03	37	51	-1	13.88	13.88
Fixation R	1	13	5481386940	5481924042	537102	1184.60	114.03	37	51	-1	14.30	14.30
Saccade L	1	13	5481924042	5482003543	79501	1173.60	141.22	581.02	337.44	7.46	277.77	0.50	93.83	6811.62	-6198.71	4371.96
Saccade R	1	13	5481924042	5482003543	79501	1173.60	141.22	581.02	337.44	7.46	277.77	0.50	93.83	6811.62	-6198.71	4371.96
Fixation L	1	14	5482003543	5482182657	179114	577.86	352.52	11	20	-1	14.71	14.71
Fixation R	1	14	5482003543	5482182657	179114	577.86	352.52	11	20	-1	16.18	16.18
