[BeGaze]
Converted from:	C:\Documents and Settings\iViewX\Desktop\EXPERIMENTATIONS\Experiments\results\finaleart\S18F56223-finaleart-1.idf
Date:	27.03.2019 15:48:19
Version:	BeGaze 2.5.77
Sample Rate:	50
Subject:	S18F56223
Description:	Pascale Sebillot

Table Header for Fixations:
Event Type	Trial	Number	Start	End	Duration	Location X	Location Y	Dispersion X	Dispersion Y	Plane	Avg. Pupil Size X	Avg. Pupil Size Y

Table Header for Saccades:
Event Type	Trial	Number	Start	End	Duration	Start Loc.X	Start Loc.Y	End Loc.X	End Loc.Y	Amplitude	Peak Speed	Peak Speed At	Average Speed	Peak Accel.	Peak Decel.	Average Accel.

Table Header for Blinks:
Event Type	Trial	Number	Start	End	Duration

Table Header for User Events:
Event Type	Trial	Number	Start	Description

UserEvent	1	1	2270185639	# Message: void.jpg
Fixation L	1	1	2270201865	2270301229	99364	1426.25	731.12	6	5	-1	16.49	16.49
Fixation R	1	1	2270201865	2270301229	99364	1426.25	731.12	6	5	-1	15.56	15.56
Saccade L	1	1	2270301229	2270321111	19882	1428.73	728.98	1335.31	738.55	0.61	94.99	1.00	30.51	2328.04	-2216.60	1695.57
Saccade R	1	1	2270301229	2270321111	19882	1428.73	728.98	1335.31	738.55	0.61	94.99	1.00	30.51	2328.04	-2216.60	1695.57
Fixation L	1	2	2270321111	2270440451	119340	1348.05	742.65	29	10	-1	16.54	16.54
Fixation R	1	2	2270321111	2270440451	119340	1348.05	742.65	29	10	-1	15.90	15.90
Saccade L	1	2	2270440451	2270520089	79638	1364.52	740.83	1546.46	650.99	7.20	211.83	1.00	90.40	4672.01	-5083.37	3139.72
Saccade R	1	2	2270440451	2270520089	79638	1364.52	740.83	1546.46	650.99	7.20	211.83	1.00	90.40	4672.01	-5083.37	3139.72
Fixation L	1	3	2270520089	2270838330	318241	1562.21	656.60	19	28	-1	17.03	17.03
Fixation R	1	3	2270520089	2270838330	318241	1562.21	656.60	19	28	-1	16.19	16.19
Saccade L	1	3	2270838330	2270937686	99356	1566.11	660.66	776.35	790.69	11.69	284.90	0.60	117.62	4140.07	-5082.74	2946.72
Saccade R	1	3	2270838330	2270937686	99356	1566.11	660.66	776.35	790.69	11.69	284.90	0.60	117.62	4140.07	-5082.74	2946.72
Fixation L	1	4	2270937686	2271057057	119371	798.86	767.62	47	33	-1	14.70	14.70
Fixation R	1	4	2270937686	2271057057	119371	798.86	767.62	47	33	-1	14.15	14.15
Saccade L	1	4	2271057057	2271713409	656352	781.29	772.42	859.79	513.38	103.93	431.24	0.52	158.34	9106.17	-9321.03	4022.58
Saccade R	1	4	2271057057	2271713409	656352	781.29	772.42	859.79	513.38	103.93	431.24	0.52	158.34	9106.17	-9321.03	4022.58
Fixation L	1	5	2271713409	2271852652	139243	874.77	513.90	20	23	-1	15.42	15.42
Fixation R	1	5	2271713409	2271852652	139243	874.77	513.90	20	23	-1	15.03	15.03
Saccade L	1	5	2271852652	2271952146	99494	872.12	521.26	881.23	518.31	21.24	435.59	1.00	213.50	10794.29	-10574.71	8893.08
Saccade R	1	5	2271852652	2271952146	99494	872.12	521.26	881.23	518.31	21.24	435.59	1.00	213.50	10794.29	-10574.71	8893.08
Fixation L	1	6	2271952146	2272091392	139246	867.15	519.03	24	16	-1	15.60	15.60
Fixation R	1	6	2271952146	2272091392	139246	867.15	519.03	24	16	-1	15.27	15.27
Saccade L	1	6	2272091392	2272170880	79488	861.76	520.98	639.22	855.34	17.24	444.14	0.75	216.89	9895.00	0.00	4009.15
Saccade R	1	6	2272091392	2272170880	79488	861.76	520.98	639.22	855.34	17.24	444.14	0.75	216.89	9895.00	0.00	4009.15
