[BeGaze]
Converted from:	C:\Documents and Settings\iViewX\Desktop\EXPERIMENTATIONS\Experiments\results\finaleart\S9H29221-finaleart-1.idf
Date:	27.03.2019 16:02:58
Version:	BeGaze 2.5.77
Sample Rate:	50
Subject:	S9H29221
Description:	steven

Table Header for Fixations:
Event Type	Trial	Number	Start	End	Duration	Location X	Location Y	Dispersion X	Dispersion Y	Plane	Avg. Pupil Size X	Avg. Pupil Size Y

Table Header for Saccades:
Event Type	Trial	Number	Start	End	Duration	Start Loc.X	Start Loc.Y	End Loc.X	End Loc.Y	Amplitude	Peak Speed	Peak Speed At	Average Speed	Peak Accel.	Peak Decel.	Average Accel.

Table Header for Blinks:
Event Type	Trial	Number	Start	End	Duration

Table Header for User Events:
Event Type	Trial	Number	Start	Description

UserEvent	1	1	6078670455	# Message: void.jpg
Fixation L	1	1	6078674602	6078853566	178964	1170.63	329.87	24	11	-1	15.25	15.25
Fixation R	1	1	6078674602	6078853566	178964	1170.63	329.87	24	11	-1	14.18	14.18
Saccade L	1	1	6078853566	6078873445	19879	1150.35	337.28	1048.19	426.99	0.86	137.50	1.00	43.27	3337.48	-3138.29	2247.56
Saccade R	1	1	6078853566	6078873445	19879	1150.35	337.28	1048.19	426.99	0.86	137.50	1.00	43.27	3337.48	-3138.29	2247.56
Fixation L	1	2	6078873445	6079967395	1093950	1050.68	437.74	32	66	-1	15.32	15.32
Fixation R	1	2	6078873445	6079967395	1093950	1050.68	437.74	32	66	-1	14.32	14.32
Saccade L	1	2	6079967395	6079987273	19878	1075.41	393.80	1078.36	392.97	0.09	7.79	1.00	4.49	331.21	-117.40	161.96
Saccade R	1	2	6079967395	6079987273	19878	1075.41	393.80	1078.36	392.97	0.09	7.79	1.00	4.49	331.21	-117.40	161.96
Fixation L	1	3	6079987273	6080345370	358097	1121.31	400.57	76	19	-1	15.48	15.48
Fixation R	1	3	6079987273	6080345370	358097	1121.31	400.57	76	19	-1	14.33	14.33
Saccade L	1	3	6080345370	6080365250	19880	1153.69	388.87	1161.51	387.28	0.14	8.93	1.00	6.81	-8.47	-170.63	66.81
Saccade R	1	3	6080345370	6080365250	19880	1153.69	388.87	1161.51	387.28	0.14	8.93	1.00	6.81	-8.47	-170.63	66.81
Fixation L	1	4	6080365250	6080683511	318261	1178.23	389.12	26	23	-1	15.51	15.51
Fixation R	1	4	6080365250	6080683511	318261	1178.23	389.12	26	23	-1	14.47	14.47
