[BeGaze]
Converted from:	C:\Documents and Settings\iViewX\Desktop\EXPERIMENTATIONS\Experiments\results\finaleart\S4120113-finaleart-1.idf
Date:	27.03.2019 15:34:21
Version:	BeGaze 2.5.77
Sample Rate:	50
Subject:	S4120113
Description:	Vidal Attias

Table Header for Fixations:
Event Type	Trial	Number	Start	End	Duration	Location X	Location Y	Dispersion X	Dispersion Y	Plane	Avg. Pupil Size X	Avg. Pupil Size Y

Table Header for Saccades:
Event Type	Trial	Number	Start	End	Duration	Start Loc.X	Start Loc.Y	End Loc.X	End Loc.Y	Amplitude	Peak Speed	Peak Speed At	Average Speed	Peak Accel.	Peak Decel.	Average Accel.

Table Header for Blinks:
Event Type	Trial	Number	Start	End	Duration

Table Header for User Events:
Event Type	Trial	Number	Start	Description

UserEvent	1	1	6357290424	# Message: The_Joy_Of_Life_Matisse_1906.jpg
Fixation L	1	1	6357296130	6357693995	397865	1006.75	488.44	9	50	-1	12.33	12.33
Fixation R	1	1	6357296130	6357693995	397865	1006.75	488.44	9	50	-1	12.70	12.70
Saccade L	1	1	6357693995	6357713864	19869	1001.90	522.81	959.99	627.73	0.85	114.27	1.00	42.57	2845.07	-2432.75	1897.12
Saccade R	1	1	6357693995	6357713864	19869	1001.90	522.81	959.99	627.73	0.85	114.27	1.00	42.57	2845.07	-2432.75	1897.12
Fixation L	1	2	6357713864	6357952457	238593	942.74	642.78	25	56	-1	11.36	11.36
Fixation R	1	2	6357713864	6357952457	238593	942.74	642.78	25	56	-1	11.92	11.92
Saccade L	1	2	6357952457	6357972456	19999	936.25	645.36	1130.07	664.80	1.38	196.97	1.00	68.94	4713.76	-4497.59	3376.22
Saccade R	1	2	6357952457	6357972456	19999	936.25	645.36	1130.07	664.80	1.38	196.97	1.00	68.94	4713.76	-4497.59	3376.22
Fixation L	1	3	6357972456	6358310551	338095	1163.39	688.19	47	38	-1	9.19	9.19
Fixation R	1	3	6357972456	6358310551	338095	1163.39	688.19	47	38	-1	9.37	9.37
Saccade L	1	3	6358310551	6358350301	39750	1177.95	672.35	1296.26	705.64	1.24	105.09	1.00	31.29	2316.91	-2174.76	1363.57
Saccade R	1	3	6358310551	6358350301	39750	1177.95	672.35	1296.26	705.64	1.24	105.09	1.00	31.29	2316.91	-2174.76	1363.57
Fixation L	1	4	6358350301	6358549171	198870	1278.00	721.37	35	42	-1	8.77	8.77
Fixation R	1	4	6358350301	6358549171	198870	1278.00	721.37	35	42	-1	9.67	9.67
Saccade L	1	4	6358549171	6358708288	159117	1284.95	732.15	1570.43	845.63	9.59	238.67	0.12	60.30	5613.01	-5518.19	2192.77
Saccade R	1	4	6358549171	6358708288	159117	1284.95	732.15	1570.43	845.63	9.59	238.67	0.12	60.30	5613.01	-5518.19	2192.77
Fixation L	1	5	6358708288	6358807787	99499	1562.07	859.95	27	32	-1	9.66	9.66
Fixation R	1	5	6358708288	6358807787	99499	1562.07	859.95	27	32	-1	10.02	10.02
Saccade L	1	5	6358807787	6358827661	19874	1550.62	870.56	1464.57	937.14	0.86	110.04	1.00	43.27	2342.29	-2259.73	1840.96
Saccade R	1	5	6358807787	6358827661	19874	1550.62	870.56	1464.57	937.14	0.86	110.04	1.00	43.27	2342.29	-2259.73	1840.96
Fixation L	1	6	6358827661	6359066413	238752	1426.78	943.91	56	32	-1	9.91	9.91
Fixation R	1	6	6358827661	6359066413	238752	1426.78	943.91	56	32	-1	10.17	10.17
Saccade L	1	6	6359066413	6359086263	19850	1408.47	960.19	1365.33	968.89	0.52	44.52	1.00	26.12	997.69	-787.43	643.48
Saccade R	1	6	6359066413	6359086263	19850	1408.47	960.19	1365.33	968.89	0.52	44.52	1.00	26.12	997.69	-787.43	643.48
Fixation L	1	7	6359086263	6359265249	178986	1362.57	993.74	15	32	-1	10.18	10.18
Fixation R	1	7	6359086263	6359265249	178986	1362.57	993.74	15	32	-1	10.32	10.32
Saccade L	1	7	6359265249	6359324871	59622	1366.07	998.87	1241.98	1027.60	2.88	125.35	0.33	48.22	3052.00	-1551.84	1613.25
Saccade R	1	7	6359265249	6359324871	59622	1366.07	998.87	1241.98	1027.60	2.88	125.35	0.33	48.22	3052.00	-1551.84	1613.25
Fixation L	1	8	6359324871	6359444248	119377	1259.14	1031.00	32	41	-1	10.37	10.37
Fixation R	1	8	6359324871	6359444248	119377	1259.14	1031.00	32	41	-1	10.76	10.76
Saccade L	1	8	6359444248	6359483988	39740	1247.80	1039.33	837.67	1085.80	4.10	237.54	0.50	103.06	5699.14	-4343.16	4462.19
Saccade R	1	8	6359444248	6359483988	39740	1247.80	1039.33	837.67	1085.80	4.10	237.54	0.50	103.06	5699.14	-4343.16	4462.19
Fixation L	1	9	6359483988	6359603359	119371	860.91	1045.89	33	65	-1	10.24	10.24
Fixation R	1	9	6359483988	6359603359	119371	860.91	1045.89	33	65	-1	11.06	11.06
Saccade L	1	9	6359603359	6359702854	99495	864.88	1069.34	864.03	1023.93	4.33	88.11	0.80	43.54	1491.27	-1797.36	892.32
Saccade R	1	9	6359603359	6359702854	99495	864.88	1069.34	864.03	1023.93	4.33	88.11	0.80	43.54	1491.27	-1797.36	892.32
Fixation L	1	10	6359702854	6359861963	159109	872.40	1032.12	32	43	-1	9.97	9.97
Fixation R	1	10	6359702854	6359861963	159109	872.40	1032.12	32	43	-1	10.80	10.80
Saccade L	1	10	6359861963	6359881849	19886	876.07	1052.71	889.07	1108.51	0.45	57.96	1.00	22.54	1024.55	-1317.32	799.04
Saccade R	1	10	6359861963	6359881849	19886	876.07	1052.71	889.07	1108.51	0.45	57.96	1.00	22.54	1024.55	-1317.32	799.04
Fixation L	1	11	6359881849	6360080711	198862	897.07	1089.44	12	47	-1	10.39	10.39
Fixation R	1	11	6359881849	6360080711	198862	897.07	1089.44	12	47	-1	11.47	11.47
Saccade L	1	11	6360080711	6360140457	59746	901.66	1073.47	487.61	844.73	6.05	323.99	0.67	101.33	7881.01	-6235.89	3603.18
Saccade R	1	11	6360080711	6360140457	59746	901.66	1073.47	487.61	844.73	6.05	323.99	0.67	101.33	7881.01	-6235.89	3603.18
Fixation L	1	12	6360140457	6360259704	119247	502.20	831.25	24	74	-1	9.28	9.28
Fixation R	1	12	6360140457	6360259704	119247	502.20	831.25	24	74	-1	11.33	11.33
Saccade L	1	12	6360259704	6360279566	19862	507.22	844.04	519.52	837.24	0.63	62.76	1.00	31.59	1012.53	-322.00	771.24
Saccade R	1	12	6360259704	6360279566	19862	507.22	844.04	519.52	837.24	0.63	62.76	1.00	31.59	1012.53	-322.00	771.24
Fixation L	1	13	6360279566	6360418816	139250	525.32	825.17	12	69	-1	8.90	8.90
Fixation R	1	13	6360279566	6360418816	139250	525.32	825.17	12	69	-1	11.51	11.51
Saccade L	1	13	6360418816	6360458681	39865	525.70	842.18	402.67	762.73	2.38	137.12	0.50	59.68	3283.68	-3114.26	3094.17
Saccade R	1	13	6360418816	6360458681	39865	525.70	842.18	402.67	762.73	2.38	137.12	0.50	59.68	3283.68	-3114.26	3094.17
Fixation L	1	14	6360458681	6360597801	139120	405.59	738.27	10	64	-1	10.17	10.17
Fixation R	1	14	6360458681	6360597801	139120	405.59	738.27	10	64	-1	11.57	11.57
Saccade L	1	14	6360597801	6360617793	19992	403.32	727.63	393.31	671.12	0.56	58.05	1.00	28.08	1035.50	-1381.72	817.78
Saccade R	1	14	6360597801	6360617793	19992	403.32	727.63	393.31	671.12	0.56	58.05	1.00	28.08	1035.50	-1381.72	817.78
Fixation L	1	15	6360617793	6360737046	119253	374.02	663.62	37	36	-1	10.12	10.12
Fixation R	1	15	6360617793	6360737046	119253	374.02	663.62	37	36	-1	11.43	11.43
Saccade L	1	15	6360737046	6360756912	19866	355.63	647.20	357.29	610.77	0.44	36.90	1.00	21.95	781.57	-805.33	736.23
Saccade R	1	15	6360737046	6360756912	19866	355.63	647.20	357.29	610.77	0.44	36.90	1.00	21.95	781.57	-805.33	736.23
Fixation L	1	16	6360756912	6361035399	278487	352.76	650.84	13	59	-1	9.91	9.91
Fixation R	1	16	6360756912	6361035399	278487	352.76	650.84	13	59	-1	11.51	11.51
Saccade L	1	16	6361035399	6361055273	19874	361.12	635.21	564.68	665.21	1.29	208.06	1.00	65.09	4978.43	-5015.41	3357.29
Saccade R	1	16	6361035399	6361055273	19874	361.12	635.21	564.68	665.21	1.29	208.06	1.00	65.09	4978.43	-5015.41	3357.29
Fixation L	1	17	6361055273	6361274133	218860	574.71	652.49	23	21	-1	10.27	10.27
Fixation R	1	17	6361055273	6361274133	218860	574.71	652.49	23	21	-1	11.76	11.76
