[BeGaze]
Converted from:	C:\Documents and Settings\iViewX\Desktop\EXPERIMENTATIONS\Experiments\results\finaleart\S01A22542-finaleart-1.idf
Date:	27.03.2019 15:33:24
Version:	BeGaze 2.5.77
Sample Rate:	50
Subject:	S01A22542
Description:	Thibault Seve Minnaert

Table Header for Fixations:
Event Type	Trial	Number	Start	End	Duration	Location X	Location Y	Dispersion X	Dispersion Y	Plane	Avg. Pupil Size X	Avg. Pupil Size Y

Table Header for Saccades:
Event Type	Trial	Number	Start	End	Duration	Start Loc.X	Start Loc.Y	End Loc.X	End Loc.Y	Amplitude	Peak Speed	Peak Speed At	Average Speed	Peak Accel.	Peak Decel.	Average Accel.

Table Header for Blinks:
Event Type	Trial	Number	Start	End	Duration

Table Header for User Events:
Event Type	Trial	Number	Start	Description

UserEvent	1	1	9824188433	# Message: void.jpg
Saccade L	1	1	9824191302	9824250922	59620	494.02	679.17	961.07	577.07	5.87	296.36	0.67	98.49	7409.04	-7252.43	4170.49
Saccade R	1	1	9824191302	9824250922	59620	494.02	679.17	961.07	577.07	5.87	296.36	0.67	98.49	7409.04	-7252.43	4170.49
Fixation L	1	1	9824250922	9824469645	218723	962.34	548.89	5	41	-1	13.04	13.04
Fixation R	1	1	9824250922	9824469645	218723	962.34	548.89	5	41	-1	13.73	13.73
Blink L	1	1	9824469645	9824648774	179129
Blink R	1	1	9824469645	9824648774	179129
Fixation L	1	2	9824648774	9824927500	278726	1039.15	373.19	43	21	-1	14.37	14.37
Fixation R	1	2	9824648774	9824927500	278726	1039.15	373.19	43	21	-1	13.95	13.95
Saccade L	1	2	9824927500	9824947374	19874	1005.99	382.84	865.54	385.10	0.97	142.07	1.00	48.77	3475.43	-2949.41	2266.25
Saccade R	1	2	9824927500	9824947374	19874	1005.99	382.84	865.54	385.10	0.97	142.07	1.00	48.77	3475.43	-2949.41	2266.25
Fixation L	1	3	9824947374	9825285862	338488	866.51	434.84	15	69	-1	15.19	15.19
Fixation R	1	3	9824947374	9825285862	338488	866.51	434.84	15	69	-1	14.25	14.25
Saccade L	1	3	9825285862	9825305733	19871	861.24	439.41	870.39	469.89	0.39	44.17	1.00	19.79	1054.02	-55.02	631.49
Saccade R	1	3	9825285862	9825305733	19871	861.24	439.41	870.39	469.89	0.39	44.17	1.00	19.79	1054.02	-55.02	631.49
Fixation L	1	4	9825305733	9825484983	179250	887.54	521.13	28	71	-1	15.39	15.39
Fixation R	1	4	9825305733	9825484983	179250	887.54	521.13	28	71	-1	14.56	14.56
Saccade L	1	4	9825484983	9825504869	19886	898.91	528.61	900.00	530.08	0.07	5.81	1.00	3.51	22.37	-98.72	45.17
Saccade R	1	4	9825484983	9825504869	19886	898.91	528.61	900.00	530.08	0.07	5.81	1.00	3.51	22.37	-98.72	45.17
Fixation L	1	5	9825504869	9826181824	676955	905.96	537.47	18	56	-1	15.83	15.83
Fixation R	1	5	9825504869	9826181824	676955	905.96	537.47	18	56	-1	15.04	15.04
