[BeGaze]
Converted from:	C:\Documents and Settings\iViewX\Desktop\EXPERIMENTATIONS\Experiments\results\finaleart\S21F22332-finaleart-1.idf
Date:	27.03.2019 15:55:36
Version:	BeGaze 2.5.77
Sample Rate:	50
Subject:	S21F22332
Description:	Cyrielle Mailart

Table Header for Fixations:
Event Type	Trial	Number	Start	End	Duration	Location X	Location Y	Dispersion X	Dispersion Y	Plane	Avg. Pupil Size X	Avg. Pupil Size Y

Table Header for Saccades:
Event Type	Trial	Number	Start	End	Duration	Start Loc.X	Start Loc.Y	End Loc.X	End Loc.Y	Amplitude	Peak Speed	Peak Speed At	Average Speed	Peak Accel.	Peak Decel.	Average Accel.

Table Header for Blinks:
Event Type	Trial	Number	Start	End	Duration

Table Header for User Events:
Event Type	Trial	Number	Start	Description

UserEvent	1	1	2735524952	# Message: void.jpg
Fixation L	1	1	2735539602	2735698710	159108	579.36	724.01	24	19	-1	14.17	14.17
Fixation R	1	1	2735539602	2735698710	159108	579.36	724.01	24	19	-1	13.89	13.89
Saccade L	1	1	2735698710	2735738454	39744	589.86	733.96	1154.13	797.60	4.97	296.76	0.50	125.10	7370.09	-6488.18	6757.43
Saccade R	1	1	2735698710	2735738454	39744	589.86	733.96	1154.13	797.60	4.97	296.76	0.50	125.10	7370.09	-6488.18	6757.43
Fixation L	1	2	2735738454	2735997064	258610	1205.50	822.80	58	38	-1	14.54	14.54
Fixation R	1	2	2735738454	2735997064	258610	1205.50	822.80	58	38	-1	13.93	13.93
Blink L	1	1	2735997064	2736374924	377860
Blink R	1	1	2735997064	2736374924	377860
Fixation L	1	3	2736374924	2736792649	417725	916.92	479.97	14	83	-1	13.84	13.84
Fixation R	1	3	2736374924	2736792649	417725	916.92	479.97	14	83	-1	12.47	12.47
Saccade L	1	2	2736792649	2736812515	19866	916.53	481.87	832.69	562.33	0.99	117.55	1.00	49.64	2849.58	-2641.89	2403.81
Saccade R	1	2	2736792649	2736812515	19866	916.53	481.87	832.69	562.33	0.99	117.55	1.00	49.64	2849.58	-2641.89	2403.81
Fixation L	1	4	2736812515	2737051260	238745	892.40	572.61	71	26	-1	13.21	13.21
Fixation R	1	4	2736812515	2737051260	238745	892.40	572.61	71	26	-1	12.28	12.28
Saccade L	1	3	2737051260	2737071133	19873	893.93	560.59	895.18	556.60	0.08	7.09	0.00	3.92	50.56	-123.88	76.37
Saccade R	1	3	2737051260	2737071133	19873	893.93	560.59	895.18	556.60	0.08	7.09	0.00	3.92	50.56	-123.88	76.37
Fixation L	1	5	2737071133	2737190375	119242	894.70	548.64	3	15	-1	12.63	12.63
Fixation R	1	5	2737071133	2737190375	119242	894.70	548.64	3	15	-1	12.00	12.00
Saccade L	1	4	2737190375	2737210382	20007	892.76	541.17	1013.29	529.21	0.87	122.51	1.00	43.34	2970.89	-2506.83	2186.03
Saccade R	1	4	2737190375	2737210382	20007	892.76	541.17	1013.29	529.21	0.87	122.51	1.00	43.34	2970.89	-2506.83	2186.03
Fixation L	1	6	2737210382	2737488738	278356	989.73	530.51	44	15	-1	13.21	13.21
Fixation R	1	6	2737210382	2737488738	278356	989.73	530.51	44	15	-1	12.48	12.48
Saccade L	1	5	2737488738	2737528642	39904	988.71	538.34	958.99	540.68	1.19	71.16	0.50	29.86	1675.44	0.00	878.55
Saccade R	1	5	2737488738	2737528642	39904	988.71	538.34	958.99	540.68	1.19	71.16	0.50	29.86	1675.44	0.00	878.55
