[BeGaze]
Converted from:	C:\Documents and Settings\iViewX\Desktop\EXPERIMENTATIONS\Experiments\results\finaleart\S18F56223-finaleart-1.idf
Date:	27.03.2019 15:49:49
Version:	BeGaze 2.5.77
Sample Rate:	50
Subject:	S18F56223
Description:	Pascale Sebillot

Table Header for Fixations:
Event Type	Trial	Number	Start	End	Duration	Location X	Location Y	Dispersion X	Dispersion Y	Plane	Avg. Pupil Size X	Avg. Pupil Size Y

Table Header for Saccades:
Event Type	Trial	Number	Start	End	Duration	Start Loc.X	Start Loc.Y	End Loc.X	End Loc.Y	Amplitude	Peak Speed	Peak Speed At	Average Speed	Peak Accel.	Peak Decel.	Average Accel.

Table Header for Blinks:
Event Type	Trial	Number	Start	End	Duration

Table Header for User Events:
Event Type	Trial	Number	Start	Description

UserEvent	1	1	3184282233	# Message: void.jpg
Fixation L	1	1	3184284441	3184543055	258614	785.88	817.67	37	60	-1	14.67	14.67
Fixation R	1	1	3184284441	3184543055	258614	785.88	817.67	37	60	-1	13.57	13.57
Saccade L	1	1	3184543055	3184562922	19867	768.05	787.76	460.19	599.13	2.10	364.75	1.00	105.61	9050.02	-8740.53	6220.34
Saccade R	1	1	3184543055	3184562922	19867	768.05	787.76	460.19	599.13	2.10	364.75	1.00	105.61	9050.02	-8740.53	6220.34
Fixation L	1	2	3184562922	3184881167	318245	430.69	582.11	36	54	-1	14.52	14.52
Fixation R	1	2	3184562922	3184881167	318245	430.69	582.11	36	54	-1	13.88	13.88
Saccade L	1	2	3184881167	3184901036	19869	435.54	593.57	439.54	614.44	0.26	21.50	1.00	13.11	231.19	-424.35	294.43
Saccade R	1	2	3184881167	3184901036	19869	435.54	593.57	439.54	614.44	0.26	21.50	1.00	13.11	231.19	-424.35	294.43
Fixation L	1	3	3184901036	3185119912	218876	438.30	602.61	12	28	-1	13.96	13.96
Fixation R	1	3	3184901036	3185119912	218876	438.30	602.61	12	28	-1	13.47	13.47
Saccade L	1	3	3185119912	3185139769	19857	437.02	607.74	428.76	441.99	0.96	167.83	1.00	48.11	3913.91	-3143.42	2379.37
Saccade R	1	3	3185119912	3185139769	19857	437.02	607.74	428.76	441.99	0.96	167.83	1.00	48.11	3913.91	-3143.42	2379.37
Fixation L	1	4	3185139769	3185398250	258481	407.13	410.90	39	59	-1	14.31	14.31
Fixation R	1	4	3185139769	3185398250	258481	407.13	410.90	39	59	-1	13.87	13.87
Saccade L	1	4	3185398250	3185497758	99508	389.20	382.46	1002.32	767.39	12.83	356.51	0.60	128.91	6248.16	-5285.34	4005.39
Saccade R	1	4	3185398250	3185497758	99508	389.20	382.46	1002.32	767.39	12.83	356.51	0.60	128.91	6248.16	-5285.34	4005.39
Fixation L	1	5	3185497758	3185696623	198865	992.73	749.89	36	47	-1	14.81	14.81
Fixation R	1	5	3185497758	3185696623	198865	992.73	749.89	36	47	-1	13.76	13.76
Saccade L	1	5	3185696623	3185756366	59743	996.62	751.50	739.89	501.88	4.28	222.79	0.67	71.63	4951.12	-5230.83	2842.81
Saccade R	1	5	3185696623	3185756366	59743	996.62	751.50	739.89	501.88	4.28	222.79	0.67	71.63	4951.12	-5230.83	2842.81
Fixation L	1	6	3185756366	3186273470	517104	739.22	489.01	33	26	-1	15.23	15.23
Fixation R	1	6	3185756366	3186273470	517104	739.22	489.01	33	26	-1	14.01	14.01
