[BeGaze]
Converted from:	C:\Documents and Settings\iViewX\Desktop\EXPERIMENTATIONS\Experiments\results\finaleart\S02123220-finaleart-1.idf
Date:	27.03.2019 15:33:31
Version:	BeGaze 2.5.77
Sample Rate:	50
Subject:	S02123220
Description:	David Xu

Table Header for Fixations:
Event Type	Trial	Number	Start	End	Duration	Location X	Location Y	Dispersion X	Dispersion Y	Plane	Avg. Pupil Size X	Avg. Pupil Size Y

Table Header for Saccades:
Event Type	Trial	Number	Start	End	Duration	Start Loc.X	Start Loc.Y	End Loc.X	End Loc.Y	Amplitude	Peak Speed	Peak Speed At	Average Speed	Peak Accel.	Peak Decel.	Average Accel.

Table Header for Blinks:
Event Type	Trial	Number	Start	End	Duration

Table Header for User Events:
Event Type	Trial	Number	Start	Description

UserEvent	1	1	716580532	# Message: void.jpg
Saccade L	1	1	716590523	717087739	497216	662.73	939.84	1065.18	450.04	86.12	476.33	0.36	173.20	8110.45	-11801.33	4543.79
Saccade R	1	1	716590523	717087739	497216	662.73	939.84	1065.18	450.04	86.12	476.33	0.36	173.20	8110.45	-11801.33	4543.79
Fixation L	1	1	717087739	717386096	298357	1058.28	458.65	17	75	-1	14.59	14.59
Fixation R	1	1	717087739	717386096	298357	1058.28	458.65	17	75	-1	13.93	13.93
Saccade L	1	2	717386096	717584956	198860	1048.14	436.13	933.21	485.61	12.54	295.77	0.70	63.08	6601.79	-7143.96	2766.66
Saccade R	1	2	717386096	717584956	198860	1048.14	436.13	933.21	485.61	12.54	295.77	0.70	63.08	6601.79	-7143.96	2766.66
Fixation L	1	2	717584956	718241295	656339	924.51	536.67	20	79	-1	15.30	15.30
Fixation R	1	2	717584956	718241295	656339	924.51	536.67	20	79	-1	15.37	15.37
Saccade L	1	3	718241295	718261163	19868	924.14	563.98	921.90	568.84	0.14	13.48	1.00	7.16	258.55	-65.93	118.12
Saccade R	1	3	718241295	718261163	19868	924.14	563.98	921.90	568.84	0.14	13.48	1.00	7.16	258.55	-65.93	118.12
Fixation L	1	3	718261163	718460153	198990	924.27	550.68	5	33	-1	15.83	15.83
Fixation R	1	3	718261163	718460153	198990	924.27	550.68	5	33	-1	15.77	15.77
Saccade L	1	4	718460153	718579393	119240	924.05	559.47	972.95	287.03	13.63	305.16	0.67	114.30	5719.76	-6723.35	3911.00
Saccade R	1	4	718460153	718579393	119240	924.05	559.47	972.95	287.03	13.63	305.16	0.67	114.30	5719.76	-6723.35	3911.00
