[BeGaze]
Converted from:	C:\Documents and Settings\iViewX\Desktop\EXPERIMENTATIONS\Experiments\results\finaleart\S22H22551-finaleart-1.idf
Date:	27.03.2019 15:58:29
Version:	BeGaze 2.5.77
Sample Rate:	50
Subject:	S22H22551
Description:	Mathieu Chambre

Table Header for Fixations:
Event Type	Trial	Number	Start	End	Duration	Location X	Location Y	Dispersion X	Dispersion Y	Plane	Avg. Pupil Size X	Avg. Pupil Size Y

Table Header for Saccades:
Event Type	Trial	Number	Start	End	Duration	Start Loc.X	Start Loc.Y	End Loc.X	End Loc.Y	Amplitude	Peak Speed	Peak Speed At	Average Speed	Peak Accel.	Peak Decel.	Average Accel.

Table Header for Blinks:
Event Type	Trial	Number	Start	End	Duration

Table Header for User Events:
Event Type	Trial	Number	Start	Description

UserEvent	1	1	5589158679	# Message: void.jpg
Fixation L	1	1	5589169238	5589368092	198854	1169.22	972.21	6	5	-1	15.94	15.94
Fixation R	1	1	5589169238	5589368092	198854	1169.22	972.21	6	5	-1	15.60	15.60
Saccade L	1	1	5589368092	5589387965	19873	1170.03	967.70	1168.75	854.60	0.64	114.41	1.00	31.98	2824.73	-2674.82	1840.77
Saccade R	1	1	5589368092	5589387965	19873	1170.03	967.70	1168.75	854.60	0.64	114.41	1.00	31.98	2824.73	-2674.82	1840.77
Fixation L	1	2	5589387965	5589527217	139252	1174.18	853.10	8	9	-1	15.41	15.41
Fixation R	1	2	5589387965	5589527217	139252	1174.18	853.10	8	9	-1	14.97	14.97
Blink L	1	1	5589527217	5589805721	278504
Blink R	1	1	5589527217	5589805721	278504
Saccade L	1	2	5589805721	5589885189	79468	1110.80	269.94	1089.93	283.46	2.34	99.91	1.00	29.44	28243.84	-516.28	5249.38
Saccade R	1	2	5589805721	5589885189	79468	1110.80	269.94	1089.93	283.46	2.34	99.91	1.00	29.44	28243.84	-516.28	5249.38
Blink L	1	2	5589885189	5590084071	198882
Blink R	1	2	5589885189	5590084071	198882
Fixation L	1	3	5590084071	5590541535	457464	1107.58	304.48	64	32	-1	16.41	16.41
Fixation R	1	3	5590084071	5590541535	457464	1107.58	304.48	64	32	-1	16.46	16.46
Saccade L	1	3	5590541535	5590561412	19877	1059.18	322.96	1060.86	326.61	0.27	36.38	1.00	13.75	121.14	-807.87	318.01
Saccade R	1	3	5590541535	5590561412	19877	1059.18	322.96	1060.86	326.61	0.27	36.38	1.00	13.75	121.14	-807.87	318.01
Fixation L	1	4	5590561412	5590959263	397851	1025.88	344.79	72	26	-1	16.04	16.04
Fixation R	1	4	5590561412	5590959263	397851	1025.88	344.79	72	26	-1	16.06	16.06
Saccade L	1	4	5590959263	5590979142	19879	988.65	347.54	985.91	348.22	0.05	3.60	1.00	2.59	70.97	-35.19	41.53
Saccade R	1	4	5590959263	5590979142	19879	988.65	347.54	985.91	348.22	0.05	3.60	1.00	2.59	70.97	-35.19	41.53
Fixation L	1	5	5590979142	5591158129	178987	974.62	347.28	23	9	-1	16.42	16.42
Fixation R	1	5	5590979142	5591158129	178987	974.62	347.28	23	9	-1	16.49	16.49
