[BeGaze]
Converted from:	C:\Documents and Settings\iViewX\Desktop\EXPERIMENTATIONS\Experiments\results\finaleart\S1022551-finaleart-1.idf
Date:	27.03.2019 15:37:39
Version:	BeGaze 2.5.77
Sample Rate:	50
Subject:	S1022551
Description:	Alexis Nebout

Table Header for Fixations:
Event Type	Trial	Number	Start	End	Duration	Location X	Location Y	Dispersion X	Dispersion Y	Plane	Avg. Pupil Size X	Avg. Pupil Size Y

Table Header for Saccades:
Event Type	Trial	Number	Start	End	Duration	Start Loc.X	Start Loc.Y	End Loc.X	End Loc.Y	Amplitude	Peak Speed	Peak Speed At	Average Speed	Peak Accel.	Peak Decel.	Average Accel.

Table Header for Blinks:
Event Type	Trial	Number	Start	End	Duration

Table Header for User Events:
Event Type	Trial	Number	Start	Description

UserEvent	1	1	7754428681	# Message: study_of_a_reclining_nude_Delacroix_1824.jpg
Fixation L	1	1	7754442694	7755360856	918162	895.02	438.76	30	28	-1	12.66	12.66
Fixation R	1	1	7754442694	7755360856	918162	895.02	438.76	30	28	-1	11.13	11.13
Saccade L	1	1	7755360856	7755397388	36532	896.06	446.50	1123.65	438.91	2.35	230.24	1.00	64.23	5642.72	-5645.66	3808.48
Saccade R	1	1	7755360856	7755397388	36532	896.06	446.50	1123.65	438.91	2.35	230.24	1.00	64.23	5642.72	-5645.66	3808.48
Fixation L	1	2	7755397388	7755536631	139243	1117.19	437.38	8	4	-1	13.60	13.60
Fixation R	1	2	7755397388	7755536631	139243	1117.19	437.38	8	4	-1	11.58	11.58
Saccade L	1	2	7755536631	7755576508	39877	1116.72	434.74	964.41	572.65	2.01	134.04	0.50	50.29	3316.39	-2981.51	2762.25
Saccade R	1	2	7755536631	7755576508	39877	1116.72	434.74	964.41	572.65	2.01	134.04	0.50	50.29	3316.39	-2981.51	2762.25
Fixation L	1	3	7755576508	7755775366	198858	944.73	569.91	28	24	-1	13.62	13.62
Fixation R	1	3	7755576508	7755775366	198858	944.73	569.91	28	24	-1	11.87	11.87
Saccade L	1	3	7755775366	7755815121	39755	935.83	567.96	533.21	694.83	3.63	256.38	1.00	91.21	6219.34	-6211.76	5224.21
Saccade R	1	3	7755775366	7755815121	39755	935.83	567.96	533.21	694.83	3.63	256.38	1.00	91.21	6219.34	-6211.76	5224.21
Fixation L	1	4	7755815121	7756133348	318227	517.30	705.95	32	21	-1	14.02	14.02
Fixation R	1	4	7755815121	7756133348	318227	517.30	705.95	32	21	-1	12.47	12.47
Saccade L	1	4	7756133348	7756153225	19877	500.95	694.08	277.20	695.08	1.22	226.23	1.00	61.57	5555.84	-5364.10	3653.77
Saccade R	1	4	7756133348	7756153225	19877	500.95	694.08	277.20	695.08	1.22	226.23	1.00	61.57	5555.84	-5364.10	3653.77
Fixation L	1	5	7756153225	7756650458	497233	288.81	719.59	17	40	-1	14.07	14.07
Fixation R	1	5	7756153225	7756650458	497233	288.81	719.59	17	40	-1	13.17	13.17
Saccade L	1	5	7756650458	7756690321	39863	294.25	729.80	801.38	612.71	4.42	289.03	0.50	110.89	7158.05	-6751.13	6437.13
Saccade R	1	5	7756650458	7756690321	39863	294.25	729.80	801.38	612.71	4.42	289.03	0.50	110.89	7158.05	-6751.13	6437.13
Fixation L	1	6	7756690321	7756869321	179000	820.26	622.39	28	17	-1	14.58	14.58
Fixation R	1	6	7756690321	7756869321	179000	820.26	622.39	28	17	-1	13.35	13.35
Saccade L	1	6	7756869321	7756889194	19873	829.67	617.47	950.69	607.00	1.02	122.87	1.00	51.37	2912.43	-2723.78	2433.09
Saccade R	1	6	7756869321	7756889194	19873	829.67	617.47	950.69	607.00	1.02	122.87	1.00	51.37	2912.43	-2723.78	2433.09
Fixation L	1	7	7756889194	7757107937	218743	1028.66	607.14	88	5	-1	14.26	14.26
Fixation R	1	7	7756889194	7757107937	218743	1028.66	607.14	88	5	-1	12.69	12.69
Saccade L	1	7	7757107937	7757147809	39872	1036.05	607.12	1246.85	281.54	3.38	309.07	0.50	84.73	7706.59	-7567.51	5059.91
Saccade R	1	7	7757107937	7757147809	39872	1036.05	607.12	1246.85	281.54	3.38	309.07	0.50	84.73	7706.59	-7567.51	5059.91
Fixation L	1	8	7757147809	7757545531	397722	1268.67	264.86	32	38	-1	13.77	13.77
Fixation R	1	8	7757147809	7757545531	397722	1268.67	264.86	32	38	-1	12.50	12.50
Saccade L	1	8	7757545531	7757565408	19877	1279.70	265.92	1190.45	280.00	0.73	91.40	1.00	36.86	2169.89	-1348.25	1580.51
Saccade R	1	8	7757545531	7757565408	19877	1279.70	265.92	1190.45	280.00	0.73	91.40	1.00	36.86	2169.89	-1348.25	1580.51
Fixation L	1	9	7757565408	7757963270	397862	1196.30	309.91	44	41	-1	13.80	13.80
Fixation R	1	9	7757565408	7757963270	397862	1196.30	309.91	44	41	-1	12.15	12.15
Saccade L	1	9	7757963270	7757983136	19866	1191.79	308.73	1212.82	463.13	0.83	157.59	1.00	41.76	3866.36	-3814.42	2585.85
Saccade R	1	9	7757963270	7757983136	19866	1191.79	308.73	1212.82	463.13	0.83	157.59	1.00	41.76	3866.36	-3814.42	2585.85
Fixation L	1	10	7757983136	7758142260	159124	1221.35	469.04	24	11	-1	14.93	14.93
Fixation R	1	10	7757983136	7758142260	159124	1221.35	469.04	24	11	-1	12.68	12.68
Saccade L	1	10	7758142260	7758162138	19878	1220.19	475.05	1026.95	518.87	1.13	200.37	1.00	56.87	4994.16	-4656.67	3217.68
Saccade R	1	10	7758142260	7758162138	19878	1220.19	475.05	1026.95	518.87	1.13	200.37	1.00	56.87	4994.16	-4656.67	3217.68
Fixation L	1	11	7758162138	7758341130	178992	1021.38	554.79	14	52	-1	15.57	15.57
Fixation R	1	11	7758162138	7758341130	178992	1021.38	554.79	14	52	-1	13.15	13.15
Saccade L	1	11	7758341130	7758380996	39866	1015.97	570.37	1246.12	386.37	2.85	185.63	1.00	71.52	4632.38	-4327.78	3889.49
Saccade R	1	11	7758341130	7758380996	39866	1015.97	570.37	1246.12	386.37	2.85	185.63	1.00	71.52	4632.38	-4327.78	3889.49
Fixation L	1	12	7758380996	7758480360	99364	1249.44	403.49	15	25	-1	15.88	15.88
Fixation R	1	12	7758380996	7758480360	99364	1249.44	403.49	15	25	-1	13.36	13.36
