[BeGaze]
Converted from:	C:\Documents and Settings\iViewX\Desktop\EXPERIMENTATIONS\Experiments\results\finaleart\S21F22332-finaleart-1.idf
Date:	27.03.2019 15:54:45
Version:	BeGaze 2.5.77
Sample Rate:	50
Subject:	S21F22332
Description:	Cyrielle Mailart

Table Header for Fixations:
Event Type	Trial	Number	Start	End	Duration	Location X	Location Y	Dispersion X	Dispersion Y	Plane	Avg. Pupil Size X	Avg. Pupil Size Y

Table Header for Saccades:
Event Type	Trial	Number	Start	End	Duration	Start Loc.X	Start Loc.Y	End Loc.X	End Loc.Y	Amplitude	Peak Speed	Peak Speed At	Average Speed	Peak Accel.	Peak Decel.	Average Accel.

Table Header for Blinks:
Event Type	Trial	Number	Start	End	Duration

Table Header for User Events:
Event Type	Trial	Number	Start	Description

UserEvent	1	1	2246989099	# Message: void.jpg
Blink L	1	1	2246991930	2247310035	318105
Blink R	1	1	2246991930	2247310035	318105
Fixation L	1	1	2247310035	2247469150	159115	1650.99	247.92	18	27	-1	12.64	12.64
Fixation R	1	1	2247310035	2247469150	159115	1650.99	247.92	18	27	-1	11.14	11.14
Blink L	1	2	2247469150	2247668149	198999
Blink R	1	2	2247469150	2247668149	198999
Fixation L	1	2	2247668149	2248026112	357963	782.83	367.90	40	37	-1	12.79	12.79
Fixation R	1	2	2247668149	2248026112	357963	782.83	367.90	40	37	-1	11.98	11.98
Saccade L	1	1	2248026112	2248045995	19883	783.83	371.14	875.44	387.58	0.64	94.14	1.00	32.20	2273.11	-1833.64	1561.74
Saccade R	1	1	2248026112	2248045995	19883	783.83	371.14	875.44	387.58	0.64	94.14	1.00	32.20	2273.11	-1833.64	1561.74
Fixation L	1	3	2248045995	2248463719	417724	885.07	436.55	15	70	-1	12.96	12.96
Fixation R	1	3	2248045995	2248463719	417724	885.07	436.55	15	70	-1	12.33	12.33
Saccade L	1	2	2248463719	2248483590	19871	879.96	449.65	712.17	305.27	1.20	223.82	1.00	60.53	5420.74	-5435.74	3672.66
Saccade R	1	2	2248463719	2248483590	19871	879.96	449.65	712.17	305.27	1.20	223.82	1.00	60.53	5420.74	-5435.74	3672.66
Fixation L	1	4	2248483590	2248682595	199005	712.06	302.96	7	6	-1	12.89	12.89
Fixation R	1	4	2248483590	2248682595	199005	712.06	302.96	7	6	-1	12.35	12.35
Saccade L	1	3	2248682595	2248702449	19854	709.76	299.83	805.21	307.42	0.57	96.85	1.00	28.89	2266.54	-2354.91	1623.96
Saccade R	1	3	2248682595	2248702449	19854	709.76	299.83	805.21	307.42	0.57	96.85	1.00	28.89	2266.54	-2354.91	1623.96
Fixation L	1	5	2248702449	2248980940	278491	813.56	308.92	11	24	-1	12.92	12.92
Fixation R	1	5	2248702449	2248980940	278491	813.56	308.92	11	24	-1	12.25	12.25
