[BeGaze]
Converted from:	C:\Documents and Settings\iViewX\Desktop\EXPERIMENTATIONS\Experiments\results\finaleart\S01A22542-finaleart-1.idf
Date:	27.03.2019 15:33:25
Version:	BeGaze 2.5.77
Sample Rate:	50
Subject:	S01A22542
Description:	Thibault Seve Minnaert

Table Header for Fixations:
Event Type	Trial	Number	Start	End	Duration	Location X	Location Y	Dispersion X	Dispersion Y	Plane	Avg. Pupil Size X	Avg. Pupil Size Y

Table Header for Saccades:
Event Type	Trial	Number	Start	End	Duration	Start Loc.X	Start Loc.Y	End Loc.X	End Loc.Y	Amplitude	Peak Speed	Peak Speed At	Average Speed	Peak Accel.	Peak Decel.	Average Accel.

Table Header for Blinks:
Event Type	Trial	Number	Start	End	Duration

Table Header for User Events:
Event Type	Trial	Number	Start	Description

UserEvent	1	1	10007268755	# Message: void.jpg
Fixation L	1	1	10007280658	10007539510	258852	1164.24	776.75	72	23	-1	12.67	12.67
Fixation R	1	1	10007280658	10007539510	258852	1164.24	776.75	72	23	-1	12.25	12.25
Saccade L	1	1	10007539510	10007599265	59755	1201.93	765.98	1004.62	539.72	3.43	220.74	0.67	57.36	5426.65	-4973.92	2821.44
Saccade R	1	1	10007539510	10007599265	59755	1201.93	765.98	1004.62	539.72	3.43	220.74	0.67	57.36	5426.65	-4973.92	2821.44
Fixation L	1	2	10007599265	10007738647	139382	982.16	540.51	29	10	-1	12.68	12.68
Fixation R	1	2	10007599265	10007738647	139382	982.16	540.51	29	10	-1	12.31	12.31
Blink L	1	1	10007738647	10007937621	198974
Blink R	1	1	10007738647	10007937621	198974
Fixation L	1	3	10007937621	10008275725	338104	1017.52	468.48	41	54	-1	13.01	13.01
Fixation R	1	3	10007937621	10008275725	338104	1017.52	468.48	41	54	-1	13.00	13.00
Saccade L	1	2	10008275725	10008295724	19999	983.30	494.86	945.49	507.93	0.51	42.95	0.00	25.53	961.58	-656.33	722.49
Saccade R	1	2	10008275725	10008295724	19999	983.30	494.86	945.49	507.93	0.51	42.95	0.00	25.53	961.58	-656.33	722.49
Fixation L	1	4	10008295724	10008753083	457359	939.40	521.22	40	22	-1	13.74	13.74
Fixation R	1	4	10008295724	10008753083	457359	939.40	521.22	40	22	-1	13.46	13.46
Saccade L	1	3	10008753083	10008773080	19997	973.57	529.74	1020.94	587.81	0.71	75.81	1.00	35.53	1760.09	-1579.17	1281.46
Saccade R	1	3	10008753083	10008773080	19997	973.57	529.74	1020.94	587.81	0.71	75.81	1.00	35.53	1760.09	-1579.17	1281.46
Fixation L	1	5	10008773080	10009051446	278366	1035.74	607.08	19	35	-1	13.52	13.52
Fixation R	1	5	10008773080	10009051446	278366	1035.74	607.08	19	35	-1	14.00	14.00
Saccade L	1	4	10009051446	10009071339	19893	1038.20	623.65	1024.75	527.51	0.78	98.19	1.00	39.11	2282.79	-2235.53	1881.63
Saccade R	1	4	10009051446	10009071339	19893	1038.20	623.65	1024.75	527.51	0.78	98.19	1.00	39.11	2282.79	-2235.53	1881.63
Fixation L	1	6	10009071339	10009250438	179099	970.49	520.60	65	12	-1	13.66	13.66
Fixation R	1	6	10009071339	10009250438	179099	970.49	520.60	65	12	-1	14.14	14.14
