[BeGaze]
Converted from:	C:\Documents and Settings\iViewX\Desktop\EXPERIMENTATIONS\Experiments\results\finaleart\S02123220-finaleart-1.idf
Date:	27.03.2019 15:33:35
Version:	BeGaze 2.5.77
Sample Rate:	50
Subject:	S02123220
Description:	David Xu

Table Header for Fixations:
Event Type	Trial	Number	Start	End	Duration	Location X	Location Y	Dispersion X	Dispersion Y	Plane	Avg. Pupil Size X	Avg. Pupil Size Y

Table Header for Saccades:
Event Type	Trial	Number	Start	End	Duration	Start Loc.X	Start Loc.Y	End Loc.X	End Loc.Y	Amplitude	Peak Speed	Peak Speed At	Average Speed	Peak Accel.	Peak Decel.	Average Accel.

Table Header for Blinks:
Event Type	Trial	Number	Start	End	Duration

Table Header for User Events:
Event Type	Trial	Number	Start	Description

UserEvent	1	1	1125499629	# Message: still-life-with-pumpkin-plums-cherries-figs-and-jug-Ribot-1860.jpg
Fixation L	1	1	1125511916	1125690887	178971	924.99	456.41	75	18	-1	15.67	15.67
Fixation R	1	1	1125511916	1125690887	178971	924.99	456.41	75	18	-1	14.18	14.18
Saccade L	1	1	1125690887	1125710770	19883	875.43	448.25	868.51	451.92	0.09	7.92	1.00	4.41	43.44	-157.99	67.93
Saccade R	1	1	1125690887	1125710770	19883	875.43	448.25	868.51	451.92	0.09	7.92	1.00	4.41	43.44	-157.99	67.93
Fixation L	1	2	1125710770	1125909644	198874	867.74	453.42	2	14	-1	15.23	15.23
Fixation R	1	2	1125710770	1125909644	198874	867.74	453.42	2	14	-1	14.28	14.28
Saccade L	1	2	1125909644	1125929553	19909	867.95	463.02	869.59	570.92	0.74	109.16	1.00	37.41	2698.78	-2043.76	1751.78
Saccade R	1	2	1125909644	1125929553	19909	867.95	463.02	869.59	570.92	0.74	109.16	1.00	37.41	2698.78	-2043.76	1751.78
Fixation L	1	3	1125929553	1126068744	139191	870.41	609.29	1	56	-1	14.89	14.89
Fixation R	1	3	1125929553	1126068744	139191	870.41	609.29	1	56	-1	14.18	14.18
Saccade L	1	3	1126068744	1126108491	39747	871.38	621.44	726.65	604.58	1.50	98.60	1.00	37.83	2084.78	-2363.14	1558.38
Saccade R	1	3	1126068744	1126108491	39747	871.38	621.44	726.65	604.58	1.50	98.60	1.00	37.83	2084.78	-2363.14	1558.38
Fixation L	1	4	1126108491	1126267607	159116	715.95	576.15	13	47	-1	14.64	14.64
Fixation R	1	4	1126108491	1126267607	159116	715.95	576.15	13	47	-1	14.06	14.06
Saccade L	1	4	1126267607	1126307484	39877	714.77	557.01	616.99	797.74	2.70	221.25	1.00	67.64	5390.32	-5240.87	3505.56
Saccade R	1	4	1126267607	1126307484	39877	714.77	557.01	616.99	797.74	2.70	221.25	1.00	67.64	5390.32	-5240.87	3505.56
Fixation L	1	5	1126307484	1126486467	178983	623.72	847.76	22	75	-1	14.48	14.48
Fixation R	1	5	1126307484	1126486467	178983	623.72	847.76	22	75	-1	14.38	14.38
Saccade L	1	5	1126486467	1126546095	59628	624.38	859.24	543.66	1096.72	2.97	140.84	0.67	49.89	3366.02	-2912.12	2214.88
Saccade R	1	5	1126486467	1126546095	59628	624.38	859.24	543.66	1096.72	2.97	140.84	0.67	49.89	3366.02	-2912.12	2214.88
Fixation L	1	6	1126546095	1126983692	437597	522.61	1057.77	27	70	-1	14.51	14.51
Fixation R	1	6	1126546095	1126983692	437597	522.61	1057.77	27	70	-1	14.71	14.71
Saccade L	1	6	1126983692	1127023439	39747	537.91	1054.62	1063.82	761.92	5.61	306.44	0.50	141.25	7244.07	-7076.25	6875.92
Saccade R	1	6	1126983692	1127023439	39747	537.91	1054.62	1063.82	761.92	5.61	306.44	0.50	141.25	7244.07	-7076.25	6875.92
Fixation L	1	7	1127023439	1127262177	238738	1119.65	776.40	68	27	-1	15.24	15.24
Fixation R	1	7	1127023439	1127262177	238738	1119.65	776.40	68	27	-1	13.78	13.78
Saccade L	1	7	1127262177	1127282041	19864	1132.17	768.33	1156.81	718.37	0.42	56.35	1.00	21.28	1381.75	-379.48	691.29
Saccade R	1	7	1127262177	1127282041	19864	1132.17	768.33	1156.81	718.37	0.42	56.35	1.00	21.28	1381.75	-379.48	691.29
Fixation L	1	8	1127282041	1127500783	218742	1168.78	683.39	29	53	-1	15.50	15.50
Fixation R	1	8	1127282041	1127500783	218742	1168.78	683.39	29	53	-1	13.75	13.75
Saccade L	1	8	1127500783	1127540659	39876	1149.66	668.88	755.50	542.63	3.80	224.30	0.50	95.25	5466.48	-5051.04	4825.77
Saccade R	1	8	1127500783	1127540659	39876	1149.66	668.88	755.50	542.63	3.80	224.30	0.50	95.25	5466.48	-5051.04	4825.77
Fixation L	1	9	1127540659	1127858888	318229	720.57	519.40	43	36	-1	15.14	15.14
Fixation R	1	9	1127540659	1127858888	318229	720.57	519.40	43	36	-1	14.65	14.65
Saccade L	1	9	1127858888	1127918507	59619	712.11	510.09	1090.72	734.81	4.77	247.31	0.67	80.00	6141.74	-5563.26	3494.97
Saccade R	1	9	1127858888	1127918507	59619	712.11	510.09	1090.72	734.81	4.77	247.31	0.67	80.00	6141.74	-5563.26	3494.97
Fixation L	1	10	1127918507	1128117384	198877	1097.24	752.85	15	24	-1	16.10	16.10
Fixation R	1	10	1127918507	1128117384	198877	1097.24	752.85	15	24	-1	14.38	14.38
Saccade L	1	10	1128117384	1128236742	119358	1100.03	759.24	1337.67	1049.49	8.94	206.29	0.17	74.88	5122.62	-3584.39	2908.72
Saccade R	1	10	1128117384	1128236742	119358	1100.03	759.24	1337.67	1049.49	8.94	206.29	0.17	74.88	5122.62	-3584.39	2908.72
Fixation L	1	11	1128236742	1128415738	178996	1343.67	1028.22	9	89	-1	16.76	16.76
Fixation R	1	11	1128236742	1128415738	178996	1343.67	1028.22	9	89	-1	11.71	11.71
Saccade L	1	11	1128415738	1128435600	19862	1345.20	1045.06	1343.91	1057.74	0.19	13.05	1.00	9.78	266.19	6.88	108.85
Saccade R	1	11	1128415738	1128435600	19862	1345.20	1045.06	1343.91	1057.74	0.19	13.05	1.00	9.78	266.19	6.88	108.85
Fixation L	1	12	1128435600	1128893073	457473	1319.29	1089.81	47	48	-1	15.40	15.40
Fixation R	1	12	1128435600	1128893073	457473	1319.29	1089.81	47	48	-1	11.89	11.89
Saccade L	1	12	1128893073	1128932953	39880	1303.52	1098.01	1320.52	852.11	2.22	137.57	0.50	55.63	3348.76	-3250.16	2983.59
Saccade R	1	12	1128893073	1128932953	39880	1303.52	1098.01	1320.52	852.11	2.22	137.57	0.50	55.63	3348.76	-3250.16	2983.59
Fixation L	1	13	1128932953	1129072059	139106	1336.88	853.14	29	42	-1	15.82	15.82
Fixation R	1	13	1128932953	1129072059	139106	1336.88	853.14	29	42	-1	13.00	13.00
Saccade L	1	13	1129072059	1129131804	59745	1340.62	858.68	984.36	607.84	4.97	246.20	0.67	83.14	5823.89	-5528.55	3298.39
Saccade R	1	13	1129072059	1129131804	59745	1340.62	858.68	984.36	607.84	4.97	246.20	0.67	83.14	5823.89	-5528.55	3298.39
Fixation L	1	14	1129131804	1129251190	119386	980.49	596.84	6	35	-1	15.32	15.32
Fixation R	1	14	1129131804	1129251190	119386	980.49	596.84	6	35	-1	13.59	13.59
Saccade L	1	14	1129251190	1129290926	39736	981.36	600.60	736.87	494.97	2.72	167.61	1.00	68.36	3737.89	-4144.88	2985.86
Saccade R	1	14	1129251190	1129290926	39736	981.36	600.60	736.87	494.97	2.72	167.61	1.00	68.36	3737.89	-4144.88	2985.86
Fixation L	1	15	1129290926	1129489787	198861	717.17	480.65	23	25	-1	14.50	14.50
Fixation R	1	15	1129290926	1129489787	198861	717.17	480.65	23	25	-1	13.48	13.48
