[BeGaze]
Converted from:	C:\Documents and Settings\iViewX\Desktop\EXPERIMENTATIONS\Experiments\results\finaleart\S21F22332-finaleart-1.idf
Date:	27.03.2019 15:54:42
Version:	BeGaze 2.5.77
Sample Rate:	50
Subject:	S21F22332
Description:	Cyrielle Mailart

Table Header for Fixations:
Event Type	Trial	Number	Start	End	Duration	Location X	Location Y	Dispersion X	Dispersion Y	Plane	Avg. Pupil Size X	Avg. Pupil Size Y

Table Header for Saccades:
Event Type	Trial	Number	Start	End	Duration	Start Loc.X	Start Loc.Y	End Loc.X	End Loc.Y	Amplitude	Peak Speed	Peak Speed At	Average Speed	Peak Accel.	Peak Decel.	Average Accel.

Table Header for Blinks:
Event Type	Trial	Number	Start	End	Duration

Table Header for User Events:
Event Type	Trial	Number	Start	Description

UserEvent	1	1	1810242990	# Message: void.jpg
Fixation L	1	1	1810250334	1810469198	218864	911.53	706.93	16	28	-1	16.37	16.37
Fixation R	1	1	1810250334	1810469198	218864	911.53	706.93	16	28	-1	13.63	13.63
Saccade L	1	1	1810469198	1810489068	19870	911.03	695.19	736.95	673.56	1.06	177.40	1.00	53.35	4381.88	-4276.39	3124.10
Saccade R	1	1	1810469198	1810489068	19870	911.03	695.19	736.95	673.56	1.06	177.40	1.00	53.35	4381.88	-4276.39	3124.10
Fixation L	1	2	1810489068	1810847045	357977	746.72	625.05	12	75	-1	15.14	15.14
Fixation R	1	2	1810489068	1810847045	357977	746.72	625.05	12	75	-1	13.12	13.12
Blink L	1	1	1810847045	1811045924	198879
Blink R	1	1	1810847045	1811045924	198879
Fixation L	1	3	1811045924	1811543267	497343	816.94	471.03	20	23	-1	14.15	14.15
Fixation R	1	3	1811045924	1811543267	497343	816.94	471.03	20	23	-1	13.60	13.60
Saccade L	1	2	1811543267	1811563136	19869	818.74	478.28	917.53	372.03	1.09	146.73	1.00	55.05	3637.43	-3350.02	2892.82
Saccade R	1	2	1811543267	1811563136	19869	818.74	478.28	917.53	372.03	1.09	146.73	1.00	55.05	3637.43	-3350.02	2892.82
Fixation L	1	4	1811563136	1811921113	357977	924.70	307.88	20	77	-1	15.46	15.46
Fixation R	1	4	1811563136	1811921113	357977	924.70	307.88	20	77	-1	14.56	14.56
Saccade L	1	3	1811921113	1811940982	19869	919.78	322.50	800.55	344.53	0.76	122.64	1.00	38.40	3047.38	-2666.83	2000.02
Saccade R	1	3	1811921113	1811940982	19869	919.78	322.50	800.55	344.53	0.76	122.64	1.00	38.40	3047.38	-2666.83	2000.02
Fixation L	1	5	1811940982	1812139856	198874	819.32	348.70	30	25	-1	15.51	15.51
Fixation R	1	5	1811940982	1812139856	198874	819.32	348.70	30	25	-1	15.22	15.22
Saccade L	1	4	1812139856	1812239348	99492	815.77	360.64	810.19	703.26	43.78	1451.91	0.80	440.03	23682.85	-3491.77	9342.42
Saccade R	1	4	1812139856	1812239348	99492	815.77	360.64	810.19	703.26	43.78	1451.91	0.80	440.03	23682.85	-3491.77	9342.42
