[BeGaze]
Converted from:	C:\Documents and Settings\iViewX\Desktop\EXPERIMENTATIONS\Experiments\results\finaleart\S12H22222-finaleart-1.idf
Date:	27.03.2019 15:40:40
Version:	BeGaze 2.5.77
Sample Rate:	50
Subject:	S12H22222
Description:	aurele barriere

Table Header for Fixations:
Event Type	Trial	Number	Start	End	Duration	Location X	Location Y	Dispersion X	Dispersion Y	Plane	Avg. Pupil Size X	Avg. Pupil Size Y

Table Header for Saccades:
Event Type	Trial	Number	Start	End	Duration	Start Loc.X	Start Loc.Y	End Loc.X	End Loc.Y	Amplitude	Peak Speed	Peak Speed At	Average Speed	Peak Accel.	Peak Decel.	Average Accel.

Table Header for Blinks:
Event Type	Trial	Number	Start	End	Duration

Table Header for User Events:
Event Type	Trial	Number	Start	Description

UserEvent	1	1	23701172981	# Message: the_kiss_gericault_1816.jpg
Fixation L	1	1	23701192153	23701748992	556839	951.46	530.48	46	38	-1	14.13	14.13
Fixation R	1	1	23701192153	23701748992	556839	951.46	530.48	46	38	-1	14.16	14.16
Saccade L	1	1	23701748992	23701768870	19878	991.40	508.00	1038.62	446.46	0.65	78.48	1.00	32.89	1857.05	-1743.03	1412.50
Saccade R	1	1	23701748992	23701768870	19878	991.40	508.00	1038.62	446.46	0.65	78.48	1.00	32.89	1857.05	-1743.03	1412.50
Fixation L	1	2	23701768870	23701987744	218874	1055.04	447.92	24	32	-1	13.88	13.88
Fixation R	1	2	23701768870	23701987744	218874	1055.04	447.92	24	32	-1	13.51	13.51
Saccade L	1	2	23701987744	23702007609	19865	1063.50	441.86	1179.94	401.21	0.90	124.75	1.00	45.42	3045.74	-2995.99	2361.95
Saccade R	1	2	23701987744	23702007609	19865	1063.50	441.86	1179.94	401.21	0.90	124.75	1.00	45.42	3045.74	-2995.99	2361.95
Fixation L	1	3	23702007609	23702206479	198870	1189.77	358.41	13	54	-1	13.33	13.33
Fixation R	1	3	23702007609	23702206479	198870	1189.77	358.41	13	54	-1	12.84	12.84
Saccade L	1	3	23702206479	23702226348	19869	1192.09	357.21	1198.00	273.80	0.65	84.58	1.00	32.61	1964.70	-1991.49	1629.13
Saccade R	1	3	23702206479	23702226348	19869	1192.09	357.21	1198.00	273.80	0.65	84.58	1.00	32.61	1964.70	-1991.49	1629.13
Fixation L	1	4	23702226348	23702604328	377980	1193.46	306.71	41	56	-1	13.30	13.30
Fixation R	1	4	23702226348	23702604328	377980	1193.46	306.71	41	56	-1	12.91	12.91
Saccade L	1	4	23702604328	23702624224	19896	1167.71	289.72	1165.50	285.08	0.09	7.15	0.00	4.68	107.05	-111.52	85.67
Saccade R	1	4	23702604328	23702624224	19896	1167.71	289.72	1165.50	285.08	0.09	7.15	0.00	4.68	107.05	-111.52	85.67
Fixation L	1	5	23702624224	23703121441	497217	1181.02	291.10	43	31	-1	14.06	14.06
Fixation R	1	5	23702624224	23703121441	497217	1181.02	291.10	43	31	-1	13.44	13.44
Saccade L	1	5	23703121441	23703161190	39749	1195.67	303.36	1540.92	541.38	3.76	298.63	1.00	94.48	7423.35	-7220.90	5493.28
Saccade R	1	5	23703121441	23703161190	39749	1195.67	303.36	1540.92	541.38	3.76	298.63	1.00	94.48	7423.35	-7220.90	5493.28
Fixation L	1	6	23703161190	23703578910	417720	1521.13	574.14	27	53	-1	14.79	14.79
Fixation R	1	6	23703161190	23703578910	417720	1521.13	574.14	27	53	-1	13.67	13.67
Saccade L	1	6	23703578910	23703618664	39754	1518.48	594.95	1360.14	1048.86	4.05	390.24	0.50	101.77	9665.96	-9684.29	6003.59
Saccade R	1	6	23703578910	23703618664	39754	1518.48	594.95	1360.14	1048.86	4.05	390.24	0.50	101.77	9665.96	-9684.29	6003.59
Fixation L	1	7	23703618664	23703976665	358001	1356.00	1054.11	13	13	-1	14.62	14.62
Fixation R	1	7	23703618664	23703976665	358001	1356.00	1054.11	13	13	-1	13.50	13.50
Saccade L	1	7	23703976665	23704016520	39855	1355.32	1057.37	1178.99	984.37	1.92	152.15	0.50	48.21	3725.13	-3512.35	2527.42
Saccade R	1	7	23703976665	23704016520	39855	1355.32	1057.37	1178.99	984.37	1.92	152.15	0.50	48.21	3725.13	-3512.35	2527.42
Fixation L	1	8	23704016520	23704175636	159116	1164.56	978.15	21	10	-1	14.55	14.55
Fixation R	1	8	23704016520	23704175636	159116	1164.56	978.15	21	10	-1	13.57	13.57
Saccade L	1	8	23704175636	23704235262	59626	1160.57	980.87	649.79	876.02	5.69	184.29	0.67	95.38	4587.97	-4161.50	3438.44
Saccade R	1	8	23704175636	23704235262	59626	1160.57	980.87	649.79	876.02	5.69	184.29	0.67	95.38	4587.97	-4161.50	3438.44
Fixation L	1	9	23704235262	23704394380	159118	607.63	874.65	59	17	-1	14.94	14.94
Fixation R	1	9	23704235262	23704394380	159118	607.63	874.65	59	17	-1	14.32	14.32
Saccade L	1	9	23704394380	23704454126	59746	590.50	867.60	476.00	550.55	4.44	301.24	0.67	74.28	7485.72	-6933.45	3627.49
Saccade R	1	9	23704394380	23704454126	59746	590.50	867.60	476.00	550.55	4.44	301.24	0.67	74.28	7485.72	-6933.45	3627.49
Fixation L	1	10	23704454126	23704593251	139125	446.56	521.39	51	46	-1	14.94	14.94
Fixation R	1	10	23704454126	23704593251	139125	446.56	521.39	51	46	-1	14.45	14.45
Saccade L	1	10	23704593251	23704613242	19991	438.17	503.78	437.88	500.56	0.06	3.62	1.00	3.14	-4.57	-54.87	22.69
Saccade R	1	10	23704593251	23704613242	19991	438.17	503.78	437.88	500.56	0.06	3.62	1.00	3.14	-4.57	-54.87	22.69
Fixation L	1	11	23704613242	23704732499	119257	437.92	498.51	4	4	-1	14.77	14.77
Fixation R	1	11	23704613242	23704732499	119257	437.92	498.51	4	4	-1	14.18	14.18
Saccade L	1	11	23704732499	23704792243	59744	439.04	495.61	530.22	141.65	4.13	237.73	0.67	69.17	5859.00	-5226.40	2901.08
Saccade R	1	11	23704732499	23704792243	59744	439.04	495.61	530.22	141.65	4.13	237.73	0.67	69.17	5859.00	-5226.40	2901.08
Fixation L	1	12	23704792243	23705170098	377855	563.87	169.89	42	46	-1	13.82	13.82
Fixation R	1	12	23704792243	23705170098	377855	563.87	169.89	42	46	-1	13.52	13.52
