[BeGaze]
Converted from:	C:\Documents and Settings\iViewX\Desktop\EXPERIMENTATIONS\Experiments\results\finaleart\S02123220-finaleart-1.idf
Date:	27.03.2019 15:33:45
Version:	BeGaze 2.5.77
Sample Rate:	50
Subject:	S02123220
Description:	David Xu

Table Header for Fixations:
Event Type	Trial	Number	Start	End	Duration	Location X	Location Y	Dispersion X	Dispersion Y	Plane	Avg. Pupil Size X	Avg. Pupil Size Y

Table Header for Saccades:
Event Type	Trial	Number	Start	End	Duration	Start Loc.X	Start Loc.Y	End Loc.X	End Loc.Y	Amplitude	Peak Speed	Peak Speed At	Average Speed	Peak Accel.	Peak Decel.	Average Accel.

Table Header for Blinks:
Event Type	Trial	Number	Start	End	Duration

Table Header for User Events:
Event Type	Trial	Number	Start	Description

UserEvent	1	1	2184389926	# Message: A_Highland_Landscape_Landseer_1830.jpg
Fixation L	1	1	2184409760	2184588867	179107	866.57	445.93	8	26	-1	14.02	14.02
Fixation R	1	1	2184409760	2184588867	179107	866.57	445.93	8	26	-1	12.67	12.67
Saccade L	1	1	2184588867	2184608742	19875	872.15	462.28	991.91	531.23	1.15	139.77	1.00	57.63	3469.30	-3422.99	2703.65
Saccade R	1	1	2184588867	2184608742	19875	872.15	462.28	991.91	531.23	1.15	139.77	1.00	57.63	3469.30	-3422.99	2703.65
Fixation L	1	2	2184608742	2184927010	318268	987.36	475.63	6	76	-1	14.12	14.12
Fixation R	1	2	2184608742	2184927010	318268	987.36	475.63	6	76	-1	12.69	12.69
Saccade L	1	2	2184927010	2184966722	39712	985.27	484.16	803.35	722.62	2.47	182.02	0.50	62.32	4461.64	-4499.89	3584.84
Saccade R	1	2	2184927010	2184966722	39712	985.27	484.16	803.35	722.62	2.47	182.02	0.50	62.32	4461.64	-4499.89	3584.84
Fixation L	1	3	2184966722	2185205340	238618	815.55	720.89	31	65	-1	12.80	12.80
Fixation R	1	3	2184966722	2185205340	238618	815.55	720.89	31	65	-1	10.76	10.76
Saccade L	1	3	2185205340	2185424211	218871	793.30	725.72	485.77	644.44	22.69	248.19	0.73	103.66	5390.63	-5725.07	3021.51
Saccade R	1	3	2185205340	2185424211	218871	793.30	725.72	485.77	644.44	22.69	248.19	0.73	103.66	5390.63	-5725.07	3021.51
Fixation L	1	4	2185424211	2185523701	99490	497.72	646.93	20	11	-1	11.73	11.73
Fixation R	1	4	2185424211	2185523701	99490	497.72	646.93	20	11	-1	11.20	11.20
Saccade L	1	4	2185523701	2185603186	79485	505.80	650.75	1525.19	684.47	12.23	412.84	0.50	153.81	10228.90	-9540.60	5870.41
Saccade R	1	4	2185523701	2185603186	79485	505.80	650.75	1525.19	684.47	12.23	412.84	0.50	153.81	10228.90	-9540.60	5870.41
Fixation L	1	5	2185603186	2185742437	139251	1533.92	735.13	16	78	-1	13.13	13.13
Fixation R	1	5	2185603186	2185742437	139251	1533.92	735.13	16	78	-1	8.61	8.61
Saccade L	1	5	2185742437	2185762303	19866	1531.07	761.41	1501.79	755.19	0.29	30.28	1.00	14.35	319.83	94.78	177.15
Saccade R	1	5	2185742437	2185762303	19866	1531.07	761.41	1501.79	755.19	0.29	30.28	1.00	14.35	319.83	94.78	177.15
Fixation L	1	6	2185762303	2185881657	119354	1506.95	777.09	26	57	-1	13.23	13.23
Fixation R	1	6	2185762303	2185881657	119354	1506.95	777.09	26	57	-1	8.43	8.43
Saccade L	1	6	2185881657	2185941292	59635	1497.01	772.17	1423.16	463.12	4.37	161.34	0.33	73.22	3082.56	-2638.97	2307.57
Saccade R	1	6	2185881657	2185941292	59635	1497.01	772.17	1423.16	463.12	4.37	161.34	0.33	73.22	3082.56	-2638.97	2307.57
Fixation L	1	7	2185941292	2186299397	358105	1439.72	425.70	28	46	-1	11.98	11.98
Fixation R	1	7	2185941292	2186299397	358105	1439.72	425.70	28	46	-1	9.89	9.89
Saccade L	1	7	2186299397	2186319260	19863	1444.97	420.41	1423.40	385.27	0.46	41.72	1.00	23.38	895.84	-736.24	739.31
Saccade R	1	7	2186299397	2186319260	19863	1444.97	420.41	1423.40	385.27	0.46	41.72	1.00	23.38	895.84	-736.24	739.31
Fixation L	1	8	2186319260	2186657369	338109	1419.99	336.53	7	59	-1	12.01	12.01
Fixation R	1	8	2186319260	2186657369	338109	1419.99	336.53	7	59	-1	9.86	9.86
Saccade L	1	8	2186657369	2186975591	318222	1418.15	337.32	1522.76	816.51	25.92	200.14	0.06	81.44	4911.49	-3279.41	1883.19
Saccade R	1	8	2186657369	2186796614	139245	1418.15	337.32	1525.65	827.50	13.65	200.14	0.14	98.03	4911.49	-3279.41	2160.68
Blink R	1	1	2186796614	2186935867	139253
Saccade R	1	9	2186935867	2186975591	39724	1521.94	944.74	1522.76	816.51	2.14	118.30	1.00	53.86	2059.56	-2134.53	1737.56
Fixation L	1	9	2186975591	2187154593	179002	1529.57	808.14	14	13	-1	13.01	13.01
Fixation R	1	9	2186975591	2187154593	179002	1529.57	808.14	14	13	-1	11.70	11.70
Saccade L	1	9	2187154593	2187214210	59617	1528.49	812.78	949.83	662.37	6.36	264.63	0.67	106.70	6345.03	-6234.16	4596.25
Saccade R	1	10	2187154593	2187214210	59617	1528.49	812.78	949.83	662.37	6.36	264.63	0.67	106.70	6345.03	-6234.16	4596.25
Fixation L	1	10	2187214210	2187452943	238733	950.65	651.19	5	20	-1	12.77	12.77
Fixation R	1	10	2187214210	2187452943	238733	950.65	651.19	5	20	-1	12.93	12.93
Saccade L	1	10	2187452943	2187492697	39754	951.70	652.74	683.39	527.19	2.74	212.30	1.00	68.95	5235.63	-5017.04	3483.91
Saccade R	1	11	2187452943	2187492697	39754	951.70	652.74	683.39	527.19	2.74	212.30	1.00	68.95	5235.63	-5017.04	3483.91
Fixation L	1	11	2187492697	2187771169	278472	668.42	493.51	27	61	-1	12.19	12.19
Fixation R	1	11	2187492697	2187771169	278472	668.42	493.51	27	61	-1	13.20	13.20
Saccade L	1	11	2187771169	2187791057	19888	675.89	487.09	674.69	410.26	0.55	77.72	1.00	27.51	1825.50	-1854.18	1304.26
Saccade R	1	12	2187771169	2187791057	19888	675.89	487.09	674.69	410.26	0.55	77.72	1.00	27.51	1825.50	-1854.18	1304.26
Fixation L	1	12	2187791057	2188188908	397851	657.82	391.43	31	27	-1	12.14	12.14
Fixation R	1	12	2187791057	2188188908	397851	657.82	391.43	31	27	-1	13.67	13.67
Saccade L	1	12	2188188908	2188228668	39760	643.59	390.90	387.28	385.95	2.47	170.32	1.00	62.05	4238.17	-3931.50	2841.45
Saccade R	1	13	2188188908	2188228668	39760	643.59	390.90	387.28	385.95	2.47	170.32	1.00	62.05	4238.17	-3931.50	2841.45
Fixation L	1	13	2188228668	2188387769	159101	339.48	365.20	56	35	-1	12.67	12.67
Fixation R	1	13	2188228668	2188387769	159101	339.48	365.20	56	35	-1	14.58	14.58
