[BeGaze]
Converted from:	C:\Documents and Settings\iViewX\Desktop\EXPERIMENTATIONS\Experiments\results\finaleart\S14F27123-finaleart-1.idf
Date:	27.03.2019 15:43:50
Version:	BeGaze 2.5.77
Sample Rate:	50
Subject:	S14F27123
Description:	Anne-flore Perrin

Table Header for Fixations:
Event Type	Trial	Number	Start	End	Duration	Location X	Location Y	Dispersion X	Dispersion Y	Plane	Avg. Pupil Size X	Avg. Pupil Size Y

Table Header for Saccades:
Event Type	Trial	Number	Start	End	Duration	Start Loc.X	Start Loc.Y	End Loc.X	End Loc.Y	Amplitude	Peak Speed	Peak Speed At	Average Speed	Peak Accel.	Peak Decel.	Average Accel.

Table Header for Blinks:
Event Type	Trial	Number	Start	End	Duration

Table Header for User Events:
Event Type	Trial	Number	Start	Description

UserEvent	1	1	31484231096	# Message: void.jpg
Fixation L	1	1	31484239297	31484438295	198998	881.69	150.66	21	54	-1	10.55	10.55
Fixation R	1	1	31484239297	31484438295	198998	881.69	150.66	21	54	-1	11.28	11.28
Saccade L	1	1	31484438295	31484458158	19863	866.92	109.32	855.79	76.46	0.55	47.92	1.00	27.93	178.22	-768.13	422.39
Saccade R	1	1	31484438295	31484458158	19863	866.92	109.32	855.79	76.46	0.55	47.92	1.00	27.93	178.22	-768.13	422.39
Fixation L	1	2	31484458158	31484716765	258607	830.45	65.72	35	21	-1	10.39	10.39
Fixation R	1	2	31484458158	31484716765	258607	830.45	65.72	35	21	-1	11.00	11.00
Saccade L	1	2	31484716765	31484736645	19880	820.67	73.47	0.00	29.15	4.24	825.65	1.00	213.38	20446.97	-20499.52	13659.63
Saccade R	1	2	31484716765	31484736645	19880	820.67	73.47	0.00	29.15	4.24	825.65	1.00	213.38	20446.97	-20499.52	13659.63
Fixation L	1	3	31484736645	31484836005	99360	0.00	14.38	0	23	-1	18.76	18.76
Fixation R	1	3	31484736645	31484875900	139255	0.00	11.52	0	27	-1	33.00	23.62
Saccade L	1	3	31484855897	31484875900	20003	0.00	3.80	0.00	2.10	0.04	2.06	0.00	1.76	4.07	-33.81	15.35
Blink L	1	1	31484875900	31485392986	517086
Blink R	1	1	31484915635	31485392986	477351
Saccade L	1	4	31485392986	31485452613	59627	659.98	841.62	655.77	844.50	1.39	74.98	1.00	23.23	26893.44	-1548.91	5843.19
Saccade R	1	3	31485392986	31485452613	59627	659.98	841.62	655.77	844.50	1.39	74.98	1.00	23.23	26893.44	-1548.91	5843.19
Blink L	1	2	31485452613	31485571985	119372
Blink R	1	2	31485452613	31485571985	119372
Blink L	1	3	31485571985	31485790845	218860
Blink R	1	3	31485571985	31485790845	218860
Saccade L	1	5	31485790845	31485810716	19871	656.38	930.94	665.32	938.81	11.43	1148.41	1.00	575.23	28664.99	-28165.17	28397.24
Saccade R	1	4	31485790845	31485810716	19871	656.38	930.94	665.32	938.81	11.43	1148.41	1.00	575.23	28664.99	-28165.17	28397.24
Saccade L	1	6	31485870340	31485910093	39753	658.34	922.91	653.39	913.97	18.26	1146.51	1.00	459.32	28178.52	-28581.32	21220.32
Saccade R	1	5	31485870340	31485910093	39753	658.34	922.91	653.39	913.97	18.26	1146.51	1.00	459.32	28178.52	-28581.32	21220.32
Saccade L	1	7	31485969838	31486009588	39750	660.47	929.67	655.53	921.36	18.11	1136.50	1.00	455.56	28159.60	-28345.73	21159.04
Saccade R	1	6	31485969838	31486009588	39750	660.47	929.67	655.53	921.36	18.11	1136.50	1.00	455.56	28159.60	-28345.73	21159.04
Blink L	1	4	31486009588	31486109090	99502
Blink R	1	4	31486009588	31486109090	99502
Saccade L	1	8	31486109090	31486228327	119237	655.70	926.84	655.41	928.71	50.81	1136.60	0.33	426.10	28248.44	-28397.42	12166.64
Saccade R	1	7	31486109090	31486228327	119237	655.70	926.84	655.41	928.71	50.81	1136.60	0.33	426.10	28248.44	-28397.42	12166.64
