[BeGaze]
Converted from:	C:\Documents and Settings\iViewX\Desktop\EXPERIMENTATIONS\Experiments\results\finaleart\S11H21112-finaleart-1.idf
Date:	27.03.2019 15:39:25
Version:	BeGaze 2.5.77
Sample Rate:	50
Subject:	S11H21112
Description:	Clement legrand-Duchenne

Table Header for Fixations:
Event Type	Trial	Number	Start	End	Duration	Location X	Location Y	Dispersion X	Dispersion Y	Plane	Avg. Pupil Size X	Avg. Pupil Size Y

Table Header for Saccades:
Event Type	Trial	Number	Start	End	Duration	Start Loc.X	Start Loc.Y	End Loc.X	End Loc.Y	Amplitude	Peak Speed	Peak Speed At	Average Speed	Peak Accel.	Peak Decel.	Average Accel.

Table Header for Blinks:
Event Type	Trial	Number	Start	End	Duration

Table Header for User Events:
Event Type	Trial	Number	Start	Description

UserEvent	1	1	5501247088	# Message: void.jpg
Fixation L	1	1	5501247748	5501466746	218998	1095.14	314.93	11	24	-1	12.39	12.39
Fixation R	1	1	5501247748	5501466746	218998	1095.14	314.93	11	24	-1	13.96	13.96
Saccade L	1	1	5501466746	5501486615	19869	1096.29	308.67	978.96	307.56	0.63	118.68	1.00	31.94	2924.79	-2942.43	1966.77
Saccade R	1	1	5501466746	5501486615	19869	1096.29	308.67	978.96	307.56	0.63	118.68	1.00	31.94	2924.79	-2942.43	1966.77
Fixation L	1	2	5501486615	5501825088	338473	986.84	315.91	13	19	-1	11.96	11.96
Fixation R	1	2	5501486615	5501825088	338473	986.84	315.91	13	19	-1	13.17	13.17
Blink L	1	1	5501825088	5501944453	119365
Blink R	1	1	5501884709	5502302944	418235
Blink L	1	2	5501964332	5502063952	99620
Blink L	1	3	5502083826	5502243192	159366
Saccade L	1	2	5502243192	5502482186	238994	74.72	452.72	-3.17	387.59	10.88	102.76	1.00	45.52	2392.03	-1760.69	802.81
Blink R	1	2	5502302944	5502402436	99492
Saccade R	1	2	5502402436	5502482186	79750	14.38	478.87	-3.17	387.59	3.31	102.76	1.00	41.51	2392.03	-1760.69	1021.92
Fixation L	1	3	5502482186	5502581679	99493	-0.79	428.27	12	78	-1	13.83	13.83
Fixation R	1	3	5502482186	5502581679	99493	-0.79	428.27	12	78	-1	13.74	13.74
Saccade L	1	3	5502581679	5502601678	19999	3.64	452.58	19.07	463.93	0.29	21.01	1.00	14.45	197.34	-40.58	95.86
Saccade R	1	3	5502581679	5502601678	19999	3.64	452.58	19.07	463.93	0.29	21.01	1.00	14.45	197.34	-40.58	95.86
Fixation L	1	4	5502601678	5502780918	179240	10.15	443.88	24	69	-1	12.99	12.99
Fixation R	1	4	5502601678	5502780918	179240	10.15	443.88	24	69	-1	12.98	12.98
Saccade L	1	4	5502780918	5502800794	19876	16.74	412.28	9.26	389.91	0.34	23.86	1.00	17.16	216.00	-276.87	204.19
Saccade R	1	4	5502780918	5502800794	19876	16.74	412.28	9.26	389.91	0.34	23.86	1.00	17.16	216.00	-276.87	204.19
Fixation L	1	5	5502800794	5503238900	438106	12.06	422.19	30	68	-1	12.64	12.64
Fixation R	1	5	5502800794	5503238900	438106	12.06	422.19	30	68	-1	12.57	12.57
