[BeGaze]
Converted from:	C:\Documents and Settings\iViewX\Desktop\EXPERIMENTATIONS\Experiments\results\finaleart\S6124332-finaleart-1.idf
Date:	27.03.2019 15:35:50
Version:	BeGaze 2.5.77
Sample Rate:	50
Subject:	S6124332
Description:	Romain Ferrand

Table Header for Fixations:
Event Type	Trial	Number	Start	End	Duration	Location X	Location Y	Dispersion X	Dispersion Y	Plane	Avg. Pupil Size X	Avg. Pupil Size Y

Table Header for Saccades:
Event Type	Trial	Number	Start	End	Duration	Start Loc.X	Start Loc.Y	End Loc.X	End Loc.Y	Amplitude	Peak Speed	Peak Speed At	Average Speed	Peak Accel.	Peak Decel.	Average Accel.

Table Header for Blinks:
Event Type	Trial	Number	Start	End	Duration

Table Header for User Events:
Event Type	Trial	Number	Start	Description

UserEvent	1	1	11779606808	# Message: Nu_Couche_Vlaminck_1905.jpg
Fixation L	1	1	11779608990	11780106194	497204	854.71	756.20	6	18	-1	19.19	19.19
Fixation R	1	1	11779608990	11780106194	497204	854.71	756.20	6	18	-1	17.92	17.92
Saccade L	1	1	11780106194	11780146078	39884	856.89	747.44	776.56	536.84	2.08	118.50	0.50	52.22	2951.79	-2675.89	2673.42
Saccade R	1	1	11780106194	11780146078	39884	856.89	747.44	776.56	536.84	2.08	118.50	0.50	52.22	2951.79	-2675.89	2673.42
Fixation L	1	2	11780146078	11780305183	159105	780.67	537.09	42	12	-1	17.54	17.54
Fixation R	1	2	11780146078	11780305183	159105	780.67	537.09	42	12	-1	16.58	16.58
Saccade L	1	2	11780305183	11780325054	19871	753.13	528.43	718.02	412.64	0.86	122.38	1.00	43.30	2992.97	-2926.90	2078.47
Saccade R	1	2	11780305183	11780325054	19871	753.13	528.43	718.02	412.64	0.86	122.38	1.00	43.30	2992.97	-2926.90	2078.47
Fixation L	1	3	11780325054	11780643283	318229	687.96	423.42	41	21	-1	15.04	15.04
Fixation R	1	3	11780325054	11780643283	318229	687.96	423.42	41	21	-1	14.50	14.50
Saccade L	1	3	11780643283	11780683033	39750	682.22	427.65	810.55	671.34	2.32	191.83	0.50	58.48	4735.48	-4689.31	3368.89
Saccade R	1	3	11780643283	11780683033	39750	682.22	427.65	810.55	671.34	2.32	191.83	0.50	58.48	4735.48	-4689.31	3368.89
Fixation L	1	4	11780683033	11781120633	437600	835.50	667.66	49	18	-1	14.82	14.82
Fixation R	1	4	11780683033	11781120633	437600	835.50	667.66	49	18	-1	14.54	14.54
Saccade L	1	4	11781120633	11781160384	39751	860.04	678.17	1128.52	530.12	2.69	221.11	0.50	67.57	5460.55	-5048.06	3698.89
Saccade R	1	4	11781120633	11781160384	39751	860.04	678.17	1128.52	530.12	2.69	221.11	0.50	67.57	5460.55	-5048.06	3698.89
Fixation L	1	5	11781160384	11781558232	397848	1123.49	503.73	48	48	-1	14.84	14.84
Fixation R	1	5	11781160384	11781558232	397848	1123.49	503.73	48	48	-1	13.86	13.86
Saccade L	1	5	11781558232	11781717358	159126	1092.07	481.30	514.45	322.54	9.39	261.81	0.87	58.99	6517.51	-6101.81	2434.71
Saccade R	1	5	11781558232	11781717358	159126	1092.07	481.30	514.45	322.54	9.39	261.81	0.87	58.99	6517.51	-6101.81	2434.71
Fixation L	1	6	11781717358	11781916207	198849	501.75	353.60	24	55	-1	14.83	14.83
Fixation R	1	6	11781717358	11781916207	198849	501.75	353.60	24	55	-1	14.92	14.92
Saccade L	1	6	11781916207	11781936094	19887	513.37	377.66	567.88	391.96	0.42	57.00	1.00	21.21	1175.94	-1258.44	849.41
Saccade R	1	6	11781916207	11781936094	19887	513.37	377.66	567.88	391.96	0.42	57.00	1.00	21.21	1175.94	-1258.44	849.41
Fixation L	1	7	11781936094	11782115068	178974	585.51	407.06	26	28	-1	15.20	15.20
Fixation R	1	7	11781936094	11782115068	178974	585.51	407.06	26	28	-1	15.13	15.13
Saccade L	1	7	11782115068	11782134941	19873	594.58	417.37	694.02	424.70	0.62	100.85	1.00	31.11	2455.58	-2274.81	1698.09
Saccade R	1	7	11782115068	11782134941	19873	594.58	417.37	694.02	424.70	0.62	100.85	1.00	31.11	2455.58	-2274.81	1698.09
Fixation L	1	8	11782134941	11782234433	99492	693.03	436.62	3	17	-1	15.64	15.64
Fixation R	1	8	11782134941	11782234433	99492	693.03	436.62	3	17	-1	15.75	15.75
Saccade L	1	8	11782234433	11782314073	79640	690.97	439.98	1498.47	817.37	10.66	287.66	0.50	133.81	7155.62	-6188.20	4393.61
Saccade R	1	8	11782234433	11782314073	79640	690.97	439.98	1498.47	817.37	10.66	287.66	0.50	133.81	7155.62	-6188.20	4393.61
Fixation L	1	9	11782314073	11782592418	278345	1515.17	860.15	28	58	-1	16.25	16.25
Fixation R	1	9	11782314073	11782592418	278345	1515.17	860.15	28	58	-1	15.46	15.46
Saccade L	1	9	11782592418	11782612404	19986	1514.81	864.86	1511.64	770.47	0.82	95.53	1.00	41.25	2222.06	-2200.45	1801.81
Saccade R	1	9	11782592418	11782612404	19986	1514.81	864.86	1511.64	770.47	0.82	95.53	1.00	41.25	2222.06	-2200.45	1801.81
Fixation L	1	10	11782612404	11782910643	298239	1487.12	716.03	37	61	-1	16.41	16.41
Fixation R	1	10	11782612404	11782910643	298239	1487.12	716.03	37	61	-1	15.36	15.36
Saccade L	1	10	11782910643	11782950520	39877	1474.00	710.03	1191.59	707.99	2.41	167.89	0.50	60.45	4156.12	-3926.69	3356.81
Saccade R	1	10	11782910643	11782950520	39877	1474.00	710.03	1191.59	707.99	2.41	167.89	0.50	60.45	4156.12	-3926.69	3356.81
Fixation L	1	11	11782950520	11783268750	318230	1192.06	685.71	41	42	-1	15.84	15.84
Fixation R	1	11	11782950520	11783268750	318230	1192.06	685.71	41	42	-1	12.06	12.06
Saccade L	1	11	11783268750	11783288623	19873	1180.19	665.05	1173.61	648.39	0.31	21.12	1.00	15.55	743.13	192.04	383.27
Saccade R	1	11	11783268750	11783288623	19873	1180.19	665.05	1173.61	648.39	0.31	21.12	1.00	15.55	743.13	192.04	383.27
Fixation L	1	12	11783288623	11783407994	119371	1173.11	644.76	50	27	-1	15.77	15.77
Saccade R	1	12	11783348243	11783388122	39879	1148.84	638.22	1175.48	651.06	0.89	47.84	1.00	22.20	4589.90	-536.56	1335.67
Blink R	1	1	11783388122	11783467616	79494
Saccade L	1	12	11783407994	11783447742	39748	1199.74	631.37	1470.73	368.55	3.45	194.50	1.00	86.91	4589.90	-4401.45	4338.50
Fixation L	1	13	11783447742	11783586974	139232	1475.74	373.98	52	36	-1	15.83	15.83
Fixation R	1	12	11783467616	11783586974	119358	1476.46	374.76	52	36	-1	15.81	15.81
