[BeGaze]
Converted from:	C:\Documents and Settings\iViewX\Desktop\EXPERIMENTATIONS\Experiments\results\finaleart\S1022551-finaleart-1.idf
Date:	27.03.2019 15:38:31
Version:	BeGaze 2.5.77
Sample Rate:	50
Subject:	S1022551
Description:	Alexis Nebout

Table Header for Fixations:
Event Type	Trial	Number	Start	End	Duration	Location X	Location Y	Dispersion X	Dispersion Y	Plane	Avg. Pupil Size X	Avg. Pupil Size Y

Table Header for Saccades:
Event Type	Trial	Number	Start	End	Duration	Start Loc.X	Start Loc.Y	End Loc.X	End Loc.Y	Amplitude	Peak Speed	Peak Speed At	Average Speed	Peak Accel.	Peak Decel.	Average Accel.

Table Header for Blinks:
Event Type	Trial	Number	Start	End	Duration

Table Header for User Events:
Event Type	Trial	Number	Start	Description

UserEvent	1	1	9036915738	# Message: mother_and_child_by_the_sea_dahl_1830.jpg
Fixation L	1	1	9036932706	9037171436	238730	849.20	531.97	11	15	-1	7.83	7.83
Fixation R	1	1	9036932706	9037171436	238730	849.20	531.97	11	15	-1	7.84	7.84
Saccade R	1	1	9037171436	9037211187	39751	857.38	528.56	857.86	544.28	1.96	111.70	0.50	49.19	2615.07	-2685.10	2594.40
Fixation R	1	2	9037211187	9037768056	556869	866.22	558.97	16	24	-1	7.51	7.51
Fixation L	1	2	9037231786	9037768056	536270	866.53	559.52	16	24	-1	9.18	9.18
Saccade L	1	1	9037768056	9037807903	39847	858.00	566.40	815.20	649.38	1.54	80.65	0.50	38.62	1988.78	-1439.72	1634.76
Saccade R	1	2	9037768056	9037807903	39847	858.00	566.40	815.20	649.38	1.54	80.65	0.50	38.62	1988.78	-1439.72	1634.76
Fixation L	1	3	9037807903	9038006770	198867	786.79	659.48	37	24	-1	10.78	10.78
Fixation R	1	3	9037807903	9038006770	198867	786.79	659.48	37	24	-1	9.05	9.05
Saccade L	1	2	9038006770	9038026642	19872	777.76	670.26	684.97	669.26	0.53	93.86	1.00	26.73	2254.71	-2164.07	1500.37
Saccade R	1	3	9038006770	9038026642	19872	777.76	670.26	684.97	669.26	0.53	93.86	1.00	26.73	2254.71	-2164.07	1500.37
Fixation L	1	4	9038026642	9039220107	1193465	673.37	668.72	25	35	-1	12.70	12.70
Fixation R	1	4	9038026642	9039220107	1193465	673.37	668.72	25	35	-1	10.81	10.81
Saccade L	1	3	9039220107	9039239966	19859	682.61	656.20	825.82	637.59	0.90	146.06	1.00	45.53	3617.04	-3442.87	2423.31
Saccade R	1	4	9039220107	9039239966	19859	682.61	656.20	825.82	637.59	0.90	146.06	1.00	45.53	3617.04	-3442.87	2423.31
Fixation L	1	5	9039239966	9039458706	218740	821.74	622.42	7	26	-1	13.92	13.92
Fixation R	1	5	9039239966	9039458706	218740	821.74	622.42	7	26	-1	11.68	11.68
Saccade L	1	4	9039458706	9039478572	19866	826.14	613.57	1109.26	570.59	1.59	289.44	1.00	80.11	7193.38	-7056.14	4898.33
Saccade R	1	5	9039458706	9039478572	19866	826.14	613.57	1109.26	570.59	1.59	289.44	1.00	80.11	7193.38	-7056.14	4898.33
Fixation L	1	6	9039478572	9039856556	377984	1117.92	597.95	35	59	-1	14.60	14.60
Fixation R	1	6	9039478572	9039856556	377984	1117.92	597.95	35	59	-1	11.98	11.98
Saccade L	1	5	9039856556	9039876441	19885	1141.68	630.00	1242.72	851.97	1.47	246.57	1.00	74.13	6099.06	-5582.29	4052.29
Saccade R	1	6	9039856556	9039876441	19885	1141.68	630.00	1242.72	851.97	1.47	246.57	1.00	74.13	6099.06	-5582.29	4052.29
Fixation L	1	7	9039876441	9040234415	357974	1239.40	889.25	15	47	-1	15.56	15.56
Fixation R	1	7	9039876441	9040234415	357974	1239.40	889.25	15	47	-1	11.68	11.68
Saccade L	1	6	9040234415	9040254293	19878	1245.60	880.36	1567.30	882.97	1.68	325.11	1.00	84.45	8076.63	-7991.65	5410.77
Saccade R	1	7	9040234415	9040254293	19878	1245.60	880.36	1567.30	882.97	1.68	325.11	1.00	84.45	8076.63	-7991.65	5410.77
Fixation L	1	8	9040254293	9040652150	397857	1577.39	885.51	20	31	-1	15.62	15.62
Fixation R	1	8	9040254293	9040652150	397857	1577.39	885.51	20	31	-1	12.10	12.10
Saccade L	1	7	9040652150	9040691908	39758	1567.40	908.21	1165.39	646.10	4.29	354.90	0.50	107.94	8674.07	-7966.97	5667.44
Saccade R	1	8	9040652150	9040691908	39758	1567.40	908.21	1165.39	646.10	4.29	354.90	0.50	107.94	8674.07	-7966.97	5667.44
Fixation L	1	9	9040691908	9040950505	258597	1140.37	646.75	35	9	-1	14.97	14.97
Fixation R	1	9	9040691908	9040950505	258597	1140.37	646.75	35	9	-1	12.09	12.09
