[BeGaze]
Converted from:	C:\Documents and Settings\iViewX\Desktop\EXPERIMENTATIONS\Experiments\results\finaleart\S22H22551-finaleart-1.idf
Date:	27.03.2019 15:58:54
Version:	BeGaze 2.5.77
Sample Rate:	50
Subject:	S22H22551
Description:	Mathieu Chambre

Table Header for Fixations:
Event Type	Trial	Number	Start	End	Duration	Location X	Location Y	Dispersion X	Dispersion Y	Plane	Avg. Pupil Size X	Avg. Pupil Size Y

Table Header for Saccades:
Event Type	Trial	Number	Start	End	Duration	Start Loc.X	Start Loc.Y	End Loc.X	End Loc.Y	Amplitude	Peak Speed	Peak Speed At	Average Speed	Peak Accel.	Peak Decel.	Average Accel.

Table Header for Blinks:
Event Type	Trial	Number	Start	End	Duration

Table Header for User Events:
Event Type	Trial	Number	Start	Description

UserEvent	1	1	5783960018	# Message: The_Joy_Of_Life_Matisse_1906.jpg
Fixation L	1	1	5783971221	5784408822	437601	959.64	374.36	48	33	-1	14.77	14.77
Fixation R	1	1	5783971221	5784408822	437601	959.64	374.36	48	33	-1	14.86	14.86
Saccade L	1	1	5784408822	5784428724	19902	927.22	400.94	925.17	531.69	0.97	132.25	1.00	48.53	3279.96	-3119.11	2266.67
Saccade R	1	1	5784408822	5784428724	19902	927.22	400.94	925.17	531.69	0.97	132.25	1.00	48.53	3279.96	-3119.11	2266.67
Fixation L	1	2	5784428724	5784866306	437582	946.83	525.13	85	11	-1	13.45	13.45
Fixation R	1	2	5784428724	5784866306	437582	946.83	525.13	85	11	-1	13.33	13.33
Saccade L	1	2	5784866306	5784886173	19867	958.28	525.80	942.67	515.29	0.27	22.48	0.00	13.44	420.39	-321.11	351.08
Saccade R	1	2	5784866306	5784886173	19867	958.28	525.80	942.67	515.29	0.27	22.48	0.00	13.44	420.39	-321.11	351.08
Fixation L	1	3	5784886173	5785303899	417726	931.89	513.11	33	47	-1	12.18	12.18
Fixation R	1	3	5784886173	5785303899	417726	931.89	513.11	33	47	-1	12.19	12.19
Saccade L	1	3	5785303899	5785343652	39753	952.63	536.15	1206.63	651.29	2.64	241.19	0.50	66.32	5957.03	-5678.35	3673.74
Saccade R	1	3	5785303899	5785343652	39753	952.63	536.15	1206.63	651.29	2.64	241.19	0.50	66.32	5957.03	-5678.35	3673.74
Fixation L	1	4	5785343652	5785721501	377849	1230.26	635.35	31	32	-1	12.22	12.22
Fixation R	1	4	5785343652	5785721501	377849	1230.26	635.35	31	32	-1	12.28	12.28
Saccade L	1	4	5785721501	5785741519	20018	1214.16	633.22	1016.68	700.11	1.25	210.83	1.00	62.31	5249.54	-5134.82	3590.13
Saccade R	1	4	5785721501	5785741519	20018	1214.16	633.22	1016.68	700.11	1.25	210.83	1.00	62.31	5249.54	-5134.82	3590.13
Fixation L	1	5	5785741519	5785880632	139113	1008.66	694.63	83	9	-1	12.29	12.29
Fixation R	1	5	5785741519	5785880632	139113	1008.66	694.63	83	9	-1	12.35	12.35
Saccade L	1	5	5785880632	5785920499	39867	937.86	691.10	522.77	565.67	4.21	263.39	0.50	105.59	6497.57	-6454.14	4910.14
Saccade R	1	5	5785880632	5785920499	39867	937.86	691.10	522.77	565.67	4.21	263.39	0.50	105.59	6497.57	-6454.14	4910.14
Fixation L	1	6	5785920499	5786159105	238606	525.99	563.90	5	9	-1	12.55	12.55
Fixation R	1	6	5785920499	5786159105	238606	525.99	563.90	5	9	-1	12.36	12.36
Saccade L	1	6	5786159105	5786179018	19913	525.13	565.72	313.82	570.77	1.14	213.73	1.00	57.34	5281.41	-5082.22	3474.14
Saccade R	1	6	5786159105	5786179018	19913	525.13	565.72	313.82	570.77	1.14	213.73	1.00	57.34	5281.41	-5082.22	3474.14
Fixation L	1	7	5786179018	5786417720	238702	315.98	598.44	9	41	-1	12.60	12.60
Fixation R	1	7	5786179018	5786417720	238702	315.98	598.44	9	41	-1	12.40	12.40
Saccade L	1	7	5786417720	5786457467	39747	318.86	612.74	455.17	871.71	2.51	171.61	1.00	63.24	4233.41	-4139.23	3758.69
Saccade R	1	7	5786417720	5786457467	39747	318.86	612.74	455.17	871.71	2.51	171.61	1.00	63.24	4233.41	-4139.23	3758.69
Fixation L	1	8	5786457467	5786696205	238738	452.37	869.05	7	13	-1	12.72	12.72
Fixation R	1	8	5786457467	5786696205	238738	452.37	869.05	7	13	-1	13.15	13.15
Saccade L	1	8	5786696205	5786735956	39751	455.27	875.99	863.03	960.00	3.58	234.27	0.50	90.03	5784.00	-5301.48	5074.83
Saccade R	1	8	5786696205	5786735956	39751	455.27	875.99	863.03	960.00	3.58	234.27	0.50	90.03	5784.00	-5301.48	5074.83
Fixation L	1	9	5786735956	5786875195	139239	851.02	946.64	16	21	-1	13.23	13.23
Fixation R	1	9	5786735956	5786875195	139239	851.02	946.64	16	21	-1	13.45	13.45
Saccade L	1	9	5786875195	5786895069	19874	849.53	948.30	954.72	948.05	0.65	106.40	1.00	32.70	2597.94	-2420.64	1825.93
Saccade R	1	9	5786875195	5786895069	19874	849.53	948.30	954.72	948.05	0.65	106.40	1.00	32.70	2597.94	-2420.64	1825.93
Fixation L	1	10	5786895069	5787054188	159119	981.45	941.71	34	11	-1	13.33	13.33
Fixation R	1	10	5786895069	5787054188	159119	981.45	941.71	34	11	-1	13.38	13.38
Saccade L	1	10	5787054188	5787093949	39761	989.58	938.13	1403.54	924.83	3.40	286.66	0.50	85.50	7135.20	-7057.88	5132.42
Saccade R	1	10	5787054188	5787093949	39761	989.58	938.13	1403.54	924.83	3.40	286.66	0.50	85.50	7135.20	-7057.88	5132.42
Fixation L	1	11	5787093949	5787233180	139231	1397.40	915.28	10	14	-1	13.57	13.57
Fixation R	1	11	5787093949	5787233180	139231	1397.40	915.28	10	14	-1	13.35	13.35
Saccade L	1	11	5787233180	5787253056	19876	1399.23	910.65	1557.00	815.88	1.11	186.12	1.00	55.81	4576.18	-3897.34	3072.99
Saccade R	1	11	5787233180	5787253056	19876	1399.23	910.65	1557.00	815.88	1.11	186.12	1.00	55.81	4576.18	-3897.34	3072.99
Fixation L	1	12	5787253056	5787650910	397854	1545.05	833.09	29	60	-1	13.55	13.55
Fixation R	1	12	5787253056	5787650910	397854	1545.05	833.09	29	60	-1	13.01	13.01
Saccade L	1	12	5787650910	5787730401	79491	1530.01	875.96	1517.40	612.29	4.64	275.31	1.00	58.36	6760.69	-6358.46	2701.94
Saccade R	1	12	5787650910	5787730401	79491	1530.01	875.96	1517.40	612.29	4.64	275.31	1.00	58.36	6760.69	-6358.46	2701.94
Fixation L	1	13	5787730401	5787949266	218865	1518.24	555.76	4	90	-1	13.76	13.76
Fixation R	1	13	5787730401	5787949266	218865	1518.24	555.76	4	90	-1	13.46	13.46
