[BeGaze]
Converted from:	C:\Documents and Settings\iViewX\Desktop\EXPERIMENTATIONS\Experiments\results\finaleart\S11H21112-finaleart-1.idf
Date:	27.03.2019 15:39:23
Version:	BeGaze 2.5.77
Sample Rate:	50
Subject:	S11H21112
Description:	Clement legrand-Duchenne

Table Header for Fixations:
Event Type	Trial	Number	Start	End	Duration	Location X	Location Y	Dispersion X	Dispersion Y	Plane	Avg. Pupil Size X	Avg. Pupil Size Y

Table Header for Saccades:
Event Type	Trial	Number	Start	End	Duration	Start Loc.X	Start Loc.Y	End Loc.X	End Loc.Y	Amplitude	Peak Speed	Peak Speed At	Average Speed	Peak Accel.	Peak Decel.	Average Accel.

Table Header for Blinks:
Event Type	Trial	Number	Start	End	Duration

Table Header for User Events:
Event Type	Trial	Number	Start	Description

UserEvent	1	1	5478887377	# Message: REJECTED_rose_in_a_bowl_fantin_latour_1883.jpg
Fixation L	1	1	5478905099	5479602056	696957	890.90	563.56	14	60	-1	16.41	16.41
Fixation R	1	1	5478905099	5479602056	696957	890.90	563.56	14	60	-1	18.48	18.48
Saccade L	1	1	5479602056	5479701680	99624	884.59	577.28	809.62	709.08	3.99	102.52	1.00	40.04	2395.00	-2023.89	1507.94
Saccade R	1	1	5479602056	5479701680	99624	884.59	577.28	809.62	709.08	3.99	102.52	1.00	40.04	2395.00	-2023.89	1507.94
Fixation L	1	2	5479701680	5479841049	139369	814.07	643.17	8	90	-1	16.43	16.43
Fixation R	1	2	5479701680	5479841049	139369	814.07	643.17	8	90	-1	18.57	18.57
Saccade L	1	2	5479841049	5479861045	19996	812.45	634.22	806.58	649.54	0.19	16.60	1.00	9.44	355.03	-364.53	298.16
Saccade R	1	2	5479841049	5479861045	19996	812.45	634.22	806.58	649.54	0.19	16.60	1.00	9.44	355.03	-364.53	298.16
Fixation L	1	3	5479861045	5480060165	199120	812.32	669.82	8	31	-1	16.05	16.05
Fixation R	1	3	5479861045	5480060165	199120	812.32	669.82	8	31	-1	18.32	18.32
Saccade L	1	3	5480060165	5480080040	19875	815.54	680.59	720.84	693.08	0.74	96.63	1.00	37.03	2383.52	-2230.85	1910.69
Saccade R	1	3	5480060165	5480080040	19875	815.54	680.59	720.84	693.08	0.74	96.63	1.00	37.03	2383.52	-2230.85	1910.69
Fixation L	1	4	5480080040	5480458522	378482	680.10	701.97	46	42	-1	15.27	15.27
Fixation R	1	4	5480080040	5480458522	378482	680.10	701.97	46	42	-1	17.58	17.58
Saccade L	1	4	5480458522	5480518261	59739	674.37	683.58	1006.86	622.55	4.09	217.07	0.67	68.38	5264.76	-4452.43	3094.40
Saccade R	1	4	5480458522	5480518261	59739	674.37	683.58	1006.86	622.55	4.09	217.07	0.67	68.38	5264.76	-4452.43	3094.40
Fixation L	1	5	5480518261	5480717390	199129	999.47	595.01	24	39	-1	14.47	14.47
Fixation R	1	5	5480518261	5480717390	199129	999.47	595.01	24	39	-1	16.81	16.81
Saccade L	1	5	5480717390	5480737252	19862	1017.82	609.53	1169.19	606.08	0.97	153.13	1.00	48.70	3620.07	-3669.76	2644.72
Saccade R	1	5	5480717390	5480737252	19862	1017.82	609.53	1169.19	606.08	0.97	153.13	1.00	48.70	3620.07	-3669.76	2644.72
Fixation L	1	6	5480737252	5481075867	338615	1175.75	619.61	9	21	-1	14.11	14.11
Fixation R	1	6	5480737252	5481075867	338615	1175.75	619.61	9	21	-1	16.10	16.10
Saccade L	1	6	5481075867	5481095762	19895	1176.93	612.53	1258.08	612.80	0.48	82.09	1.00	24.03	1905.83	-1900.77	1269.08
Saccade R	1	6	5481075867	5481095762	19895	1176.93	612.53	1258.08	612.80	0.48	82.09	1.00	24.03	1905.83	-1900.77	1269.08
Fixation L	1	7	5481095762	5481653345	557583	1232.50	614.80	81	8	-1	13.73	13.73
Fixation R	1	7	5481095762	5481653345	557583	1232.50	614.80	81	8	-1	15.83	15.83
Saccade L	1	7	5481653345	5481673342	19997	1184.06	615.17	1138.65	615.46	0.46	45.93	1.00	23.12	1109.92	-915.21	1025.56
Saccade R	1	7	5481653345	5481673342	19997	1184.06	615.17	1138.65	615.46	0.46	45.93	1.00	23.12	1109.92	-915.21	1025.56
Fixation L	1	8	5481673342	5481991955	318613	1072.47	621.81	82	15	-1	13.93	13.93
Fixation R	1	8	5481673342	5481991955	318613	1072.47	621.81	82	15	-1	15.78	15.78
Saccade L	1	8	5481991955	5482011834	19879	1056.14	617.11	1054.43	612.92	0.07	4.76	1.00	3.60	-4.71	-82.27	37.72
Saccade R	1	8	5481991955	5482011834	19879	1056.14	617.11	1054.43	612.92	0.07	4.76	1.00	3.60	-4.71	-82.27	37.72
Fixation L	1	9	5482011834	5482191068	179234	1050.70	611.10	13	5	-1	14.04	14.04
Fixation R	1	9	5482011834	5482191068	179234	1050.70	611.10	13	5	-1	15.93	15.93
Saccade L	1	9	5482191068	5482210948	19880	1041.20	610.59	849.68	608.26	1.14	193.69	1.00	57.25	4805.48	-4761.28	3291.54
Saccade R	1	9	5482191068	5482210948	19880	1041.20	610.59	849.68	608.26	1.14	193.69	1.00	57.25	4805.48	-4761.28	3291.54
Fixation L	1	10	5482210948	5482868169	657221	825.19	623.25	30	34	-1	13.85	13.85
Fixation R	1	10	5482210948	5482868169	657221	825.19	623.25	30	34	-1	15.98	15.98
