[BeGaze]
Converted from:	C:\Documents and Settings\iViewX\Desktop\EXPERIMENTATIONS\Experiments\results\finaleart\S5121332-finaleart-1.idf
Date:	27.03.2019 15:35:16
Version:	BeGaze 2.5.77
Sample Rate:	50
Subject:	S5121332
Description:	Dylan Marinho

Table Header for Fixations:
Event Type	Trial	Number	Start	End	Duration	Location X	Location Y	Dispersion X	Dispersion Y	Plane	Avg. Pupil Size X	Avg. Pupil Size Y

Table Header for Saccades:
Event Type	Trial	Number	Start	End	Duration	Start Loc.X	Start Loc.Y	End Loc.X	End Loc.Y	Amplitude	Peak Speed	Peak Speed At	Average Speed	Peak Accel.	Peak Decel.	Average Accel.

Table Header for Blinks:
Event Type	Trial	Number	Start	End	Duration

Table Header for User Events:
Event Type	Trial	Number	Start	Description

UserEvent	1	1	9778236049	# Message: bowl_of_fruits_Fantin-Latour_1857.jpg
Fixation L	1	1	9778253432	9778472293	218861	941.82	579.40	8	21	-1	15.43	15.43
Fixation R	1	1	9778253432	9778472293	218861	941.82	579.40	8	21	-1	14.92	14.92
Blink L	1	1	9778472293	9778651301	179008
Blink R	1	1	9778472293	9778651301	179008
Fixation L	1	2	9778651301	9778850147	198846	997.45	544.22	7	39	-1	15.65	15.65
Fixation R	1	2	9778651301	9778850147	198846	997.45	544.22	7	39	-1	15.44	15.44
Saccade L	1	1	9778850147	9778870014	19867	997.74	554.62	882.52	552.84	0.67	116.56	1.00	33.77	2825.53	-2518.29	1884.61
Saccade R	1	1	9778850147	9778870014	19867	997.74	554.62	882.52	552.84	0.67	116.56	1.00	33.77	2825.53	-2518.29	1884.61
Fixation L	1	3	9778870014	9779148500	278486	848.56	542.90	43	44	-1	15.90	15.90
Fixation R	1	3	9778870014	9779148500	278486	848.56	542.90	43	44	-1	15.49	15.49
Saccade L	1	2	9779148500	9779168380	19880	848.88	509.64	857.93	403.44	0.75	107.82	1.00	37.92	2403.07	-2532.17	1759.06
Saccade R	1	2	9779148500	9779168380	19880	848.88	509.64	857.93	403.44	0.75	107.82	1.00	37.92	2403.07	-2532.17	1759.06
Fixation L	1	4	9779168380	9779267888	99508	867.65	398.46	16	8	-1	15.95	15.95
Fixation R	1	4	9779168380	9779267888	99508	867.65	398.46	16	8	-1	15.59	15.59
Blink L	1	2	9779267888	9779407112	139224
Blink R	1	2	9779267888	9779407112	139224
Fixation L	1	5	9779407112	9779605967	198855	862.89	257.24	12	29	-1	15.86	15.86
Fixation R	1	5	9779407112	9779605967	198855	862.89	257.24	12	29	-1	15.07	15.07
Saccade L	1	3	9779605967	9779645730	39763	862.73	265.91	613.73	268.34	2.17	152.26	1.00	54.67	3754.00	-3657.41	2976.46
Saccade R	1	3	9779605967	9779645730	39763	862.73	265.91	613.73	268.34	2.17	152.26	1.00	54.67	3754.00	-3657.41	2976.46
Fixation L	1	6	9779645730	9779884458	238728	601.97	308.50	17	64	-1	16.22	16.22
Fixation R	1	6	9779645730	9779884458	238728	601.97	308.50	17	64	-1	15.54	15.54
Saccade L	1	4	9779884458	9779924211	39753	597.61	329.46	525.39	625.85	2.90	176.51	1.00	72.86	4342.65	-4143.93	3483.49
Saccade R	1	4	9779884458	9779924211	39753	597.61	329.46	525.39	625.85	2.90	176.51	1.00	72.86	4342.65	-4143.93	3483.49
Fixation L	1	7	9779924211	9780143071	218860	518.32	684.48	22	74	-1	16.25	16.25
Fixation R	1	7	9779924211	9780143071	218860	518.32	684.48	22	74	-1	15.48	15.48
Blink L	1	3	9780143071	9780361805	218734
Blink R	1	3	9780143071	9780361805	218734
Fixation L	1	8	9780361805	9780600411	238606	1336.68	523.75	18	34	-1	15.54	15.54
Fixation R	1	8	9780361805	9780600411	238606	1336.68	523.75	18	34	-1	15.71	15.71
Saccade L	1	5	9780600411	9780620431	20020	1330.92	538.50	1330.21	605.55	0.49	67.83	1.00	24.69	1610.14	-1630.61	1256.90
Saccade R	1	5	9780600411	9780620431	20020	1330.92	538.50	1330.21	605.55	0.49	67.83	1.00	24.69	1610.14	-1630.61	1256.90
Fixation L	1	9	9780620431	9780898767	278336	1325.67	630.67	16	51	-1	15.62	15.62
Fixation R	1	9	9780620431	9780898767	278336	1325.67	630.67	16	51	-1	15.39	15.39
Saccade L	1	6	9780898767	9780938658	39891	1315.69	656.89	1300.44	890.76	2.11	152.88	0.50	52.83	3776.93	-3643.77	2746.42
Saccade R	1	6	9780898767	9780938658	39891	1315.69	656.89	1300.44	890.76	2.11	152.88	0.50	52.83	3776.93	-3643.77	2746.42
Fixation L	1	10	9780938658	9781654599	715941	1273.87	883.30	39	20	-1	15.48	15.48
Fixation R	1	10	9780938658	9781654599	715941	1273.87	883.30	39	20	-1	15.31	15.31
Saccade L	1	7	9781654599	9781674475	19876	1260.74	874.22	1221.02	875.36	0.46	50.31	1.00	23.11	1235.87	-729.83	981.58
Saccade R	1	7	9781654599	9781674475	19876	1260.74	874.22	1221.02	875.36	0.46	50.31	1.00	23.11	1235.87	-729.83	981.58
Fixation L	1	11	9781674475	9781893329	218854	1162.08	885.66	68	15	-1	15.20	15.20
Fixation R	1	11	9781674475	9781893329	218854	1162.08	885.66	68	15	-1	15.20	15.20
Blink L	1	4	9781893329	9782052459	159130
Blink R	1	4	9781893329	9782052459	159130
Fixation L	1	12	9782052459	9782231445	178986	925.38	587.36	2	61	-1	16.25	16.25
Fixation R	1	12	9782052459	9782231445	178986	925.38	587.36	2	61	-1	15.89	15.89
