[BeGaze]
Converted from:	C:\Documents and Settings\iViewX\Desktop\EXPERIMENTATIONS\Experiments\results\finaleart\S15H25531-finaleart-1.idf
Date:	27.03.2019 15:44:40
Version:	BeGaze 2.5.77
Sample Rate:	50
Subject:	S15H25531
Description:	Mikail Demirdelen

Table Header for Fixations:
Event Type	Trial	Number	Start	End	Duration	Location X	Location Y	Dispersion X	Dispersion Y	Plane	Avg. Pupil Size X	Avg. Pupil Size Y

Table Header for Saccades:
Event Type	Trial	Number	Start	End	Duration	Start Loc.X	Start Loc.Y	End Loc.X	End Loc.Y	Amplitude	Peak Speed	Peak Speed At	Average Speed	Peak Accel.	Peak Decel.	Average Accel.

Table Header for Blinks:
Event Type	Trial	Number	Start	End	Duration

Table Header for User Events:
Event Type	Trial	Number	Start	Description

UserEvent	1	1	3779257779	# Message: the_rainbow__moore_henry_1865.jpg
Fixation L	1	1	3779277617	3779774843	497226	836.34	484.14	27	16	-1	13.41	13.41
Fixation R	1	1	3779277617	3779774843	497226	836.34	484.14	27	16	-1	14.79	14.79
Saccade L	1	1	3779774843	3779794740	19897	858.36	485.93	918.20	511.26	0.51	65.73	1.00	25.55	1612.25	-718.33	955.04
Saccade R	1	1	3779774843	3779794740	19897	858.36	485.93	918.20	511.26	0.51	65.73	1.00	25.55	1612.25	-718.33	955.04
Fixation L	1	2	3779794740	3779914082	119342	924.14	495.00	11	38	-1	12.67	12.67
Fixation R	1	2	3779794740	3779914082	119342	924.14	495.00	11	38	-1	14.06	14.06
Saccade L	1	2	3779914082	3779973703	59621	926.94	492.76	428.20	430.79	5.85	313.98	0.67	98.11	7778.06	-7354.87	4763.81
Saccade R	1	2	3779914082	3779973703	59621	926.94	492.76	428.20	430.79	5.85	313.98	0.67	98.11	7778.06	-7354.87	4763.81
Fixation L	1	3	3779973703	3780212451	238748	427.57	398.83	6	49	-1	11.20	11.20
Fixation R	1	3	3779973703	3780212451	238748	427.57	398.83	6	49	-1	12.48	12.48
Saccade L	1	3	3780212451	3780252190	39739	428.08	381.34	779.57	493.00	3.28	252.85	1.00	82.59	6204.38	-6096.62	4376.63
Saccade R	1	3	3780212451	3780252190	39739	428.08	381.34	779.57	493.00	3.28	252.85	1.00	82.59	6204.38	-6096.62	4376.63
Fixation L	1	4	3780252190	3780490807	238617	810.12	469.39	37	36	-1	10.39	10.39
Fixation R	1	4	3780252190	3780490807	238617	810.12	469.39	37	36	-1	11.84	11.84
Saccade L	1	4	3780490807	3780530689	39882	816.75	458.38	1111.57	613.29	3.02	278.78	1.00	75.72	6924.95	-6395.20	3932.40
Saccade R	1	4	3780490807	3780530689	39882	816.75	458.38	1111.57	613.29	3.02	278.78	1.00	75.72	6924.95	-6395.20	3932.40
Fixation L	1	5	3780530689	3780769289	238600	1125.73	644.10	25	43	-1	10.51	10.51
Fixation R	1	5	3780530689	3780769289	238600	1125.73	644.10	25	43	-1	11.80	11.80
Saccade L	1	5	3780769289	3780809050	39761	1130.01	648.27	1272.07	673.57	2.04	121.66	0.50	51.31	3023.72	-2127.20	2377.43
Saccade R	1	5	3780769289	3780809050	39761	1130.01	648.27	1272.07	673.57	2.04	121.66	0.50	51.31	3023.72	-2127.20	2377.43
Fixation L	1	6	3780809050	3781027937	218887	1279.19	716.48	13	51	-1	10.94	10.94
Fixation R	1	6	3780809050	3781027937	218887	1279.19	716.48	13	51	-1	12.13	12.13
Saccade L	1	6	3781027937	3781067658	39721	1276.14	723.29	1166.75	951.81	2.18	155.90	1.00	55.00	3815.21	-3651.71	3057.80
Saccade R	1	6	3781027937	3781067658	39721	1276.14	723.29	1166.75	951.81	2.18	155.90	1.00	55.00	3815.21	-3651.71	3057.80
Fixation L	1	7	3781067658	3781266516	198858	1162.81	941.32	81	15	-1	11.74	11.74
Fixation R	1	7	3781067658	3781266516	198858	1162.81	941.32	81	15	-1	12.72	12.72
Saccade L	1	7	3781266516	3781286397	19881	1101.25	945.57	837.78	949.35	1.69	266.36	1.00	85.17	6593.28	-6199.60	4680.65
Saccade R	1	7	3781266516	3781286397	19881	1101.25	945.57	837.78	949.35	1.69	266.36	1.00	85.17	6593.28	-6199.60	4680.65
Fixation L	1	8	3781286397	3781584754	298357	818.39	967.41	23	27	-1	12.60	12.60
Fixation R	1	8	3781286397	3781584754	298357	818.39	967.41	23	27	-1	13.79	13.79
Saccade L	1	8	3781584754	3781624630	39876	816.80	961.25	743.00	672.99	2.53	182.04	0.50	63.56	4464.03	-4416.32	3660.98
Saccade R	1	8	3781584754	3781624630	39876	816.80	961.25	743.00	672.99	2.53	182.04	0.50	63.56	4464.03	-4416.32	3660.98
Fixation L	1	9	3781624630	3781962738	338108	743.38	657.36	12	23	-1	12.92	12.92
Fixation R	1	9	3781624630	3781962738	338108	743.38	657.36	12	23	-1	14.51	14.51
Saccade L	1	9	3781962738	3782002489	39751	745.38	658.95	523.35	782.66	2.12	160.18	0.50	53.21	3989.00	-3874.24	3092.48
Saccade R	1	9	3781962738	3782002489	39751	745.38	658.95	523.35	782.66	2.12	160.18	0.50	53.21	3989.00	-3874.24	3092.48
Fixation L	1	10	3782002489	3782320723	318234	524.28	802.04	12	35	-1	12.65	12.65
Fixation R	1	10	3782002489	3782320723	318234	524.28	802.04	12	35	-1	14.61	14.61
Saccade L	1	10	3782320723	3782360469	39746	527.13	808.82	771.63	975.39	3.04	239.74	0.50	76.48	5897.30	-4794.71	3615.19
Saccade R	1	10	3782320723	3782360469	39746	527.13	808.82	771.63	975.39	3.04	239.74	0.50	76.48	5897.30	-4794.71	3615.19
Fixation L	1	11	3782360469	3782539461	178992	807.73	952.73	42	38	-1	13.56	13.56
Fixation R	1	11	3782360469	3782539461	178992	807.73	952.73	42	38	-1	15.38	15.38
Blink L	1	1	3782539461	3782758320	218859
Blink R	1	1	3782539461	3782758320	218859
Fixation L	1	12	3782758320	3783195921	437601	770.34	1028.10	8	14	-1	14.88	14.88
Fixation R	1	12	3782758320	3783195921	437601	770.34	1028.10	8	14	-1	16.27	16.27
Saccade L	1	11	3783195921	3783255545	59624	770.12	1019.81	1117.95	1006.58	4.59	206.58	0.33	76.95	5122.15	-4785.35	3471.51
Saccade R	1	11	3783195921	3783255545	59624	770.12	1019.81	1117.95	1006.58	4.59	206.58	0.33	76.95	5122.15	-4785.35	3471.51
