[BeGaze]
Converted from:	C:\Documents and Settings\iViewX\Desktop\EXPERIMENTATIONS\Experiments\results\finaleart\S19F21442-finaleart-1.idf
Date:	27.03.2019 15:51:46
Version:	BeGaze 2.5.77
Sample Rate:	50
Subject:	S19F21442
Description:	Juliette Veuillez

Table Header for Fixations:
Event Type	Trial	Number	Start	End	Duration	Location X	Location Y	Dispersion X	Dispersion Y	Plane	Avg. Pupil Size X	Avg. Pupil Size Y

Table Header for Saccades:
Event Type	Trial	Number	Start	End	Duration	Start Loc.X	Start Loc.Y	End Loc.X	End Loc.Y	Amplitude	Peak Speed	Peak Speed At	Average Speed	Peak Accel.	Peak Decel.	Average Accel.

Table Header for Blinks:
Event Type	Trial	Number	Start	End	Duration

Table Header for User Events:
Event Type	Trial	Number	Start	Description

UserEvent	1	1	8227560732	# Message: lair_of_the_sea_serpent_vedder_1899.jpg
Fixation L	1	1	8227571620	8228088724	517104	816.45	543.68	8	55	-1	10.97	10.97
Fixation R	1	1	8227571620	8228088724	517104	816.45	543.68	8	55	-1	13.48	13.48
Saccade L	1	1	8228088724	8228148370	59646	812.86	571.02	1298.21	563.53	5.21	244.39	0.67	87.32	6001.61	-5637.65	3739.63
Saccade R	1	1	8228088724	8228148370	59646	812.86	571.02	1298.21	563.53	5.21	244.39	0.67	87.32	6001.61	-5637.65	3739.63
Fixation L	1	2	8228148370	8228426828	278458	1317.10	570.59	24	20	-1	8.96	8.96
Fixation R	1	2	8228148370	8228426828	278458	1317.10	570.59	24	20	-1	10.43	10.43
Saccade L	1	2	8228426828	8228506452	79624	1316.83	583.31	1067.56	647.49	3.82	152.90	0.25	48.01	3729.50	-3357.30	1872.63
Saccade R	1	2	8228426828	8228506452	79624	1316.83	583.31	1067.56	647.49	3.82	152.90	0.25	48.01	3729.50	-3357.30	1872.63
Fixation L	1	3	8228506452	8228665565	159113	1047.48	664.69	63	35	-1	8.33	8.33
Fixation R	1	3	8228506452	8228665565	159113	1047.48	664.69	63	35	-1	9.93	9.93
Saccade L	1	3	8228665565	8228685458	19893	1003.74	650.65	848.76	658.75	1.25	156.96	1.00	62.87	3286.11	-3321.74	2684.54
Saccade R	1	3	8228665565	8228685458	19893	1003.74	650.65	848.76	658.75	1.25	156.96	1.00	62.87	3286.11	-3321.74	2684.54
Fixation L	1	4	8228685458	8228904185	218727	835.29	621.71	25	64	-1	8.48	8.48
Fixation R	1	4	8228685458	8228904185	218727	835.29	621.71	25	64	-1	10.36	10.36
Saccade L	1	4	8228904185	8228963934	59749	822.93	593.77	701.24	609.10	1.72	85.07	1.00	28.73	1613.73	-2067.19	1160.76
Saccade R	1	4	8228904185	8228963934	59749	822.93	593.77	701.24	609.10	1.72	85.07	1.00	28.73	1613.73	-2067.19	1160.76
Fixation L	1	5	8228963934	8229282169	318235	722.07	589.86	58	37	-1	8.31	8.31
Fixation R	1	5	8228963934	8229282169	318235	722.07	589.86	58	37	-1	10.60	10.60
Saccade L	1	5	8229282169	8229461160	178991	759.38	584.21	1596.21	606.35	13.25	332.17	0.78	74.05	8210.13	-6176.70	2666.20
Saccade R	1	5	8229282169	8229461160	178991	759.38	584.21	1596.21	606.35	13.25	332.17	0.78	74.05	8210.13	-6176.70	2666.20
Fixation L	1	6	8229461160	8229878894	417734	1568.12	637.84	40	54	-1	9.29	9.29
Fixation R	1	6	8229461160	8229878894	417734	1568.12	637.84	40	54	-1	10.04	10.04
Saccade L	1	6	8229878894	8229918635	39741	1563.50	644.31	1761.09	652.07	1.69	107.26	0.50	42.44	2559.08	-2591.18	2419.47
Saccade R	1	6	8229878894	8229918635	39741	1563.50	644.31	1761.09	652.07	1.69	107.26	0.50	42.44	2559.08	-2591.18	2419.47
Fixation L	1	7	8229918635	8230773854	855219	1749.44	646.13	29	37	-1	9.45	9.45
Fixation R	1	7	8229918635	8230773854	855219	1749.44	646.13	29	37	-1	10.23	10.23
Saccade L	1	7	8230773854	8230833601	59747	1743.63	644.97	1151.69	428.45	7.23	335.38	0.67	120.94	7980.67	-7743.99	5121.43
Saccade R	1	7	8230773854	8230833601	59747	1743.63	644.97	1151.69	428.45	7.23	335.38	0.67	120.94	7980.67	-7743.99	5121.43
Fixation L	1	8	8230833601	8231072207	238606	1147.39	398.15	15	45	-1	9.84	9.84
Fixation R	1	8	8230833601	8231072207	238606	1147.39	398.15	15	45	-1	11.40	11.40
Saccade L	1	8	8231072207	8231111987	39780	1142.92	385.69	890.82	409.36	2.19	148.25	0.50	54.98	3588.48	-3488.65	2854.14
Saccade R	1	8	8231072207	8231111987	39780	1142.92	385.69	890.82	409.36	2.19	148.25	0.50	54.98	3588.48	-3488.65	2854.14
Fixation L	1	9	8231111987	8231370576	258589	872.30	449.40	29	66	-1	9.68	9.68
Fixation R	1	9	8231111987	8231370576	258589	872.30	449.40	29	66	-1	11.84	11.84
Saccade L	1	9	8231370576	8231430330	59754	862.99	467.58	364.79	593.27	5.38	264.83	0.67	90.01	6535.77	-6382.76	4369.35
Saccade R	1	9	8231370576	8231430330	59754	862.99	467.58	364.79	593.27	5.38	264.83	0.67	90.01	6535.77	-6382.76	4369.35
Fixation L	1	10	8231430330	8231529685	99355	369.15	607.70	37	34	-1	9.33	9.33
Fixation R	1	10	8231430330	8231529685	99355	369.15	607.70	37	34	-1	12.17	12.17
Saccade L	1	10	8231529685	8231549570	19885	394.95	627.66	415.13	644.05	0.44	26.30	1.00	22.27	212.25	0.00	106.13
Saccade R	1	10	8231529685	8231549570	19885	394.95	627.66	415.13	644.05	0.44	26.30	1.00	22.27	212.25	0.00	106.13
