[BeGaze]
Converted from:	C:\Documents and Settings\iViewX\Desktop\EXPERIMENTATIONS\Experiments\results\finaleart\S13H22431-finaleart-1.idf
Date:	27.03.2019 15:42:07
Version:	BeGaze 2.5.77
Sample Rate:	50
Subject:	S13H22431
Description:	Jimmy Petit

Table Header for Fixations:
Event Type	Trial	Number	Start	End	Duration	Location X	Location Y	Dispersion X	Dispersion Y	Plane	Avg. Pupil Size X	Avg. Pupil Size Y

Table Header for Saccades:
Event Type	Trial	Number	Start	End	Duration	Start Loc.X	Start Loc.Y	End Loc.X	End Loc.Y	Amplitude	Peak Speed	Peak Speed At	Average Speed	Peak Accel.	Peak Decel.	Average Accel.

Table Header for Blinks:
Event Type	Trial	Number	Start	End	Duration

Table Header for User Events:
Event Type	Trial	Number	Start	Description

UserEvent	1	1	28056762162	# Message: the-wood_cross_907.jpg
Saccade L	1	1	28056774679	28056854182	79503	737.41	561.34	822.13	574.31	1.82	82.74	1.00	22.85	1844.50	-1688.51	754.86
Saccade R	1	1	28056774679	28056854182	79503	737.41	561.34	822.13	574.31	1.82	82.74	1.00	22.85	1844.50	-1688.51	754.86
Fixation L	1	1	28056854182	28057192283	338101	842.02	558.47	29	23	-1	15.40	15.40
Fixation R	1	1	28056854182	28057192283	338101	842.02	558.47	29	23	-1	16.89	16.89
Saccade L	1	2	28057192283	28057232149	39866	842.24	555.66	1110.76	631.29	2.46	146.48	0.50	61.73	3587.24	-3164.10	3314.66
Saccade R	1	2	28057192283	28057232149	39866	842.24	555.66	1110.76	631.29	2.46	146.48	0.50	61.73	3587.24	-3164.10	3314.66
Fixation L	1	2	28057232149	28057729379	497230	1113.67	665.10	24	51	-1	14.55	14.55
Fixation R	1	2	28057232149	28057729379	497230	1113.67	665.10	24	51	-1	15.67	15.67
Saccade L	1	3	28057729379	28057769131	39752	1127.97	679.15	945.63	572.57	1.92	143.61	0.50	48.40	3452.21	-3238.07	2508.44
Saccade R	1	3	28057729379	28057769131	39752	1127.97	679.15	945.63	572.57	1.92	143.61	0.50	48.40	3452.21	-3238.07	2508.44
Fixation L	1	3	28057769131	28058186864	417733	937.32	540.33	21	74	-1	13.63	13.63
Fixation R	1	3	28057769131	28058186864	417733	937.32	540.33	21	74	-1	14.36	14.36
Saccade L	1	4	28058186864	28058206740	19876	936.24	497.87	934.93	483.34	0.16	14.76	1.00	8.09	233.74	-263.18	232.79
Saccade R	1	4	28058186864	28058206740	19876	936.24	497.87	934.93	483.34	0.16	14.76	1.00	8.09	233.74	-263.18	232.79
Fixation L	1	4	28058206740	28058544849	338109	949.47	450.79	30	64	-1	13.70	13.70
Fixation R	1	4	28058206740	28058544849	338109	949.47	450.79	30	64	-1	14.69	14.69
Saccade L	1	5	28058544849	28058564725	19876	965.20	424.01	950.30	630.28	1.50	209.12	1.00	75.24	5049.78	-4916.70	3936.87
Saccade R	1	5	28058544849	28058564725	19876	965.20	424.01	950.30	630.28	1.50	209.12	1.00	75.24	5049.78	-4916.70	3936.87
Fixation L	1	5	28058564725	28058664214	99489	946.56	694.10	10	89	-1	14.07	14.07
Fixation R	1	5	28058564725	28058664214	99489	946.56	694.10	10	89	-1	14.94	14.94
Saccade L	1	6	28058664214	28058684091	19877	941.77	703.66	935.90	696.47	0.16	13.95	1.00	8.20	26.32	-114.31	48.88
Saccade R	1	6	28058664214	28058684091	19877	941.77	703.66	935.90	696.47	0.16	13.95	1.00	8.20	26.32	-114.31	48.88
Fixation L	1	6	28058684091	28058882958	198867	938.86	723.32	16	62	-1	14.05	14.05
Fixation R	1	6	28058684091	28058882958	198867	938.86	723.32	16	62	-1	15.16	15.16
Saccade L	1	7	28058882958	28058902827	19869	948.61	756.43	950.52	783.50	0.33	27.45	1.00	16.61	453.10	-635.12	376.24
Saccade R	1	7	28058882958	28058902827	19869	948.61	756.43	950.52	783.50	0.33	27.45	1.00	16.61	453.10	-635.12	376.24
Fixation L	1	7	28058902827	28059121693	218866	958.61	774.07	26	16	-1	14.46	14.46
Fixation R	1	7	28058902827	28059121693	218866	958.61	774.07	26	16	-1	15.49	15.49
Saccade L	1	8	28059121693	28059141566	19873	977.18	768.99	1107.96	702.85	1.11	148.22	1.00	56.01	3652.15	-3020.48	2533.57
Saccade R	1	8	28059121693	28059141566	19873	977.18	768.99	1107.96	702.85	1.11	148.22	1.00	56.01	3652.15	-3020.48	2533.57
Fixation L	1	8	28059141566	28059439927	298361	1120.35	665.87	18	54	-1	14.15	14.15
Fixation R	1	8	28059141566	28059439927	298361	1120.35	665.87	18	54	-1	14.59	14.59
Saccade L	1	9	28059439927	28059499555	59628	1126.86	656.86	1535.10	602.91	4.34	160.54	0.33	72.82	3832.57	-3704.30	3029.59
Saccade R	1	9	28059439927	28059499555	59628	1126.86	656.86	1535.10	602.91	4.34	160.54	0.33	72.82	3832.57	-3704.30	3029.59
Fixation L	1	9	28059499555	28059837665	338110	1508.57	600.85	49	14	-1	13.81	13.81
Fixation R	1	9	28059499555	28059837665	338110	1508.57	600.85	49	14	-1	14.31	14.31
Saccade L	1	10	28059837665	28059857665	20000	1485.28	603.43	1417.72	691.80	0.74	112.51	1.00	36.89	2729.64	-2439.34	1946.76
Saccade R	1	10	28059837665	28059857665	20000	1485.28	603.43	1417.72	691.80	0.74	112.51	1.00	36.89	2729.64	-2439.34	1946.76
Fixation L	1	10	28059857665	28060136033	278368	1425.54	715.11	32	64	-1	14.11	14.11
Fixation R	1	10	28059857665	28060136033	278368	1425.54	715.11	32	64	-1	14.31	14.31
Saccade L	1	11	28060136033	28060155896	19863	1407.77	751.50	1396.22	758.83	0.20	17.07	1.00	9.88	-80.82	-265.46	151.26
Saccade R	1	11	28060136033	28060155896	19863	1407.77	751.50	1396.22	758.83	0.20	17.07	1.00	9.88	-80.82	-265.46	151.26
Fixation L	1	11	28060155896	28060295145	139249	1390.61	767.29	12	14	-1	14.47	14.47
Fixation R	1	11	28060155896	28060295145	139249	1390.61	767.29	12	14	-1	14.47	14.47
Saccade L	1	12	28060295145	28060315016	19871	1390.75	773.35	1440.42	695.95	0.60	93.03	1.00	30.03	2304.45	-1837.77	1471.52
Saccade R	1	12	28060295145	28060315016	19871	1390.75	773.35	1440.42	695.95	0.60	93.03	1.00	30.03	2304.45	-1837.77	1471.52
Fixation L	1	12	28060315016	28060553764	238748	1445.17	697.03	31	21	-1	14.19	14.19
Fixation R	1	12	28060315016	28060553764	238748	1445.17	697.03	31	21	-1	14.20	14.20
Saccade L	1	13	28060553764	28060613393	59629	1424.19	703.05	718.03	252.48	8.77	346.31	0.33	147.11	8547.12	-7604.29	6357.62
Saccade R	1	13	28060553764	28060613393	59629	1424.19	703.05	718.03	252.48	8.77	346.31	0.33	147.11	8547.12	-7604.29	6357.62
Fixation L	1	13	28060613393	28060752620	139227	713.49	252.67	12	10	-1	13.59	13.59
Fixation R	1	13	28060613393	28060752620	139227	713.49	252.67	12	10	-1	13.76	13.76
