[BeGaze]
Converted from:	C:\Documents and Settings\iViewX\Desktop\EXPERIMENTATIONS\Experiments\results\finaleart\S16F14542-finaleart-1.idf
Date:	27.03.2019 15:47:29
Version:	BeGaze 2.5.77
Sample Rate:	50
Subject:	S16F14542
Description:	Diane Dewez

Table Header for Fixations:
Event Type	Trial	Number	Start	End	Duration	Location X	Location Y	Dispersion X	Dispersion Y	Plane	Avg. Pupil Size X	Avg. Pupil Size Y

Table Header for Saccades:
Event Type	Trial	Number	Start	End	Duration	Start Loc.X	Start Loc.Y	End Loc.X	End Loc.Y	Amplitude	Peak Speed	Peak Speed At	Average Speed	Peak Accel.	Peak Decel.	Average Accel.

Table Header for Blinks:
Event Type	Trial	Number	Start	End	Duration

Table Header for User Events:
Event Type	Trial	Number	Start	Description

UserEvent	1	1	7235855914	# Message: void.jpg
Fixation L	1	1	7235867287	7235966823	99536	674.35	182.69	45	43	-1	11.67	11.67
Fixation R	1	1	7235867287	7235966823	99536	674.35	182.69	45	43	-1	11.35	11.35
Saccade L	1	1	7235966823	7236026401	59578	708.93	212.33	1143.71	191.48	5.36	209.39	0.67	89.90	4234.82	-4526.06	3341.41
Saccade R	1	1	7235966823	7236026401	59578	708.93	212.33	1143.71	191.48	5.36	209.39	0.67	89.90	4234.82	-4526.06	3341.41
Fixation L	1	2	7236026401	7236165639	139238	1140.51	233.80	29	65	-1	12.33	12.33
Fixation R	1	2	7236026401	7236165639	139238	1140.51	233.80	29	65	-1	11.32	11.32
Saccade L	1	2	7236165639	7236185512	19873	1132.49	250.52	1120.39	258.40	0.19	14.61	1.00	9.59	145.74	36.42	90.91
Saccade R	1	2	7236165639	7236185512	19873	1132.49	250.52	1120.39	258.40	0.19	14.61	1.00	9.59	145.74	36.42	90.91
Fixation L	1	3	7236185512	7236285004	99492	1127.84	258.86	15	28	-1	12.34	12.34
Fixation R	1	3	7236185512	7236285004	99492	1127.84	258.86	15	28	-1	11.71	11.71
Blink L	1	1	7236285004	7236841978	556974
Blink R	1	1	7236285004	7236841978	556974
Saccade L	1	3	7236841978	7236941359	99381	1087.16	711.48	1063.50	625.42	6.37	125.03	0.80	64.05	2365.53	-3062.08	2028.07
Saccade R	1	3	7236841978	7236941359	99381	1087.16	711.48	1063.50	625.42	6.37	125.03	0.80	64.05	2365.53	-3062.08	2028.07
Fixation L	1	4	7236941359	7237418698	477339	1034.89	621.06	42	16	-1	13.36	13.36
Fixation R	1	4	7236941359	7237418698	477339	1034.89	621.06	42	16	-1	13.18	13.18
Saccade L	1	4	7237418698	7237458572	39874	1024.30	616.39	891.49	587.65	1.31	87.74	0.50	32.86	2121.89	-1698.92	1481.69
Saccade R	1	4	7237418698	7237458572	39874	1024.30	616.39	891.49	587.65	1.31	87.74	0.50	32.86	2121.89	-1698.92	1481.69
Fixation L	1	5	7237458572	7237836432	377860	869.86	553.37	27	44	-1	10.18	10.18
Fixation R	1	5	7237458572	7237836432	377860	869.86	553.37	27	44	-1	10.15	10.15
