[BeGaze]
Converted from:	C:\Documents and Settings\iViewX\Desktop\EXPERIMENTATIONS\Experiments\results\finaleart\S5121332-finaleart-1.idf
Date:	27.03.2019 15:35:28
Version:	BeGaze 2.5.77
Sample Rate:	50
Subject:	S5121332
Description:	Dylan Marinho

Table Header for Fixations:
Event Type	Trial	Number	Start	End	Duration	Location X	Location Y	Dispersion X	Dispersion Y	Plane	Avg. Pupil Size X	Avg. Pupil Size Y

Table Header for Saccades:
Event Type	Trial	Number	Start	End	Duration	Start Loc.X	Start Loc.Y	End Loc.X	End Loc.Y	Amplitude	Peak Speed	Peak Speed At	Average Speed	Peak Accel.	Peak Decel.	Average Accel.

Table Header for Blinks:
Event Type	Trial	Number	Start	End	Duration

Table Header for User Events:
Event Type	Trial	Number	Start	Description

UserEvent	1	1	10185635374	# Message: sargent-reclining-nude.jpg
Fixation L	1	1	10185644357	10186101839	457482	921.38	513.35	11	70	-1	13.95	13.95
Fixation R	1	1	10185644357	10186101839	457482	921.38	513.35	11	70	-1	13.24	13.24
Saccade L	1	1	10186101839	10186141586	39747	913.87	457.71	776.34	267.69	3.18	276.32	0.50	80.04	6769.10	-6238.83	3697.34
Saccade R	1	1	10186101839	10186141586	39747	913.87	457.71	776.34	267.69	3.18	276.32	0.50	80.04	6769.10	-6238.83	3697.34
Fixation L	1	2	10186141586	10186280818	139232	767.88	304.58	16	47	-1	13.83	13.83
Fixation R	1	2	10186141586	10186280818	139232	767.88	304.58	16	47	-1	13.00	13.00
Saccade L	1	2	10186280818	10186320693	39875	774.02	312.95	609.39	214.52	2.29	201.77	0.50	57.41	4953.94	-4337.58	2847.48
Saccade R	1	2	10186280818	10186320693	39875	774.02	312.95	609.39	214.52	2.29	201.77	0.50	57.41	4953.94	-4337.58	2847.48
Fixation L	1	3	10186320693	10186738291	417598	590.84	163.90	25	66	-1	12.65	12.65
Fixation R	1	3	10186320693	10186738291	417598	590.84	163.90	25	66	-1	12.15	12.15
Saccade L	1	3	10186738291	10186877525	139234	587.85	155.86	1040.32	377.12	11.30	339.72	1.00	81.18	7886.62	-8190.05	3465.30
Saccade R	1	3	10186738291	10186877525	139234	587.85	155.86	1040.32	377.12	11.30	339.72	1.00	81.18	7886.62	-8190.05	3465.30
Fixation L	1	4	10186877525	10187056520	178995	1072.10	405.18	38	56	-1	13.53	13.53
Fixation R	1	4	10186877525	10187056520	178995	1072.10	405.18	38	56	-1	13.20	13.20
Saccade L	1	4	10187056520	10187116258	59738	1078.66	428.76	1524.17	383.95	4.91	250.24	0.67	82.23	6127.36	-5841.59	3904.27
Saccade R	1	4	10187056520	10187116258	59738	1078.66	428.76	1524.17	383.95	4.91	250.24	0.67	82.23	6127.36	-5841.59	3904.27
Fixation L	1	5	10187116258	10187633362	517104	1526.77	354.03	33	37	-1	14.77	14.77
Fixation R	1	5	10187116258	10187633362	517104	1526.77	354.03	33	37	-1	13.99	13.99
Blink L	1	1	10187633362	10187712969	79607
Blink R	1	1	10187633362	10187712969	79607
Fixation L	1	6	10187752730	10187951594	198864	1433.08	373.48	40	11	-1	15.59	15.59
Fixation R	1	6	10187752730	10187951594	198864	1433.08	373.48	40	11	-1	14.84	14.84
Saccade L	1	5	10187951594	10187991331	39737	1416.70	378.58	1156.63	475.83	2.46	155.17	1.00	61.80	3775.64	-3783.27	3386.06
Saccade R	1	5	10187951594	10187991331	39737	1416.70	378.58	1156.63	475.83	2.46	155.17	1.00	61.80	3775.64	-3783.27	3386.06
Fixation L	1	7	10187991331	10188269818	278487	1145.48	452.53	13	34	-1	16.27	16.27
Fixation R	1	7	10187991331	10188269818	278487	1145.48	452.53	13	34	-1	15.62	15.62
Saccade L	1	6	10188269818	10188309563	39745	1143.69	441.26	1011.15	691.86	2.94	216.52	1.00	74.03	5343.15	-5321.74	3100.15
Saccade R	1	6	10188269818	10188309563	39745	1143.69	441.26	1011.15	691.86	2.94	216.52	1.00	74.03	5343.15	-5321.74	3100.15
Fixation L	1	8	10188309563	10189164889	855326	1012.02	758.80	9	80	-1	15.61	15.61
Fixation R	1	8	10188309563	10189164889	855326	1012.02	758.80	9	80	-1	15.53	15.53
Saccade L	1	7	10189164889	10189204641	39752	1011.67	757.60	869.25	761.02	1.23	94.47	1.00	30.96	2321.16	-2320.07	1724.20
Saccade R	1	7	10189164889	10189204641	39752	1011.67	757.60	869.25	761.02	1.23	94.47	1.00	30.96	2321.16	-2320.07	1724.20
Fixation L	1	9	10189204641	10189383625	178984	862.67	767.84	14	11	-1	15.30	15.30
Fixation R	1	9	10189204641	10189383625	178984	862.67	767.84	14	11	-1	15.09	15.09
Saccade L	1	8	10189383625	10189423504	39879	855.04	769.68	576.55	563.83	2.95	259.79	0.50	73.98	6468.72	-6377.57	4343.20
Saccade R	1	8	10189383625	10189423504	39879	855.04	769.68	576.55	563.83	2.95	259.79	0.50	73.98	6468.72	-6377.57	4343.20
Fixation L	1	10	10189423504	10189662114	238610	581.44	553.66	14	19	-1	15.50	15.50
Fixation R	1	10	10189423504	10189662114	238610	581.44	553.66	14	19	-1	15.46	15.46
