[BeGaze]
Converted from:	C:\Documents and Settings\iViewX\Desktop\EXPERIMENTATIONS\Experiments\results\finaleart\S01A22542-finaleart-1.idf
Date:	27.03.2019 15:33:22
Version:	BeGaze 2.5.77
Sample Rate:	50
Subject:	S01A22542
Description:	Thibault Seve Minnaert

Table Header for Fixations:
Event Type	Trial	Number	Start	End	Duration	Location X	Location Y	Dispersion X	Dispersion Y	Plane	Avg. Pupil Size X	Avg. Pupil Size Y

Table Header for Saccades:
Event Type	Trial	Number	Start	End	Duration	Start Loc.X	Start Loc.Y	End Loc.X	End Loc.Y	Amplitude	Peak Speed	Peak Speed At	Average Speed	Peak Accel.	Peak Decel.	Average Accel.

Table Header for Blinks:
Event Type	Trial	Number	Start	End	Duration

Table Header for User Events:
Event Type	Trial	Number	Start	Description

UserEvent	1	1	9558432088	# Message: void.jpg
Fixation L	1	1	9558440250	9558539758	99508	901.35	681.81	3	14	-1	17.07	17.07
Fixation R	1	1	9558440250	9558539758	99508	901.35	681.81	3	14	-1	17.11	17.11
Saccade L	1	1	9558539758	9558579483	39725	900.33	684.90	1024.49	456.30	2.21	176.65	1.00	55.72	4335.21	-4313.70	3215.48
Saccade R	1	1	9558539758	9558579483	39725	900.33	684.90	1024.49	456.30	2.21	176.65	1.00	55.72	4335.21	-4313.70	3215.48
Fixation L	1	2	9558579483	9558718733	139250	1024.50	462.68	8	86	-1	16.97	16.97
Fixation R	1	2	9558579483	9558718733	139250	1024.50	462.68	8	86	-1	17.07	17.07
Saccade L	1	2	9558718733	9558758487	39754	1021.11	535.29	939.05	950.33	4.25	283.67	0.50	106.95	6947.65	-6817.12	4697.22
Saccade R	1	2	9558718733	9558758487	39754	1021.11	535.29	939.05	950.33	4.25	283.67	0.50	106.95	6947.65	-6817.12	4697.22
Fixation L	1	3	9558758487	9558957466	198979	921.35	956.78	29	8	-1	17.30	17.30
Fixation R	1	3	9558758487	9558957466	198979	921.35	956.78	29	8	-1	17.34	17.34
Blink L	1	1	9558957466	9559156339	198873
Blink R	1	1	9558957466	9559156339	198873
Fixation L	1	4	9559156339	9559395086	238747	1016.56	377.12	9	61	-1	14.47	14.47
Fixation R	1	4	9559156339	9559395086	238747	1016.56	377.12	9	61	-1	15.16	15.16
Saccade L	1	3	9559395086	9559434815	39729	1018.22	395.59	1353.17	220.74	3.32	214.41	1.00	83.52	5176.61	-5295.75	4875.87
Saccade R	1	3	9559395086	9559434815	39729	1018.22	395.59	1353.17	220.74	3.32	214.41	1.00	83.52	5176.61	-5295.75	4875.87
Fixation L	1	5	9559434815	9559693307	258492	1348.57	234.94	13	26	-1	14.65	14.65
Fixation R	1	5	9559434815	9559693307	258492	1348.57	234.94	13	26	-1	15.12	15.12
Blink L	1	2	9559693307	9559991674	298367
Blink R	1	2	9559693307	9559991674	298367
Fixation L	1	6	9559991674	9560150799	159125	840.78	780.96	16	11	-1	15.48	15.48
Fixation R	1	6	9559991674	9560150799	159125	840.78	780.96	16	11	-1	15.94	15.94
Saccade L	1	4	9560150799	9560190663	39864	846.77	783.63	925.88	543.13	2.20	200.05	0.50	55.15	4901.00	-4667.48	2877.02
Saccade R	1	4	9560150799	9560190663	39864	846.77	783.63	925.88	543.13	2.20	200.05	0.50	55.15	4901.00	-4667.48	2877.02
Fixation L	1	7	9560190663	9560429283	238620	943.89	532.24	21	37	-1	14.74	14.74
Fixation R	1	7	9560190663	9560429283	238620	943.89	532.24	21	37	-1	14.99	14.99
