[BeGaze]
Converted from:	C:\Documents and Settings\iViewX\Desktop\EXPERIMENTATIONS\Experiments\results\finaleart\S14F27123-finaleart-1.idf
Date:	27.03.2019 15:43:48
Version:	BeGaze 2.5.77
Sample Rate:	50
Subject:	S14F27123
Description:	Anne-flore Perrin

Table Header for Fixations:
Event Type	Trial	Number	Start	End	Duration	Location X	Location Y	Dispersion X	Dispersion Y	Plane	Avg. Pupil Size X	Avg. Pupil Size Y

Table Header for Saccades:
Event Type	Trial	Number	Start	End	Duration	Start Loc.X	Start Loc.Y	End Loc.X	End Loc.Y	Amplitude	Peak Speed	Peak Speed At	Average Speed	Peak Accel.	Peak Decel.	Average Accel.

Table Header for Blinks:
Event Type	Trial	Number	Start	End	Duration

Table Header for User Events:
Event Type	Trial	Number	Start	Description

UserEvent	1	1	31467967453	# Message: Turner-snow-storm-boat-off-a-harbours-mouth-1842.jpg
Fixation L	1	1	31467969259	31468486365	517106	693.04	630.15	24	45	-1	11.58	11.58
Fixation R	1	1	31467969259	31468486365	517106	693.04	630.15	24	45	-1	12.48	12.48
Saccade L	1	1	31468486365	31468526237	39872	704.01	655.45	711.30	764.57	2.76	194.79	0.50	69.18	4247.10	-4656.37	3026.00
Saccade R	1	1	31468486365	31468526237	39872	704.01	655.45	711.30	764.57	2.76	194.79	0.50	69.18	4247.10	-4656.37	3026.00
Fixation L	1	2	31468526237	31468884201	357964	705.79	751.03	27	59	-1	9.23	9.23
Fixation R	1	2	31468526237	31468884201	357964	705.79	751.03	27	59	-1	10.24	10.24
Saccade L	1	2	31468884201	31468963729	79528	698.38	775.45	998.97	826.68	4.45	234.95	0.75	55.99	5272.43	-5111.31	2328.19
Saccade R	1	2	31468884201	31468963729	79528	698.38	775.45	998.97	826.68	4.45	234.95	0.75	55.99	5272.43	-5111.31	2328.19
Fixation L	1	3	31468963729	31469142820	179091	1004.17	790.61	29	49	-1	11.09	11.09
Fixation R	1	3	31468963729	31469142820	179091	1004.17	790.61	29	49	-1	11.64	11.64
Saccade L	1	3	31469142820	31469162690	19870	1015.89	788.01	1087.24	769.98	0.59	74.45	1.00	29.64	1483.89	-1300.30	977.69
Saccade R	1	3	31469142820	31469162690	19870	1015.89	788.01	1087.24	769.98	0.59	74.45	1.00	29.64	1483.89	-1300.30	977.69
Fixation L	1	4	31469162690	31469401314	238624	1089.85	769.52	27	35	-1	12.08	12.08
Fixation R	1	4	31469162690	31469401314	238624	1089.85	769.52	27	35	-1	12.34	12.34
Saccade L	1	4	31469401314	31469421192	19878	1092.02	760.34	1038.57	732.88	0.76	60.79	1.00	38.17	699.25	-1196.25	707.86
Saccade R	1	4	31469401314	31469421192	19878	1092.02	760.34	1038.57	732.88	0.76	60.79	1.00	38.17	699.25	-1196.25	707.86
Fixation L	1	5	31469421192	31469679796	258604	1032.96	710.01	67	32	-1	11.80	11.80
Fixation R	1	5	31469421192	31469679796	258604	1032.96	710.01	67	32	-1	11.57	11.57
Saccade L	1	5	31469679796	31469699670	19874	1076.14	730.16	1082.01	720.82	0.29	27.67	0.00	14.63	59.69	-418.66	195.85
Saccade R	1	5	31469679796	31469699670	19874	1076.14	730.16	1082.01	720.82	0.29	27.67	0.00	14.63	59.69	-418.66	195.85
Fixation L	1	6	31469699670	31469958281	258611	1085.27	742.84	5	30	-1	12.21	12.21
Fixation R	1	6	31469699670	31469958281	258611	1085.27	742.84	5	30	-1	12.23	12.23
Saccade L	1	6	31469958281	31469978162	19881	1083.75	748.47	987.52	703.68	0.89	107.37	1.00	44.59	2641.01	-2182.97	2179.88
Saccade R	1	6	31469958281	31469978162	19881	1083.75	748.47	987.52	703.68	0.89	107.37	1.00	44.59	2641.01	-2182.97	2179.88
Fixation L	1	7	31469978162	31470077654	99492	937.68	681.44	62	36	-1	12.29	12.29
Fixation R	1	7	31469978162	31470077654	99492	937.68	681.44	62	36	-1	12.57	12.57
Saccade L	1	7	31470077654	31470097529	19875	926.86	666.76	924.05	675.61	0.28	21.85	1.00	14.03	-233.03	-462.22	335.59
Saccade R	1	7	31470077654	31470097529	19875	926.86	666.76	924.05	675.61	0.28	21.85	1.00	14.03	-233.03	-462.22	335.59
Fixation L	1	8	31470097529	31470356025	258496	927.61	656.83	22	66	-1	12.05	12.05
Fixation R	1	8	31470097529	31470356025	258496	927.61	656.83	22	66	-1	12.37	12.37
Saccade L	1	8	31470356025	31470455512	99487	945.00	616.71	966.19	263.35	5.85	215.47	0.80	58.79	4588.18	-5310.40	2612.66
Saccade R	1	8	31470356025	31470455512	99487	945.00	616.71	966.19	263.35	5.85	215.47	0.80	58.79	4588.18	-5310.40	2612.66
Fixation L	1	9	31470455512	31470654378	198866	972.65	279.87	17	37	-1	11.33	11.33
Fixation R	1	9	31470455512	31470654378	198866	972.65	279.87	17	37	-1	11.70	11.70
Saccade L	1	9	31470654378	31470694248	39870	981.18	276.42	1106.70	167.14	1.64	125.20	1.00	41.23	3054.09	-2921.95	2265.93
Saccade R	1	9	31470654378	31470694248	39870	981.18	276.42	1106.70	167.14	1.64	125.20	1.00	41.23	3054.09	-2921.95	2265.93
Fixation L	1	10	31470694248	31470952744	258496	1109.61	191.50	14	49	-1	11.43	11.43
Fixation R	1	10	31470694248	31470952744	258496	1109.61	191.50	14	49	-1	11.91	11.91
Saccade L	1	10	31470952744	31471012494	59750	1114.89	215.38	990.40	513.98	3.93	230.13	0.67	65.77	5350.37	-5194.75	2672.97
Saccade R	1	10	31470952744	31471012494	59750	1114.89	215.38	990.40	513.98	3.93	230.13	0.67	65.77	5350.37	-5194.75	2672.97
Fixation L	1	11	31471012494	31471270982	258488	993.36	555.42	4	51	-1	13.06	13.06
Fixation R	1	11	31471012494	31471270982	258488	993.36	555.42	4	51	-1	13.45	13.45
Saccade L	1	11	31471270982	31471310721	39739	993.56	560.40	1279.21	562.05	2.56	178.95	0.50	64.50	4354.16	-3875.18	3380.18
Saccade R	1	11	31471270982	31471310721	39739	993.56	560.40	1279.21	562.05	2.56	178.95	0.50	64.50	4354.16	-3875.18	3380.18
Fixation L	1	12	31471310721	31471788205	477484	1296.86	555.65	27	42	-1	11.78	11.78
Fixation R	1	12	31471310721	31471788205	477484	1296.86	555.65	27	42	-1	11.97	11.97
Saccade L	1	12	31471788205	31471808077	19872	1287.84	567.94	1055.92	660.34	1.35	252.38	1.00	68.15	6112.22	-5976.46	4076.67
Saccade R	1	12	31471788205	31471808077	19872	1287.84	567.94	1055.92	660.34	1.35	252.38	1.00	68.15	6112.22	-5976.46	4076.67
Fixation L	1	13	31471808077	31471967194	159117	1036.00	686.79	32	44	-1	11.47	11.47
Fixation R	1	13	31471808077	31471967194	159117	1036.00	686.79	32	44	-1	11.76	11.76
