[BeGaze]
Converted from:	C:\Documents and Settings\iViewX\Desktop\EXPERIMENTATIONS\Experiments\results\finaleart\S9H29221-finaleart-1.idf
Date:	27.03.2019 16:04:14
Version:	BeGaze 2.5.77
Sample Rate:	50
Subject:	S9H29221
Description:	steven

Table Header for Fixations:
Event Type	Trial	Number	Start	End	Duration	Location X	Location Y	Dispersion X	Dispersion Y	Plane	Avg. Pupil Size X	Avg. Pupil Size Y

Table Header for Saccades:
Event Type	Trial	Number	Start	End	Duration	Start Loc.X	Start Loc.Y	End Loc.X	End Loc.Y	Amplitude	Peak Speed	Peak Speed At	Average Speed	Peak Accel.	Peak Decel.	Average Accel.

Table Header for Blinks:
Event Type	Trial	Number	Start	End	Duration

Table Header for User Events:
Event Type	Trial	Number	Start	Description

UserEvent	1	1	6886141210	# Message: void.jpg
Saccade L	1	1	6886147464	6886167333	19869	920.69	735.33	1118.95	573.65	2.09	258.63	1.00	105.04	1412.08	-6325.83	2579.30
Saccade R	1	1	6886147464	6886167333	19869	920.69	735.33	1118.95	573.65	2.09	258.63	1.00	105.04	1412.08	-6325.83	2579.30
Fixation L	1	1	6886167333	6886982797	815464	1165.62	584.37	54	36	-1	14.77	14.77
Fixation R	1	1	6886167333	6886982797	815464	1165.62	584.37	54	36	-1	13.71	13.71
Saccade L	1	2	6886982797	6887002664	19867	1157.43	591.45	1045.97	584.32	0.72	112.96	1.00	36.21	2803.66	-2663.76	2008.88
Saccade R	1	2	6886982797	6887002664	19867	1157.43	591.45	1045.97	584.32	0.72	112.96	1.00	36.21	2803.66	-2663.76	2008.88
Fixation L	1	2	6887002664	6887261268	258604	1014.12	564.27	38	36	-1	14.96	14.96
Fixation R	1	2	6887002664	6887261268	258604	1014.12	564.27	38	36	-1	13.91	13.91
Saccade L	1	3	6887261268	6887281150	19882	1007.64	548.11	894.81	545.40	0.81	114.17	1.00	40.65	2808.85	-2729.02	2184.50
Saccade R	1	3	6887261268	6887281150	19882	1007.64	548.11	894.81	545.40	0.81	114.17	1.00	40.65	2808.85	-2729.02	2184.50
Fixation L	1	3	6887281150	6887460146	178996	851.30	528.45	60	32	-1	15.01	15.01
Fixation R	1	3	6887281150	6887460146	178996	851.30	528.45	60	32	-1	14.14	14.14
Saccade L	1	4	6887460146	6887519892	59746	834.63	521.70	452.24	514.98	4.02	150.00	0.33	67.31	3609.82	-3361.83	2756.71
Saccade R	1	4	6887460146	6887519892	59746	834.63	521.70	452.24	514.98	4.02	150.00	0.33	67.31	3609.82	-3361.83	2756.71
Fixation L	1	4	6887519892	6887857998	338106	467.33	518.11	35	14	-1	14.57	14.57
Fixation R	1	4	6887519892	6887857998	338106	467.33	518.11	35	14	-1	14.18	14.18
Saccade L	1	5	6887857998	6887937505	79507	487.04	515.99	981.19	491.21	5.91	175.95	0.50	74.29	4306.88	-2680.53	2463.58
Saccade R	1	5	6887857998	6887937505	79507	487.04	515.99	981.19	491.21	5.91	175.95	0.50	74.29	4306.88	-2680.53	2463.58
Fixation L	1	5	6887937505	6888156368	218863	978.80	464.59	7	40	-1	13.97	13.97
Fixation R	1	5	6887937505	6888156368	218863	978.80	464.59	7	40	-1	14.18	14.18
