[BeGaze]
Converted from:	C:\Documents and Settings\iViewX\Desktop\EXPERIMENTATIONS\Experiments\results\finaleart\S6124332-finaleart-1.idf
Date:	27.03.2019 15:36:19
Version:	BeGaze 2.5.77
Sample Rate:	50
Subject:	S6124332
Description:	Romain Ferrand

Table Header for Fixations:
Event Type	Trial	Number	Start	End	Duration	Location X	Location Y	Dispersion X	Dispersion Y	Plane	Avg. Pupil Size X	Avg. Pupil Size Y

Table Header for Saccades:
Event Type	Trial	Number	Start	End	Duration	Start Loc.X	Start Loc.Y	End Loc.X	End Loc.Y	Amplitude	Peak Speed	Peak Speed At	Average Speed	Peak Accel.	Peak Decel.	Average Accel.

Table Header for Blinks:
Event Type	Trial	Number	Start	End	Duration

Table Header for User Events:
Event Type	Trial	Number	Start	Description

UserEvent	1	1	12620226887	# Message: chestnut_avenue_in_la_celle_saint_cloud_sisley_1865.jpg
Fixation L	1	1	12620236802	12620754004	517202	942.75	534.41	13	13	-1	21.02	21.02
Fixation R	1	1	12620236802	12620754004	517202	942.75	534.41	13	13	-1	20.26	20.26
Saccade L	1	1	12620754004	12620793759	39755	938.17	541.27	844.92	914.86	3.32	220.78	1.00	83.53	5484.02	-4723.64	4650.50
Saccade R	1	1	12620754004	12620793759	39755	938.17	541.27	844.92	914.86	3.32	220.78	1.00	83.53	5484.02	-4723.64	4650.50
Fixation L	1	2	12620793759	12621052364	258605	842.37	962.25	5	60	-1	20.86	20.86
Fixation R	1	2	12620793759	12621052364	258605	842.37	962.25	5	60	-1	20.19	20.19
Saccade L	1	2	12621052364	12621072232	19868	842.65	975.22	840.30	863.89	0.76	112.63	1.00	38.49	2776.00	-2645.24	2112.54
Saccade R	1	2	12621052364	12621072232	19868	842.65	975.22	840.30	863.89	0.76	112.63	1.00	38.49	2776.00	-2645.24	2112.54
Fixation L	1	3	12621072232	12621310839	238607	825.42	812.30	26	70	-1	20.26	20.26
Fixation R	1	3	12621072232	12621310839	238607	825.42	812.30	26	70	-1	19.60	19.60
Saccade L	1	3	12621310839	12621330724	19885	813.77	792.97	814.40	784.71	0.13	8.38	1.00	6.60	25.35	-97.17	49.75
Saccade R	1	3	12621310839	12621330724	19885	813.77	792.97	814.40	784.71	0.13	8.38	1.00	6.60	25.35	-97.17	49.75
Fixation L	1	4	12621330724	12621708699	377975	804.56	791.85	46	49	-1	20.28	20.28
Fixation R	1	4	12621330724	12621708699	377975	804.56	791.85	46	49	-1	19.77	19.77
Saccade L	1	4	12621708699	12621728556	19857	779.18	824.63	776.65	828.11	0.08	4.73	0.00	3.88	28.39	-76.78	47.50
Saccade R	1	4	12621708699	12621728556	19857	779.18	824.63	776.65	828.11	0.08	4.73	0.00	3.88	28.39	-76.78	47.50
Fixation L	1	5	12621728556	12621927430	198874	778.59	833.17	3	8	-1	20.23	20.23
Fixation R	1	5	12621728556	12621927430	198874	778.59	833.17	3	8	-1	19.58	19.58
Saccade L	1	5	12621927430	12621967181	39751	779.05	836.56	1138.36	766.04	3.57	200.60	1.00	89.83	4944.27	-4815.99	4171.48
Saccade R	1	5	12621927430	12621967181	39751	779.05	836.56	1138.36	766.04	3.57	200.60	1.00	89.83	4944.27	-4815.99	4171.48
Fixation L	1	6	12621967181	12622106413	139232	1188.50	769.01	73	26	-1	19.92	19.92
Fixation R	1	6	12621967181	12622106413	139232	1188.50	769.01	73	26	-1	19.20	19.20
Saccade L	1	6	12622106413	12622126296	19883	1204.10	756.07	1207.93	753.88	0.32	34.64	0.00	15.89	100.97	-649.36	344.60
Saccade R	1	6	12622106413	12622126296	19883	1204.10	756.07	1207.93	753.88	0.32	34.64	0.00	15.89	100.97	-649.36	344.60
Fixation L	1	7	12622126296	12622484400	358104	1211.71	751.60	7	13	-1	19.88	19.88
Fixation R	1	7	12622126296	12622484400	358104	1211.71	751.60	7	13	-1	18.90	18.90
Saccade L	1	7	12622484400	12622544023	59623	1208.67	746.78	1120.69	481.42	3.11	118.87	0.67	52.11	2923.97	-2532.77	1845.78
Saccade R	1	7	12622484400	12622544023	59623	1208.67	746.78	1120.69	481.42	3.11	118.87	0.67	52.11	2923.97	-2532.77	1845.78
Fixation L	1	8	12622544023	12622901999	357976	1108.38	445.69	32	52	-1	19.55	19.55
Fixation R	1	8	12622544023	12622901999	357976	1108.38	445.69	32	52	-1	18.24	18.24
Saccade L	1	8	12622901999	12622921995	19996	1126.03	428.77	1077.74	433.22	0.56	49.06	1.00	28.20	1014.24	-1001.92	920.70
Saccade R	1	8	12622901999	12622921995	19996	1126.03	428.77	1077.74	433.22	0.56	49.06	1.00	28.20	1014.24	-1001.92	920.70
Fixation L	1	9	12622921995	12623478847	556852	1020.70	421.84	65	23	-1	20.40	20.40
Fixation R	1	9	12622921995	12623478847	556852	1020.70	421.84	65	23	-1	19.18	19.18
Saccade L	1	9	12623478847	12623558460	79613	1025.19	423.91	702.99	771.27	6.43	168.69	0.50	80.74	4161.80	-2367.02	2367.03
Saccade R	1	9	12623478847	12623558460	79613	1025.19	423.91	702.99	771.27	6.43	168.69	0.50	80.74	4161.80	-2367.02	2367.03
Fixation L	1	10	12623558460	12623717577	159117	681.94	819.67	27	62	-1	21.45	21.45
Fixation R	1	10	12623558460	12623717577	159117	681.94	819.67	27	62	-1	21.19	21.19
Saccade L	1	10	12623717577	12623737443	19866	678.01	825.17	500.40	940.42	1.18	214.09	1.00	59.63	5122.55	-5061.30	3489.25
Saccade R	1	10	12623717577	12623737443	19866	678.01	825.17	500.40	940.42	1.18	214.09	1.00	59.63	5122.55	-5061.30	3489.25
Fixation L	1	11	12623737443	12624214794	477351	499.92	956.13	25	37	-1	21.41	21.41
Fixation R	1	11	12623737443	12624214794	477351	499.92	956.13	25	37	-1	21.56	21.56
