[BeGaze]
Converted from:	C:\Documents and Settings\iViewX\Desktop\EXPERIMENTATIONS\Experiments\results\finaleart\S4120113-finaleart-1.idf
Date:	27.03.2019 15:34:28
Version:	BeGaze 2.5.77
Sample Rate:	50
Subject:	S4120113
Description:	Vidal Attias

Table Header for Fixations:
Event Type	Trial	Number	Start	End	Duration	Location X	Location Y	Dispersion X	Dispersion Y	Plane	Avg. Pupil Size X	Avg. Pupil Size Y

Table Header for Saccades:
Event Type	Trial	Number	Start	End	Duration	Start Loc.X	Start Loc.Y	End Loc.X	End Loc.Y	Amplitude	Peak Speed	Peak Speed At	Average Speed	Peak Accel.	Peak Decel.	Average Accel.

Table Header for Blinks:
Event Type	Trial	Number	Start	End	Duration

Table Header for User Events:
Event Type	Trial	Number	Start	Description

UserEvent	1	1	6683743290	# Message: void.jpg
Fixation L	1	1	6683744448	6684062648	318200	771.15	516.46	7	20	-1	12.64	12.64
Fixation R	1	1	6683744448	6684062648	318200	771.15	516.46	7	20	-1	12.40	12.40
Saccade L	1	1	6684062648	6684082526	19878	767.82	509.60	869.89	498.53	0.85	103.86	1.00	42.99	2280.18	-2248.35	1934.38
Saccade R	1	1	6684062648	6684082526	19878	767.82	509.60	869.89	498.53	0.85	103.86	1.00	42.99	2280.18	-2248.35	1934.38
Fixation L	1	2	6684082526	6684778730	696204	891.62	449.88	32	58	-1	12.91	12.91
Fixation R	1	2	6684082526	6684778730	696204	891.62	449.88	32	58	-1	12.28	12.28
Saccade L	1	2	6684778730	6684798609	19879	901.00	450.51	969.32	460.02	0.62	69.77	1.00	31.17	1619.79	-1354.86	1262.37
Saccade R	1	2	6684778730	6684798609	19879	901.00	450.51	969.32	460.02	0.62	69.77	1.00	31.17	1619.79	-1354.86	1262.37
Fixation L	1	3	6684798609	6684997465	198856	996.51	499.57	33	63	-1	13.63	13.63
Fixation R	1	3	6684798609	6684997465	198856	996.51	499.57	33	63	-1	13.13	13.13
Saccade L	1	3	6684997465	6685017337	19872	1001.48	523.40	1002.38	529.65	0.10	8.67	1.00	5.01	171.58	80.24	110.77
Saccade R	1	3	6684997465	6685017337	19872	1001.48	523.40	1002.38	529.65	0.10	8.67	1.00	5.01	171.58	80.24	110.77
Fixation L	1	4	6685017337	6685733429	716092	998.08	523.47	15	33	-1	13.66	13.66
Fixation R	1	4	6685017337	6685733429	716092	998.08	523.47	15	33	-1	13.26	13.26
