[BeGaze]
Converted from:	C:\Documents and Settings\iViewX\Desktop\EXPERIMENTATIONS\Experiments\results\finaleart\S12H22222-finaleart-1.idf
Date:	27.03.2019 15:40:49
Version:	BeGaze 2.5.77
Sample Rate:	50
Subject:	S12H22222
Description:	aurele barriere

Table Header for Fixations:
Event Type	Trial	Number	Start	End	Duration	Location X	Location Y	Dispersion X	Dispersion Y	Plane	Avg. Pupil Size X	Avg. Pupil Size Y

Table Header for Saccades:
Event Type	Trial	Number	Start	End	Duration	Start Loc.X	Start Loc.Y	End Loc.X	End Loc.Y	Amplitude	Peak Speed	Peak Speed At	Average Speed	Peak Accel.	Peak Decel.	Average Accel.

Table Header for Blinks:
Event Type	Trial	Number	Start	End	Duration

Table Header for User Events:
Event Type	Trial	Number	Start	Description

UserEvent	1	1	23830690948	# Message: paysage_avec_du_betail_au_limousin_jules-dupre_1837.jpg
Fixation L	1	1	23830697662	23831314243	616581	1054.46	522.71	54	41	-1	14.00	14.00
Fixation R	1	1	23830697662	23831314243	616581	1054.46	522.71	54	41	-1	13.52	13.52
Saccade L	1	1	23831314243	23831393731	79488	1032.47	499.43	1075.50	780.28	4.09	224.51	0.75	51.41	5507.29	-5120.46	2387.60
Saccade R	1	1	23831314243	23831393731	79488	1032.47	499.43	1075.50	780.28	4.09	224.51	0.75	51.41	5507.29	-5120.46	2387.60
Fixation L	1	2	23831393731	23831572847	179116	1098.72	800.09	37	28	-1	11.78	11.78
Fixation R	1	2	23831393731	23831572847	179116	1098.72	800.09	37	28	-1	11.47	11.47
Saccade L	1	2	23831572847	23831612595	39748	1112.72	804.26	1304.16	1005.45	2.68	203.03	1.00	67.48	4940.63	-4978.46	3745.44
Saccade R	1	2	23831572847	23831612595	39748	1112.72	804.26	1304.16	1005.45	2.68	203.03	1.00	67.48	4940.63	-4978.46	3745.44
Fixation L	1	3	23831612595	23831871091	258496	1299.33	992.34	8	16	-1	12.35	12.35
Fixation R	1	3	23831612595	23831871091	258496	1299.33	992.34	8	16	-1	11.96	11.96
Saccade L	1	3	23831871091	23832070077	198986	1295.80	991.60	696.40	260.68	19.23	220.40	0.20	96.62	5483.94	-4818.47	3059.95
Saccade R	1	3	23831871091	23832070077	198986	1295.80	991.60	696.40	260.68	19.23	220.40	0.20	96.62	5483.94	-4818.47	3059.95
Fixation L	1	4	23832070077	23832209321	139244	696.18	254.95	9	39	-1	13.23	13.23
Fixation R	1	4	23832070077	23832209321	139244	696.18	254.95	9	39	-1	13.01	13.01
Saccade L	1	4	23832209321	23832229195	19874	691.17	268.10	609.47	137.64	1.08	155.68	1.00	54.34	3670.91	-2934.85	2597.37
Saccade R	1	4	23832209321	23832229195	19874	691.17	268.10	609.47	137.64	1.08	155.68	1.00	54.34	3670.91	-2934.85	2597.37
Fixation L	1	5	23832229195	23832428059	198864	624.03	128.27	30	49	-1	13.05	13.05
Fixation R	1	5	23832229195	23832428059	198864	624.03	128.27	30	49	-1	12.76	12.76
Saccade L	1	5	23832428059	23832507681	79622	624.60	139.18	564.27	1055.87	11.57	434.87	0.50	145.32	10778.43	-9229.55	6195.72
Saccade R	1	5	23832428059	23832507681	79622	624.60	139.18	564.27	1055.87	11.57	434.87	0.50	145.32	10778.43	-9229.55	6195.72
Fixation L	1	6	23832507681	23832666679	158998	575.35	1064.14	34	21	-1	13.07	13.07
Fixation R	1	6	23832507681	23832666679	158998	575.35	1064.14	34	21	-1	13.19	13.19
Saccade L	1	6	23832666679	23832686553	19874	581.49	1052.83	582.88	971.53	0.54	82.26	1.00	27.42	1897.28	-1935.47	1384.17
Saccade R	1	6	23832666679	23832686553	19874	581.49	1052.83	582.88	971.53	0.54	82.26	1.00	27.42	1897.28	-1935.47	1384.17
Fixation L	1	7	23832686553	23833004911	318358	593.60	982.30	20	19	-1	12.83	12.83
Fixation R	1	7	23832686553	23833004911	318358	593.60	982.30	20	19	-1	12.79	12.79
Saccade L	1	7	23833004911	23833044682	39771	602.93	991.23	729.68	978.06	1.31	113.60	0.50	32.83	2732.33	-2278.82	1389.82
Saccade R	1	7	23833004911	23833044682	39771	602.93	991.23	729.68	978.06	1.31	113.60	0.50	32.83	2732.33	-2278.82	1389.82
Fixation L	1	8	23833044682	23833422527	377845	767.84	951.34	56	37	-1	13.55	13.55
Fixation R	1	8	23833044682	23833422527	377845	767.84	951.34	56	37	-1	13.32	13.32
Saccade L	1	8	23833422527	23833442394	19867	785.96	956.79	795.06	960.40	0.10	9.91	1.00	5.16	108.06	-125.63	94.28
Saccade R	1	8	23833422527	23833442394	19867	785.96	956.79	795.06	960.40	0.10	9.91	1.00	5.16	108.06	-125.63	94.28
Fixation L	1	9	23833442394	23833621383	178989	803.51	960.60	12	9	-1	14.33	14.33
Fixation R	1	9	23833442394	23833621383	178989	803.51	960.60	12	9	-1	13.86	13.86
Saccade L	1	9	23833621383	23833641387	20004	805.31	955.79	620.40	961.29	1.06	187.09	1.00	53.08	4641.77	-4407.57	3178.13
Saccade R	1	9	23833621383	23833641387	20004	805.31	955.79	620.40	961.29	1.06	187.09	1.00	53.08	4641.77	-4407.57	3178.13
Fixation L	1	10	23833641387	23833999371	357984	633.43	954.69	20	8	-1	14.12	14.12
Fixation R	1	10	23833641387	23833999371	357984	633.43	954.69	20	8	-1	13.87	13.87
Saccade L	1	10	23833999371	23834019245	19874	632.61	954.03	445.56	954.43	1.22	189.16	1.00	61.40	4706.89	-4674.36	3556.57
Saccade R	1	10	23833999371	23834019245	19874	632.61	954.03	445.56	954.43	1.22	189.16	1.00	61.40	4706.89	-4674.36	3556.57
Fixation L	1	11	23834019245	23834257986	238741	410.25	961.63	52	14	-1	13.60	13.60
Fixation R	1	11	23834019245	23834257986	238741	410.25	961.63	52	14	-1	13.62	13.62
Saccade L	1	11	23834257986	23834277855	19869	414.00	968.52	291.04	960.16	0.75	124.66	1.00	37.51	3040.33	-3011.00	2171.28
Saccade R	1	11	23834257986	23834277855	19869	414.00	968.52	291.04	960.16	0.75	124.66	1.00	37.51	3040.33	-3011.00	2171.28
Fixation L	1	12	23834277855	23834476723	198868	309.55	958.97	23	8	-1	13.40	13.40
Fixation R	1	12	23834277855	23834476723	198868	309.55	958.97	23	8	-1	13.44	13.44
Saccade L	1	12	23834476723	23834516474	39751	314.81	960.53	594.29	891.76	2.48	156.87	1.00	62.49	3868.93	-3646.09	3533.79
Saccade R	1	12	23834476723	23834516474	39751	314.81	960.53	594.29	891.76	2.48	156.87	1.00	62.49	3868.93	-3646.09	3533.79
Fixation L	1	13	23834516474	23834675595	159121	602.55	892.26	27	20	-1	13.14	13.14
Fixation R	1	13	23834516474	23834675595	159121	602.55	892.26	27	20	-1	13.58	13.58
