[BeGaze]
Converted from:	C:\Documents and Settings\iViewX\Desktop\EXPERIMENTATIONS\Experiments\results\finaleart\S12H22222-finaleart-1.idf
Date:	27.03.2019 15:41:11
Version:	BeGaze 2.5.77
Sample Rate:	50
Subject:	S12H22222
Description:	aurele barriere

Table Header for Fixations:
Event Type	Trial	Number	Start	End	Duration	Location X	Location Y	Dispersion X	Dispersion Y	Plane	Avg. Pupil Size X	Avg. Pupil Size Y

Table Header for Saccades:
Event Type	Trial	Number	Start	End	Duration	Start Loc.X	Start Loc.Y	End Loc.X	End Loc.Y	Amplitude	Peak Speed	Peak Speed At	Average Speed	Peak Accel.	Peak Decel.	Average Accel.

Table Header for Blinks:
Event Type	Trial	Number	Start	End	Duration

Table Header for User Events:
Event Type	Trial	Number	Start	Description

UserEvent	1	1	24254433318	# Message: void.jpg
Fixation L	1	1	24254452975	24254552337	99362	1216.42	699.58	1	2	-1	12.82	12.82
Fixation R	1	1	24254452975	24254552337	99362	1216.42	699.58	1	2	-1	12.58	12.58
Saccade L	1	1	24254552337	24254612118	59781	1215.59	700.80	1343.93	221.29	5.25	240.73	0.67	87.84	5982.97	-5757.77	3902.34
Saccade R	1	1	24254552337	24254612118	59781	1215.59	700.80	1343.93	221.29	5.25	240.73	0.67	87.84	5982.97	-5757.77	3902.34
Fixation L	1	2	24254612118	24254950194	338076	1347.23	222.44	20	72	-1	11.98	11.98
Fixation R	1	2	24254612118	24254950194	338076	1347.23	222.44	20	72	-1	11.86	11.86
Saccade L	1	2	24254950194	24255009817	59623	1331.86	265.98	1250.77	288.38	2.54	110.78	0.33	42.57	2682.43	-2085.81	1307.14
Saccade R	1	2	24254950194	24254989945	39751	1331.86	265.98	1276.59	280.40	1.76	110.78	0.50	44.28	2682.43	-2085.81	1476.88
Blink R	1	1	24254989945	24255268426	278481
Blink L	1	1	24255009817	24255507046	497229
Blink R	1	2	24255288303	24255507046	218743
Saccade L	1	3	24255507046	24255546915	39869	1061.30	296.09	1060.86	351.92	2.09	150.32	1.00	52.39	1007.30	-3682.82	1634.93
Saccade R	1	3	24255507046	24255546915	39869	1061.30	296.09	1060.86	351.92	2.09	150.32	1.00	52.39	1007.30	-3682.82	1634.93
Fixation L	1	3	24255546915	24255666161	119246	1013.47	341.89	67	22	-1	12.68	12.68
Fixation R	1	3	24255546915	24255666161	119246	1013.47	341.89	67	22	-1	12.71	12.71
Saccade L	1	4	24255666161	24255686066	19905	993.17	349.84	983.10	359.20	0.19	13.91	1.00	9.44	157.23	-246.75	156.86
Saccade R	1	4	24255666161	24255686066	19905	993.17	349.84	983.10	359.20	0.19	13.91	1.00	9.44	157.23	-246.75	156.86
Fixation L	1	4	24255686066	24256422003	735937	972.33	387.39	46	52	-1	12.84	12.84
Fixation R	1	4	24255686066	24256422003	735937	972.33	387.39	46	52	-1	12.64	12.64
