[BeGaze]
Converted from:	C:\Documents and Settings\iViewX\Desktop\EXPERIMENTATIONS\Experiments\results\finaleart\S8119532-finaleart-1.idf
Date:	27.03.2019 15:59:59
Version:	BeGaze 2.5.77
Sample Rate:	50
Subject:	S8119532
Description:	Alexandre Drewery

Table Header for Fixations:
Event Type	Trial	Number	Start	End	Duration	Location X	Location Y	Dispersion X	Dispersion Y	Plane	Avg. Pupil Size X	Avg. Pupil Size Y

Table Header for Saccades:
Event Type	Trial	Number	Start	End	Duration	Start Loc.X	Start Loc.Y	End Loc.X	End Loc.Y	Amplitude	Peak Speed	Peak Speed At	Average Speed	Peak Accel.	Peak Decel.	Average Accel.

Table Header for Blinks:
Event Type	Trial	Number	Start	End	Duration

Table Header for User Events:
Event Type	Trial	Number	Start	Description

UserEvent	1	1	2803032875	# Message: void.jpg
Fixation L	1	1	2803043123	2803404091	360968	1033.30	506.97	16	32	-1	14.28	14.28
Fixation R	1	1	2803043123	2803404091	360968	1033.30	506.97	16	32	-1	15.91	15.91
Saccade L	1	1	2803404091	2803440860	36769	1028.99	523.71	563.98	257.40	5.34	540.49	1.00	145.14	12815.35	-12989.74	8621.13
Saccade R	1	1	2803404091	2803440860	36769	1028.99	523.71	563.98	257.40	5.34	540.49	1.00	145.14	12815.35	-12989.74	8621.13
Fixation L	1	2	2803440860	2803659724	218864	544.32	272.39	38	56	-1	14.46	14.46
Fixation R	1	2	2803440860	2803659724	218864	544.32	272.39	38	56	-1	16.05	16.05
Saccade L	1	2	2803659724	2803679626	19902	525.03	245.63	513.45	232.28	0.44	29.08	0.00	22.31	-56.88	-331.54	201.13
Saccade R	1	2	2803659724	2803679626	19902	525.03	245.63	513.45	232.28	0.44	29.08	0.00	22.31	-56.88	-331.54	201.13
Fixation L	1	3	2803679626	2803838707	159081	508.45	252.04	19	34	-1	14.44	14.44
Fixation R	1	3	2803679626	2803838707	159081	508.45	252.04	19	34	-1	16.30	16.30
Blink L	1	1	2803838707	2804079907	241200
Blink R	1	1	2803838707	2804156966	318259
Fixation L	1	4	2804118074	2804594545	476471	890.73	511.74	71	21	-1	15.66	15.66
Fixation R	1	4	2804156966	2804594545	437579	890.55	511.21	71	16	-1	16.96	16.96
Saccade L	1	3	2804594545	2804614412	19867	952.67	512.43	983.21	547.59	0.78	60.08	0.00	39.25	1057.76	-376.43	603.39
Saccade R	1	3	2804594545	2804614412	19867	952.67	512.43	983.21	547.59	0.78	60.08	0.00	39.25	1057.76	-376.43	603.39
Fixation L	1	5	2804614412	2805052020	437608	990.93	573.47	42	41	-1	15.41	15.41
Fixation R	1	5	2804614412	2805052020	437608	990.93	573.47	42	41	-1	16.88	16.88
