[BeGaze]
Converted from:	C:\Documents and Settings\iViewX\Desktop\EXPERIMENTATIONS\Experiments\results\finaleart\S18F56223-finaleart-1.idf
Date:	27.03.2019 15:48:30
Version:	BeGaze 2.5.77
Sample Rate:	50
Subject:	S18F56223
Description:	Pascale Sebillot

Table Header for Fixations:
Event Type	Trial	Number	Start	End	Duration	Location X	Location Y	Dispersion X	Dispersion Y	Plane	Avg. Pupil Size X	Avg. Pupil Size Y

Table Header for Saccades:
Event Type	Trial	Number	Start	End	Duration	Start Loc.X	Start Loc.Y	End Loc.X	End Loc.Y	Amplitude	Peak Speed	Peak Speed At	Average Speed	Peak Accel.	Peak Decel.	Average Accel.

Table Header for Blinks:
Event Type	Trial	Number	Start	End	Duration

Table Header for User Events:
Event Type	Trial	Number	Start	Description

UserEvent	1	1	2391566860	# Message: void.jpg
Fixation L	1	1	2391571304	2391869637	298333	727.70	849.87	40	38	-1	13.19	13.19
Fixation R	1	1	2391571304	2391869637	298333	727.70	849.87	40	38	-1	13.19	13.19
Saccade L	1	1	2391869637	2391909384	39747	710.56	862.22	1001.62	883.28	2.78	171.32	0.50	69.88	3658.77	-4170.56	3149.47
Saccade R	1	1	2391869637	2391909384	39747	710.56	862.22	1001.62	883.28	2.78	171.32	0.50	69.88	3658.77	-4170.56	3149.47
Fixation L	1	2	2391909384	2392148007	238623	1009.24	867.90	21	52	-1	13.35	13.35
Fixation R	1	2	2391909384	2392148007	238623	1009.24	867.90	21	52	-1	13.71	13.71
Saccade L	1	2	2392148007	2392267373	119366	1019.44	834.64	688.87	285.58	10.28	177.16	0.67	86.12	2356.06	-3122.68	1537.92
Saccade R	1	2	2392148007	2392267373	119366	1019.44	834.64	688.87	285.58	10.28	177.16	0.67	86.12	2356.06	-3122.68	1537.92
Fixation L	1	3	2392267373	2392466246	198873	697.18	288.95	23	28	-1	13.37	13.37
Fixation R	1	3	2392267373	2392466246	198873	697.18	288.95	23	28	-1	13.01	13.01
Saccade L	1	3	2392466246	2392605484	139238	694.80	302.21	34.37	44.87	13.05	268.03	0.29	93.73	6547.36	-5277.92	2804.71
Saccade R	1	3	2392466246	2392605484	139238	694.80	302.21	34.37	44.87	13.05	268.03	0.29	93.73	6547.36	-5277.92	2804.71
Fixation L	1	4	2392605484	2392804481	198997	32.21	91.88	32	63	-1	12.30	12.30
Fixation R	1	4	2392605484	2392804481	198997	32.21	91.88	32	63	-1	13.15	13.15
Saccade L	1	4	2392804481	2392883974	79493	30.59	108.27	373.42	409.69	7.84	301.80	0.75	98.65	7233.10	-7143.54	4411.09
Saccade R	1	4	2392804481	2392883974	79493	30.59	108.27	373.42	409.69	7.84	301.80	0.75	98.65	7233.10	-7143.54	4411.09
Fixation L	1	5	2392883974	2393102708	218734	351.69	380.74	40	39	-1	13.13	13.13
Fixation R	1	5	2392883974	2393102708	218734	351.69	380.74	40	39	-1	13.84	13.84
Saccade L	1	5	2393102708	2393142588	39880	332.52	369.91	557.68	702.17	3.71	248.12	0.50	93.13	6054.56	-5188.66	4428.07
Saccade R	1	5	2393102708	2393142588	39880	332.52	369.91	557.68	702.17	3.71	248.12	0.50	93.13	6054.56	-5188.66	4428.07
Fixation L	1	6	2393142588	2393560196	417608	557.40	672.28	17	52	-1	14.42	14.42
Fixation R	1	6	2393142588	2393560196	417608	557.40	672.28	17	52	-1	14.27	14.27
