[BeGaze]
Converted from:	C:\Documents and Settings\iViewX\Desktop\EXPERIMENTATIONS\Experiments\results\finaleart\S8119532-finaleart-1.idf
Date:	27.03.2019 15:59:43
Version:	BeGaze 2.5.77
Sample Rate:	50
Subject:	S8119532
Description:	Alexandre Drewery

Table Header for Fixations:
Event Type	Trial	Number	Start	End	Duration	Location X	Location Y	Dispersion X	Dispersion Y	Plane	Avg. Pupil Size X	Avg. Pupil Size Y

Table Header for Saccades:
Event Type	Trial	Number	Start	End	Duration	Start Loc.X	Start Loc.Y	End Loc.X	End Loc.Y	Amplitude	Peak Speed	Peak Speed At	Average Speed	Peak Accel.	Peak Decel.	Average Accel.

Table Header for Blinks:
Event Type	Trial	Number	Start	End	Duration

Table Header for User Events:
Event Type	Trial	Number	Start	Description

UserEvent	1	1	2704681981	# Message: void.jpg
Saccade L	1	1	2704686966	2704826209	139243	862.59	796.93	1270.44	656.78	11.22	311.28	0.86	80.57	5659.55	-7189.58	2501.06
Saccade R	1	1	2704686966	2704826209	139243	862.59	796.93	1270.44	656.78	11.22	311.28	0.86	80.57	5659.55	-7189.58	2501.06
Fixation L	1	1	2704826209	2705204935	378726	1296.01	623.56	38	49	-1	13.15	13.15
Fixation R	1	1	2704826209	2705204935	378726	1296.01	623.56	38	49	-1	13.21	13.21
Saccade L	1	2	2705204935	2705243823	38888	1300.03	621.80	1107.16	496.31	2.78	232.65	1.00	71.43	5717.17	-4735.84	3793.81
Saccade R	1	2	2705204935	2705243823	38888	1300.03	621.80	1107.16	496.31	2.78	232.65	1.00	71.43	5717.17	-4735.84	3793.81
Fixation L	1	2	2705243823	2705442677	198854	1090.78	471.54	31	50	-1	12.43	12.43
Fixation R	1	2	2705243823	2705442677	198854	1090.78	471.54	31	50	-1	12.74	12.74
Blink L	1	1	2705442677	2705764790	322113
Blink R	1	1	2705442677	2705764790	322113
Blink L	1	2	2705701281	2705959900	258619
Blink R	1	2	2705701281	2705959900	258619
Fixation L	1	3	2705959900	2706258264	298364	878.20	1034.28	26	62	-1	13.86	13.86
Fixation R	1	3	2705959900	2706258264	298364	878.20	1034.28	26	62	-1	14.34	14.34
Saccade L	1	3	2706258264	2706357633	99369	867.91	1062.25	582.11	1058.12	8.42	261.14	0.20	84.71	6073.48	-6219.39	3373.72
Saccade R	1	3	2706258264	2706357633	99369	867.91	1062.25	582.11	1058.12	8.42	261.14	0.20	84.71	6073.48	-6219.39	3373.72
Fixation L	1	4	2706357633	2706496880	139247	579.76	1051.78	27	14	-1	12.26	12.26
Fixation R	1	4	2706357633	2706496880	139247	579.76	1051.78	27	14	-1	13.52	13.52
Saccade L	1	4	2706496880	2706516743	19863	580.89	1044.13	565.97	1138.97	0.89	97.12	1.00	44.81	2015.72	-1847.91	1750.96
Saccade R	1	4	2706496880	2706516743	19863	580.89	1044.13	565.97	1138.97	0.89	97.12	1.00	44.81	2015.72	-1847.91	1750.96
Fixation L	1	5	2706516743	2706636115	119372	522.63	1120.64	61	35	-1	12.21	12.21
Fixation R	1	5	2706516743	2706636115	119372	522.63	1120.64	61	35	-1	13.43	13.43
Saccade L	1	5	2706636115	2706675865	39750	504.75	1118.84	504.84	1127.67	0.38	10.46	0.00	9.45	0.00	-71.80	28.90
Saccade R	1	5	2706636115	2706675865	39750	504.75	1118.84	504.84	1127.67	0.38	10.46	0.00	9.45	0.00	-71.80	28.90
