[BeGaze]
Converted from:	C:\Documents and Settings\iViewX\Desktop\EXPERIMENTATIONS\Experiments\results\finaleart\S01A22542-finaleart-1.idf
Date:	27.03.2019 15:33:25
Version:	BeGaze 2.5.77
Sample Rate:	50
Subject:	S01A22542
Description:	Thibault Seve Minnaert

Table Header for Fixations:
Event Type	Trial	Number	Start	End	Duration	Location X	Location Y	Dispersion X	Dispersion Y	Plane	Avg. Pupil Size X	Avg. Pupil Size Y

Table Header for Saccades:
Event Type	Trial	Number	Start	End	Duration	Start Loc.X	Start Loc.Y	End Loc.X	End Loc.Y	Amplitude	Peak Speed	Peak Speed At	Average Speed	Peak Accel.	Peak Decel.	Average Accel.

Table Header for Blinks:
Event Type	Trial	Number	Start	End	Duration

Table Header for User Events:
Event Type	Trial	Number	Start	Description

UserEvent	1	1	9873023290	# Message: void.jpg
Saccade L	1	1	9873030458	9873130086	99628	1349.48	217.01	518.75	282.27	12.49	385.30	0.80	125.38	9528.72	-8794.57	4357.91
Saccade R	1	1	9873030458	9873130086	99628	1349.48	217.01	518.75	282.27	12.49	385.30	0.80	125.38	9528.72	-8794.57	4357.91
Fixation L	1	1	9873130086	9873448569	318483	479.56	283.79	49	23	-1	15.11	15.11
Fixation R	1	1	9873130086	9873448569	318483	479.56	283.79	49	23	-1	14.71	14.71
Blink L	1	1	9873448569	9873707433	258864
Blink R	1	1	9873448569	9873707433	258864
Fixation L	1	2	9873707433	9874125546	418113	1000.44	533.07	17	68	-1	15.73	15.73
Fixation R	1	2	9873707433	9874125546	418113	1000.44	533.07	17	68	-1	15.45	15.45
Saccade L	1	2	9874125546	9874145518	19972	1005.43	522.74	1183.11	516.08	1.09	179.82	1.00	54.64	4414.02	-4152.70	3058.37
Saccade R	1	2	9874125546	9874145518	19972	1005.43	522.74	1183.11	516.08	1.09	179.82	1.00	54.64	4414.02	-4152.70	3058.37
Fixation L	1	3	9874145518	9874384389	238871	1205.05	549.84	36	47	-1	16.35	16.35
Fixation R	1	3	9874145518	9874384389	238871	1205.05	549.84	36	47	-1	15.70	15.70
Saccade L	1	3	9874384389	9874404252	19863	1178.63	557.64	1024.81	534.53	1.13	157.32	1.00	56.68	3792.01	-3484.31	2437.62
Saccade R	1	3	9874384389	9874404252	19863	1178.63	557.64	1024.81	534.53	1.13	157.32	1.00	56.68	3792.01	-3484.31	2437.62
Fixation L	1	4	9874404252	9874563630	159378	978.34	510.43	62	35	-1	15.72	15.72
Fixation R	1	4	9874404252	9874563630	159378	978.34	510.43	62	35	-1	15.25	15.25
Saccade L	1	4	9874563630	9874583524	19894	966.83	498.84	963.86	495.81	0.11	8.79	1.00	5.58	106.53	-112.50	74.52
Saccade R	1	4	9874563630	9874583524	19894	966.83	498.84	963.86	495.81	0.11	8.79	1.00	5.58	106.53	-112.50	74.52
Fixation L	1	5	9874583524	9875001604	418080	960.16	488.41	55	44	-1	15.56	15.56
Fixation R	1	5	9874583524	9875001604	418080	960.16	488.41	55	44	-1	14.67	14.67
Saccade L	1	5	9875001604	9875021478	19874	921.75	506.99	924.01	518.14	0.17	11.51	1.00	8.37	91.23	0.00	45.61
Saccade R	1	5	9875001604	9875021478	19874	921.75	506.99	924.01	518.14	0.17	11.51	1.00	8.37	91.23	0.00	45.61
