[BeGaze]
Converted from:	C:\Documents and Settings\iViewX\Desktop\EXPERIMENTATIONS\Experiments\results\finaleart\S15H25531-finaleart-1.idf
Date:	27.03.2019 15:45:35
Version:	BeGaze 2.5.77
Sample Rate:	50
Subject:	S15H25531
Description:	Mikail Demirdelen

Table Header for Fixations:
Event Type	Trial	Number	Start	End	Duration	Location X	Location Y	Dispersion X	Dispersion Y	Plane	Avg. Pupil Size X	Avg. Pupil Size Y

Table Header for Saccades:
Event Type	Trial	Number	Start	End	Duration	Start Loc.X	Start Loc.Y	End Loc.X	End Loc.Y	Amplitude	Peak Speed	Peak Speed At	Average Speed	Peak Accel.	Peak Decel.	Average Accel.

Table Header for Blinks:
Event Type	Trial	Number	Start	End	Duration

Table Header for User Events:
Event Type	Trial	Number	Start	Description

UserEvent	1	1	4502751194	# Message: void.jpg
Fixation L	1	1	4502770921	4503228383	457462	755.48	567.99	43	55	-1	15.91	15.91
Fixation R	1	1	4502770921	4503228383	457462	755.48	567.99	43	55	-1	16.87	16.87
Saccade L	1	1	4503228383	4503248257	19874	725.81	591.39	724.47	594.55	0.08	5.19	1.00	3.90	482.51	10.45	175.49
Saccade R	1	1	4503228383	4503248257	19874	725.81	591.39	724.47	594.55	0.08	5.19	1.00	3.90	482.51	10.45	175.49
Fixation L	1	2	4503248257	4503347746	99489	747.64	579.78	45	40	-1	15.37	15.37
Fixation R	1	2	4503248257	4503347746	99489	747.64	579.78	45	40	-1	16.59	16.59
Saccade L	1	2	4503347746	4503367628	19882	770.31	553.91	766.83	532.63	0.41	21.81	1.00	20.59	61.52	-225.13	109.42
Saccade R	1	2	4503347746	4503367628	19882	770.31	553.91	766.83	532.63	0.41	21.81	1.00	20.59	61.52	-225.13	109.42
Fixation L	1	3	4503367628	4504600838	1233210	781.09	519.18	30	62	-1	13.90	13.90
Fixation R	1	3	4503367628	4504600838	1233210	781.09	519.18	30	62	-1	15.04	15.04
Saccade L	1	3	4504600838	4504620690	19852	796.80	546.58	948.64	521.51	0.89	155.64	1.00	44.95	3848.26	-3750.04	2647.91
Saccade R	1	3	4504600838	4504620690	19852	796.80	546.58	948.64	521.51	0.89	155.64	1.00	44.95	3848.26	-3750.04	2647.91
Fixation L	1	4	4504620690	4504740064	119374	940.76	531.00	13	16	-1	14.97	14.97
Fixation R	1	4	4504620690	4504740064	119374	940.76	531.00	13	16	-1	16.18	16.18
