[BeGaze]
Converted from:	C:\Documents and Settings\iViewX\Desktop\EXPERIMENTATIONS\Experiments\results\finaleart\S15H25531-finaleart-1.idf
Date:	27.03.2019 15:45:15
Version:	BeGaze 2.5.77
Sample Rate:	50
Subject:	S15H25531
Description:	Mikail Demirdelen

Table Header for Fixations:
Event Type	Trial	Number	Start	End	Duration	Location X	Location Y	Dispersion X	Dispersion Y	Plane	Avg. Pupil Size X	Avg. Pupil Size Y

Table Header for Saccades:
Event Type	Trial	Number	Start	End	Duration	Start Loc.X	Start Loc.Y	End Loc.X	End Loc.Y	Amplitude	Peak Speed	Peak Speed At	Average Speed	Peak Accel.	Peak Decel.	Average Accel.

Table Header for Blinks:
Event Type	Trial	Number	Start	End	Duration

Table Header for User Events:
Event Type	Trial	Number	Start	Description

UserEvent	1	1	4221523005	# Message: manet-the-salmon-1868.jpg
Saccade L	1	1	4221537352	4221597091	59739	983.58	405.62	854.00	420.66	2.17	126.73	1.00	36.31	3120.60	-2736.12	1406.93
Saccade R	1	1	4221537352	4221597091	59739	983.58	405.62	854.00	420.66	2.17	126.73	1.00	36.31	3120.60	-2736.12	1406.93
Fixation L	1	1	4221597091	4221776082	178991	880.26	454.62	44	55	-1	14.29	14.29
Fixation R	1	1	4221597091	4221776082	178991	880.26	454.62	44	55	-1	14.77	14.77
Saccade L	1	2	4221776082	4221795953	19871	882.46	475.90	883.13	481.10	0.08	5.31	1.00	4.02	14.22	-71.77	33.91
Saccade R	1	2	4221776082	4221795953	19871	882.46	475.90	883.13	481.10	0.08	5.31	1.00	4.02	14.22	-71.77	33.91
Fixation L	1	2	4221795953	4221974968	179015	885.15	487.76	3	24	-1	14.14	14.14
Fixation R	1	2	4221795953	4221974968	179015	885.15	487.76	3	24	-1	14.69	14.69
Saccade L	1	3	4221974968	4221994840	19872	885.90	505.12	888.64	594.77	0.55	90.73	1.00	27.57	2185.30	-2123.02	1557.68
Saccade R	1	3	4221974968	4221994840	19872	885.90	505.12	888.64	594.77	0.55	90.73	1.00	27.57	2185.30	-2123.02	1557.68
Fixation L	1	3	4221994840	4222173810	178970	900.89	595.54	74	10	-1	13.67	13.67
Fixation R	1	3	4221994840	4222173810	178970	900.89	595.54	74	10	-1	14.21	14.21
Saccade L	1	4	4222173810	4222193811	20001	962.69	588.17	1047.67	588.38	0.81	85.96	1.00	40.70	1987.16	-2085.54	1813.37
Saccade R	1	4	4222173810	4222193811	20001	962.69	588.17	1047.67	588.38	0.81	85.96	1.00	40.70	1987.16	-2085.54	1813.37
Fixation L	1	4	4222193811	4222472181	278370	1061.00	577.48	19	19	-1	12.36	12.36
Fixation R	1	4	4222193811	4222472181	278370	1061.00	577.48	19	19	-1	12.56	12.56
Saccade L	1	5	4222472181	4222512057	39876	1065.35	569.38	1296.46	553.84	1.98	166.41	1.00	49.57	4095.74	-3915.28	2782.49
Saccade R	1	5	4222472181	4222512057	39876	1065.35	569.38	1296.46	553.84	1.98	166.41	1.00	49.57	4095.74	-3915.28	2782.49
Fixation L	1	5	4222512057	4222691045	178988	1304.03	512.10	20	78	-1	11.66	11.66
Fixation R	1	5	4222512057	4222691045	178988	1304.03	512.10	20	78	-1	12.08	12.08
Saccade L	1	6	4222691045	4222770539	79494	1311.79	475.41	1148.00	421.43	2.54	130.40	1.00	31.92	3191.31	-3022.26	1330.81
Saccade R	1	6	4222691045	4222770539	79494	1311.79	475.41	1148.00	421.43	2.54	130.40	1.00	31.92	3191.31	-3022.26	1330.81
Fixation L	1	6	4222770539	4222929651	159112	1118.65	422.13	61	26	-1	11.14	11.14
Fixation R	1	6	4222770539	4222929651	159112	1118.65	422.13	61	26	-1	11.48	11.48
Saccade L	1	7	4222929651	4222949534	19883	1086.81	412.42	1032.48	404.30	0.53	55.57	1.00	26.79	1346.55	-1250.67	983.45
Saccade R	1	7	4222929651	4222949534	19883	1086.81	412.42	1032.48	404.30	0.53	55.57	1.00	26.79	1346.55	-1250.67	983.45
Fixation L	1	7	4222949534	4223068899	119365	1008.83	403.23	33	5	-1	11.03	11.03
Fixation R	1	7	4222949534	4223068899	119365	1008.83	403.23	33	5	-1	11.32	11.32
Saccade L	1	8	4223068899	4223128654	59755	1001.21	406.90	517.79	711.86	6.26	321.09	0.67	104.84	7875.72	-7288.70	4505.06
Saccade R	1	8	4223068899	4223128654	59755	1001.21	406.90	517.79	711.86	6.26	321.09	0.67	104.84	7875.72	-7288.70	4505.06
Fixation L	1	8	4223128654	4223407004	278350	505.55	692.92	18	28	-1	11.44	11.44
Fixation R	1	8	4223128654	4223407004	278350	505.55	692.92	18	28	-1	11.79	11.79
Saccade L	1	9	4223407004	4223426896	19892	507.88	707.92	604.02	833.85	0.91	160.24	1.00	45.75	3907.21	-3725.45	2554.16
Saccade R	1	9	4223407004	4223426896	19892	507.88	707.92	604.02	833.85	0.91	160.24	1.00	45.75	3907.21	-3725.45	2554.16
Fixation L	1	9	4223426896	4223705380	278484	600.75	857.66	17	31	-1	11.63	11.63
Fixation R	1	9	4223426896	4223705380	278484	600.75	857.66	17	31	-1	12.83	12.83
Saccade L	1	10	4223705380	4223725239	19859	604.97	862.92	702.89	845.37	0.60	100.62	1.00	30.13	2414.00	-2282.90	1636.89
Saccade R	1	10	4223705380	4223725239	19859	604.97	862.92	702.89	845.37	0.60	100.62	1.00	30.13	2414.00	-2282.90	1636.89
Fixation L	1	10	4223725239	4223983862	258623	709.51	834.33	9	21	-1	11.44	11.44
Fixation R	1	10	4223725239	4223983862	258623	709.51	834.33	9	21	-1	12.61	12.61
Saccade L	1	11	4223983862	4224023608	39746	709.48	830.97	1057.89	840.43	2.92	223.83	0.50	73.37	5529.68	-5380.76	3981.22
Saccade R	1	11	4223983862	4224023608	39746	709.48	830.97	1057.89	840.43	2.92	223.83	0.50	73.37	5529.68	-5380.76	3981.22
Fixation L	1	11	4224023608	4224202600	178992	1062.17	884.87	6	61	-1	11.67	11.67
Fixation R	1	11	4224023608	4224202600	178992	1062.17	884.87	6	61	-1	12.52	12.52
Saccade L	1	12	4224202600	4224262340	59740	1062.75	900.71	1441.44	547.94	5.70	266.73	0.67	95.40	6510.70	-6317.38	4153.74
Saccade R	1	12	4224202600	4224262340	59740	1062.75	900.71	1441.44	547.94	5.70	266.73	0.67	95.40	6510.70	-6317.38	4153.74
Fixation L	1	12	4224262340	4224779444	517104	1444.84	577.28	34	59	-1	11.24	11.24
Fixation R	1	12	4224262340	4224779444	517104	1444.84	577.28	34	59	-1	11.47	11.47
Saccade L	1	13	4224779444	4224799320	19876	1417.30	607.79	1414.97	615.25	0.21	20.71	1.00	10.66	88.44	-320.05	144.84
Saccade R	1	13	4224779444	4224799320	19876	1417.30	607.79	1414.97	615.25	0.21	20.71	1.00	10.66	88.44	-320.05	144.84
Fixation L	1	13	4224799320	4224938564	139244	1405.56	612.83	19	17	-1	11.12	11.12
Fixation R	1	13	4224799320	4224938564	139244	1405.56	612.83	19	17	-1	11.08	11.08
Saccade L	1	14	4224938564	4224958434	19870	1395.50	600.91	1380.31	475.64	0.82	127.63	1.00	41.22	3082.63	-2657.57	1935.52
Saccade R	1	14	4224938564	4224958434	19870	1395.50	600.91	1380.31	475.64	0.82	127.63	1.00	41.22	3082.63	-2657.57	1935.52
Fixation L	1	14	4224958434	4225157428	198994	1345.27	498.00	50	45	-1	10.98	10.98
Fixation R	1	14	4224958434	4225157428	198994	1345.27	498.00	50	45	-1	11.24	11.24
Saccade L	1	15	4225157428	4225256814	99386	1334.88	481.84	1156.60	389.23	3.64	124.74	1.00	36.66	3097.47	-2656.98	1120.72
Saccade R	1	15	4225157428	4225256814	99386	1334.88	481.84	1156.60	389.23	3.64	124.74	1.00	36.66	3097.47	-2656.98	1120.72
Fixation L	1	15	4225256814	4225515407	258593	1167.85	349.43	19	54	-1	10.99	10.99
Fixation R	1	15	4225256814	4225515407	258593	1167.85	349.43	19	54	-1	11.32	11.32
