[BeGaze]
Converted from:	C:\Documents and Settings\iViewX\Desktop\EXPERIMENTATIONS\Experiments\results\finaleart\S16F14542-finaleart-1.idf
Date:	27.03.2019 15:46:13
Version:	BeGaze 2.5.77
Sample Rate:	50
Subject:	S16F14542
Description:	Diane Dewez

Table Header for Fixations:
Event Type	Trial	Number	Start	End	Duration	Location X	Location Y	Dispersion X	Dispersion Y	Plane	Avg. Pupil Size X	Avg. Pupil Size Y

Table Header for Saccades:
Event Type	Trial	Number	Start	End	Duration	Start Loc.X	Start Loc.Y	End Loc.X	End Loc.Y	Amplitude	Peak Speed	Peak Speed At	Average Speed	Peak Accel.	Peak Decel.	Average Accel.

Table Header for Blinks:
Event Type	Trial	Number	Start	End	Duration

Table Header for User Events:
Event Type	Trial	Number	Start	Description

UserEvent	1	1	6351540522	# Message: void.jpg
Blink L	1	1	6351555154	6351773885	218731
Blink R	1	1	6351555154	6351773885	218731
Fixation L	1	1	6351773885	6352291114	517229	1337.40	981.10	68	29	-1	15.37	15.37
Fixation R	1	1	6351773885	6352291114	517229	1337.40	981.10	68	29	-1	15.49	15.49
Saccade L	1	1	6352291114	6352310985	19871	1310.35	983.60	1308.67	979.41	0.07	5.46	1.00	3.55	1.59	-83.31	35.75
Saccade R	1	1	6352291114	6352310985	19871	1310.35	983.60	1308.67	979.41	0.07	5.46	1.00	3.55	1.59	-83.31	35.75
Fixation L	1	2	6352310985	6352450240	139255	1304.17	978.29	22	3	-1	14.48	14.48
Fixation R	1	2	6352310985	6352450240	139255	1304.17	978.29	22	3	-1	14.89	14.89
Saccade L	1	2	6352450240	6352470099	19859	1286.24	979.97	1106.72	976.12	1.22	181.59	1.00	61.63	4497.69	-4355.80	3145.75
Saccade R	1	2	6352450240	6352470099	19859	1286.24	979.97	1106.72	976.12	1.22	181.59	1.00	61.63	4497.69	-4355.80	3145.75
Fixation L	1	3	6352470099	6352947453	477354	1076.41	927.76	42	57	-1	13.27	13.27
Fixation R	1	3	6352470099	6352947453	477354	1076.41	927.76	42	57	-1	14.09	14.09
Saccade L	1	3	6352947453	6353066819	119366	1064.40	938.03	880.71	743.49	4.07	195.55	0.83	34.14	4868.48	-4647.50	1646.13
Saccade R	1	3	6352947453	6353066819	119366	1064.40	938.03	880.71	743.49	4.07	195.55	0.83	34.14	4868.48	-4647.50	1646.13
Fixation L	1	4	6353066819	6353484430	417611	868.32	738.57	18	77	-1	13.70	13.70
Fixation R	1	4	6353066819	6353484430	417611	868.32	738.57	18	77	-1	15.38	15.38
Saccade L	1	4	6353484430	6353524294	39864	871.53	702.67	874.25	673.02	1.33	60.64	1.00	33.37	0.00	-597.15	379.26
Saccade R	1	4	6353484430	6353524294	39864	871.53	702.67	874.25	673.02	1.33	60.64	1.00	33.37	0.00	-597.15	379.26
