[BeGaze]
Converted from:	C:\Documents and Settings\iViewX\Desktop\EXPERIMENTATIONS\Experiments\results\finaleart\S13H22431-finaleart-1.idf
Date:	27.03.2019 15:42:01
Version:	BeGaze 2.5.77
Sample Rate:	50
Subject:	S13H22431
Description:	Jimmy Petit

Table Header for Fixations:
Event Type	Trial	Number	Start	End	Duration	Location X	Location Y	Dispersion X	Dispersion Y	Plane	Avg. Pupil Size X	Avg. Pupil Size Y

Table Header for Saccades:
Event Type	Trial	Number	Start	End	Duration	Start Loc.X	Start Loc.Y	End Loc.X	End Loc.Y	Amplitude	Peak Speed	Peak Speed At	Average Speed	Peak Accel.	Peak Decel.	Average Accel.

Table Header for Blinks:
Event Type	Trial	Number	Start	End	Duration

Table Header for User Events:
Event Type	Trial	Number	Start	Description

UserEvent	1	1	27987438140	# Message: void.jpg
Saccade L	1	1	27987457582	27987497435	39853	807.85	961.70	802.54	950.48	1.64	146.33	1.00	41.26	27270.82	0.00	7810.72
Saccade R	1	1	27987457582	27987497435	39853	807.85	961.70	802.54	950.48	1.64	146.33	1.00	41.26	27270.82	0.00	7810.72
Blink L	1	1	27987497435	27987636691	139256
Blink R	1	1	27987497435	27987636691	139256
Fixation L	1	1	27987636691	27988273155	636464	753.51	449.39	36	56	-1	17.07	17.07
Fixation R	1	1	27987636691	27988273155	636464	753.51	449.39	36	56	-1	17.02	17.02
Saccade L	1	2	27988273155	27988293032	19877	778.33	486.73	784.69	482.81	0.08	7.56	1.00	4.15	122.98	55.62	85.09
Saccade R	1	2	27988273155	27988293032	19877	778.33	486.73	784.69	482.81	0.08	7.56	1.00	4.15	122.98	55.62	85.09
Fixation L	1	2	27988293032	27988432265	139233	787.19	489.02	13	12	-1	16.25	16.25
Fixation R	1	2	27988293032	27988432265	139233	787.19	489.02	13	12	-1	16.16	16.16
Saccade L	1	3	27988432265	27988472009	39744	794.42	494.26	1063.87	485.43	2.55	180.51	0.50	64.26	4434.42	-3534.87	3065.48
Saccade R	1	3	27988432265	27988472009	39744	794.42	494.26	1063.87	485.43	2.55	180.51	0.50	64.26	4434.42	-3534.87	3065.48
Fixation L	1	3	27988472009	27988810128	338119	1103.91	474.30	45	16	-1	16.76	16.76
Fixation R	1	3	27988472009	27988810128	338119	1103.91	474.30	45	16	-1	16.69	16.69
Saccade L	1	4	27988810128	27988929498	119370	1108.83	481.37	939.43	604.10	4.11	146.25	0.17	34.46	3589.52	-3288.48	1863.34
Saccade R	1	4	27988810128	27988929498	119370	1108.83	481.37	939.43	604.10	4.11	146.25	0.17	34.46	3589.52	-3288.48	1863.34
Blink L	1	2	27988929498	27989088637	159139
Blink R	1	2	27988929498	27989088637	159139
Fixation L	1	4	27989088637	27989426724	338087	835.45	606.81	7	22	-1	18.01	18.01
Fixation R	1	4	27989088637	27989426724	338087	835.45	606.81	7	22	-1	17.54	17.54
