[BeGaze]
Converted from:	C:\Documents and Settings\iViewX\Desktop\EXPERIMENTATIONS\Experiments\results\finaleart\S3121421-finaleart-1.idf
Date:	27.03.2019 15:34:07
Version:	BeGaze 2.5.77
Sample Rate:	50
Subject:	S3121421
Description:	Jean Jouve

Table Header for Fixations:
Event Type	Trial	Number	Start	End	Duration	Location X	Location Y	Dispersion X	Dispersion Y	Plane	Avg. Pupil Size X	Avg. Pupil Size Y

Table Header for Saccades:
Event Type	Trial	Number	Start	End	Duration	Start Loc.X	Start Loc.Y	End Loc.X	End Loc.Y	Amplitude	Peak Speed	Peak Speed At	Average Speed	Peak Accel.	Peak Decel.	Average Accel.

Table Header for Blinks:
Event Type	Trial	Number	Start	End	Duration

Table Header for User Events:
Event Type	Trial	Number	Start	Description

UserEvent	1	1	5243223534	# Message: void.jpg
Fixation L	1	1	5243228029	5243407014	178985	1335.19	138.55	15	20	-1	9.29	9.29
Fixation R	1	1	5243228029	5243407014	178985	1335.19	138.55	15	20	-1	10.06	10.06
Saccade L	1	1	5243407014	5243486624	79610	1331.81	148.64	1701.72	136.64	6.06	241.11	0.25	76.14	5953.19	-4291.15	3032.29
Saccade R	1	1	5243407014	5243486624	79610	1331.81	148.64	1701.72	136.64	6.06	241.11	0.25	76.14	5953.19	-4291.15	3032.29
Fixation L	1	2	5243486624	5243705496	218872	1695.88	119.41	13	41	-1	9.46	9.46
Fixation R	1	2	5243486624	5243705496	218872	1695.88	119.41	13	41	-1	10.04	10.04
Saccade L	1	2	5243705496	5243864737	159241	1700.40	100.26	1891.97	705.26	12.70	145.63	0.75	79.77	2781.55	-2542.53	1631.14
Saccade R	1	2	5243705496	5243864737	159241	1700.40	100.26	1891.97	705.26	12.70	145.63	0.75	79.77	2781.55	-2542.53	1631.14
Fixation L	1	3	5243864737	5244083613	218876	1866.29	699.98	48	22	-1	10.56	10.56
Fixation R	1	3	5243864737	5244083613	218876	1866.29	699.98	48	22	-1	9.24	9.24
Saccade L	1	3	5244083613	5244202964	119351	1843.87	698.51	1078.41	807.06	14.06	435.37	0.17	117.77	10746.55	-6693.18	4221.42
Saccade R	1	3	5244083613	5244202964	119351	1843.87	698.51	1078.41	807.06	14.06	435.37	0.17	117.77	10746.55	-6693.18	4221.42
Blink L	1	1	5244202964	5244421825	218861
Blink R	1	1	5244202964	5244421825	218861
Fixation L	1	4	5244421825	5245217764	795939	873.68	615.61	13	69	-1	12.47	12.47
Fixation R	1	4	5244421825	5245217764	795939	873.68	615.61	13	69	-1	13.21	13.21
