[BeGaze]
Converted from:	C:\Documents and Settings\iViewX\Desktop\EXPERIMENTATIONS\Experiments\results\finaleart\S5121332-finaleart-1.idf
Date:	27.03.2019 15:35:36
Version:	BeGaze 2.5.77
Sample Rate:	50
Subject:	S5121332
Description:	Dylan Marinho

Table Header for Fixations:
Event Type	Trial	Number	Start	End	Duration	Location X	Location Y	Dispersion X	Dispersion Y	Plane	Avg. Pupil Size X	Avg. Pupil Size Y

Table Header for Saccades:
Event Type	Trial	Number	Start	End	Duration	Start Loc.X	Start Loc.Y	End Loc.X	End Loc.Y	Amplitude	Peak Speed	Peak Speed At	Average Speed	Peak Accel.	Peak Decel.	Average Accel.

Table Header for Blinks:
Event Type	Trial	Number	Start	End	Duration

Table Header for User Events:
Event Type	Trial	Number	Start	Description

UserEvent	1	1	10485091639	# Message: paysage_avec_du_betail_au_limousin_jules-dupre_1837.jpg
Fixation L	1	1	10485092925	10485649759	556834	972.45	535.84	11	32	-1	13.54	13.54
Fixation R	1	1	10485092925	10485649759	556834	972.45	535.84	11	32	-1	12.96	12.96
Saccade L	1	1	10485649759	10485689621	39862	965.30	558.34	837.26	882.67	3.05	225.54	0.50	76.39	5631.43	-5503.21	4424.23
Saccade R	1	1	10485649759	10485689621	39862	965.30	558.34	837.26	882.67	3.05	225.54	0.50	76.39	5631.43	-5503.21	4424.23
Fixation L	1	2	10485689621	10486107230	417609	826.30	880.17	40	56	-1	13.25	13.25
Fixation R	1	2	10485689621	10486107230	417609	826.30	880.17	40	56	-1	12.75	12.75
Saccade L	1	2	10486107230	10486127105	19875	798.07	909.74	794.45	907.36	0.08	6.64	1.00	3.97	-47.19	-56.69	51.86
Saccade R	1	2	10486107230	10486127105	19875	798.07	909.74	794.45	907.36	0.08	6.64	1.00	3.97	-47.19	-56.69	51.86
Fixation L	1	3	10486127105	10486365839	238734	787.78	909.85	11	5	-1	12.84	12.84
Fixation R	1	3	10486127105	10486365839	238734	787.78	909.85	11	5	-1	11.90	11.90
Saccade L	1	3	10486365839	10486405591	39752	784.08	909.66	537.82	917.99	2.21	173.34	1.00	55.68	4253.44	-4122.84	2901.29
Saccade R	1	3	10486365839	10486405591	39752	784.08	909.66	537.82	917.99	2.21	173.34	1.00	55.68	4253.44	-4122.84	2901.29
Fixation L	1	4	10486405591	10487061917	656326	539.56	936.01	45	32	-1	12.40	12.40
Fixation R	1	4	10486405591	10487061917	656326	539.56	936.01	45	32	-1	12.52	12.52
Saccade L	1	4	10487061917	10487081790	19873	510.94	950.63	510.20	978.03	0.31	27.73	1.00	15.55	594.45	-552.06	558.71
Saccade R	1	4	10487061917	10487081790	19873	510.94	950.63	510.20	978.03	0.31	27.73	1.00	15.55	594.45	-552.06	558.71
Fixation L	1	5	10487081790	10487698377	616587	494.02	1004.56	38	37	-1	13.22	13.22
Fixation R	1	5	10487081790	10487698377	616587	494.02	1004.56	38	37	-1	13.30	13.30
Saccade L	1	5	10487698377	10487718372	19995	474.74	999.91	351.65	984.67	0.87	125.45	1.00	43.33	2990.74	-2776.36	2096.83
Saccade R	1	5	10487698377	10487718372	19995	474.74	999.91	351.65	984.67	0.87	125.45	1.00	43.33	2990.74	-2776.36	2096.83
Fixation L	1	6	10487718372	10488175851	457479	366.55	957.82	33	45	-1	13.42	13.42
Fixation R	1	6	10487718372	10488175851	457479	366.55	957.82	33	45	-1	13.25	13.25
Saccade L	1	6	10488235472	10488275222	39750	5.10	0.00	2.63	0.00	9.36	1170.29	1.00	235.52	-12.36	-29216.55	7335.42
Saccade R	1	6	10488235472	10488255361	19889	5.10	0.00	3.48	0.00	5.85	1170.29	1.00	294.27	-27.29	-29216.55	9776.44
Saccade R	1	7	10488275222	10488295099	19877	2.63	0.00	2.09	0.00	0.02	1.63	1.00	0.85	35786.33	-27.29	11941.99
Saccade L	1	7	10488295099	10488354846	59747	2.09	0.00	1322.23	471.30	15.12	1431.99	0.67	253.06	35786.33	-35282.11	14770.40
Blink R	1	1	10488295099	10488394597	99498
Fixation L	1	7	10488354846	10488633201	278355	1288.44	490.90	44	39	-1	14.03	14.03
Fixation R	1	7	10488394597	10488633201	238604	1284.14	492.63	19	31	-1	14.07	14.07
Saccade L	1	8	10488633201	10488673078	39877	1277.35	488.91	1060.65	498.86	1.83	109.97	1.00	45.89	2709.51	-2614.79	2646.68
Saccade R	1	8	10488633201	10488673078	39877	1277.35	488.91	1060.65	498.86	1.83	109.97	1.00	45.89	2709.51	-2614.79	2646.68
Fixation L	1	8	10488673078	10489070798	397720	1058.31	511.70	12	20	-1	13.39	13.39
Fixation R	1	8	10488673078	10489070798	397720	1058.31	511.70	12	20	-1	13.06	13.06
Saccade L	1	9	10489070798	10489110674	39876	1066.66	513.32	913.61	765.97	3.05	164.41	1.00	76.52	4037.85	0.00	2477.16
Saccade R	1	9	10489070798	10489110674	39876	1066.66	513.32	913.61	765.97	3.05	164.41	1.00	76.52	4037.85	0.00	2477.16
