[BeGaze]
Converted from:	C:\Documents and Settings\iViewX\Desktop\EXPERIMENTATIONS\Experiments\results\finaleart\S3121421-finaleart-1.idf
Date:	27.03.2019 15:33:59
Version:	BeGaze 2.5.77
Sample Rate:	50
Subject:	S3121421
Description:	Jean Jouve

Table Header for Fixations:
Event Type	Trial	Number	Start	End	Duration	Location X	Location Y	Dispersion X	Dispersion Y	Plane	Avg. Pupil Size X	Avg. Pupil Size Y

Table Header for Saccades:
Event Type	Trial	Number	Start	End	Duration	Start Loc.X	Start Loc.Y	End Loc.X	End Loc.Y	Amplitude	Peak Speed	Peak Speed At	Average Speed	Peak Accel.	Peak Decel.	Average Accel.

Table Header for Blinks:
Event Type	Trial	Number	Start	End	Duration

Table Header for User Events:
Event Type	Trial	Number	Start	Description

UserEvent	1	1	4584954862	# Message: void.jpg
Fixation L	1	1	4584958806	4585933844	975038	1159.26	702.50	16	41	-1	12.11	12.11
Fixation R	1	1	4584958806	4585933844	975038	1159.26	702.50	16	41	-1	12.26	12.26
Saccade L	1	1	4585933844	4585973591	39747	1160.82	703.63	1145.49	373.19	3.15	202.44	0.50	79.35	4905.77	-3895.34	3773.33
Saccade R	1	1	4585933844	4585973591	39747	1160.82	703.63	1145.49	373.19	3.15	202.44	0.50	79.35	4905.77	-3895.34	3773.33
Fixation L	1	2	4585973591	4586092964	119373	1121.43	335.01	47	51	-1	11.80	11.80
Fixation R	1	2	4585973591	4586092964	119373	1121.43	335.01	47	51	-1	12.24	12.24
Saccade L	1	2	4586092964	4586112836	19872	1097.58	336.71	1093.76	339.85	0.14	15.72	0.00	6.82	103.90	-258.33	152.57
Saccade R	1	2	4586092964	4586112836	19872	1097.58	336.71	1093.76	339.85	0.14	15.72	0.00	6.82	103.90	-258.33	152.57
Fixation L	1	3	4586112836	4586809295	696459	1081.05	359.06	24	71	-1	11.79	11.79
Fixation R	1	3	4586112836	4586809295	696459	1081.05	359.06	24	71	-1	12.09	12.09
Saccade L	1	3	4586809295	4586829173	19878	1085.50	364.88	1006.00	490.72	1.08	150.54	1.00	54.52	3649.07	-3277.27	2753.30
Saccade R	1	3	4586809295	4586829173	19878	1085.50	364.88	1006.00	490.72	1.08	150.54	1.00	54.52	3649.07	-3277.27	2753.30
Fixation L	1	4	4586829173	4586928679	99506	1000.05	546.82	20	79	-1	12.61	12.61
Fixation R	1	4	4586829173	4586928679	99506	1000.05	546.82	20	79	-1	12.80	12.80
Saccade L	1	4	4586928679	4586948535	19856	989.08	542.85	984.14	584.02	0.52	41.95	1.00	26.21	822.23	0.00	411.12
Saccade R	1	4	4586928679	4586948535	19856	989.08	542.85	984.14	584.02	0.52	41.95	1.00	26.21	822.23	0.00	411.12
