[BeGaze]
Converted from:	C:\Documents and Settings\iViewX\Desktop\EXPERIMENTATIONS\Experiments\results\finaleart\S15H25531-finaleart-1.idf
Date:	27.03.2019 15:45:10
Version:	BeGaze 2.5.77
Sample Rate:	50
Subject:	S15H25531
Description:	Mikail Demirdelen

Table Header for Fixations:
Event Type	Trial	Number	Start	End	Duration	Location X	Location Y	Dispersion X	Dispersion Y	Plane	Avg. Pupil Size X	Avg. Pupil Size Y

Table Header for Saccades:
Event Type	Trial	Number	Start	End	Duration	Start Loc.X	Start Loc.Y	End Loc.X	End Loc.Y	Amplitude	Peak Speed	Peak Speed At	Average Speed	Peak Accel.	Peak Decel.	Average Accel.

Table Header for Blinks:
Event Type	Trial	Number	Start	End	Duration

Table Header for User Events:
Event Type	Trial	Number	Start	Description

UserEvent	1	1	4116937621	# Message: Turner-chichester-canal-1828.jpg
Fixation L	1	1	4116942107	4117339984	397877	313.51	477.93	42	53	-1	13.75	13.75
Fixation R	1	1	4116942107	4117339984	397877	313.51	477.93	42	53	-1	14.68	14.68
Saccade L	1	1	4117339984	4117399586	59602	301.74	501.46	834.63	663.28	6.31	311.81	0.67	105.83	7519.78	-6810.99	5076.54
Saccade R	1	1	4117339984	4117399586	59602	301.74	501.46	834.63	663.28	6.31	311.81	0.67	105.83	7519.78	-6810.99	5076.54
Fixation L	1	2	4117399586	4117578569	178983	864.14	671.66	36	16	-1	13.38	13.38
Fixation R	1	2	4117399586	4117578569	178983	864.14	671.66	36	16	-1	14.46	14.46
Saccade L	1	2	4117578569	4117618430	39861	864.71	679.28	288.74	777.19	4.86	309.82	0.50	121.97	7684.00	-7459.08	7156.00
Saccade R	1	2	4117578569	4117618430	39861	864.71	679.28	288.74	777.19	4.86	309.82	0.50	121.97	7684.00	-7459.08	7156.00
Fixation L	1	3	4117618430	4117837195	218765	304.23	793.22	48	22	-1	11.11	11.11
Fixation R	1	3	4117618430	4117837195	218765	304.23	793.22	48	22	-1	12.25	12.25
Saccade L	1	3	4117837195	4117876927	39732	337.22	790.36	952.87	732.04	5.49	414.81	0.50	138.23	10329.87	-9685.77	7154.53
Saccade R	1	3	4117837195	4117876927	39732	337.22	790.36	952.87	732.04	5.49	414.81	0.50	138.23	10329.87	-9685.77	7154.53
Fixation L	1	4	4117876927	4118095795	218868	948.65	664.55	7	85	-1	10.46	10.46
Fixation R	1	4	4117876927	4118095795	218868	948.65	664.55	7	85	-1	10.46	10.46
Saccade L	1	4	4118095795	4118115674	19879	947.10	646.41	1070.55	646.03	0.73	124.87	1.00	36.91	2797.21	-2824.64	1918.15
Saccade R	1	4	4118095795	4118115674	19879	947.10	646.41	1070.55	646.03	0.73	124.87	1.00	36.91	2797.21	-2824.64	1918.15
Fixation L	1	5	4118115674	4118632762	517088	1055.79	611.91	37	51	-1	9.94	9.94
Fixation R	1	5	4118115674	4118632762	517088	1055.79	611.91	37	51	-1	10.44	10.44
Saccade L	1	5	4118632762	4118652637	19875	1037.36	594.88	1012.75	608.07	0.32	31.24	1.00	16.05	716.81	-334.08	567.81
Saccade R	1	5	4118632762	4118652637	19875	1037.36	594.88	1012.75	608.07	0.32	31.24	1.00	16.05	716.81	-334.08	567.81
Fixation L	1	6	4118652637	4118950994	298357	962.48	606.05	68	30	-1	9.44	9.44
Fixation R	1	6	4118652637	4118950994	298357	962.48	606.05	68	30	-1	9.86	9.86
Saccade L	1	6	4118950994	4118970875	19881	944.01	598.97	944.08	587.74	0.16	11.36	1.00	8.10	203.03	-228.79	144.86
Saccade R	1	6	4118950994	4118970875	19881	944.01	598.97	944.08	587.74	0.16	11.36	1.00	8.10	203.03	-228.79	144.86
Fixation L	1	7	4118970875	4119229485	258610	941.88	588.59	62	17	-1	8.93	8.93
Fixation R	1	7	4118970875	4119229485	258610	941.88	588.59	62	17	-1	9.14	9.14
Saccade L	1	7	4119229485	4119249369	19884	887.17	599.82	863.27	683.77	0.87	88.29	1.00	43.70	2116.43	-2098.27	1813.97
Saccade R	1	7	4119229485	4119249369	19884	887.17	599.82	863.27	683.77	0.87	88.29	1.00	43.70	2116.43	-2098.27	1813.97
Fixation L	1	8	4119249369	4119527848	278479	847.71	675.52	23	12	-1	8.96	8.96
Fixation R	1	8	4119249369	4119527848	278479	847.71	675.52	23	12	-1	9.19	9.19
Saccade L	1	8	4119527848	4119547724	19876	859.14	678.05	978.47	674.28	0.74	120.75	1.00	37.46	2708.48	-2431.32	1823.09
Saccade R	1	8	4119527848	4119547724	19876	859.14	678.05	978.47	674.28	0.74	120.75	1.00	37.46	2708.48	-2431.32	1823.09
Fixation L	1	9	4119547724	4119846076	298352	1025.47	678.85	60	10	-1	9.02	9.02
Fixation R	1	9	4119547724	4119846076	298352	1025.47	678.85	60	10	-1	9.38	9.38
Saccade L	1	9	4119846076	4119885830	39754	1038.83	680.24	477.47	681.55	4.99	337.48	1.00	125.48	8403.36	-8131.09	6645.81
Saccade R	1	9	4119846076	4119885830	39754	1038.83	680.24	477.47	681.55	4.99	337.48	1.00	125.48	8403.36	-8131.09	6645.81
Fixation L	1	10	4119885830	4120084693	198863	420.07	693.11	67	30	-1	9.08	9.08
Fixation R	1	10	4119885830	4120084693	198863	420.07	693.11	67	30	-1	9.60	9.60
Saccade L	1	10	4120084693	4120164321	79628	414.40	711.89	280.81	720.12	1.88	138.51	1.00	23.65	3364.68	-3449.18	1161.52
Saccade R	1	10	4120084693	4120164321	79628	414.40	711.89	280.81	720.12	1.88	138.51	1.00	23.65	3364.68	-3449.18	1161.52
Fixation L	1	11	4120164321	4120582052	417731	286.47	722.36	16	11	-1	9.52	9.52
Fixation R	1	11	4120164321	4120582052	417731	286.47	722.36	16	11	-1	9.98	9.98
Saccade L	1	11	4120582052	4120641666	59614	275.28	716.77	222.39	738.06	3.23	98.09	1.00	54.13	1873.48	-1979.10	1561.67
Saccade R	1	11	4120582052	4120641666	59614	275.28	716.77	222.39	738.06	3.23	98.09	1.00	54.13	1873.48	-1979.10	1561.67
Fixation L	1	12	4120641666	4120920151	278485	259.44	731.06	54	20	-1	10.00	10.00
Fixation R	1	12	4120641666	4120920151	278485	259.44	731.06	54	20	-1	10.54	10.54
