[BeGaze]
Converted from:	C:\Documents and Settings\iViewX\Desktop\EXPERIMENTATIONS\Experiments\results\finaleart\S02123220-finaleart-1.idf
Date:	27.03.2019 15:33:45
Version:	BeGaze 2.5.77
Sample Rate:	50
Subject:	S02123220
Description:	David Xu

Table Header for Fixations:
Event Type	Trial	Number	Start	End	Duration	Location X	Location Y	Dispersion X	Dispersion Y	Plane	Avg. Pupil Size X	Avg. Pupil Size Y

Table Header for Saccades:
Event Type	Trial	Number	Start	End	Duration	Start Loc.X	Start Loc.Y	End Loc.X	End Loc.Y	Amplitude	Peak Speed	Peak Speed At	Average Speed	Peak Accel.	Peak Decel.	Average Accel.

Table Header for Blinks:
Event Type	Trial	Number	Start	End	Duration

Table Header for User Events:
Event Type	Trial	Number	Start	Description

UserEvent	1	1	2159902799	# Message: goya-Bodegones-con-pargos-dorados-1812.jpg
Fixation L	1	1	2159905615	2160263638	358023	968.89	460.08	20	15	-1	13.78	13.78
Fixation R	1	1	2159905615	2160263638	358023	968.89	460.08	20	15	-1	11.97	11.97
Saccade L	1	1	2160263638	2160363097	99459	972.29	462.19	859.42	610.07	3.38	96.01	0.20	33.94	2349.92	-1503.10	940.50
Saccade R	1	1	2160263638	2160363097	99459	972.29	462.19	859.42	610.07	3.38	96.01	0.20	33.94	2349.92	-1503.10	940.50
Fixation L	1	2	2160363097	2160561956	198859	857.88	591.52	11	68	-1	14.18	14.18
Fixation R	1	2	2160363097	2160561956	198859	857.88	591.52	11	68	-1	11.90	11.90
Saccade L	1	2	2160561956	2160581822	19866	856.26	586.93	775.66	610.14	0.72	84.84	1.00	36.03	1687.72	-1751.16	1309.12
Saccade R	1	2	2160561956	2160581822	19866	856.26	586.93	775.66	610.14	0.72	84.84	1.00	36.03	1687.72	-1751.16	1309.12
Fixation L	1	3	2160581822	2160721071	139249	738.70	602.72	51	15	-1	14.03	14.03
Fixation R	1	3	2160581822	2160721071	139249	738.70	602.72	51	15	-1	12.37	12.37
Saccade L	1	3	2160721071	2160740940	19869	745.42	605.40	832.57	582.52	0.63	91.15	1.00	31.68	2224.75	-1811.88	1398.76
Saccade R	1	3	2160721071	2160740940	19869	745.42	605.40	832.57	582.52	0.63	91.15	1.00	31.68	2224.75	-1811.88	1398.76
Fixation L	1	4	2160740940	2160979669	238729	823.06	550.16	20	60	-1	14.07	14.07
Fixation R	1	4	2160740940	2160979669	238729	823.06	550.16	20	60	-1	12.29	12.29
Saccade L	1	4	2160979669	2161019424	39755	811.83	521.58	555.04	547.60	2.27	173.38	1.00	57.08	4294.44	-3081.68	2800.09
Saccade R	1	4	2160979669	2161019424	39755	811.83	521.58	555.04	547.60	2.27	173.38	1.00	57.08	4294.44	-3081.68	2800.09
Fixation L	1	5	2161019424	2161118906	99482	561.02	572.73	8	67	-1	14.42	14.42
Fixation R	1	5	2161019424	2161118906	99482	561.02	572.73	8	67	-1	12.95	12.95
Saccade L	1	5	2161118906	2161138782	19876	563.36	601.26	578.17	621.21	0.30	25.14	1.00	14.89	258.44	8.33	106.13
Saccade R	1	5	2161118906	2161138782	19876	563.36	601.26	578.17	621.21	0.30	25.14	1.00	14.89	258.44	8.33	106.13
Fixation L	1	6	2161138782	2161297907	159125	579.46	623.17	13	24	-1	14.59	14.59
Fixation R	1	6	2161138782	2161297907	159125	579.46	623.17	13	24	-1	13.27	13.27
Saccade L	1	6	2161297907	2161337653	39746	576.61	616.76	561.72	854.54	2.11	121.31	0.50	52.97	2908.76	-2751.20	2732.69
Saccade R	1	6	2161297907	2161337653	39746	576.61	616.76	561.72	854.54	2.11	121.31	0.50	52.97	2908.76	-2751.20	2732.69
Fixation L	1	7	2161337653	2161437150	99497	573.84	863.36	25	62	-1	14.85	14.85
Fixation R	1	7	2161337653	2161437150	99497	573.84	863.36	25	62	-1	13.19	13.19
Saccade L	1	7	2161437150	2161496762	59612	587.19	898.82	616.17	898.97	2.25	63.89	0.00	37.69	526.05	-1285.19	624.95
Saccade R	1	7	2161437150	2161496762	59612	587.19	898.82	616.17	898.97	2.25	63.89	0.00	37.69	526.05	-1285.19	624.95
Fixation L	1	8	2161496762	2161616127	119365	610.29	864.73	26	70	-1	14.99	14.99
Fixation R	1	8	2161496762	2161616127	119365	610.29	864.73	26	70	-1	13.67	13.67
Saccade L	1	8	2161616127	2161814996	198869	612.74	861.74	844.86	594.80	13.42	210.73	0.30	67.49	5102.02	-5172.66	2819.71
Saccade R	1	8	2161616127	2161814996	198869	612.74	861.74	844.86	594.80	13.42	210.73	0.30	67.49	5102.02	-5172.66	2819.71
Fixation L	1	9	2161814996	2161934363	119367	853.10	599.72	17	9	-1	15.43	15.43
Fixation R	1	9	2161814996	2161934363	119367	853.10	599.72	17	9	-1	13.37	13.37
Saccade L	1	9	2161934363	2161993985	59622	858.10	602.57	1316.27	643.87	5.01	234.37	0.67	83.97	5743.04	-5330.20	3996.79
Saccade R	1	9	2161934363	2161993985	59622	858.10	602.57	1316.27	643.87	5.01	234.37	0.67	83.97	5743.04	-5330.20	3996.79
Fixation L	1	10	2161993985	2162272459	278474	1338.80	654.96	26	25	-1	15.75	15.75
Fixation R	1	10	2161993985	2162272459	278474	1338.80	654.96	26	25	-1	12.36	12.36
Saccade L	1	10	2162272459	2162292356	19897	1338.55	665.38	1230.25	845.32	1.30	212.36	1.00	65.26	5190.43	-5002.15	3706.95
Saccade R	1	10	2162272459	2162292356	19897	1338.55	665.38	1230.25	845.32	1.30	212.36	1.00	65.26	5190.43	-5002.15	3706.95
Fixation L	1	11	2162292356	2162531079	238723	1200.18	872.53	45	46	-1	15.82	15.82
Fixation R	1	11	2162292356	2162531079	238723	1200.18	872.53	45	46	-1	12.08	12.08
Saccade L	1	11	2162531079	2162550964	19885	1184.70	866.63	1171.23	866.37	0.16	13.63	1.00	8.30	178.32	-144.49	118.87
Saccade R	1	11	2162531079	2162550964	19885	1184.70	866.63	1171.23	866.37	0.16	13.63	1.00	8.30	178.32	-144.49	118.87
Fixation L	1	12	2162550964	2162670325	119361	1167.27	866.35	9	16	-1	15.87	15.87
Fixation R	1	12	2162550964	2162670325	119361	1167.27	866.35	9	16	-1	12.44	12.44
Saccade L	1	12	2162670325	2162690196	19871	1168.73	866.21	1310.90	860.93	0.96	143.89	1.00	48.25	3396.11	-3487.30	2570.80
Saccade R	1	12	2162670325	2162690196	19871	1168.73	866.21	1310.90	860.93	0.96	143.89	1.00	48.25	3396.11	-3487.30	2570.80
Fixation L	1	13	2162690196	2162809561	119365	1350.41	845.14	59	30	-1	15.79	15.79
Fixation R	1	13	2162690196	2162809561	119365	1350.41	845.14	59	30	-1	11.05	11.05
Saccade L	1	13	2162809561	2162829444	19883	1370.29	830.45	1369.96	820.13	0.17	11.08	1.00	8.49	177.68	-64.51	97.28
Saccade R	1	13	2162809561	2162829444	19883	1370.29	830.45	1369.96	820.13	0.17	11.08	1.00	8.49	177.68	-64.51	97.28
Fixation L	1	14	2162829444	2163306788	477344	1375.25	820.14	50	37	-1	15.62	15.62
Fixation R	1	14	2162829444	2163306788	477344	1375.25	820.14	50	37	-1	10.85	10.85
Saccade L	1	14	2163306788	2163326661	19873	1405.28	843.75	1414.68	861.86	0.32	25.81	1.00	16.14	187.96	-129.31	144.87
Saccade R	1	14	2163306788	2163326661	19873	1405.28	843.75	1414.68	861.86	0.32	25.81	1.00	16.14	187.96	-129.31	144.87
Fixation L	1	15	2163326661	2163724503	397842	1416.60	876.75	12	26	-1	15.79	15.79
Fixation R	1	15	2163326661	2163724503	397842	1416.60	876.75	12	26	-1	10.87	10.87
Saccade L	1	15	2163724503	2163744400	19897	1421.93	878.60	1353.83	831.64	0.72	83.68	1.00	36.38	1811.51	-1783.82	1554.11
Saccade R	1	15	2163724503	2163744400	19897	1421.93	878.60	1353.83	831.64	0.72	83.68	1.00	36.38	1811.51	-1783.82	1554.11
Fixation L	1	16	2163744400	2163903503	159103	1310.91	833.77	51	40	-1	15.95	15.95
Fixation R	1	16	2163744400	2163903503	159103	1310.91	833.77	51	40	-1	11.62	11.62
