[BeGaze]
Converted from:	C:\Documents and Settings\iViewX\Desktop\EXPERIMENTATIONS\Experiments\results\finaleart\S8119532-finaleart-1.idf
Date:	27.03.2019 16:00:49
Version:	BeGaze 2.5.77
Sample Rate:	50
Subject:	S8119532
Description:	Alexandre Drewery

Table Header for Fixations:
Event Type	Trial	Number	Start	End	Duration	Location X	Location Y	Dispersion X	Dispersion Y	Plane	Avg. Pupil Size X	Avg. Pupil Size Y

Table Header for Saccades:
Event Type	Trial	Number	Start	End	Duration	Start Loc.X	Start Loc.Y	End Loc.X	End Loc.Y	Amplitude	Peak Speed	Peak Speed At	Average Speed	Peak Accel.	Peak Decel.	Average Accel.

Table Header for Blinks:
Event Type	Trial	Number	Start	End	Duration

Table Header for User Events:
Event Type	Trial	Number	Start	Description

UserEvent	1	1	3299226242	# Message: void.jpg
Fixation L	1	1	3299236841	3299455697	218856	654.18	484.71	12	66	-1	13.45	13.45
Fixation R	1	1	3299236841	3299455697	218856	654.18	484.71	12	66	-1	14.33	14.33
Saccade L	1	1	3299455697	3299475565	19868	660.77	534.42	660.76	560.33	0.63	56.86	0.00	31.80	564.29	-487.48	487.16
Saccade R	1	1	3299455697	3299475565	19868	660.77	534.42	660.76	560.33	0.63	56.86	0.00	31.80	564.29	-487.48	487.16
Fixation L	1	2	3299475565	3299654547	178982	658.20	522.86	25	69	-1	13.67	13.67
Fixation R	1	2	3299475565	3299654547	178982	658.20	522.86	25	69	-1	14.43	14.43
Saccade L	1	2	3299654547	3299677545	22998	677.48	491.21	741.64	460.57	0.92	71.93	1.00	40.18	1379.49	-1424.28	939.46
Saccade R	1	2	3299654547	3299677545	22998	677.48	491.21	741.64	460.57	0.92	71.93	1.00	40.18	1379.49	-1424.28	939.46
Fixation L	1	3	3299677545	3299972793	295248	758.14	450.47	22	46	-1	13.51	13.51
Fixation R	1	3	3299677545	3299972793	295248	758.14	450.47	22	46	-1	14.30	14.30
Saccade L	1	3	3299972793	3300052424	79631	761.86	433.11	770.11	803.19	5.11	146.94	0.50	64.16	3142.54	-2132.79	1614.29
Saccade R	1	3	3299972793	3300052424	79631	761.86	433.11	770.11	803.19	5.11	146.94	0.50	64.16	3142.54	-2132.79	1614.29
Fixation L	1	4	3300052424	3300151778	99354	770.26	843.25	2	53	-1	12.92	12.92
Fixation R	1	4	3300052424	3300151778	99354	770.26	843.25	2	53	-1	13.75	13.75
Saccade L	1	4	3300151778	3300171644	19866	769.27	853.66	771.06	917.88	0.69	67.12	1.00	34.89	1612.70	-1121.57	1412.46
Saccade R	1	4	3300151778	3300171644	19866	769.27	853.66	771.06	917.88	0.69	67.12	1.00	34.89	1612.70	-1121.57	1412.46
Fixation L	1	5	3300171644	3300354483	182839	771.39	880.28	0	66	-1	13.57	13.57
Fixation R	1	5	3300171644	3300354483	182839	771.39	880.28	0	66	-1	14.13	14.13
Saccade L	1	5	3300354483	3300390526	36043	771.56	871.43	829.55	556.06	3.71	324.04	1.00	102.88	6423.20	-7732.44	4884.44
Saccade R	1	5	3300354483	3300390526	36043	771.56	871.43	829.55	556.06	3.71	324.04	1.00	102.88	6423.20	-7732.44	4884.44
Fixation L	1	6	3300390526	3300748496	357970	848.16	537.37	28	70	-1	13.21	13.21
Fixation R	1	6	3300390526	3300748496	357970	848.16	537.37	28	70	-1	14.05	14.05
Saccade L	1	6	3300748496	3300768375	19879	845.44	507.27	846.72	505.75	0.22	24.98	1.00	10.84	1100.30	-230.88	609.22
Saccade R	1	6	3300748496	3300768375	19879	845.44	507.27	846.72	505.75	0.22	24.98	1.00	10.84	1100.30	-230.88	609.22
Blink L	1	1	3300768375	3300967369	198994
Blink R	1	1	3300768375	3300967369	198994
Fixation L	1	7	3300967369	3301225854	258485	879.47	556.26	22	18	-1	13.01	13.01
Fixation R	1	7	3300967369	3301225854	258485	879.47	556.26	22	18	-1	14.95	14.95
