[BeGaze]
Converted from:	C:\Documents and Settings\iViewX\Desktop\EXPERIMENTATIONS\Experiments\results\finaleart\S1022551-finaleart-1.idf
Date:	27.03.2019 15:38:22
Version:	BeGaze 2.5.77
Sample Rate:	50
Subject:	S1022551
Description:	Alexis Nebout

Table Header for Fixations:
Event Type	Trial	Number	Start	End	Duration	Location X	Location Y	Dispersion X	Dispersion Y	Plane	Avg. Pupil Size X	Avg. Pupil Size Y

Table Header for Saccades:
Event Type	Trial	Number	Start	End	Duration	Start Loc.X	Start Loc.Y	End Loc.X	End Loc.Y	Amplitude	Peak Speed	Peak Speed At	Average Speed	Peak Accel.	Peak Decel.	Average Accel.

Table Header for Blinks:
Event Type	Trial	Number	Start	End	Duration

Table Header for User Events:
Event Type	Trial	Number	Start	Description

UserEvent	1	1	8901449819	# Message: REJECTED_after-the-bath_degas_1885.jpg
Saccade L	1	1	8901457315	8901497053	39738	808.62	492.59	788.41	572.62	1.17	92.17	1.00	29.45	2304.29	-2151.64	1142.32
Saccade R	1	1	8901457315	8901497053	39738	808.62	492.59	788.41	572.62	1.17	92.17	1.00	29.45	2304.29	-2151.64	1142.32
Fixation L	1	1	8901497053	8901715791	218738	780.90	583.04	14	18	-1	13.48	13.48
Fixation R	1	1	8901497053	8901715791	218738	780.90	583.04	14	18	-1	11.78	11.78
Saccade L	1	2	8901715791	8901755538	39747	785.89	585.08	1009.66	453.39	2.40	186.02	0.50	60.45	4613.15	-4032.31	3024.32
Saccade R	1	2	8901715791	8901755538	39747	785.89	585.08	1009.66	453.39	2.40	186.02	0.50	60.45	4613.15	-4032.31	3024.32
Fixation L	1	2	8901755538	8902034026	278488	1002.55	438.41	12	20	-1	13.43	13.43
Fixation R	1	2	8901755538	8902034026	278488	1002.55	438.41	12	20	-1	11.69	11.69
Blink L	1	1	8902034026	8902173270	139244
Blink R	1	1	8902034026	8902173270	139244
Saccade L	1	3	8902173270	8902312518	139248	945.83	469.22	620.60	415.15	11.58	189.88	0.80	83.13	3953.16	-4040.09	3698.93
Saccade R	1	3	8902173270	8902312518	139248	945.83	469.22	620.60	415.15	11.58	189.88	0.80	83.13	3953.16	-4040.09	3698.93
Fixation L	1	3	8902312518	8902451757	139239	642.00	447.26	37	43	-1	13.49	13.49
Fixation R	1	3	8902312518	8902451757	139239	642.00	447.26	37	43	-1	12.02	12.02
Saccade L	1	4	8902451757	8902471648	19891	634.05	446.68	491.25	331.20	1.08	185.72	1.00	54.53	4521.51	-4244.80	3116.74
Saccade R	1	4	8902451757	8902471648	19891	634.05	446.68	491.25	331.20	1.08	185.72	1.00	54.53	4521.51	-4244.80	3116.74
Fixation L	1	4	8902471648	8902630752	159104	496.69	345.15	10	26	-1	12.73	12.73
Fixation R	1	4	8902471648	8902630752	159104	496.69	345.15	10	26	-1	11.23	11.23
Saccade L	1	5	8902630752	8902650618	19866	500.70	355.26	359.29	351.36	1.06	143.07	1.00	53.54	3541.63	-3308.38	2802.12
Saccade R	1	5	8902630752	8902650618	19866	500.70	355.26	359.29	351.36	1.06	143.07	1.00	53.54	3541.63	-3308.38	2802.12
Fixation L	1	5	8902650618	8903247342	596724	317.82	366.32	64	33	-1	11.71	11.71
Fixation R	1	5	8902650618	8903247342	596724	317.82	366.32	64	33	-1	10.66	10.66
Saccade L	1	6	8903247342	8903267210	19868	331.43	379.09	389.59	372.46	0.40	59.22	1.00	20.21	1432.80	-1355.33	1043.58
Saccade R	1	6	8903247342	8903267210	19868	331.43	379.09	389.59	372.46	0.40	59.22	1.00	20.21	1432.80	-1355.33	1043.58
Fixation L	1	6	8903267210	8903486076	218866	408.96	357.93	30	23	-1	11.75	11.75
Fixation R	1	6	8903267210	8903486076	218866	408.96	357.93	30	23	-1	10.63	10.63
Saccade L	1	7	8903486076	8903505964	19888	400.28	348.61	302.30	345.10	0.63	99.18	1.00	31.48	2422.43	-2331.70	1706.79
Saccade R	1	7	8903486076	8903505964	19888	400.28	348.61	302.30	345.10	0.63	99.18	1.00	31.48	2422.43	-2331.70	1706.79
Fixation L	1	7	8903505964	8903684947	178983	310.75	354.21	25	30	-1	11.86	11.86
Fixation R	1	7	8903505964	8903684947	178983	310.75	354.21	25	30	-1	11.00	11.00
Blink L	1	2	8903684947	8903844059	159112
Blink R	1	2	8903684947	8903844059	159112
Fixation L	1	8	8903844059	8904520284	676225	328.38	368.14	46	34	-1	12.70	12.70
Fixation R	1	8	8903844059	8904520284	676225	328.38	368.14	46	34	-1	11.56	11.56
Saccade L	1	8	8904520284	8904560031	39747	303.50	354.67	725.63	366.11	3.51	295.53	0.50	88.42	7321.03	-7123.92	5210.23
Saccade R	1	8	8904520284	8904560031	39747	303.50	354.67	725.63	366.11	3.51	295.53	0.50	88.42	7321.03	-7123.92	5210.23
Fixation L	1	9	8904560031	8904778893	218862	713.23	381.45	15	23	-1	12.88	12.88
Fixation R	1	9	8904560031	8904778893	218862	713.23	381.45	15	23	-1	11.76	11.76
Saccade L	1	9	8904778893	8904818643	39750	711.11	388.97	1065.04	393.37	2.93	255.44	0.50	73.83	6347.68	-6176.55	4384.22
Saccade R	1	9	8904778893	8904818643	39750	711.11	388.97	1065.04	393.37	2.93	255.44	0.50	73.83	6347.68	-6176.55	4384.22
Fixation L	1	10	8904818643	8905276124	457481	1080.52	399.26	57	41	-1	12.26	12.26
Fixation R	1	10	8904818643	8905276124	457481	1080.52	399.26	57	41	-1	10.86	10.86
Saccade L	1	10	8905276124	8905295997	19873	1122.27	371.06	1126.46	366.22	0.09	6.48	1.00	4.32	125.83	-100.26	101.07
Saccade R	1	10	8905276124	8905295997	19873	1122.27	371.06	1126.46	366.22	0.09	6.48	1.00	4.32	125.83	-100.26	101.07
Fixation L	1	11	8905295997	8905435246	139249	1132.62	362.81	36	5	-1	12.05	12.05
Fixation R	1	11	8905295997	8905435246	139249	1132.62	362.81	36	5	-1	10.49	10.49
Saccade L	1	11	8905435246	8905455132	19886	1163.43	365.43	1308.19	394.85	1.24	149.40	1.00	62.43	3698.90	0.00	1849.45
Saccade R	1	11	8905435246	8905455132	19886	1163.43	365.43	1308.19	394.85	1.24	149.40	1.00	62.43	3698.90	0.00	1849.45
