[BeGaze]
Converted from:	C:\Documents and Settings\iViewX\Desktop\EXPERIMENTATIONS\Experiments\results\finaleart\S15H25531-finaleart-1.idf
Date:	27.03.2019 15:44:45
Version:	BeGaze 2.5.77
Sample Rate:	50
Subject:	S15H25531
Description:	Mikail Demirdelen

Table Header for Fixations:
Event Type	Trial	Number	Start	End	Duration	Location X	Location Y	Dispersion X	Dispersion Y	Plane	Avg. Pupil Size X	Avg. Pupil Size Y

Table Header for Saccades:
Event Type	Trial	Number	Start	End	Duration	Start Loc.X	Start Loc.Y	End Loc.X	End Loc.Y	Amplitude	Peak Speed	Peak Speed At	Average Speed	Peak Accel.	Peak Decel.	Average Accel.

Table Header for Blinks:
Event Type	Trial	Number	Start	End	Duration

Table Header for User Events:
Event Type	Trial	Number	Start	Description

UserEvent	1	1	3826096980	# Message: void.jpg
Fixation L	1	1	3826109139	3826327989	218850	852.59	400.90	10	65	-1	10.08	10.08
Fixation R	1	1	3826109139	3826327989	218850	852.59	400.90	10	65	-1	10.83	10.83
Saccade L	1	1	3826327989	3826367736	39747	857.25	375.09	973.34	253.39	1.55	123.13	1.00	39.03	3057.13	-2465.18	2061.22
Saccade R	1	1	3826327989	3826367736	39747	857.25	375.09	973.34	253.39	1.55	123.13	1.00	39.03	3057.13	-2465.18	2061.22
Fixation L	1	2	3826367736	3826546717	178981	971.87	283.02	17	46	-1	9.56	9.56
Fixation R	1	2	3826367736	3826546717	178981	971.87	283.02	17	46	-1	10.31	10.31
Saccade L	1	2	3826546717	3826566605	19888	976.51	293.71	906.26	291.05	0.70	71.11	1.00	35.35	1708.78	1345.16	1552.35
Saccade R	1	2	3826546717	3826586474	39757	976.51	293.71	851.17	314.74	2.20	135.24	1.00	55.33	1708.78	468.61	1281.42
Blink L	1	1	3826566605	3826904845	338240
Blink R	1	1	3826586474	3826904845	318371
Fixation L	1	3	3826904845	3827183197	278352	1012.13	629.58	60	28	-1	11.68	11.68
Fixation R	1	3	3826904845	3827183197	278352	1012.13	629.58	60	28	-1	12.18	12.18
Saccade L	1	3	3827183197	3827223078	39881	960.14	633.56	561.16	484.40	4.13	259.65	0.50	103.56	6415.50	-6160.87	4878.44
Saccade R	1	3	3827183197	3827223078	39881	960.14	633.56	561.16	484.40	4.13	259.65	0.50	103.56	6415.50	-6160.87	4878.44
Fixation L	1	4	3827223078	3827720304	497226	590.77	523.61	36	45	-1	12.46	12.46
Fixation R	1	4	3827223078	3827720304	497226	590.77	523.61	36	45	-1	13.92	13.92
Saccade L	1	4	3827720304	3827760050	39746	597.92	526.04	856.78	540.37	2.39	195.63	0.50	60.05	4882.90	-4034.22	2976.73
Saccade R	1	4	3827720304	3827760050	39746	597.92	526.04	856.78	540.37	2.39	195.63	0.50	60.05	4882.90	-4034.22	2976.73
Fixation L	1	5	3827760050	3828078284	318234	864.18	560.14	14	33	-1	12.92	12.92
Fixation R	1	5	3827760050	3828078284	318234	864.18	560.14	14	33	-1	14.37	14.37
