[BeGaze]
Converted from:	C:\Documents and Settings\iViewX\Desktop\EXPERIMENTATIONS\Experiments\results\finaleart\S13H22431-finaleart-1.idf
Date:	27.03.2019 15:42:07
Version:	BeGaze 2.5.77
Sample Rate:	50
Subject:	S13H22431
Description:	Jimmy Petit

Table Header for Fixations:
Event Type	Trial	Number	Start	End	Duration	Location X	Location Y	Dispersion X	Dispersion Y	Plane	Avg. Pupil Size X	Avg. Pupil Size Y

Table Header for Saccades:
Event Type	Trial	Number	Start	End	Duration	Start Loc.X	Start Loc.Y	End Loc.X	End Loc.Y	Amplitude	Peak Speed	Peak Speed At	Average Speed	Peak Accel.	Peak Decel.	Average Accel.

Table Header for Blinks:
Event Type	Trial	Number	Start	End	Duration

Table Header for User Events:
Event Type	Trial	Number	Start	Description

UserEvent	1	1	28054721422	# Message: void.jpg
Fixation L	1	1	28054726018	28054924875	198857	608.50	683.53	40	41	-1	14.26	14.26
Fixation R	1	1	28054726018	28054924875	198857	608.50	683.53	40	41	-1	15.45	15.45
Saccade L	1	1	28054924875	28054964622	39747	622.26	681.16	549.18	979.46	2.77	165.35	0.50	69.69	4032.55	-3742.85	3700.71
Saccade R	1	1	28054924875	28054964622	39747	622.26	681.16	549.18	979.46	2.77	165.35	0.50	69.69	4032.55	-3742.85	3700.71
Fixation L	1	2	28054964622	28055203361	238739	552.53	1013.63	30	44	-1	14.20	14.20
Fixation R	1	2	28054964622	28055203361	238739	552.53	1013.63	30	44	-1	15.53	15.53
Saccade L	1	2	28055203361	28055422121	218760	577.13	1017.17	1257.88	10.78	21.08	295.93	0.09	96.34	7316.96	-3402.54	2946.70
Saccade R	1	2	28055203361	28055422121	218760	577.13	1017.17	1257.88	10.78	21.08	295.93	0.09	96.34	7316.96	-3402.54	2946.70
Fixation L	1	3	28055422121	28055561347	139226	1262.57	33.04	18	37	-1	12.30	12.30
Fixation R	1	3	28055422121	28055561347	139226	1262.57	33.04	18	37	-1	11.71	11.71
Saccade L	1	3	28055561347	28055660846	99499	1274.58	47.17	1108.83	170.38	40.64	1342.73	0.40	408.47	33096.91	-29720.56	18383.62
Blink R	1	1	28055561347	28055680717	119370
Fixation L	1	4	28055660846	28055879590	218744	1101.81	188.67	13	37	-1	13.37	13.37
Fixation R	1	4	28055680717	28055879590	198873	1101.18	190.34	12	37	-1	14.11	14.11
Saccade L	1	4	28055879590	28055899459	19869	1097.66	203.83	970.41	281.68	1.01	150.88	1.00	50.90	3502.91	-3531.32	2658.03
Saccade R	1	3	28055879590	28055899459	19869	1097.66	203.83	970.41	281.68	1.01	150.88	1.00	50.90	3502.91	-3531.32	2658.03
Fixation L	1	5	28055899459	28056058576	159117	981.91	310.24	19	38	-1	14.55	14.55
Fixation R	1	5	28055899459	28056058576	159117	981.91	310.24	19	38	-1	15.25	15.25
Saccade L	1	5	28056058576	28056098327	39751	980.18	311.05	862.56	565.16	2.47	191.12	0.50	62.15	4741.52	-4213.14	3396.07
Saccade R	1	4	28056058576	28056098327	39751	980.18	311.05	862.56	565.16	2.47	191.12	0.50	62.15	4741.52	-4213.14	3396.07
Fixation L	1	6	28056098327	28056516070	417743	845.26	549.44	23	26	-1	15.08	15.08
Fixation R	1	6	28056098327	28056516070	417743	845.26	549.44	23	26	-1	16.04	16.04
Saccade L	1	6	28056516070	28056535938	19868	842.61	567.46	753.00	578.05	0.61	91.28	1.00	30.83	1970.23	-2145.67	1504.13
Saccade R	1	5	28056516070	28056535938	19868	842.61	567.46	753.00	578.05	0.61	91.28	1.00	30.83	1970.23	-2145.67	1504.13
Fixation L	1	7	28056535938	28056714921	178983	739.02	581.54	19	15	-1	14.67	14.67
Fixation R	1	7	28056535938	28056714921	178983	739.02	581.54	19	15	-1	16.00	16.00
