[BeGaze]
Converted from:	C:\Documents and Settings\iViewX\Desktop\EXPERIMENTATIONS\Experiments\results\finaleart\S7121223-finaleart-1.idf
Date:	27.03.2019 15:36:48
Version:	BeGaze 2.5.77
Sample Rate:	50
Subject:	S7121223
Description:	Gregoire pacreau

Table Header for Fixations:
Event Type	Trial	Number	Start	End	Duration	Location X	Location Y	Dispersion X	Dispersion Y	Plane	Avg. Pupil Size X	Avg. Pupil Size Y

Table Header for Saccades:
Event Type	Trial	Number	Start	End	Duration	Start Loc.X	Start Loc.Y	End Loc.X	End Loc.Y	Amplitude	Peak Speed	Peak Speed At	Average Speed	Peak Accel.	Peak Decel.	Average Accel.

Table Header for Blinks:
Event Type	Trial	Number	Start	End	Duration

Table Header for User Events:
Event Type	Trial	Number	Start	Description

UserEvent	1	1	4125031361	# Message: Pots_Et_Fruits_Matisse_1901.jpg
Fixation L	1	1	4125036291	4125434517	398226	835.70	514.05	62	18	-1	14.29	14.29
Fixation R	1	1	4125036291	4125434517	398226	835.70	514.05	62	18	-1	15.60	15.60
Saccade L	1	1	4125434517	4125673502	238985	867.23	517.42	839.77	301.90	12.66	212.89	0.42	52.96	5282.28	-4711.96	1923.11
Saccade R	1	1	4125434517	4125673502	238985	867.23	517.42	839.77	301.90	12.66	212.89	0.42	52.96	5282.28	-4711.96	1923.11
Fixation L	1	2	4125673502	4125852737	179235	829.66	296.05	22	21	-1	11.51	11.51
Fixation R	1	2	4125673502	4125852737	179235	829.66	296.05	22	21	-1	12.24	12.24
Saccade L	1	2	4125852737	4125932355	79618	817.40	285.93	791.32	190.29	3.73	191.75	0.25	46.86	4660.30	-4195.49	1994.48
Saccade R	1	2	4125852737	4125932355	79618	817.40	285.93	791.32	190.29	3.73	191.75	0.25	46.86	4660.30	-4195.49	1994.48
Fixation L	1	3	4125932355	4126091625	159270	774.35	215.94	30	38	-1	11.36	11.36
Fixation R	1	3	4125932355	4126091625	159270	774.35	215.94	30	38	-1	11.75	11.75
Saccade L	1	3	4126091625	4126151352	59727	762.36	228.53	594.15	569.01	4.43	197.75	0.67	74.09	4799.28	-4225.30	3000.95
Saccade R	1	3	4126091625	4126151352	59727	762.36	228.53	594.15	569.01	4.43	197.75	0.67	74.09	4799.28	-4225.30	3000.95
Fixation L	1	4	4126151352	4126350466	199114	600.54	599.79	16	40	-1	12.21	12.21
Fixation R	1	4	4126151352	4126350466	199114	600.54	599.79	16	40	-1	13.08	13.08
Saccade L	1	4	4126350466	4126370457	19991	607.39	606.44	599.88	728.07	0.77	123.26	1.00	38.58	2896.18	-2935.58	2079.96
Saccade R	1	4	4126350466	4126370457	19991	607.39	606.44	599.88	728.07	0.77	123.26	1.00	38.58	2896.18	-2935.58	2079.96
Fixation L	1	5	4126370457	4126868195	497738	592.24	777.98	24	73	-1	12.56	12.56
Fixation R	1	5	4126370457	4126868195	497738	592.24	777.98	24	73	-1	14.15	14.15
Saccade L	1	5	4126868195	4126888185	19990	577.80	797.65	575.14	793.16	0.07	5.86	1.00	3.64	1.78	-87.07	34.41
Saccade R	1	5	4126868195	4126888185	19990	577.80	797.65	575.14	793.16	0.07	5.86	1.00	3.64	1.78	-87.07	34.41
Fixation L	1	6	4126888185	4127206820	318635	608.66	794.53	65	17	-1	12.44	12.44
Fixation R	1	6	4126888185	4127206820	318635	608.66	794.53	65	17	-1	14.03	14.03
Saccade L	1	6	4127206820	4127246544	39724	639.72	802.86	977.79	744.96	3.06	182.76	0.50	76.99	4519.93	-3851.02	4091.72
Saccade R	1	6	4127206820	4127246544	39724	639.72	802.86	977.79	744.96	3.06	182.76	0.50	76.99	4519.93	-3851.02	4091.72
Fixation L	1	7	4127246544	4127505400	258856	1014.44	717.67	47	37	-1	13.26	13.26
Fixation R	1	7	4127246544	4127505400	258856	1014.44	717.67	47	37	-1	14.49	14.49
Saccade L	1	7	4127505400	4127525401	20001	1024.96	721.27	1041.26	717.62	0.28	28.13	1.00	13.88	483.64	-279.38	381.00
Saccade R	1	7	4127505400	4127525401	20001	1024.96	721.27	1041.26	717.62	0.28	28.13	1.00	13.88	483.64	-279.38	381.00
Fixation L	1	8	4127525401	4127903627	378226	1087.57	714.16	57	14	-1	13.30	13.30
Fixation R	1	8	4127525401	4127903627	378226	1087.57	714.16	57	14	-1	14.27	14.27
Blink L	1	1	4127903627	4128122769	219142
Blink R	1	1	4127903627	4128122769	219142
Fixation L	1	9	4128122769	4128222239	99470	604.92	594.79	74	25	-1	14.54	14.54
Fixation R	1	9	4128122769	4128222239	99470	604.92	594.79	74	25	-1	14.72	14.72
Saccade L	1	8	4128222239	4128321862	99623	628.57	602.68	764.58	424.49	3.43	113.00	0.80	34.47	2563.09	-2784.12	1463.06
Saccade R	1	8	4128222239	4128321862	99623	628.57	602.68	764.58	424.49	3.43	113.00	0.80	34.47	2563.09	-2784.12	1463.06
Fixation L	1	10	4128321862	4128680222	358360	755.37	433.32	16	58	-1	13.87	13.87
Fixation R	1	10	4128321862	4128680222	358360	755.37	433.32	16	58	-1	14.33	14.33
Saccade L	1	9	4128680222	4128700221	19999	749.38	392.10	749.06	359.24	0.32	33.25	1.00	16.15	446.02	-702.93	404.71
Saccade R	1	9	4128680222	4128700221	19999	749.38	392.10	749.06	359.24	0.32	33.25	1.00	16.15	446.02	-702.93	404.71
Fixation L	1	11	4128700221	4128899334	199113	757.63	364.15	59	20	-1	13.01	13.01
Fixation R	1	11	4128700221	4128899334	199113	757.63	364.15	59	20	-1	13.41	13.41
Saccade L	1	10	4128899334	4128919207	19873	806.13	352.23	834.42	355.92	0.46	51.88	0.00	23.19	647.49	-1070.81	669.87
Saccade R	1	10	4128899334	4128919207	19873	806.13	352.23	834.42	355.92	0.46	51.88	0.00	23.19	647.49	-1070.81	669.87
Fixation L	1	12	4128919207	4129018819	99612	847.40	351.53	23	14	-1	12.93	12.93
Fixation R	1	12	4128919207	4129018819	99612	847.40	351.53	23	14	-1	12.96	12.96
