[BeGaze]
Converted from:	C:\Documents and Settings\iViewX\Desktop\EXPERIMENTATIONS\Experiments\results\finaleart\S15H25531-finaleart-1.idf
Date:	27.03.2019 15:45:03
Version:	BeGaze 2.5.77
Sample Rate:	50
Subject:	S15H25531
Description:	Mikail Demirdelen

Table Header for Fixations:
Event Type	Trial	Number	Start	End	Duration	Location X	Location Y	Dispersion X	Dispersion Y	Plane	Avg. Pupil Size X	Avg. Pupil Size Y

Table Header for Saccades:
Event Type	Trial	Number	Start	End	Duration	Start Loc.X	Start Loc.Y	End Loc.X	End Loc.Y	Amplitude	Peak Speed	Peak Speed At	Average Speed	Peak Accel.	Peak Decel.	Average Accel.

Table Header for Blinks:
Event Type	Trial	Number	Start	End	Duration

Table Header for User Events:
Event Type	Trial	Number	Start	Description

UserEvent	1	1	4049783861	# Message: still-life_pissarro_1867.jpg
Fixation L	1	1	4049789435	4050246919	457484	858.40	521.47	22	76	-1	13.51	13.51
Fixation R	1	1	4049789435	4050246919	457484	858.40	521.47	22	76	-1	15.31	15.31
Saccade L	1	1	4050246919	4050266788	19869	876.85	568.65	879.97	571.49	0.39	43.62	1.00	19.46	600.14	-10.82	356.72
Saccade R	1	1	4050246919	4050266788	19869	876.85	568.65	879.97	571.49	0.39	43.62	1.00	19.46	600.14	-10.82	356.72
Fixation L	1	2	4050266788	4050445778	178990	909.64	591.79	41	41	-1	14.22	14.22
Fixation R	1	2	4050266788	4050445778	178990	909.64	591.79	41	41	-1	16.02	16.02
Saccade L	1	2	4050445778	4050505527	59749	921.19	603.16	1181.70	372.61	4.07	161.11	0.67	68.18	3982.12	-3664.18	3009.68
Saccade R	1	2	4050445778	4050505527	59749	921.19	603.16	1181.70	372.61	4.07	161.11	0.67	68.18	3982.12	-3664.18	3009.68
Fixation L	1	3	4050505527	4050704405	198878	1168.86	382.61	20	59	-1	13.78	13.78
Fixation R	1	3	4050505527	4050704405	198878	1168.86	382.61	20	59	-1	15.51	15.51
Saccade L	1	3	4050704405	4050803754	99349	1161.05	406.05	703.10	359.15	7.45	249.24	1.00	74.96	5631.16	-5860.42	3050.92
Saccade R	1	3	4050704405	4050803754	99349	1161.05	406.05	703.10	359.15	7.45	249.24	1.00	74.96	5631.16	-5860.42	3050.92
Fixation L	1	4	4050803754	4051062367	258613	737.01	353.45	41	19	-1	13.70	13.70
Fixation R	1	4	4050803754	4051062367	258613	737.01	353.45	41	19	-1	15.42	15.42
Saccade L	1	4	4051062367	4051082248	19881	739.53	356.37	850.17	340.48	0.81	113.06	1.00	40.80	2797.11	-2395.20	2124.17
Saccade R	1	4	4051062367	4051082248	19881	739.53	356.37	850.17	340.48	0.81	113.06	1.00	40.80	2797.11	-2395.20	2124.17
Fixation L	1	5	4051082248	4051221492	139244	893.40	324.87	53	32	-1	13.70	13.70
Fixation R	1	5	4051082248	4051221492	139244	893.40	324.87	53	32	-1	15.72	15.72
Saccade L	1	5	4051221492	4051360737	139245	901.57	309.34	1486.07	-47.73	11.47	387.12	0.14	82.38	9586.23	-9560.23	3706.72
Saccade R	1	5	4051221492	4051360737	139245	901.57	309.34	1486.07	-47.73	11.47	387.12	0.14	82.38	9586.23	-9560.23	3706.72
Fixation L	1	6	4051360737	4051619347	258610	1487.82	-26.20	30	61	-1	13.82	13.82
Fixation R	1	6	4051360737	4051619347	258610	1487.82	-26.20	30	61	-1	15.48	15.48
Saccade L	1	6	4051619347	4051639223	19876	1488.98	-16.29	1623.04	-34.24	1.00	136.80	1.00	50.56	2610.87	-3177.80	2043.64
Saccade R	1	6	4051619347	4051639223	19876	1488.98	-16.29	1623.04	-34.24	1.00	136.80	1.00	50.56	2610.87	-3177.80	2043.64
Fixation L	1	7	4051639223	4051937576	298353	1606.07	-29.82	24	38	-1	13.97	13.97
Fixation R	1	7	4051639223	4051937576	298353	1606.07	-29.82	24	38	-1	15.46	15.46
Saccade L	1	7	4051937576	4052056947	119371	1603.48	-33.04	1344.83	723.44	11.92	214.62	0.50	99.83	4428.13	-4382.44	2338.38
Saccade R	1	7	4051937576	4052056947	119371	1603.48	-33.04	1344.83	723.44	11.92	214.62	0.50	99.83	4428.13	-4382.44	2338.38
Fixation L	1	8	4052056947	4052255815	198868	1317.54	746.15	36	44	-1	14.45	14.45
Fixation R	1	8	4052056947	4052255815	198868	1317.54	746.15	36	44	-1	16.19	16.19
Saccade L	1	8	4052255815	4052295563	39748	1308.26	742.05	718.42	758.92	4.90	313.72	0.50	123.19	7734.19	-7622.46	7066.78
Saccade R	1	8	4052255815	4052295563	39748	1308.26	742.05	718.42	758.92	4.90	313.72	0.50	123.19	7734.19	-7622.46	7066.78
Fixation L	1	9	4052295563	4052554179	258616	667.23	751.86	63	15	-1	14.18	14.18
Fixation R	1	9	4052295563	4052554179	258616	667.23	751.86	63	15	-1	16.13	16.13
Saccade L	1	9	4052554179	4052574051	19872	657.77	753.83	582.81	752.01	0.45	75.85	1.00	22.70	1867.75	-1719.89	1274.14
Saccade R	1	9	4052554179	4052574051	19872	657.77	753.83	582.81	752.01	0.45	75.85	1.00	22.70	1867.75	-1719.89	1274.14
Fixation L	1	10	4052574051	4052792789	218738	567.98	730.06	25	40	-1	14.49	14.49
Fixation R	1	10	4052574051	4052792789	218738	567.98	730.06	25	40	-1	16.64	16.64
Saccade L	1	10	4052792789	4052832667	39878	557.74	711.25	916.73	795.90	3.22	227.30	0.50	80.83	5649.84	-5397.05	4743.69
Saccade R	1	10	4052792789	4052832667	39878	557.74	711.25	916.73	795.90	3.22	227.30	0.50	80.83	5649.84	-5397.05	4743.69
Fixation L	1	11	4052832667	4053210526	377859	923.70	805.49	17	13	-1	14.86	14.86
Fixation R	1	11	4052832667	4053210526	377859	923.70	805.49	17	13	-1	17.02	17.02
Saccade L	1	11	4053210526	4053250271	39745	917.90	803.09	689.14	986.49	3.12	245.76	0.50	78.62	6103.39	-4419.01	3012.35
Saccade R	1	11	4053210526	4053250271	39745	917.90	803.09	689.14	986.49	3.12	245.76	0.50	78.62	6103.39	-4419.01	3012.35
Fixation L	1	12	4053250271	4053429263	178992	661.76	977.33	63	31	-1	15.10	15.10
Fixation R	1	12	4053250271	4053429263	178992	661.76	977.33	63	31	-1	17.09	17.09
Saccade L	1	12	4053429263	4053449134	19871	653.33	954.73	600.88	805.03	1.22	160.42	1.00	61.30	3892.44	-3464.86	2587.45
Saccade R	1	12	4053429263	4053449134	19871	653.33	954.73	600.88	805.03	1.22	160.42	1.00	61.30	3892.44	-3464.86	2587.45
Fixation L	1	13	4053449134	4053687873	238739	580.23	767.35	27	47	-1	14.94	14.94
Fixation R	1	13	4053449134	4053687873	238739	580.23	767.35	27	47	-1	17.25	17.25
Saccade L	1	13	4053687873	4053767488	79615	577.12	759.76	911.50	760.07	5.66	352.71	0.25	71.10	8767.67	-8164.65	3736.73
Saccade R	1	13	4053687873	4053767488	79615	577.12	759.76	911.50	760.07	5.66	352.71	0.25	71.10	8767.67	-8164.65	3736.73
