[BeGaze]
Converted from:	C:\Documents and Settings\iViewX\Desktop\EXPERIMENTATIONS\Experiments\results\finaleart\S15H25531-finaleart-1.idf
Date:	27.03.2019 15:44:44
Version:	BeGaze 2.5.77
Sample Rate:	50
Subject:	S15H25531
Description:	Mikail Demirdelen

Table Header for Fixations:
Event Type	Trial	Number	Start	End	Duration	Location X	Location Y	Dispersion X	Dispersion Y	Plane	Avg. Pupil Size X	Avg. Pupil Size Y

Table Header for Saccades:
Event Type	Trial	Number	Start	End	Duration	Start Loc.X	Start Loc.Y	End Loc.X	End Loc.Y	Amplitude	Peak Speed	Peak Speed At	Average Speed	Peak Accel.	Peak Decel.	Average Accel.

Table Header for Blinks:
Event Type	Trial	Number	Start	End	Duration

Table Header for User Events:
Event Type	Trial	Number	Start	Description

UserEvent	1	1	3822042394	# Message: after_a_rain_country_road_Vasilyev_1869.jpg
Fixation L	1	1	3822051574	3822210829	159255	859.24	802.58	8	47	-1	15.62	15.62
Fixation R	1	1	3822051574	3822210829	159255	859.24	802.58	8	47	-1	17.16	17.16
Blink L	1	1	3822210829	3822389813	178984
Blink R	1	1	3822210829	3822389813	178984
Fixation L	1	2	3822389813	3822509064	119251	1008.68	710.80	6	13	-1	15.25	15.25
Fixation R	1	2	3822389813	3822509064	119251	1008.68	710.80	6	13	-1	16.59	16.59
Saccade L	1	1	3822509064	3822548921	39857	1005.97	706.06	810.24	814.59	1.95	124.93	1.00	48.91	3075.18	-2933.77	2684.59
Saccade R	1	1	3822509064	3822548921	39857	1005.97	706.06	810.24	814.59	1.95	124.93	1.00	48.91	3075.18	-2933.77	2684.59
Fixation L	1	3	3822548921	3822767671	218750	802.75	811.19	14	9	-1	14.73	14.73
Fixation R	1	3	3822548921	3822767671	218750	802.75	811.19	14	9	-1	16.37	16.37
Saccade L	1	2	3822767671	3822787552	19881	795.48	811.09	632.59	781.90	1.16	167.35	1.00	58.53	4101.37	-4020.95	3031.26
Saccade R	1	2	3822767671	3822787552	19881	795.48	811.09	632.59	781.90	1.16	167.35	1.00	58.53	4101.37	-4020.95	3031.26
Fixation L	1	4	3822787552	3822986401	198849	629.26	728.81	10	68	-1	13.12	13.12
Fixation R	1	4	3822787552	3822986401	198849	629.26	728.81	10	68	-1	15.07	15.07
Saccade L	1	3	3822986401	3823006285	19884	634.94	713.64	791.19	733.44	0.88	159.29	1.00	44.03	3926.70	-3493.48	2548.14
Saccade R	1	3	3822986401	3823006285	19884	634.94	713.64	791.19	733.44	0.88	159.29	1.00	44.03	3926.70	-3493.48	2548.14
Fixation L	1	5	3823006285	3823642873	636588	810.03	748.56	42	26	-1	11.80	11.80
Fixation R	1	5	3823006285	3823642873	636588	810.03	748.56	42	26	-1	13.29	13.29
Saccade L	1	4	3823642873	3823702503	59630	820.06	740.32	1240.26	734.06	4.41	243.65	0.67	73.99	6019.45	-5762.44	3514.33
Saccade R	1	4	3823642873	3823702503	59630	820.06	740.32	1240.26	734.06	4.41	243.65	0.67	73.99	6019.45	-5762.44	3514.33
Fixation L	1	6	3823702503	3824060469	357966	1257.41	704.74	25	46	-1	11.02	11.02
Fixation R	1	6	3823702503	3824060469	357966	1257.41	704.74	25	46	-1	11.98	11.98
Saccade L	1	5	3824060469	3824080351	19882	1255.58	691.55	1120.93	681.79	0.76	136.54	1.00	38.20	3336.51	-3255.32	2274.14
Saccade R	1	5	3824060469	3824080351	19882	1255.58	691.55	1120.93	681.79	0.76	136.54	1.00	38.20	3336.51	-3255.32	2274.14
Fixation L	1	7	3824080351	3824319087	238736	1100.46	672.45	30	16	-1	10.91	10.91
Fixation R	1	7	3824080351	3824319087	238736	1100.46	672.45	30	16	-1	11.18	11.18
Saccade L	1	6	3824319087	3824338955	19868	1100.10	665.44	1282.66	665.79	0.98	184.63	1.00	49.54	4577.71	-4565.21	3106.08
Saccade R	1	6	3824319087	3824338955	19868	1100.10	665.44	1282.66	665.79	0.98	184.63	1.00	49.54	4577.71	-4565.21	3106.08
Fixation L	1	8	3824338955	3824796440	457485	1299.42	689.05	23	32	-1	10.35	10.35
Fixation R	1	8	3824338955	3824796440	457485	1299.42	689.05	23	32	-1	10.88	10.88
Saccade L	1	7	3824796440	3824836203	39763	1292.37	698.53	1563.04	689.96	2.24	158.05	0.50	56.39	3870.83	-3897.53	3363.44
Saccade R	1	7	3824796440	3824836203	39763	1292.37	698.53	1563.04	689.96	2.24	158.05	0.50	56.39	3870.83	-3897.53	3363.44
Fixation L	1	9	3824836203	3825174303	338100	1555.54	687.89	27	7	-1	11.05	11.05
Fixation R	1	9	3824836203	3825174303	338100	1555.54	687.89	27	7	-1	11.33	11.33
Saccade L	1	8	3825174303	3825214166	39863	1538.36	686.14	1301.16	701.17	2.01	134.18	1.00	50.31	3304.95	-3214.10	2903.92
Saccade R	1	8	3825174303	3825214166	39863	1538.36	686.14	1301.16	701.17	2.01	134.18	1.00	50.31	3304.95	-3214.10	2903.92
Fixation L	1	10	3825214166	3825373295	159129	1296.92	719.83	7	31	-1	11.93	11.93
Fixation R	1	10	3825214166	3825373295	159129	1296.92	719.83	7	31	-1	12.27	12.27
Saccade L	1	9	3825373295	3825432916	59621	1297.05	732.78	662.48	688.15	6.92	319.51	0.67	116.09	7907.83	-6917.04	5567.72
Saccade R	1	9	3825373295	3825432916	59621	1297.05	732.78	662.48	688.15	6.92	319.51	0.67	116.09	7907.83	-6917.04	5567.72
Fixation L	1	11	3825432916	3825592034	159118	640.15	683.26	39	43	-1	11.79	11.79
Fixation R	1	11	3825432916	3825592034	159118	640.15	683.26	39	43	-1	12.48	12.48
Saccade L	1	10	3825592034	3825611899	19865	636.21	671.27	551.54	662.20	0.91	86.14	1.00	45.79	1520.94	-2030.47	1672.19
Saccade R	1	10	3825592034	3825611899	19865	636.21	671.27	551.54	662.20	0.91	86.14	1.00	45.79	1520.94	-2030.47	1672.19
Fixation L	1	12	3825611899	3826029638	417739	584.59	650.49	64	23	-1	10.97	10.97
Fixation R	1	12	3825611899	3826029638	417739	584.59	650.49	64	23	-1	11.88	11.88
