[BeGaze]
Converted from:	C:\Documents and Settings\iViewX\Desktop\EXPERIMENTATIONS\Experiments\results\finaleart\S13H22431-finaleart-1.idf
Date:	27.03.2019 15:41:57
Version:	BeGaze 2.5.77
Sample Rate:	50
Subject:	S13H22431
Description:	Jimmy Petit

Table Header for Fixations:
Event Type	Trial	Number	Start	End	Duration	Location X	Location Y	Dispersion X	Dispersion Y	Plane	Avg. Pupil Size X	Avg. Pupil Size Y

Table Header for Saccades:
Event Type	Trial	Number	Start	End	Duration	Start Loc.X	Start Loc.Y	End Loc.X	End Loc.Y	Amplitude	Peak Speed	Peak Speed At	Average Speed	Peak Accel.	Peak Decel.	Average Accel.

Table Header for Blinks:
Event Type	Trial	Number	Start	End	Duration

Table Header for User Events:
Event Type	Trial	Number	Start	Description

UserEvent	1	1	27952752750	# Message: REJECTED_cezanne-still-life-with-green-pot-and-pewter-1870.jpg
Saccade L	1	1	27952769327	27952868724	99397	978.28	503.16	533.62	487.68	6.80	181.40	0.60	68.41	4222.93	-2869.72	2098.70
Saccade R	1	1	27952769327	27952868724	99397	978.28	503.16	533.62	487.68	6.80	181.40	0.60	68.41	4222.93	-2869.72	2098.70
Fixation L	1	1	27952868724	27953087557	218833	528.36	490.72	11	12	-1	14.23	14.23
Fixation R	1	1	27952868724	27953087557	218833	528.36	490.72	11	12	-1	15.28	15.28
Saccade L	1	2	27953087557	27953127318	39761	526.54	489.17	876.28	573.32	3.10	218.17	1.00	77.88	5395.31	-4399.27	4181.20
Fixation L	1	2	27953127318	27953346046	218728	893.30	596.21	25	42	-1	14.70	14.70
Fixation R	1	2	27953147174	27953346046	198872	894.85	598.29	12	41	-1	16.37	16.37
Saccade L	1	3	27953346046	27953365918	19872	896.60	606.38	824.60	609.12	0.56	72.89	1.00	28.12	1812.10	-1566.03	1390.11
Saccade R	1	2	27953346046	27953365918	19872	896.60	606.38	824.60	609.12	0.56	72.89	1.00	28.12	1812.10	-1566.03	1390.11
Fixation L	1	3	27953365918	27953485284	119366	843.17	618.46	35	28	-1	14.86	14.86
Fixation R	1	3	27953365918	27953485284	119366	843.17	618.46	35	28	-1	16.68	16.68
Saccade L	1	4	27953485284	27953505164	19880	840.30	636.58	946.25	707.31	0.77	128.86	1.00	38.55	2886.79	-3075.34	2013.50
Saccade R	1	3	27953485284	27953505164	19880	840.30	636.58	946.25	707.31	0.77	128.86	1.00	38.55	2886.79	-3075.34	2013.50
Fixation L	1	4	27953505164	27953942770	437606	958.18	727.50	40	40	-1	15.05	15.05
Fixation R	1	4	27953505164	27953942770	437606	958.18	727.50	40	40	-1	16.30	16.30
Saccade L	1	5	27953942770	27954002515	59745	930.66	746.10	412.92	742.13	5.40	261.25	0.67	90.45	6495.79	-6252.16	4198.93
Saccade R	1	4	27953942770	27954002515	59745	930.66	746.10	412.92	742.13	5.40	261.25	0.67	90.45	6495.79	-6252.16	4198.93
Fixation L	1	5	27954002515	27954320756	318241	417.64	726.34	52	43	-1	13.73	13.73
Fixation R	1	5	27954002515	27954320756	318241	417.64	726.34	52	43	-1	15.39	15.39
Saccade L	1	6	27954320756	27954400250	79494	390.85	702.14	992.97	453.51	8.46	365.88	0.75	106.42	9016.92	-7721.10	4505.84
Saccade R	1	5	27954320756	27954400250	79494	390.85	702.14	992.97	453.51	8.46	365.88	0.75	106.42	9016.92	-7721.10	4505.84
Fixation L	1	6	27954400250	27954638991	238741	1022.52	412.64	34	51	-1	13.69	13.69
Fixation R	1	6	27954400250	27954638991	238741	1022.52	412.64	34	51	-1	15.23	15.23
Saccade L	1	7	27954638991	27954678737	39746	1025.98	403.61	1235.74	394.79	1.85	178.39	1.00	46.63	4410.48	-4307.74	2494.07
Saccade R	1	6	27954638991	27954678737	39746	1025.98	403.61	1235.74	394.79	1.85	178.39	1.00	46.63	4410.48	-4307.74	2494.07
Fixation L	1	7	27954678737	27954937344	258607	1248.84	407.99	21	23	-1	13.80	13.80
Fixation R	1	7	27954678737	27954937344	258607	1248.84	407.99	21	23	-1	15.20	15.20
Saccade L	1	8	27954937344	27954977093	39749	1244.70	416.55	998.17	414.33	2.04	130.94	1.00	51.43	3264.00	-3189.51	3047.68
Saccade R	1	7	27954937344	27954977093	39749	1244.70	416.55	998.17	414.33	2.04	130.94	1.00	51.43	3264.00	-3189.51	3047.68
Fixation L	1	8	27954977093	27955275462	298369	997.12	412.25	25	14	-1	15.17	15.17
Fixation R	1	8	27954977093	27955275462	298369	997.12	412.25	25	14	-1	15.57	15.57
Blink L	1	1	27955275462	27955394700	119238
Blink R	1	1	27955275462	27955394700	119238
Fixation L	1	9	27955394700	27956011298	616598	1020.46	358.36	23	60	-1	17.42	17.42
Fixation R	1	9	27955394700	27956011298	616598	1020.46	358.36	23	60	-1	17.55	17.55
Saccade L	1	9	27956011298	27956051177	39879	1022.62	323.11	1055.23	395.48	4.72	299.15	0.50	118.41	7087.89	-6521.50	6074.57
Blink R	1	2	27956011298	27956090923	79625
Fixation L	1	10	27956051177	27956210295	159118	1035.89	392.05	25	50	-1	18.28	18.28
Fixation R	1	10	27956090923	27956210295	119372	1033.96	395.11	6	37	-1	16.70	16.70
Saccade L	1	10	27956210295	27956250043	39748	1037.66	384.60	1055.40	397.15	1.68	75.71	0.50	42.30	1353.48	-1412.16	1092.04
Saccade R	1	8	27956210295	27956250043	39748	1037.66	384.60	1055.40	397.15	1.68	75.71	0.50	42.30	1353.48	-1412.16	1092.04
Fixation L	1	11	27956250043	27956468776	218733	1037.54	386.85	47	41	-1	18.91	18.91
Fixation R	1	11	27956250043	27956468776	218733	1037.54	386.85	47	41	-1	17.53	17.53
Saccade L	1	11	27956468776	27956488654	19878	1007.49	404.54	999.84	496.80	0.87	93.65	1.00	43.69	1961.31	-2058.07	1678.72
Saccade R	1	9	27956468776	27956488654	19878	1007.49	404.54	999.84	496.80	0.87	93.65	1.00	43.69	1961.31	-2058.07	1678.72
Fixation L	1	12	27956488654	27956588160	99506	976.95	485.91	37	28	-1	18.47	18.47
Fixation R	1	12	27956488654	27956588160	99506	976.95	485.91	37	28	-1	18.44	18.44
Saccade L	1	12	27956588160	27956608024	19864	961.99	477.42	867.05	622.76	1.14	175.57	1.00	57.46	3882.18	-4164.24	2809.71
Saccade R	1	10	27956588160	27956608024	19864	961.99	477.42	867.05	622.76	1.14	175.57	1.00	57.46	3882.18	-4164.24	2809.71
Fixation L	1	13	27956608024	27956747268	139244	861.02	640.33	11	24	-1	18.37	18.37
Fixation R	1	13	27956608024	27956747268	139244	861.02	640.33	11	24	-1	18.45	18.45
