[BeGaze]
Converted from:	C:\Documents and Settings\iViewX\Desktop\EXPERIMENTATIONS\Experiments\results\finaleart\S4120113-finaleart-1.idf
Date:	27.03.2019 15:34:36
Version:	BeGaze 2.5.77
Sample Rate:	50
Subject:	S4120113
Description:	Vidal Attias

Table Header for Fixations:
Event Type	Trial	Number	Start	End	Duration	Location X	Location Y	Dispersion X	Dispersion Y	Plane	Avg. Pupil Size X	Avg. Pupil Size Y

Table Header for Saccades:
Event Type	Trial	Number	Start	End	Duration	Start Loc.X	Start Loc.Y	End Loc.X	End Loc.Y	Amplitude	Peak Speed	Peak Speed At	Average Speed	Peak Accel.	Peak Decel.	Average Accel.

Table Header for Blinks:
Event Type	Trial	Number	Start	End	Duration

Table Header for User Events:
Event Type	Trial	Number	Start	Description

UserEvent	1	1	7234710309	# Message: The_Lying_Nude_Matisse_1906.jpg
Fixation L	1	1	7234724777	7235043003	318226	890.64	460.78	87	11	-1	12.53	12.53
Fixation R	1	1	7234724777	7235043003	318226	890.64	460.78	87	11	-1	13.03	13.03
Saccade L	1	1	7235043003	7235062882	19879	875.74	466.02	881.90	452.28	0.13	15.24	1.00	6.29	302.98	-73.99	158.56
Saccade R	1	1	7235043003	7235062882	19879	875.74	466.02	881.90	452.28	0.13	15.24	1.00	6.29	302.98	-73.99	158.56
Fixation L	1	2	7235062882	7235520355	457473	891.58	424.89	17	63	-1	11.19	11.19
Fixation R	1	2	7235062882	7235520355	457473	891.58	424.89	17	63	-1	11.56	11.56
Saccade L	1	2	7235520355	7235560097	39742	898.36	395.24	562.17	405.89	3.08	180.68	0.50	77.62	4465.83	-3479.19	3812.15
Saccade R	1	2	7235520355	7235560097	39742	898.36	395.24	562.17	405.89	3.08	180.68	0.50	77.62	4465.83	-3479.19	3812.15
Fixation L	1	3	7235560097	7235878332	318235	564.92	428.71	50	40	-1	9.23	9.23
Fixation R	1	3	7235560097	7235878332	318235	564.92	428.71	50	40	-1	10.11	10.11
Saccade L	1	3	7235878332	7235898208	19876	523.26	433.76	491.62	429.04	0.43	32.36	1.00	21.41	298.05	-726.13	571.30
Saccade R	1	3	7235878332	7235898208	19876	523.26	433.76	491.62	429.04	0.43	32.36	1.00	21.41	298.05	-726.13	571.30
Fixation L	1	4	7235898208	7236415303	517095	495.11	439.08	14	51	-1	10.09	10.09
Fixation R	1	4	7235898208	7236415303	517095	495.11	439.08	14	51	-1	11.12	11.12
Saccade L	1	4	7236415303	7236475045	59742	490.43	450.48	1014.19	451.19	5.35	296.75	0.67	89.63	7314.30	-7330.80	4123.10
Saccade R	1	4	7236415303	7236475045	59742	490.43	450.48	1014.19	451.19	5.35	296.75	0.67	89.63	7314.30	-7330.80	4123.10
Fixation L	1	5	7236475045	7236733539	258494	1017.77	455.18	7	27	-1	11.26	11.26
Fixation R	1	5	7236475045	7236733539	258494	1017.77	455.18	7	27	-1	11.70	11.70
Saccade L	1	5	7236733539	7236753530	19991	1016.67	473.81	1094.98	481.95	0.48	79.63	1.00	23.81	1947.96	-952.20	982.37
Saccade R	1	5	7236733539	7236753530	19991	1016.67	473.81	1094.98	481.95	0.48	79.63	1.00	23.81	1947.96	-952.20	982.37
Fixation L	1	6	7236753530	7236932518	178988	1102.12	490.12	48	25	-1	11.53	11.53
Fixation R	1	6	7236753530	7236932518	178988	1102.12	490.12	48	25	-1	11.76	11.76
Saccade L	1	6	7236932518	7236992140	59622	1110.37	503.22	1359.27	674.31	3.64	214.97	0.67	61.12	5036.07	-4705.57	2577.43
Saccade R	1	6	7236932518	7236992140	59622	1110.37	503.22	1359.27	674.31	3.64	214.97	0.67	61.12	5036.07	-4705.57	2577.43
Fixation L	1	7	7236992140	7237230881	238741	1354.91	700.96	18	38	-1	11.51	11.51
Fixation R	1	7	7236992140	7237230881	238741	1354.91	700.96	18	38	-1	11.62	11.62
Saccade L	1	7	7237230881	7237250746	19865	1352.38	712.43	1500.38	714.01	0.85	149.70	1.00	43.02	3654.23	-3436.32	2462.98
Saccade R	1	7	7237230881	7237250746	19865	1352.38	712.43	1500.38	714.01	0.85	149.70	1.00	43.02	3654.23	-3436.32	2462.98
Fixation L	1	8	7237250746	7237648478	397732	1524.50	728.91	32	21	-1	11.58	11.58
Fixation R	1	8	7237250746	7237648478	397732	1524.50	728.91	32	21	-1	11.28	11.28
Saccade L	1	8	7237648478	7237747973	99495	1519.87	734.12	636.37	1005.90	12.77	373.24	0.40	128.33	9205.53	-7001.51	4936.13
Saccade R	1	8	7237648478	7237747973	99495	1519.87	734.12	636.37	1005.90	12.77	373.24	0.40	128.33	9205.53	-7001.51	4936.13
Fixation L	1	9	7237747973	7238026456	278483	660.09	990.06	33	56	-1	11.01	11.01
Fixation R	1	9	7237747973	7238026456	278483	660.09	990.06	33	56	-1	12.02	12.02
Saccade L	1	9	7238026456	7238046332	19876	660.22	985.57	652.94	948.48	0.42	38.24	1.00	20.89	516.34	-476.93	483.09
Saccade R	1	9	7238026456	7238046332	19876	660.22	985.57	652.94	948.48	0.42	38.24	1.00	20.89	516.34	-476.93	483.09
Fixation L	1	10	7238046332	7238225318	178986	649.32	959.60	39	40	-1	10.45	10.45
Fixation R	1	10	7238046332	7238225318	178986	649.32	959.60	39	40	-1	11.66	11.66
Saccade L	1	10	7238225318	7238245192	19874	680.64	972.03	737.77	926.04	0.82	74.19	1.00	41.28	1444.95	-1628.89	1113.66
Saccade R	1	10	7238225318	7238245192	19874	680.64	972.03	737.77	926.04	0.82	74.19	1.00	41.28	1444.95	-1628.89	1113.66
Fixation L	1	11	7238245192	7238444052	198860	768.53	922.91	36	19	-1	11.30	11.30
Fixation R	1	11	7238245192	7238444052	198860	768.53	922.91	36	19	-1	12.12	12.12
Saccade L	1	11	7238444052	7238483919	39867	770.74	919.62	676.97	635.73	2.63	167.68	1.00	65.87	4076.70	-3939.74	3600.38
Saccade R	1	11	7238444052	7238483919	39867	770.74	919.62	676.97	635.73	2.63	167.68	1.00	65.87	4076.70	-3939.74	3600.38
Fixation L	1	12	7238483919	7238583293	99374	681.89	634.95	19	19	-1	11.56	11.56
Fixation R	1	12	7238483919	7238583293	99374	681.89	634.95	19	19	-1	12.55	12.55
Saccade L	1	12	7238583293	7238623180	39887	685.45	636.77	624.27	474.22	1.81	90.33	1.00	45.43	2037.77	-2171.99	1856.44
Saccade R	1	12	7238583293	7238623180	39887	685.45	636.77	624.27	474.22	1.81	90.33	1.00	45.43	2037.77	-2171.99	1856.44
Fixation L	1	13	7238623180	7238742403	119223	605.52	465.41	26	15	-1	11.58	11.58
Fixation R	1	13	7238623180	7238742403	119223	605.52	465.41	26	15	-1	12.49	12.49
