[BeGaze]
Converted from:	C:\Documents and Settings\iViewX\Desktop\EXPERIMENTATIONS\Experiments\results\finaleart\S5121332-finaleart-1.idf
Date:	27.03.2019 15:34:55
Version:	BeGaze 2.5.77
Sample Rate:	50
Subject:	S5121332
Description:	Dylan Marinho

Table Header for Fixations:
Event Type	Trial	Number	Start	End	Duration	Location X	Location Y	Dispersion X	Dispersion Y	Plane	Avg. Pupil Size X	Avg. Pupil Size Y

Table Header for Saccades:
Event Type	Trial	Number	Start	End	Duration	Start Loc.X	Start Loc.Y	End Loc.X	End Loc.Y	Amplitude	Peak Speed	Peak Speed At	Average Speed	Peak Accel.	Peak Decel.	Average Accel.

Table Header for Blinks:
Event Type	Trial	Number	Start	End	Duration

Table Header for User Events:
Event Type	Trial	Number	Start	Description

UserEvent	1	1	8993061969	# Message: courbet-the-sleepers-1866.jpg
Fixation L	1	1	8993063698	8993580782	517084	901.05	565.47	43	28	-1	16.99	16.99
Fixation R	1	1	8993063698	8993580782	517084	901.05	565.47	43	28	-1	17.16	17.16
Saccade L	1	1	8993580782	8993600735	19953	925.41	584.51	815.49	557.20	0.82	114.57	1.00	40.91	2712.36	-2853.59	2197.97
Saccade R	1	1	8993580782	8993600735	19953	925.41	584.51	815.49	557.20	0.82	114.57	1.00	40.91	2712.36	-2853.59	2197.97
Fixation L	1	2	8993600735	8993799652	198917	776.47	528.86	49	35	-1	17.08	17.08
Fixation R	1	2	8993600735	8993799652	198917	776.47	528.86	49	35	-1	16.85	16.85
Saccade L	1	2	8993799652	8993839395	39743	768.27	531.26	575.08	402.87	2.15	139.96	0.50	54.01	3382.53	-3037.82	2777.36
Saccade R	1	2	8993799652	8993839395	39743	768.27	531.26	575.08	402.87	2.15	139.96	0.50	54.01	3382.53	-3037.82	2777.36
Fixation L	1	3	8993839395	8994078002	238607	592.62	374.69	28	40	-1	15.81	15.81
Fixation R	1	3	8993839395	8994078002	238607	592.62	374.69	28	40	-1	16.08	16.08
Saccade L	1	3	8994078002	8994097884	19882	584.10	364.14	522.46	358.07	0.47	62.66	1.00	23.61	1466.67	-1170.15	975.60
Saccade R	1	3	8994078002	8994097884	19882	584.10	364.14	522.46	358.07	0.47	62.66	1.00	23.61	1466.67	-1170.15	975.60
Fixation L	1	4	8994097884	8994336609	238725	514.49	365.59	25	21	-1	15.53	15.53
Fixation R	1	4	8994097884	8994336609	238725	514.49	365.59	25	21	-1	15.95	15.95
Saccade L	1	4	8994336609	8994356501	19892	503.07	370.67	348.12	356.86	0.95	157.34	1.00	47.51	3905.84	-3754.88	2638.41
Saccade R	1	4	8994336609	8994356501	19892	503.07	370.67	348.12	356.86	0.95	157.34	1.00	47.51	3905.84	-3754.88	2638.41
Fixation L	1	5	8994356501	8994953204	596703	361.20	345.21	19	35	-1	16.51	16.51
Fixation R	1	5	8994356501	8994953204	596703	361.20	345.21	19	35	-1	16.62	16.62
Saccade L	1	5	8994953204	8995132186	178982	367.03	355.60	1247.78	569.24	14.86	165.42	0.78	83.00	3915.86	-3776.45	2415.77
Saccade R	1	5	8994953204	8995132186	178982	367.03	355.60	1247.78	569.24	14.86	165.42	0.78	83.00	3915.86	-3776.45	2415.77
Fixation L	1	6	8995132186	8995231686	99500	1269.49	588.75	28	31	-1	17.55	17.55
Fixation R	1	6	8995132186	8995231686	99500	1269.49	588.75	28	31	-1	17.96	17.96
Blink L	1	1	8995231686	8995410670	178984
Blink R	1	1	8995231686	8995410670	178984
Fixation L	1	7	8995410670	8995649284	238614	1242.84	585.01	34	60	-1	18.39	18.39
Fixation R	1	7	8995410670	8995649284	238614	1242.84	585.01	34	60	-1	18.40	18.40
Saccade L	1	6	8995649284	8995669282	19998	1263.48	561.85	1265.91	546.09	0.20	16.13	1.00	9.92	330.82	-346.10	307.92
Saccade R	1	6	8995649284	8995669282	19998	1263.48	561.85	1265.91	546.09	0.20	16.13	1.00	9.92	330.82	-346.10	307.92
Fixation L	1	8	8995669282	8995907890	238608	1272.91	539.92	81	14	-1	17.72	17.72
Fixation R	1	8	8995669282	8995907890	238608	1272.91	539.92	81	14	-1	17.78	17.78
Saccade L	1	7	8995907890	8995927769	19879	1204.66	533.38	1085.00	535.60	1.05	121.05	1.00	52.96	2973.58	-2814.86	2572.83
Saccade R	1	7	8995907890	8995927769	19879	1204.66	533.38	1085.00	535.60	1.05	121.05	1.00	52.96	2973.58	-2814.86	2572.83
Fixation L	1	9	8995927769	8996186376	258607	1083.75	543.18	11	19	-1	17.29	17.29
Fixation R	1	9	8995927769	8996186376	258607	1083.75	543.18	11	19	-1	17.11	17.11
Saccade L	1	8	8996186376	8996206252	19876	1087.54	550.81	965.44	557.10	0.90	123.67	1.00	45.13	2958.25	-2954.70	2335.89
Saccade R	1	8	8996186376	8996206252	19876	1087.54	550.81	965.44	557.10	0.90	123.67	1.00	45.13	2958.25	-2954.70	2335.89
Fixation L	1	10	8996206252	8996385230	178978	911.17	575.73	66	32	-1	17.77	17.77
Fixation R	1	10	8996206252	8996385230	178978	911.17	575.73	66	32	-1	17.56	17.56
Saccade L	1	9	8996385230	8996405118	19888	899.88	589.94	903.34	592.95	0.06	4.63	1.00	3.23	0.22	-45.95	19.13
Saccade R	1	9	8996385230	8996405118	19888	899.88	589.94	903.34	592.95	0.06	4.63	1.00	3.23	0.22	-45.95	19.13
Fixation L	1	11	8996405118	8996524484	119366	902.75	594.44	5	2	-1	17.87	17.87
Fixation R	1	11	8996405118	8996524484	119366	902.75	594.44	5	2	-1	17.77	17.77
Saccade L	1	10	8996524484	8996544348	19864	905.74	595.65	798.52	593.46	0.78	108.48	1.00	39.50	2631.52	-2466.70	2056.20
Saccade R	1	10	8996524484	8996544348	19864	905.74	595.65	798.52	593.46	0.78	108.48	1.00	39.50	2631.52	-2466.70	2056.20
Fixation L	1	12	8996544348	8997061450	517102	744.58	574.08	60	25	-1	18.26	18.26
Fixation R	1	12	8996544348	8997061450	517102	744.58	574.08	60	25	-1	18.21	18.21
