[BeGaze]
Converted from:	C:\Documents and Settings\iViewX\Desktop\EXPERIMENTATIONS\Experiments\results\finaleart\S13H22431-finaleart-1.idf
Date:	27.03.2019 15:42:11
Version:	BeGaze 2.5.77
Sample Rate:	50
Subject:	S13H22431
Description:	Jimmy Petit

Table Header for Fixations:
Event Type	Trial	Number	Start	End	Duration	Location X	Location Y	Dispersion X	Dispersion Y	Plane	Avg. Pupil Size X	Avg. Pupil Size Y

Table Header for Saccades:
Event Type	Trial	Number	Start	End	Duration	Start Loc.X	Start Loc.Y	End Loc.X	End Loc.Y	Amplitude	Peak Speed	Peak Speed At	Average Speed	Peak Accel.	Peak Decel.	Average Accel.

Table Header for Blinks:
Event Type	Trial	Number	Start	End	Duration

Table Header for User Events:
Event Type	Trial	Number	Start	Description

UserEvent	1	1	28099526165	# Message: sisley-still-life-heron-with-spread-wings-1867.jpg
Fixation L	1	1	28099538326	28099657726	119400	914.52	605.30	29	39	-1	16.14	16.14
Fixation R	1	1	28099538326	28099657726	119400	914.52	605.30	29	39	-1	17.18	17.18
Saccade L	1	1	28099657726	28099717307	59581	922.86	601.90	709.41	925.49	4.38	213.47	0.67	73.45	5039.05	-4991.13	3002.85
Saccade R	1	1	28099657726	28099717307	59581	922.86	601.90	709.41	925.49	4.38	213.47	0.67	73.45	5039.05	-4991.13	3002.85
Fixation L	1	2	28099717307	28099916316	199009	693.26	932.84	31	54	-1	15.81	15.81
Fixation R	1	2	28099717307	28099916316	199009	693.26	932.84	31	54	-1	17.20	17.20
Saccade L	1	2	28099916316	28099975929	59613	677.76	965.36	836.62	631.57	4.48	259.06	0.67	75.14	6380.40	-6252.20	3798.39
Saccade R	1	2	28099916316	28099975929	59613	677.76	965.36	836.62	631.57	4.48	259.06	0.67	75.14	6380.40	-6252.20	3798.39
Fixation L	1	3	28099975929	28100274285	298356	843.70	639.16	35	60	-1	15.65	15.65
Fixation R	1	3	28099975929	28100274285	298356	843.70	639.16	35	60	-1	16.93	16.93
Saccade L	1	3	28100274285	28100333906	59621	829.48	605.52	654.52	894.23	4.01	205.30	1.00	67.18	4955.54	-4875.82	3431.72
Saccade R	1	3	28100274285	28100333906	59621	829.48	605.52	654.52	894.23	4.01	205.30	1.00	67.18	4955.54	-4875.82	3431.72
Fixation L	1	4	28100333906	28100950499	616593	655.00	906.92	48	26	-1	15.57	15.57
Fixation R	1	4	28100333906	28100950499	616593	655.00	906.92	48	26	-1	16.60	16.60
Saccade L	1	4	28100950499	28101030121	79622	678.29	898.45	763.38	434.78	5.76	206.68	0.50	72.33	5116.63	-2757.85	2669.13
Saccade R	1	4	28100950499	28101030121	79622	678.29	898.45	763.38	434.78	5.76	206.68	0.50	72.33	5116.63	-2757.85	2669.13
Fixation L	1	5	28101030121	28101228988	198867	763.34	467.78	8	54	-1	16.14	16.14
Fixation R	1	5	28101030121	28101228988	198867	763.34	467.78	8	54	-1	17.26	17.26
Saccade L	1	5	28101228988	28101268741	39753	767.68	466.95	770.55	203.79	2.20	152.04	0.50	55.40	3733.54	-3704.50	3241.14
Saccade R	1	5	28101228988	28101268741	39753	767.68	466.95	770.55	203.79	2.20	152.04	0.50	55.40	3733.54	-3704.50	3241.14
Fixation L	1	6	28101268741	28101606985	338244	762.28	199.12	36	62	-1	15.79	15.79
Fixation R	1	6	28101268741	28101606985	338244	762.28	199.12	36	62	-1	16.81	16.81
Saccade L	1	6	28101606985	28101626849	19864	751.89	166.38	746.31	161.13	0.21	14.87	0.00	10.39	-92.23	-233.52	155.89
Saccade R	1	6	28101606985	28101626849	19864	751.89	166.38	746.31	161.13	0.21	14.87	0.00	10.39	-92.23	-233.52	155.89
Fixation L	1	7	28101626849	28101825725	198876	741.96	174.19	12	36	-1	16.54	16.54
Fixation R	1	7	28101626849	28101825725	198876	741.96	174.19	12	36	-1	17.07	17.07
Saccade L	1	7	28101825725	28101885338	59613	747.25	186.36	824.71	651.82	5.14	249.71	0.67	86.23	6002.64	-5765.99	3643.42
Saccade R	1	7	28101825725	28101885338	59613	747.25	186.36	824.71	651.82	5.14	249.71	0.67	86.23	6002.64	-5765.99	3643.42
Fixation L	1	8	28101885338	28102143956	258618	828.97	669.21	29	22	-1	17.69	17.69
Fixation R	1	8	28101885338	28102143956	258618	828.97	669.21	29	22	-1	18.52	18.52
Saccade L	1	8	28102143956	28102183695	39739	836.07	673.12	1043.21	682.16	2.16	147.54	1.00	54.35	3653.45	-3564.61	2202.63
Saccade R	1	8	28102143956	28102183695	39739	836.07	673.12	1043.21	682.16	2.16	147.54	1.00	54.35	3653.45	-3564.61	2202.63
Fixation L	1	9	28102183695	28102402561	218866	1101.30	683.99	67	11	-1	17.69	17.69
Fixation R	1	9	28102183695	28102402561	218866	1101.30	683.99	67	11	-1	18.40	18.40
Saccade L	1	9	28102402561	28102422440	19879	1108.22	684.82	1216.69	684.11	0.87	109.72	1.00	43.87	2629.17	-2369.46	2060.03
Saccade R	1	9	28102402561	28102422440	19879	1108.22	684.82	1216.69	684.11	0.87	109.72	1.00	43.87	2629.17	-2369.46	2060.03
Fixation L	1	10	28102422440	28102621304	198864	1260.97	691.30	55	11	-1	17.10	17.10
Fixation R	1	10	28102422440	28102621304	198864	1260.97	691.30	55	11	-1	17.70	17.70
Saccade L	1	10	28102621304	28102661055	39751	1271.79	695.40	998.63	803.07	2.73	159.73	1.00	68.72	3912.87	-3864.83	3719.53
Saccade R	1	10	28102621304	28102661055	39751	1271.79	695.40	998.63	803.07	2.73	159.73	1.00	68.72	3912.87	-3864.83	3719.53
Fixation L	1	11	28102661055	28102879917	218862	980.66	780.87	24	30	-1	16.83	16.83
Fixation R	1	11	28102661055	28102879917	218862	980.66	780.87	24	30	-1	17.45	17.45
Saccade L	1	11	28102879917	28102919665	39748	979.07	775.79	803.04	787.68	1.60	90.86	0.50	40.16	2195.70	-2029.67	2080.38
Saccade R	1	11	28102879917	28102919665	39748	979.07	775.79	803.04	787.68	1.60	90.86	0.50	40.16	2195.70	-2029.67	2080.38
Fixation L	1	12	28102919665	28103138408	218743	803.60	818.87	4	45	-1	16.78	16.78
Fixation R	1	12	28102919665	28103138408	218743	803.60	818.87	4	45	-1	17.58	17.58
Saccade L	1	12	28103138408	28103158404	19996	800.65	831.00	673.63	835.67	0.82	128.56	1.00	41.24	3150.42	-2858.45	2208.84
Saccade R	1	12	28103138408	28103158404	19996	800.65	831.00	673.63	835.67	0.82	128.56	1.00	41.24	3150.42	-2858.45	2208.84
Fixation L	1	13	28103158404	28103397022	238618	690.46	862.08	26	41	-1	16.57	16.57
Fixation R	1	13	28103158404	28103397022	238618	690.46	862.08	26	41	-1	17.59	17.59
Saccade L	1	13	28103397022	28103516394	119372	695.53	877.15	492.57	970.95	4.08	117.49	0.67	34.20	2606.82	-2871.82	1291.41
Saccade R	1	13	28103397022	28103516394	119372	695.53	877.15	492.57	970.95	4.08	117.49	0.67	34.20	2606.82	-2871.82	1291.41
