[BeGaze]
Converted from:	C:\Documents and Settings\iViewX\Desktop\EXPERIMENTATIONS\Experiments\results\finaleart\S9H29221-finaleart-1.idf
Date:	27.03.2019 16:03:00
Version:	BeGaze 2.5.77
Sample Rate:	50
Subject:	S9H29221
Description:	steven

Table Header for Fixations:
Event Type	Trial	Number	Start	End	Duration	Location X	Location Y	Dispersion X	Dispersion Y	Plane	Avg. Pupil Size X	Avg. Pupil Size Y

Table Header for Saccades:
Event Type	Trial	Number	Start	End	Duration	Start Loc.X	Start Loc.Y	End Loc.X	End Loc.Y	Amplitude	Peak Speed	Peak Speed At	Average Speed	Peak Accel.	Peak Decel.	Average Accel.

Table Header for Blinks:
Event Type	Trial	Number	Start	End	Duration

Table Header for User Events:
Event Type	Trial	Number	Start	Description

UserEvent	1	1	6091006115	# Message: void.jpg
Fixation L	1	1	6091022386	6091209844	187458	1124.27	421.91	9	22	-1	13.56	13.56
Fixation R	1	1	6091022386	6091209844	187458	1124.27	421.91	9	22	-1	13.62	13.62
Saccade L	1	1	6091209844	6091260986	51142	1121.23	421.63	1185.09	853.35	4.22	201.13	0.22	82.61	4792.51	-2654.00	3045.05
Saccade R	1	1	6091209844	6091260986	51142	1121.23	421.63	1185.09	853.35	4.22	201.13	0.22	82.61	4792.51	-2654.00	3045.05
Fixation L	1	2	6091260986	6091539476	278490	1197.71	871.75	31	41	-1	13.23	13.23
Fixation R	1	2	6091260986	6091539476	278490	1197.71	871.75	31	41	-1	12.96	12.96
Saccade L	1	2	6091539476	6091638961	99485	1176.87	865.37	1013.31	840.64	3.68	90.09	0.20	37.04	1575.73	-1214.00	599.96
Saccade R	1	2	6091539476	6091638961	99485	1176.87	865.37	1013.31	840.64	3.68	90.09	0.20	37.04	1575.73	-1214.00	599.96
Fixation L	1	3	6091638961	6091778203	139242	984.97	809.59	38	47	-1	12.83	12.83
Fixation R	1	3	6091638961	6091778203	139242	984.97	809.59	38	47	-1	13.07	13.07
Saccade L	1	3	6091778203	6091837820	59617	975.04	797.36	868.14	415.78	4.26	174.83	0.67	71.38	4291.25	-3914.85	3004.88
Saccade R	1	3	6091778203	6091837820	59617	975.04	797.36	868.14	415.78	4.26	174.83	0.67	71.38	4291.25	-3914.85	3004.88
Fixation L	1	4	6091837820	6092315180	477360	830.20	430.50	46	32	-1	11.66	11.66
Fixation R	1	4	6091837820	6092315180	477360	830.20	430.50	46	32	-1	12.01	12.01
Saccade L	1	4	6092315180	6092374934	59754	826.98	438.13	656.22	536.18	2.22	92.10	0.67	37.16	2080.03	-1978.83	1466.44
Saccade R	1	4	6092315180	6092374934	59754	826.98	438.13	656.22	536.18	2.22	92.10	0.67	37.16	2080.03	-1978.83	1466.44
Fixation L	1	5	6092374934	6092514166	139232	640.13	532.24	41	12	-1	11.68	11.68
Fixation R	1	5	6092374934	6092514166	139232	640.13	532.24	41	12	-1	11.99	11.99
Saccade L	1	5	6092514166	6092534055	19889	615.15	526.73	536.46	526.67	0.95	80.63	1.00	47.64	1930.05	-1795.81	1681.16
Saccade R	1	5	6092514166	6092534055	19889	615.15	526.73	536.46	526.67	0.95	80.63	1.00	47.64	1930.05	-1795.81	1681.16
Fixation L	1	6	6092534055	6092752786	218731	471.05	529.29	79	11	-1	12.44	12.44
Fixation R	1	6	6092534055	6092752786	218731	471.05	529.29	79	11	-1	12.83	12.83
Saccade L	1	6	6092752786	6092772664	19878	467.30	523.61	588.69	531.04	1.08	123.01	1.00	54.52	3043.09	-2949.29	2687.75
Saccade R	1	6	6092752786	6092772664	19878	467.30	523.61	588.69	531.04	1.08	123.01	1.00	54.52	3043.09	-2949.29	2687.75
Fixation L	1	7	6092772664	6092971522	198858	671.02	529.79	93	5	-1	12.36	12.36
Fixation R	1	7	6092772664	6092971522	198858	671.02	529.79	93	5	-1	13.02	13.02
Saccade L	1	7	6092971522	6093051147	79625	682.44	532.49	751.60	526.64	1.01	62.07	1.00	12.71	1514.23	-28.00	338.74
Saccade R	1	7	6092971522	6093051147	79625	682.44	532.49	751.60	526.64	1.01	62.07	1.00	12.71	1514.23	-28.00	338.74
