[BeGaze]
Converted from:	C:\Documents and Settings\iViewX\Desktop\EXPERIMENTATIONS\Experiments\results\finaleart\S12H22222-finaleart-1.idf
Date:	27.03.2019 15:41:03
Version:	BeGaze 2.5.77
Sample Rate:	50
Subject:	S12H22222
Description:	aurele barriere

Table Header for Fixations:
Event Type	Trial	Number	Start	End	Duration	Location X	Location Y	Dispersion X	Dispersion Y	Plane	Avg. Pupil Size X	Avg. Pupil Size Y

Table Header for Saccades:
Event Type	Trial	Number	Start	End	Duration	Start Loc.X	Start Loc.Y	End Loc.X	End Loc.Y	Amplitude	Peak Speed	Peak Speed At	Average Speed	Peak Accel.	Peak Decel.	Average Accel.

Table Header for Blinks:
Event Type	Trial	Number	Start	End	Duration

Table Header for User Events:
Event Type	Trial	Number	Start	Description

UserEvent	1	1	24158629649	# Message: red-mullets_monet_1869.jpg
Fixation L	1	1	24158642262	24159179231	536969	916.99	541.89	29	54	-1	13.75	13.75
Fixation R	1	1	24158642262	24159179231	536969	916.99	541.89	29	54	-1	12.95	12.95
Saccade L	1	1	24159179231	24159199235	20004	902.88	579.12	806.67	697.86	0.99	154.57	1.00	49.27	3748.66	-3809.75	2803.14
Saccade R	1	1	24159179231	24159199235	20004	902.88	579.12	806.67	697.86	0.99	154.57	1.00	49.27	3748.66	-3809.75	2803.14
Fixation L	1	2	24159199235	24159378233	178998	807.33	690.83	2	21	-1	11.84	11.84
Fixation R	1	2	24159199235	24159378233	178998	807.33	690.83	2	21	-1	11.60	11.60
Saccade L	1	2	24159378233	24159398117	19884	806.41	683.91	677.44	797.49	1.12	173.79	1.00	56.09	4144.27	-4040.90	2955.50
Saccade R	1	2	24159378233	24159398117	19884	806.41	683.91	677.44	797.49	1.12	173.79	1.00	56.09	4144.27	-4040.90	2955.50
Fixation L	1	3	24159398117	24159616855	218738	653.28	838.05	29	53	-1	11.20	11.20
Fixation R	1	3	24159398117	24159616855	218738	653.28	838.05	29	53	-1	10.86	10.86
Saccade L	1	3	24159616855	24159636711	19856	651.85	849.78	636.84	857.75	0.31	30.88	1.00	15.46	725.71	-3.39	287.10
Saccade R	1	3	24159616855	24159636711	19856	651.85	849.78	636.84	857.75	0.31	30.88	1.00	15.46	725.71	-3.39	287.10
Fixation L	1	4	24159636711	24159795840	159129	643.20	802.26	13	85	-1	11.43	11.43
Fixation R	1	4	24159636711	24159795840	159129	643.20	802.26	13	85	-1	11.31	11.31
Saccade L	1	4	24159795840	24159815848	20008	637.18	772.00	635.39	770.20	0.09	8.36	1.00	4.64	-1.21	-144.92	85.08
Saccade R	1	4	24159795840	24159815848	20008	637.18	772.00	635.39	770.20	0.09	8.36	1.00	4.64	-1.21	-144.92	85.08
Fixation L	1	5	24159815848	24159915199	99351	634.28	766.79	2	7	-1	11.46	11.46
Fixation R	1	5	24159815848	24159915199	99351	634.28	766.79	2	7	-1	11.62	11.62
Saccade L	1	5	24159915199	24159935078	19879	633.09	763.10	631.50	875.97	0.61	114.17	1.00	30.51	2819.91	-2794.94	1872.01
Saccade R	1	5	24159915199	24159935078	19879	633.09	763.10	631.50	875.97	0.61	114.17	1.00	30.51	2819.91	-2794.94	1872.01
Fixation L	1	6	24159935078	24160332940	397862	618.50	896.60	27	37	-1	11.94	11.94
Fixation R	1	6	24159935078	24160332940	397862	618.50	896.60	27	37	-1	12.08	12.08
Saccade L	1	6	24160332940	24160392557	59617	610.34	878.58	1014.74	274.77	7.88	348.09	0.33	132.17	8653.25	-5508.82	5488.51
Saccade R	1	6	24160332940	24160392557	59617	610.34	878.58	1014.74	274.77	7.88	348.09	0.33	132.17	8653.25	-5508.82	5488.51
Fixation L	1	7	24160392557	24161228042	835485	1026.25	237.91	19	49	-1	12.00	12.00
Fixation R	1	7	24160392557	24161228042	835485	1026.25	237.91	19	49	-1	11.87	11.87
Saccade L	1	7	24161228042	24161247892	19850	1030.45	254.05	1024.64	323.41	0.53	70.40	1.00	26.69	1705.23	-1380.35	1244.12
Saccade R	1	7	24161228042	24161247892	19850	1030.45	254.05	1024.64	323.41	0.53	70.40	1.00	26.69	1705.23	-1380.35	1244.12
Fixation L	1	8	24161247892	24161506386	258494	1000.48	354.62	37	45	-1	12.51	12.51
Fixation R	1	8	24161247892	24161506386	258494	1000.48	354.62	37	45	-1	12.37	12.37
Saccade L	1	8	24161506386	24161526377	19991	986.87	365.77	988.50	476.09	0.71	111.60	1.00	35.57	2679.78	-2760.32	1881.74
Saccade R	1	8	24161506386	24161526377	19991	986.87	365.77	988.50	476.09	0.71	111.60	1.00	35.57	2679.78	-2760.32	1881.74
Fixation L	1	9	24161526377	24161764999	238622	990.18	465.52	28	19	-1	12.48	12.48
Fixation R	1	9	24161526377	24161764999	238622	990.18	465.52	28	19	-1	12.36	12.36
Saccade L	1	9	24161764999	24161804749	39750	1013.02	473.94	1392.34	655.48	3.91	261.88	0.50	98.30	6362.95	-6438.78	5345.02
Saccade R	1	9	24161764999	24161804749	39750	1013.02	473.94	1392.34	655.48	3.91	261.88	0.50	98.30	6362.95	-6438.78	5345.02
Fixation L	1	10	24161804749	24162162850	358101	1390.29	647.46	57	21	-1	12.66	12.66
Fixation R	1	10	24161804749	24162162850	358101	1390.29	647.46	57	21	-1	12.14	12.14
Saccade L	1	10	24162162850	24162182725	19875	1393.97	637.05	1438.41	611.53	0.52	51.84	1.00	26.07	1218.06	-939.22	1107.00
Saccade R	1	10	24162162850	24162182725	19875	1393.97	637.05	1438.41	611.53	0.52	51.84	1.00	26.07	1218.06	-939.22	1107.00
Fixation L	1	11	24162182725	24162302094	119369	1470.41	570.29	43	54	-1	12.26	12.26
Fixation R	1	11	24162182725	24162302094	119369	1470.41	570.29	43	54	-1	11.66	11.66
Saccade L	1	11	24162302094	24162381594	79500	1482.23	557.05	1778.41	408.17	4.81	126.46	0.75	60.47	2243.51	-3048.07	1934.07
Saccade R	1	11	24162302094	24162381594	79500	1482.23	557.05	1778.41	408.17	4.81	126.46	0.75	60.47	2243.51	-3048.07	1934.07
Fixation L	1	12	24162381594	24162500963	119369	1769.30	406.03	34	49	-1	12.11	12.11
Fixation R	1	12	24162381594	24162500963	119369	1769.30	406.03	34	49	-1	11.63	11.63
Saccade L	1	12	24162500963	24162520839	19876	1747.37	427.32	1709.77	457.57	0.58	50.22	1.00	29.27	1073.95	-890.78	971.97
Saccade R	1	12	24162500963	24162520839	19876	1747.37	427.32	1709.77	457.57	0.58	50.22	1.00	29.27	1073.95	-890.78	971.97
Fixation L	1	13	24162520839	24162620331	99492	1728.65	442.54	39	30	-1	12.25	12.25
Fixation R	1	13	24162520839	24162620331	99492	1728.65	442.54	39	30	-1	11.33	11.33
