[BeGaze]
Converted from:	C:\Documents and Settings\iViewX\Desktop\EXPERIMENTATIONS\Experiments\results\finaleart\S3121421-finaleart-1.idf
Date:	27.03.2019 15:33:52
Version:	BeGaze 2.5.77
Sample Rate:	50
Subject:	S3121421
Description:	Jean Jouve

Table Header for Fixations:
Event Type	Trial	Number	Start	End	Duration	Location X	Location Y	Dispersion X	Dispersion Y	Plane	Avg. Pupil Size X	Avg. Pupil Size Y

Table Header for Saccades:
Event Type	Trial	Number	Start	End	Duration	Start Loc.X	Start Loc.Y	End Loc.X	End Loc.Y	Amplitude	Peak Speed	Peak Speed At	Average Speed	Peak Accel.	Peak Decel.	Average Accel.

Table Header for Blinks:
Event Type	Trial	Number	Start	End	Duration

Table Header for User Events:
Event Type	Trial	Number	Start	Description

UserEvent	1	1	4222478314	# Message: void.jpg
Fixation L	1	1	4222496324	4223252205	755881	489.79	218.74	35	61	-1	11.29	11.29
Fixation R	1	1	4222496324	4223252205	755881	489.79	218.74	35	61	-1	10.46	10.46
Saccade L	1	1	4223252205	4223272022	19817	507.07	251.41	512.52	253.06	0.09	8.56	1.00	4.42	-21.20	-79.87	56.94
Saccade R	1	1	4223252205	4223272022	19817	507.07	251.41	512.52	253.06	0.09	8.56	1.00	4.42	-21.20	-79.87	56.94
Fixation L	1	2	4223272022	4223371516	99494	511.31	253.36	15	8	-1	11.49	11.49
Fixation R	1	2	4223272022	4223371516	99494	511.31	253.36	15	8	-1	10.88	10.88
Saccade L	1	2	4223371516	4223431128	59612	521.95	259.05	1141.27	363.74	6.74	275.01	0.33	113.00	6838.72	-4725.21	4252.57
Saccade R	1	2	4223371516	4223431128	59612	521.95	259.05	1141.27	363.74	6.74	275.01	0.33	113.00	6838.72	-4725.21	4252.57
Fixation L	1	3	4223431128	4223629997	198869	1152.29	368.23	19	28	-1	12.07	12.07
Fixation R	1	3	4223431128	4223629997	198869	1152.29	368.23	19	28	-1	11.29	11.29
Blink L	1	1	4223629997	4223848855	218858
Blink R	1	1	4223629997	4223848855	218858
Fixation L	1	4	4223848855	4224266482	417627	1081.77	600.45	7	24	-1	12.47	12.47
Fixation R	1	4	4223848855	4224266482	417627	1081.77	600.45	7	24	-1	13.31	13.31
Saccade L	1	3	4224266482	4224306331	39849	1083.82	611.50	929.05	589.17	1.44	118.56	0.50	36.03	2893.16	-2671.86	1698.56
Saccade R	1	3	4224266482	4224306331	39849	1083.82	611.50	929.05	589.17	1.44	118.56	0.50	36.03	2893.16	-2671.86	1698.56
Fixation L	1	5	4224306331	4224465440	159109	919.18	567.18	13	48	-1	12.24	12.24
Fixation R	1	5	4224306331	4224465440	159109	919.18	567.18	13	48	-1	13.12	13.12
