[BeGaze]
Converted from:	C:\Documents and Settings\iViewX\Desktop\EXPERIMENTATIONS\Experiments\results\finaleart\S9H29221-finaleart-1.idf
Date:	27.03.2019 16:04:20
Version:	BeGaze 2.5.77
Sample Rate:	50
Subject:	S9H29221
Description:	steven

Table Header for Fixations:
Event Type	Trial	Number	Start	End	Duration	Location X	Location Y	Dispersion X	Dispersion Y	Plane	Avg. Pupil Size X	Avg. Pupil Size Y

Table Header for Saccades:
Event Type	Trial	Number	Start	End	Duration	Start Loc.X	Start Loc.Y	End Loc.X	End Loc.Y	Amplitude	Peak Speed	Peak Speed At	Average Speed	Peak Accel.	Peak Decel.	Average Accel.

Table Header for Blinks:
Event Type	Trial	Number	Start	End	Duration

Table Header for User Events:
Event Type	Trial	Number	Start	Description

UserEvent	1	1	6923153196	# Message: void.jpg
Saccade L	1	1	6923162815	6923202558	39743	851.33	53.89	1084.62	297.04	3.51	189.69	1.00	88.22	4742.30	-4705.84	3273.61
Saccade R	1	1	6923162815	6923202558	39743	851.33	53.89	1084.62	297.04	3.51	189.69	1.00	88.22	4742.30	-4705.84	3273.61
Fixation L	1	1	6923202558	6923858917	656359	1086.64	276.44	8	41	-1	17.53	17.53
Fixation R	1	1	6923202558	6923858917	656359	1086.64	276.44	8	41	-1	16.51	16.51
Blink L	1	1	6923858917	6924077778	218861
Blink R	1	1	6923858917	6924077778	218861
Fixation L	1	2	6924077778	6924574992	497214	959.76	451.54	16	26	-1	16.44	16.44
Fixation R	1	2	6924077778	6924574992	497214	959.76	451.54	16	26	-1	14.73	14.73
Saccade L	1	2	6924574992	6924634612	59620	963.54	462.27	1331.55	594.52	4.05	156.84	0.33	67.97	3893.81	-3442.62	2934.31
Saccade R	1	2	6924574992	6924634612	59620	963.54	462.27	1331.55	594.52	4.05	156.84	0.33	67.97	3893.81	-3442.62	2934.31
Fixation L	1	3	6924634612	6925151718	517106	1332.78	619.05	54	36	-1	16.46	16.46
Fixation R	1	3	6924634612	6925151718	517106	1332.78	619.05	54	36	-1	14.83	14.83
Saccade L	1	3	6925151718	6925211462	59744	1283.01	631.31	1155.70	616.71	2.27	116.17	0.33	38.03	2847.49	-2778.33	1619.52
Saccade R	1	3	6925151718	6925211462	59744	1283.01	631.31	1155.70	616.71	2.27	116.17	0.33	38.03	2847.49	-2778.33	1619.52
