[BeGaze]
Converted from:	C:\Documents and Settings\iViewX\Desktop\EXPERIMENTATIONS\Experiments\results\finaleart\S8119532-finaleart-1.idf
Date:	27.03.2019 16:00:31
Version:	BeGaze 2.5.77
Sample Rate:	50
Subject:	S8119532
Description:	Alexandre Drewery

Table Header for Fixations:
Event Type	Trial	Number	Start	End	Duration	Location X	Location Y	Dispersion X	Dispersion Y	Plane	Avg. Pupil Size X	Avg. Pupil Size Y

Table Header for Saccades:
Event Type	Trial	Number	Start	End	Duration	Start Loc.X	Start Loc.Y	End Loc.X	End Loc.Y	Amplitude	Peak Speed	Peak Speed At	Average Speed	Peak Accel.	Peak Decel.	Average Accel.

Table Header for Blinks:
Event Type	Trial	Number	Start	End	Duration

Table Header for User Events:
Event Type	Trial	Number	Start	Description

UserEvent	1	1	3184162602	# Message: Houses_at_Chatou_Vlaminck_1905.jpg
Fixation L	1	1	3184173100	3184988547	815447	894.05	507.76	19	46	-1	15.24	15.24
Fixation R	1	1	3184173100	3184988547	815447	894.05	507.76	19	46	-1	16.12	16.12
Saccade L	1	1	3184988547	3185008418	19871	889.02	519.36	984.79	653.92	0.99	167.03	1.00	49.76	3911.41	-3859.14	2639.97
Saccade R	1	1	3184988547	3185008418	19871	889.02	519.36	984.79	653.92	0.99	167.03	1.00	49.76	3911.41	-3859.14	2639.97
Fixation L	1	2	3185008418	3185187456	179038	983.47	658.61	4	12	-1	15.03	15.03
Fixation R	1	2	3185008418	3185187456	179038	983.47	658.61	4	12	-1	15.70	15.70
Saccade L	1	2	3185187456	3185247161	59705	985.00	655.09	1230.58	663.30	4.56	183.62	0.67	76.35	4273.97	-3926.20	2829.09
Saccade R	1	2	3185187456	3185247161	59705	985.00	655.09	1230.58	663.30	4.56	183.62	0.67	76.35	4273.97	-3926.20	2829.09
Fixation L	1	3	3185247161	3185386402	139241	1240.56	698.17	29	64	-1	14.14	14.14
Fixation R	1	3	3185247161	3185386402	139241	1240.56	698.17	29	64	-1	13.86	13.86
Saccade L	1	3	3185386402	3185485773	99371	1227.43	710.07	953.95	439.59	7.50	262.84	0.80	75.49	5596.39	-6241.30	2946.91
Saccade R	1	3	3185386402	3185485773	99371	1227.43	710.07	953.95	439.59	7.50	262.84	0.80	75.49	5596.39	-6241.30	2946.91
Fixation L	1	4	3185485773	3185644889	159116	951.51	447.54	7	13	-1	13.22	13.22
Fixation R	1	4	3185485773	3185644889	159116	951.51	447.54	7	13	-1	13.15	13.15
Saccade L	1	4	3185644889	3185684649	39760	949.89	443.34	1308.89	637.32	3.48	302.52	1.00	87.64	7470.29	-6660.90	4842.81
Saccade R	1	4	3185644889	3185684649	39760	949.89	443.34	1308.89	637.32	3.48	302.52	1.00	87.64	7470.29	-6660.90	4842.81
Fixation L	1	5	3185684649	3185804006	119357	1315.92	654.59	13	52	-1	12.93	12.93
Fixation R	1	5	3185684649	3185804006	119357	1315.92	654.59	13	52	-1	12.46	12.46
Saccade L	1	5	3185804006	3185843879	39873	1320.71	643.51	1325.32	645.72	1.64	82.57	1.00	41.04	1858.94	-1634.96	1656.96
Saccade R	1	5	3185804006	3185843879	39873	1320.71	643.51	1325.32	645.72	1.64	82.57	1.00	41.04	1858.94	-1634.96	1656.96
Fixation L	1	6	3185843879	3185983003	139124	1316.62	629.64	31	45	-1	12.71	12.71
Fixation R	1	6	3185843879	3185983003	139124	1316.62	629.64	31	45	-1	12.27	12.27
Saccade L	1	6	3185983003	3186003001	19998	1303.92	602.32	1280.26	639.33	0.53	44.44	1.00	26.43	878.77	-984.05	645.32
Saccade R	1	6	3185983003	3186003001	19998	1303.92	602.32	1280.26	639.33	0.53	44.44	1.00	26.43	878.77	-984.05	645.32
Fixation L	1	7	3186003001	3186599596	596595	1294.86	616.52	25	73	-1	12.63	12.63
Fixation R	1	7	3186003001	3186599596	596595	1294.86	616.52	25	73	-1	12.51	12.51
Saccade L	1	7	3186599596	3186798589	198993	1283.54	596.81	778.85	366.80	13.08	242.05	0.90	65.72	4721.56	-5585.17	2114.89
Saccade R	1	7	3186599596	3186798589	198993	1283.54	596.81	778.85	366.80	13.08	242.05	0.90	65.72	4721.56	-5585.17	2114.89
Fixation L	1	8	3186798589	3186957706	159117	772.52	375.43	20	21	-1	12.44	12.44
Fixation R	1	8	3186798589	3186957706	159117	772.52	375.43	20	21	-1	12.84	12.84
Saccade L	1	8	3186957706	3186977578	19872	773.71	371.95	667.73	379.49	0.69	107.47	1.00	34.51	2473.41	-2285.75	1631.54
Saccade R	1	8	3186957706	3186977578	19872	773.71	371.95	667.73	379.49	0.69	107.47	1.00	34.51	2473.41	-2285.75	1631.54
Fixation L	1	9	3186977578	3187216184	238606	658.96	379.30	41	45	-1	12.77	12.77
Fixation R	1	9	3186977578	3187216184	238606	658.96	379.30	41	45	-1	13.22	13.22
Saccade L	1	9	3187216184	3187335581	119397	659.32	385.63	995.95	276.40	8.03	262.52	0.83	67.22	6128.27	-6196.63	2709.84
Saccade R	1	9	3187216184	3187335581	119397	659.32	385.63	995.95	276.40	8.03	262.52	0.83	67.22	6128.27	-6196.63	2709.84
Fixation L	1	10	3187335581	3187494685	159104	992.69	292.46	17	63	-1	12.85	12.85
Fixation R	1	10	3187335581	3187494685	159104	992.69	292.46	17	63	-1	13.08	13.08
Saccade L	1	10	3187494685	3187594169	99484	987.37	306.82	1198.00	285.24	4.54	115.35	0.80	45.68	2778.58	-2416.87	1395.78
Saccade R	1	10	3187494685	3187594169	99484	987.37	306.82	1198.00	285.24	4.54	115.35	0.80	45.68	2778.58	-2416.87	1395.78
Fixation L	1	11	3187594169	3187733409	139240	1217.62	319.47	34	54	-1	13.06	13.06
Fixation R	1	11	3187594169	3187733409	139240	1217.62	319.47	34	54	-1	13.17	13.17
Saccade L	1	11	3187733409	3187753288	19879	1227.34	339.47	1223.67	352.86	0.30	27.58	1.00	15.24	362.72	93.49	216.96
Saccade R	1	11	3187733409	3187753288	19879	1227.34	339.47	1223.67	352.86	0.30	27.58	1.00	15.24	362.72	93.49	216.96
Fixation L	1	12	3187753288	3187872660	119372	1227.20	340.50	12	27	-1	13.03	13.03
Fixation R	1	12	3187753288	3187872660	119372	1227.20	340.50	12	27	-1	13.06	13.06
Saccade L	1	12	3187872660	3187932279	59619	1233.06	342.82	1287.54	727.08	4.30	211.35	0.67	72.20	5126.27	-4729.81	3125.43
Saccade R	1	12	3187872660	3187932279	59619	1233.06	342.82	1287.54	727.08	4.30	211.35	0.67	72.20	5126.27	-4729.81	3125.43
Fixation L	1	13	3187932279	3188051651	119372	1289.35	708.31	12	31	-1	13.11	13.11
Fixation R	1	13	3187932279	3188051651	119372	1289.35	708.31	12	31	-1	13.25	13.25
Saccade L	1	13	3188051651	3188071525	19874	1293.91	695.56	1295.29	612.49	0.50	84.04	1.00	25.26	2008.56	-1993.09	1411.01
Saccade R	1	13	3188051651	3188071525	19874	1293.91	695.56	1295.29	612.49	0.50	84.04	1.00	25.26	2008.56	-1993.09	1411.01
Fixation L	1	14	3188071525	3188170908	99383	1296.74	622.79	5	42	-1	13.36	13.36
Fixation R	1	14	3188071525	3188170908	99383	1296.74	622.79	5	42	-1	13.37	13.37
