[BeGaze]
Converted from:	C:\Documents and Settings\iViewX\Desktop\EXPERIMENTATIONS\Experiments\results\finaleart\S02123220-finaleart-1.idf
Date:	27.03.2019 15:33:40
Version:	BeGaze 2.5.77
Sample Rate:	50
Subject:	S02123220
Description:	David Xu

Table Header for Fixations:
Event Type	Trial	Number	Start	End	Duration	Location X	Location Y	Dispersion X	Dispersion Y	Plane	Avg. Pupil Size X	Avg. Pupil Size Y

Table Header for Saccades:
Event Type	Trial	Number	Start	End	Duration	Start Loc.X	Start Loc.Y	End Loc.X	End Loc.Y	Amplitude	Peak Speed	Peak Speed At	Average Speed	Peak Accel.	Peak Decel.	Average Accel.

Table Header for Blinks:
Event Type	Trial	Number	Start	End	Duration

Table Header for User Events:
Event Type	Trial	Number	Start	Description

UserEvent	1	1	1530856301	# Message: void.jpg
Fixation L	1	1	1530859340	1530978700	119360	666.85	637.58	21	70	-1	14.80	14.80
Fixation R	1	1	1530859340	1530978700	119360	666.85	637.58	21	70	-1	15.11	15.11
Saccade L	1	1	1530978700	1530998571	19871	677.15	659.88	676.22	673.39	0.21	20.06	1.00	10.44	136.03	-295.29	196.70
Saccade R	1	1	1530978700	1530998571	19871	677.15	659.88	676.22	673.39	0.21	20.06	1.00	10.44	136.03	-295.29	196.70
Fixation L	1	2	1530998571	1531157698	159127	691.14	694.14	28	57	-1	14.98	14.98
Fixation R	1	2	1530998571	1531157698	159127	691.14	694.14	28	57	-1	15.46	15.46
Saccade L	1	2	1531157698	1531177562	19864	704.71	719.35	643.70	723.44	0.56	61.85	1.00	28.25	883.26	-1226.35	704.98
Saccade R	1	2	1531157698	1531177562	19864	704.71	719.35	643.70	723.44	0.56	61.85	1.00	28.25	883.26	-1226.35	704.98
Fixation L	1	3	1531177562	1531376428	198866	622.88	728.85	27	22	-1	14.68	14.68
Fixation R	1	3	1531177562	1531376428	198866	622.88	728.85	27	22	-1	15.26	15.26
Saccade L	1	3	1531376428	1531416297	39869	623.97	736.83	863.08	658.34	2.25	151.48	0.50	56.52	3703.21	-3691.77	3132.49
Saccade R	1	3	1531376428	1531416297	39869	623.97	736.83	863.08	658.34	2.25	151.48	0.50	56.52	3703.21	-3691.77	3132.49
Fixation L	1	4	1531416297	1531694656	278359	866.75	621.34	6	60	-1	11.98	11.98
Fixation R	1	4	1531416297	1531694656	278359	866.75	621.34	6	60	-1	11.53	11.53
Saccade L	1	4	1531694656	1531714658	20002	868.95	602.44	853.75	568.82	0.37	37.32	1.00	18.65	1949.10	811.02	1213.21
Saccade R	1	4	1531694656	1531714658	20002	868.95	602.44	853.75	568.82	0.37	37.32	1.00	18.65	1949.10	811.02	1213.21
Blink L	1	1	1531714658	1532072636	357978
Blink R	1	1	1531714658	1532072636	357978
Fixation L	1	5	1532072636	1532311239	238603	779.03	386.82	32	49	-1	13.61	13.61
Fixation R	1	5	1532072636	1532311239	238603	779.03	386.82	32	49	-1	12.55	12.55
Saccade L	1	5	1532311239	1532370981	59742	795.18	405.44	1004.38	414.99	2.49	106.63	0.34	41.69	2596.33	-1491.01	1388.20
Saccade R	1	5	1532311239	1532370981	59742	795.18	405.44	1004.38	414.99	2.49	106.63	0.34	41.69	2596.33	-1491.01	1388.20
Fixation L	1	6	1532370981	1532748841	377860	1008.44	443.74	28	56	-1	14.02	14.02
Fixation R	1	6	1532370981	1532748841	377860	1008.44	443.74	28	56	-1	11.98	11.98
Saccade L	1	6	1532748841	1532848333	99492	992.07	456.59	924.41	467.91	1.79	32.57	0.40	18.03	385.33	-661.04	250.24
Saccade R	1	6	1532748841	1532848333	99492	992.07	456.59	924.41	467.91	1.79	32.57	0.40	18.03	385.33	-661.04	250.24
