[BeGaze]
Converted from:	C:\Documents and Settings\iViewX\Desktop\EXPERIMENTATIONS\Experiments\results\finaleart\S02123220-finaleart-1.idf
Date:	27.03.2019 15:33:43
Version:	BeGaze 2.5.77
Sample Rate:	50
Subject:	S02123220
Description:	David Xu

Table Header for Fixations:
Event Type	Trial	Number	Start	End	Duration	Location X	Location Y	Dispersion X	Dispersion Y	Plane	Avg. Pupil Size X	Avg. Pupil Size Y

Table Header for Saccades:
Event Type	Trial	Number	Start	End	Duration	Start Loc.X	Start Loc.Y	End Loc.X	End Loc.Y	Amplitude	Peak Speed	Peak Speed At	Average Speed	Peak Accel.	Peak Decel.	Average Accel.

Table Header for Blinks:
Event Type	Trial	Number	Start	End	Duration

Table Header for User Events:
Event Type	Trial	Number	Start	Description

UserEvent	1	1	1814018636	# Message: The_Joy_Of_Life_Matisse_1906.jpg
Fixation L	1	1	1814036428	1814474031	437603	869.42	537.52	12	30	-1	15.60	15.60
Fixation R	1	1	1814036428	1814474031	437603	869.42	537.52	12	30	-1	13.93	13.93
Saccade L	1	1	1814474031	1814513776	39745	873.24	562.38	947.20	654.46	1.49	93.26	0.50	37.50	2299.80	-1880.55	1286.59
Saccade R	1	1	1814474031	1814513776	39745	873.24	562.38	947.20	654.46	1.49	93.26	0.50	37.50	2299.80	-1880.55	1286.59
Fixation L	1	2	1814513776	1814692763	178987	957.48	626.28	14	48	-1	13.73	13.73
Fixation R	1	2	1814513776	1814692763	178987	957.48	626.28	14	48	-1	12.05	12.05
Saccade L	1	2	1814692763	1814732619	39856	961.52	613.74	1318.64	729.65	3.36	230.59	0.50	84.18	5452.78	-5318.43	4577.46
Saccade R	1	2	1814692763	1814732619	39856	961.52	613.74	1318.64	729.65	3.36	230.59	0.50	84.18	5452.78	-5318.43	4577.46
Fixation L	1	3	1814732619	1815070738	338119	1342.27	724.37	70	18	-1	11.37	11.37
Fixation R	1	3	1814732619	1815070738	338119	1342.27	724.37	70	18	-1	9.09	9.09
Saccade L	1	3	1815070738	1815209973	139235	1356.13	735.50	434.54	718.94	14.41	377.72	0.86	103.47	9151.67	-9103.32	4187.72
Saccade R	1	3	1815070738	1815209973	139235	1356.13	735.50	434.54	718.94	14.41	377.72	0.86	103.47	9151.67	-9103.32	4187.72
Fixation L	1	4	1815209973	1815388964	178991	435.91	676.38	4	71	-1	10.64	10.64
Fixation R	1	4	1815209973	1815388964	178991	435.91	676.38	4	71	-1	10.14	10.14
Saccade L	1	4	1815388964	1815408842	19878	437.44	647.51	475.89	650.08	0.34	38.98	1.00	17.29	898.90	-716.22	656.22
Saccade R	1	4	1815388964	1815408842	19878	437.44	647.51	475.89	650.08	0.34	38.98	1.00	17.29	898.90	-716.22	656.22
Fixation L	1	5	1815408842	1815587824	178982	503.93	621.26	39	57	-1	10.89	10.89
Fixation R	1	5	1815408842	1815587824	178982	503.93	621.26	39	57	-1	10.18	10.18
Saccade L	1	5	1815587824	1815607711	19887	494.67	618.80	312.86	646.30	1.29	185.95	1.00	64.97	4480.33	-3908.36	2803.98
Saccade R	1	5	1815587824	1815607711	19887	494.67	618.80	312.86	646.30	1.29	185.95	1.00	64.97	4480.33	-3908.36	2803.98
Fixation L	1	6	1815607711	1815846446	238735	283.54	662.75	35	42	-1	11.05	11.05
Fixation R	1	6	1815607711	1815846446	238735	283.54	662.75	35	42	-1	10.76	10.76
Saccade L	1	6	1815846446	1815886191	39745	281.82	676.14	464.01	855.87	2.31	143.88	1.00	58.16	3499.67	-2413.99	2742.87
Saccade R	1	6	1815846446	1815886191	39745	281.82	676.14	464.01	855.87	2.31	143.88	1.00	58.16	3499.67	-2413.99	2742.87
Fixation L	1	7	1815886191	1816124804	238613	486.26	873.58	68	28	-1	11.43	11.43
Fixation R	1	7	1815886191	1816124804	238613	486.26	873.58	68	28	-1	11.43	11.43
Saccade L	1	7	1816124804	1816184545	59741	508.57	879.35	1114.24	882.82	6.97	280.99	0.67	116.66	6693.23	-5882.29	4734.70
Saccade R	1	7	1816124804	1816184545	59741	508.57	879.35	1114.24	882.82	6.97	280.99	0.67	116.66	6693.23	-5882.29	4734.70
Fixation L	1	8	1816184545	1816502777	318232	1083.43	905.51	58	33	-1	11.55	11.55
Fixation R	1	8	1816184545	1816502777	318232	1083.43	905.51	58	33	-1	9.42	9.42
Saccade L	1	8	1816502777	1816602273	99496	1084.98	916.52	1547.55	907.61	11.83	397.02	0.40	118.91	9633.24	-6382.61	4350.60
Blink R	1	1	1816502777	1816622143	119366
Fixation L	1	9	1816602273	1816741395	139122	1539.26	915.61	18	43	-1	11.46	11.46
Fixation R	1	9	1816622143	1816741395	119252	1538.07	916.76	18	43	-1	8.69	8.69
Saccade L	1	9	1816741395	1816860758	119363	1534.99	927.13	1559.38	805.37	7.02	153.67	0.33	58.80	3265.38	-3595.49	2444.47
Saccade R	1	8	1816741395	1816860758	119363	1534.99	927.13	1559.38	805.37	7.02	153.67	0.33	58.80	3265.38	-3595.49	2444.47
Fixation L	1	10	1816860758	1816999996	139238	1560.90	841.05	8	74	-1	11.59	11.59
Fixation R	1	10	1816860758	1816999996	139238	1560.90	841.05	8	74	-1	10.17	10.17
Saccade L	1	10	1816999996	1817417715	417719	1557.57	859.01	1803.67	620.43	60.40	374.86	1.00	144.59	9296.67	-9075.14	5225.38
Saccade R	1	9	1816999996	1817417715	417719	1557.57	859.01	1803.67	620.43	60.40	374.86	1.00	144.59	9296.67	-9075.14	5225.38
Fixation L	1	11	1817417715	1817517093	99378	1806.31	643.48	10	34	-1	12.23	12.23
Fixation R	1	11	1817417715	1817517093	99378	1806.31	643.48	10	34	-1	11.10	11.10
Saccade L	1	11	1817517093	1817616607	99514	1807.68	654.61	1498.36	554.99	19.79	329.83	1.00	198.84	7475.26	-7727.10	4457.04
Saccade R	1	10	1817517093	1817616607	99514	1807.68	654.61	1498.36	554.99	19.79	329.83	1.00	198.84	7475.26	-7727.10	4457.04
Fixation L	1	12	1817616607	1817716097	99490	1498.40	564.25	3	44	-1	12.83	12.83
Fixation R	1	12	1817616607	1817716097	99490	1498.40	564.25	3	44	-1	11.58	11.58
Saccade L	1	12	1817716097	1817755823	39726	1496.95	579.21	1504.23	944.83	3.41	276.27	1.00	85.82	6733.21	-6558.39	4665.91
Saccade R	1	11	1817716097	1817755823	39726	1496.95	579.21	1504.23	944.83	3.41	276.27	1.00	85.82	6733.21	-6558.39	4665.91
Fixation L	1	13	1817755823	1817934828	179005	1515.40	951.78	32	35	-1	13.28	13.28
Fixation R	1	13	1817755823	1817934828	179005	1515.40	951.78	32	35	-1	10.21	10.21
Saccade L	1	13	1817934828	1818014430	79602	1533.65	925.53	1622.71	971.83	7.00	233.43	0.25	87.88	5694.27	-4469.69	3544.28
Saccade R	1	12	1817934828	1818014430	79602	1533.65	925.53	1622.71	971.83	7.00	233.43	0.25	87.88	5694.27	-4469.69	3544.28
