[BeGaze]
Converted from:	C:\Documents and Settings\iViewX\Desktop\EXPERIMENTATIONS\Experiments\results\finaleart\S19F21442-finaleart-1.idf
Date:	27.03.2019 15:50:14
Version:	BeGaze 2.5.77
Sample Rate:	50
Subject:	S19F21442
Description:	Juliette Veuillez

Table Header for Fixations:
Event Type	Trial	Number	Start	End	Duration	Location X	Location Y	Dispersion X	Dispersion Y	Plane	Avg. Pupil Size X	Avg. Pupil Size Y

Table Header for Saccades:
Event Type	Trial	Number	Start	End	Duration	Start Loc.X	Start Loc.Y	End Loc.X	End Loc.Y	Amplitude	Peak Speed	Peak Speed At	Average Speed	Peak Accel.	Peak Decel.	Average Accel.

Table Header for Blinks:
Event Type	Trial	Number	Start	End	Duration

Table Header for User Events:
Event Type	Trial	Number	Start	Description

UserEvent	1	1	5573910586	# Message: void.jpg
Saccade L	1	1	5573911651	5573931528	19877	534.15	617.68	673.53	569.24	1.15	149.24	1.00	57.94	614.80	-3410.09	1341.63
Saccade R	1	1	5573911651	5573931528	19877	534.15	617.68	673.53	569.24	1.15	149.24	1.00	57.94	614.80	-3410.09	1341.63
Fixation L	1	1	5573931528	5574130400	198872	688.77	515.08	19	72	-1	12.73	12.73
Fixation R	1	1	5573931528	5574130400	198872	688.77	515.08	19	72	-1	15.71	15.71
Saccade L	1	2	5574130400	5574190133	59733	692.94	496.32	1395.08	481.06	7.19	312.83	0.67	120.43	7775.50	-7617.60	5870.84
Saccade R	1	2	5574130400	5574190133	59733	692.94	496.32	1395.08	481.06	7.19	312.83	0.67	120.43	7775.50	-7617.60	5870.84
Fixation L	1	2	5574190133	5574687361	497228	1414.20	473.10	31	41	-1	13.16	13.16
Fixation R	1	2	5574190133	5574687361	497228	1414.20	473.10	31	41	-1	15.03	15.03
Saccade L	1	3	5574687361	5574727110	39749	1407.46	476.37	943.34	526.79	4.14	253.81	0.50	104.25	6223.79	-5598.21	5513.14
Saccade R	1	3	5574687361	5574727110	39749	1407.46	476.37	943.34	526.79	4.14	253.81	0.50	104.25	6223.79	-5598.21	5513.14
Fixation L	1	3	5574727110	5575105096	377986	940.43	528.60	24	71	-1	12.94	12.94
Fixation R	1	3	5574727110	5575105096	377986	940.43	528.60	24	71	-1	15.25	15.25
Saccade L	1	4	5575105096	5575124965	19869	930.66	554.62	924.09	538.77	0.26	17.35	1.00	12.88	251.61	-209.80	165.88
Saccade R	1	4	5575105096	5575124965	19869	930.66	554.62	924.09	538.77	0.26	17.35	1.00	12.88	251.61	-209.80	165.88
Fixation L	1	4	5575124965	5575661942	536977	930.91	550.27	17	50	-1	13.68	13.68
Fixation R	1	4	5575124965	5575661942	536977	930.91	550.27	17	50	-1	16.12	16.12
Saccade L	1	5	5575661942	5575761439	99497	933.27	566.17	923.23	484.11	8.61	210.35	0.60	86.54	4456.88	-3645.31	2520.37
Blink R	1	1	5575661942	5575741590	79648
Saccade R	1	5	5575741590	5575761439	19849	926.96	394.73	923.23	484.11	1.64	210.35	1.00	82.67	314.05	-2996.61	1775.59
Fixation L	1	5	5575761439	5575900681	139242	917.66	487.81	14	30	-1	14.91	14.91
Fixation R	1	5	5575761439	5575900681	139242	917.66	487.81	14	30	-1	16.76	16.76
