[BeGaze]
Converted from:	C:\Documents and Settings\iViewX\Desktop\EXPERIMENTATIONS\Experiments\results\finaleart\S13H22431-finaleart-1.idf
Date:	27.03.2019 15:42:08
Version:	BeGaze 2.5.77
Sample Rate:	50
Subject:	S13H22431
Description:	Jimmy Petit

Table Header for Fixations:
Event Type	Trial	Number	Start	End	Duration	Location X	Location Y	Dispersion X	Dispersion Y	Plane	Avg. Pupil Size X	Avg. Pupil Size Y

Table Header for Saccades:
Event Type	Trial	Number	Start	End	Duration	Start Loc.X	Start Loc.Y	End Loc.X	End Loc.Y	Amplitude	Peak Speed	Peak Speed At	Average Speed	Peak Accel.	Peak Decel.	Average Accel.

Table Header for Blinks:
Event Type	Trial	Number	Start	End	Duration

Table Header for User Events:
Event Type	Trial	Number	Start	Description

UserEvent	1	1	28066921528	# Message: void.jpg
Fixation L	1	1	28066938504	28067038000	99496	1259.79	985.70	68	9	-1	15.70	15.70
Fixation R	1	1	28066938504	28067038000	99496	1259.79	985.70	68	9	-1	15.72	15.72
Saccade L	1	1	28067038000	28067097599	59599	1203.64	980.02	632.93	798.37	6.88	237.28	0.33	115.44	5894.75	-5253.57	4160.40
Saccade R	1	1	28067038000	28067097599	59599	1203.64	980.02	632.93	798.37	6.88	237.28	0.33	115.44	5894.75	-5253.57	4160.40
Fixation L	1	2	28067097599	28067475455	377856	633.63	806.78	15	35	-1	15.49	15.49
Fixation R	1	2	28067097599	28067475455	377856	633.63	806.78	15	35	-1	15.38	15.38
Blink L	1	1	28067475455	28067634574	159119
Blink R	1	1	28067475455	28067634574	159119
Fixation L	1	3	28067634574	28067833566	198992	360.34	1068.85	11	37	-1	14.84	14.84
Fixation R	1	3	28067634574	28067833566	198992	360.34	1068.85	11	37	-1	13.45	13.45
Blink L	1	2	28067833566	28068489911	656345
Blink R	1	2	28067833566	28068489911	656345
Blink L	1	3	28068509787	28068609282	99495
Blink R	1	3	28068509787	28068609282	99495
Fixation L	1	4	28068609282	28068907643	298361	833.05	468.17	22	56	-1	15.26	15.26
Fixation R	1	4	28068609282	28068907643	298361	833.05	468.17	22	56	-1	15.60	15.60
