[BeGaze]
Converted from:	C:\Documents and Settings\iViewX\Desktop\EXPERIMENTATIONS\Experiments\results\finaleart\S12H22222-finaleart-1.idf
Date:	27.03.2019 15:40:20
Version:	BeGaze 2.5.77
Sample Rate:	50
Subject:	S12H22222
Description:	aurele barriere

Table Header for Fixations:
Event Type	Trial	Number	Start	End	Duration	Location X	Location Y	Dispersion X	Dispersion Y	Plane	Avg. Pupil Size X	Avg. Pupil Size Y

Table Header for Saccades:
Event Type	Trial	Number	Start	End	Duration	Start Loc.X	Start Loc.Y	End Loc.X	End Loc.Y	Amplitude	Peak Speed	Peak Speed At	Average Speed	Peak Accel.	Peak Decel.	Average Accel.

Table Header for Blinks:
Event Type	Trial	Number	Start	End	Duration

Table Header for User Events:
Event Type	Trial	Number	Start	Description

UserEvent	1	1	23399618483	# Message: Poppy_Fields_near_Argenteuil_Monet_1875.jpg
Fixation L	1	1	23399638153	23400095607	457454	976.51	548.33	24	25	-1	15.34	15.34
Fixation R	1	1	23399638153	23400095607	457454	976.51	548.33	24	25	-1	14.87	14.87
Saccade L	1	1	23400095607	23400115487	19880	993.07	560.66	1214.87	698.64	1.62	264.07	1.00	81.66	6530.05	-6423.35	4382.21
Saccade R	1	1	23400095607	23400115487	19880	993.07	560.66	1214.87	698.64	1.62	264.07	1.00	81.66	6530.05	-6423.35	4382.21
Fixation L	1	2	23400115487	23400294603	179116	1237.75	728.82	30	53	-1	14.46	14.46
Fixation R	1	2	23400115487	23400294603	179116	1237.75	728.82	30	53	-1	13.55	13.55
Saccade L	1	2	23400294603	23400314483	19880	1245.64	733.36	1275.32	719.30	0.29	33.22	1.00	14.41	688.96	-729.19	551.02
Saccade R	1	2	23400294603	23400314483	19880	1245.64	733.36	1275.32	719.30	0.29	33.22	1.00	14.41	688.96	-729.19	551.02
Fixation L	1	3	23400314483	23400632716	318233	1280.03	729.62	24	19	-1	11.99	11.99
Fixation R	1	3	23400314483	23400632716	318233	1280.03	729.62	24	19	-1	11.61	11.61
Saccade L	1	3	23400632716	23400672463	39747	1287.88	734.16	1076.00	854.03	2.15	147.97	0.50	54.18	3625.95	-3533.90	3017.09
Saccade R	1	3	23400632716	23400672463	39747	1287.88	734.16	1076.00	854.03	2.15	147.97	0.50	54.18	3625.95	-3533.90	3017.09
Fixation L	1	4	23400672463	23400970828	298365	1074.50	873.66	20	28	-1	12.25	12.25
Fixation R	1	4	23400672463	23400970828	298365	1074.50	873.66	20	28	-1	11.82	11.82
Saccade L	1	4	23400970828	23401010575	39747	1090.31	876.88	1455.01	915.00	3.27	244.54	0.50	82.21	6092.42	-5713.59	4370.93
Saccade R	1	4	23400970828	23401010575	39747	1090.31	876.88	1455.01	915.00	3.27	244.54	0.50	82.21	6092.42	-5713.59	4370.93
Fixation L	1	5	23401010575	23401169693	159118	1475.23	942.62	37	46	-1	12.60	12.60
Fixation R	1	5	23401010575	23401169693	159118	1475.23	942.62	37	46	-1	11.78	11.78
Saccade L	1	5	23401169693	23401189563	19870	1492.59	959.44	1536.27	1104.27	0.86	153.00	1.00	43.46	3733.48	-3144.05	2293.37
Saccade R	1	5	23401169693	23401189563	19870	1492.59	959.44	1536.27	1104.27	0.86	153.00	1.00	43.46	3733.48	-3144.05	2293.37
Fixation L	1	6	23401189563	23401567548	377985	1574.38	1083.99	50	36	-1	13.39	13.39
Fixation R	1	6	23401189563	23401567548	377985	1574.38	1083.99	50	36	-1	12.35	12.35
Saccade L	1	6	23401567548	23401607292	39744	1587.25	1067.98	1613.17	1055.36	0.51	24.27	1.00	12.85	309.66	-77.95	209.84
Saccade R	1	6	23401567548	23401607292	39744	1587.25	1067.98	1613.17	1055.36	0.51	24.27	1.00	12.85	309.66	-77.95	209.84
Fixation L	1	7	23401607292	23401766415	159123	1640.21	1019.33	36	52	-1	13.87	13.87
Fixation R	1	7	23401607292	23401766415	159123	1640.21	1019.33	36	52	-1	12.95	12.95
Saccade L	1	7	23401766415	23401786285	19870	1647.77	1003.10	1704.68	995.03	0.39	58.15	1.00	19.74	1312.99	49.08	530.77
Saccade R	1	7	23401766415	23401786285	19870	1647.77	1003.10	1704.68	995.03	0.39	58.15	1.00	19.74	1312.99	49.08	530.77
Fixation L	1	8	23401786285	23401885783	99498	1686.16	997.56	69	23	-1	14.01	14.01
Fixation R	1	8	23401786285	23401885783	99498	1686.16	997.56	69	23	-1	13.03	13.03
Saccade L	1	8	23401885783	23401945407	59624	1643.61	1006.13	1347.23	511.31	6.58	258.93	0.33	110.42	6328.01	-5503.96	4484.90
Saccade R	1	8	23401885783	23401945407	59624	1643.61	1006.13	1347.23	511.31	6.58	258.93	0.33	110.42	6328.01	-5503.96	4484.90
Fixation L	1	9	23401945407	23402303524	358117	1325.92	520.53	38	16	-1	14.06	14.06
Fixation R	1	9	23401945407	23402303524	358117	1325.92	520.53	38	16	-1	13.16	13.16
Saccade L	1	9	23402303524	23402343267	39743	1309.23	527.54	996.71	427.73	3.08	261.34	0.50	77.60	6487.65	-6083.37	4061.62
Saccade R	1	9	23402303524	23402343267	39743	1309.23	527.54	996.71	427.73	3.08	261.34	0.50	77.60	6487.65	-6083.37	4061.62
Fixation L	1	10	23402343267	23402542126	198859	972.85	410.17	29	23	-1	13.79	13.79
Fixation R	1	10	23402343267	23402542126	198859	972.85	410.17	29	23	-1	12.83	12.83
Saccade L	1	10	23402542126	23402581884	39758	967.95	406.20	725.90	758.45	4.03	265.39	0.50	101.30	6550.17	-5238.82	4819.67
Saccade R	1	10	23402542126	23402581884	39758	967.95	406.20	725.90	758.45	4.03	265.39	0.50	101.30	6550.17	-5238.82	4819.67
Fixation L	1	11	23402581884	23403118986	537102	729.33	768.34	19	76	-1	13.76	13.76
Fixation R	1	11	23402581884	23403118986	537102	729.33	768.34	19	76	-1	13.24	13.24
Saccade L	1	11	23403118986	23403158757	39771	734.96	767.83	1016.96	772.63	2.41	195.03	0.50	60.52	4863.95	-4502.01	3436.85
Saccade R	1	11	23403118986	23403158757	39771	734.96	767.83	1016.96	772.63	2.41	195.03	0.50	60.52	4863.95	-4502.01	3436.85
Fixation L	1	12	23403158757	23403457089	298332	1011.07	795.01	15	34	-1	14.91	14.91
Fixation R	1	12	23403158757	23403457089	298332	1011.07	795.01	15	34	-1	14.12	14.12
Saccade L	1	12	23403457089	23403476966	19877	1019.03	807.23	1299.50	742.68	1.61	290.90	1.00	81.03	7146.29	-7179.77	4778.40
Saccade R	1	12	23403457089	23403476966	19877	1019.03	807.23	1299.50	742.68	1.61	290.90	1.00	81.03	7146.29	-7179.77	4778.40
Fixation L	1	13	23403476966	23403616207	139241	1296.83	728.20	6	24	-1	14.55	14.55
Fixation R	1	13	23403476966	23403616207	139241	1296.83	728.20	6	24	-1	13.95	13.95
