[BeGaze]
Converted from:	C:\Documents and Settings\iViewX\Desktop\EXPERIMENTATIONS\Experiments\results\finaleart\S01A22542-finaleart-1.idf
Date:	27.03.2019 15:33:16
Version:	BeGaze 2.5.77
Sample Rate:	50
Subject:	S01A22542
Description:	Thibault Seve Minnaert

Table Header for Fixations:
Event Type	Trial	Number	Start	End	Duration	Location X	Location Y	Dispersion X	Dispersion Y	Plane	Avg. Pupil Size X	Avg. Pupil Size Y

Table Header for Saccades:
Event Type	Trial	Number	Start	End	Duration	Start Loc.X	Start Loc.Y	End Loc.X	End Loc.Y	Amplitude	Peak Speed	Peak Speed At	Average Speed	Peak Accel.	Peak Decel.	Average Accel.

Table Header for Blinks:
Event Type	Trial	Number	Start	End	Duration

Table Header for User Events:
Event Type	Trial	Number	Start	Description

UserEvent	1	1	8750796555	# Message: female_nude_reclining_on-a_divan_delacroix_1826.jpg
Fixation L	1	1	8750807399	8751205147	397748	764.72	534.49	26	57	-1	14.09	14.09
Fixation R	1	1	8750807399	8751205147	397748	764.72	534.49	26	57	-1	14.39	14.39
Saccade L	1	1	8751205147	8751244872	39725	749.59	565.90	757.42	357.42	2.00	135.74	1.00	50.43	3335.38	-3153.43	2326.91
Saccade R	1	1	8751205147	8751244872	39725	749.59	565.90	757.42	357.42	2.00	135.74	1.00	50.43	3335.38	-3153.43	2326.91
Fixation L	1	2	8751244872	8751344243	99371	749.87	313.98	12	63	-1	13.93	13.93
Fixation R	1	2	8751244872	8751344243	99371	749.87	313.98	12	63	-1	14.08	14.08
Saccade L	1	2	8751344243	8751364110	19867	745.29	299.21	728.16	225.00	0.76	77.04	1.00	38.10	1720.38	-1448.60	1529.42
Saccade R	1	2	8751344243	8751364110	19867	745.29	299.21	728.16	225.00	0.76	77.04	1.00	38.10	1720.38	-1448.60	1529.42
Fixation L	1	3	8751364110	8752219329	855219	687.45	251.79	47	49	-1	13.90	13.90
Fixation R	1	3	8751364110	8752219329	855219	687.45	251.79	47	49	-1	14.23	14.23
Saccade L	1	3	8752219329	8752278944	59615	693.29	234.02	1119.79	745.65	7.24	293.52	0.33	121.46	7268.57	-6408.99	5538.68
Saccade R	1	3	8752219329	8752278944	59615	693.29	234.02	1119.79	745.65	7.24	293.52	0.33	121.46	7268.57	-6408.99	5538.68
Fixation L	1	4	8752278944	8752438067	159123	1131.41	735.03	17	14	-1	15.59	15.59
Fixation R	1	4	8752278944	8752438067	159123	1131.41	735.03	17	14	-1	15.89	15.89
Saccade L	1	4	8752438067	8752477962	39895	1137.25	734.38	1008.05	558.86	1.92	115.35	0.50	48.25	2822.75	-2577.46	2632.12
Saccade R	1	4	8752438067	8752477962	39895	1137.25	734.38	1008.05	558.86	1.92	115.35	0.50	48.25	2822.75	-2577.46	2632.12
Fixation L	1	5	8752477962	8752716673	238711	988.89	561.68	27	14	-1	15.34	15.34
Fixation R	1	5	8752477962	8752716673	238711	988.89	561.68	27	14	-1	15.24	15.24
Saccade L	1	5	8752716673	8752776288	59615	980.39	557.01	714.13	375.94	3.35	156.59	0.67	56.25	3838.71	-3801.62	2500.22
Saccade R	1	5	8752716673	8752776288	59615	980.39	557.01	714.13	375.94	3.35	156.59	0.67	56.25	3838.71	-3801.62	2500.22
Fixation L	1	6	8752776288	8753233900	457612	717.54	389.65	8	31	-1	14.49	14.49
Fixation R	1	6	8752776288	8753233900	457612	717.54	389.65	8	31	-1	14.71	14.71
Saccade L	1	6	8753233900	8753253779	19879	715.12	399.25	707.60	263.52	0.79	137.49	1.00	39.55	3396.86	-3284.08	2340.66
Saccade R	1	6	8753233900	8753253779	19879	715.12	399.25	707.60	263.52	0.79	137.49	1.00	39.55	3396.86	-3284.08	2340.66
Fixation L	1	7	8753253779	8753631874	378095	688.60	252.36	31	19	-1	14.67	14.67
Fixation R	1	7	8753253779	8753631874	378095	688.60	252.36	31	19	-1	15.12	15.12
Saccade L	1	7	8753631874	8753691502	59628	697.14	255.42	1303.60	269.06	6.49	316.39	0.67	108.78	7838.56	-7173.18	4917.57
Saccade R	1	7	8753631874	8753691502	59628	697.14	255.42	1303.60	269.06	6.49	316.39	0.67	108.78	7838.56	-7173.18	4917.57
Fixation L	1	8	8753691502	8754029745	338243	1309.29	315.82	23	69	-1	15.18	15.18
Fixation R	1	8	8753691502	8754029745	338243	1309.29	315.82	23	69	-1	15.72	15.72
Saccade L	1	8	8754029745	8754049612	19867	1326.27	338.39	1331.06	342.23	0.12	9.45	0.00	6.21	82.20	-95.31	81.25
Saccade R	1	8	8754029745	8754049612	19867	1326.27	338.39	1331.06	342.23	0.12	9.45	0.00	6.21	82.20	-95.31	81.25
Fixation L	1	9	8754049612	8754149099	99487	1333.11	352.16	6	15	-1	15.67	15.67
Fixation R	1	9	8754049612	8754149099	99487	1333.11	352.16	6	15	-1	15.64	15.64
Saccade L	1	9	8754149099	8754188863	39764	1332.14	357.98	922.88	590.56	3.96	301.05	0.50	99.65	7438.81	-7203.42	5781.82
Saccade R	1	9	8754149099	8754188863	39764	1332.14	357.98	922.88	590.56	3.96	301.05	0.50	99.65	7438.81	-7203.42	5781.82
Fixation L	1	10	8754188863	8754427592	238729	919.97	573.58	10	27	-1	16.39	16.39
Fixation R	1	10	8754188863	8754427592	238729	919.97	573.58	10	27	-1	16.24	16.24
Saccade L	1	10	8754427592	8754447599	20007	913.70	562.60	823.58	415.34	0.99	174.61	1.00	49.39	4289.78	-4006.56	2884.29
Saccade R	1	10	8754427592	8754447599	20007	913.70	562.60	823.58	415.34	0.99	174.61	1.00	49.39	4289.78	-4006.56	2884.29
Fixation L	1	11	8754447599	8754785831	338232	796.12	400.09	48	33	-1	15.50	15.50
Fixation R	1	11	8754447599	8754785831	338232	796.12	400.09	48	33	-1	15.67	15.67
