[BeGaze]
Converted from:	C:\Documents and Settings\iViewX\Desktop\EXPERIMENTATIONS\Experiments\results\finaleart\S01A22542-finaleart-1.idf
Date:	27.03.2019 15:33:26
Version:	BeGaze 2.5.77
Sample Rate:	50
Subject:	S01A22542
Description:	Thibault Seve Minnaert

Table Header for Fixations:
Event Type	Trial	Number	Start	End	Duration	Location X	Location Y	Dispersion X	Dispersion Y	Plane	Avg. Pupil Size X	Avg. Pupil Size Y

Table Header for Saccades:
Event Type	Trial	Number	Start	End	Duration	Start Loc.X	Start Loc.Y	End Loc.X	End Loc.Y	Amplitude	Peak Speed	Peak Speed At	Average Speed	Peak Accel.	Peak Decel.	Average Accel.

Table Header for Blinks:
Event Type	Trial	Number	Start	End	Duration

Table Header for User Events:
Event Type	Trial	Number	Start	Description

UserEvent	1	1	10125221194	# Message: Morning,_An_Overcast_Day_Rouen_Pissaro_1896.jpg
Fixation L	1	1	10125221657	10125321134	99477	1064.08	459.55	36	5	-1	14.84	14.84
Fixation R	1	1	10125221657	10125321134	99477	1064.08	459.55	36	5	-1	14.90	14.90
Saccade L	1	1	10125321134	10125341068	19934	1034.96	461.69	949.94	515.63	0.75	101.85	1.00	37.47	2521.73	-2414.90	1875.62
Saccade R	1	1	10125321134	10125341068	19934	1034.96	461.69	949.94	515.63	0.75	101.85	1.00	37.47	2521.73	-2414.90	1875.62
Fixation L	1	2	10125341068	10125639390	298322	950.16	527.08	35	63	-1	15.38	15.38
Fixation R	1	2	10125341068	10125639390	298322	950.16	527.08	35	63	-1	15.24	15.24
Saccade L	1	2	10125639390	10125659255	19865	920.90	571.91	891.08	647.81	0.79	82.49	1.00	39.69	2012.27	-1971.61	1681.04
Saccade R	1	2	10125639390	10125659255	19865	920.90	571.91	891.08	647.81	0.79	82.49	1.00	39.69	2012.27	-1971.61	1681.04
Fixation L	1	3	10125659255	10125917859	258604	877.04	639.14	19	14	-1	14.77	14.77
Fixation R	1	3	10125659255	10125917859	258604	877.04	639.14	19	14	-1	14.96	14.96
Saccade L	1	3	10125917859	10125937743	19884	874.69	640.19	869.27	541.16	0.61	100.32	1.00	30.47	2455.38	-1918.64	1586.04
Saccade R	1	3	10125917859	10125937743	19884	874.69	640.19	869.27	541.16	0.61	100.32	1.00	30.47	2455.38	-1918.64	1586.04
Fixation L	1	4	10125937743	10126076975	139232	861.16	539.29	18	28	-1	12.63	12.63
Fixation R	1	4	10125937743	10126076975	139232	861.16	539.29	18	28	-1	13.08	13.08
Saccade L	1	4	10126076975	10126116728	39753	858.28	529.53	1420.99	347.81	4.97	356.26	0.50	124.94	8797.51	-8582.48	7121.95
Saccade R	1	4	10126076975	10126116728	39753	858.28	529.53	1420.99	347.81	4.97	356.26	0.50	124.94	8797.51	-8582.48	7121.95
Fixation L	1	5	10126116728	10126275835	159107	1425.76	325.61	29	58	-1	11.80	11.80
Fixation R	1	5	10126116728	10126275835	159107	1425.76	325.61	29	58	-1	12.37	12.37
Saccade L	1	5	10126275835	10126295719	19884	1444.81	289.61	1467.75	214.27	0.77	79.66	1.00	38.48	1768.49	-1103.32	1307.47
Saccade R	1	5	10126275835	10126295719	19884	1444.81	289.61	1467.75	214.27	0.77	79.66	1.00	38.48	1768.49	-1103.32	1307.47
Fixation L	1	6	10126295719	10126494701	198982	1463.06	235.62	23	36	-1	11.19	11.19
Fixation R	1	6	10126295719	10126494701	198982	1463.06	235.62	23	36	-1	11.74	11.74
Saccade L	1	6	10126494701	10126554328	59627	1462.18	241.91	900.12	529.44	6.56	297.76	0.33	110.10	7297.30	-6242.37	5470.94
Saccade R	1	6	10126494701	10126554328	59627	1462.18	241.91	900.12	529.44	6.56	297.76	0.33	110.10	7297.30	-6242.37	5470.94
Fixation L	1	7	10126554328	10126912311	357983	883.07	521.20	24	35	-1	11.62	11.62
Fixation R	1	7	10126554328	10126912311	357983	883.07	521.20	24	35	-1	11.96	11.96
Saccade L	1	7	10126912311	10126932193	19882	889.00	504.28	1092.06	507.27	1.26	205.36	1.00	63.48	5106.51	-4669.27	3426.56
Saccade R	1	7	10126912311	10126932193	19882	889.00	504.28	1092.06	507.27	1.26	205.36	1.00	63.48	5106.51	-4669.27	3426.56
Fixation L	1	8	10126932193	10127170913	238720	1140.49	513.10	58	14	-1	11.76	11.76
Fixation R	1	8	10126932193	10127170913	238720	1140.49	513.10	58	14	-1	12.24	12.24
Saccade L	1	8	10127170913	10127210681	39768	1146.32	515.83	769.02	611.54	3.35	220.44	0.50	84.22	5478.36	-5085.86	4660.03
Saccade R	1	8	10127170913	10127210681	39768	1146.32	515.83	769.02	611.54	3.35	220.44	0.50	84.22	5478.36	-5085.86	4660.03
Fixation L	1	9	10127210681	10127449407	238726	740.53	615.93	37	41	-1	11.73	11.73
Fixation R	1	9	10127210681	10127449407	238726	740.53	615.93	37	41	-1	12.37	12.37
Saccade L	1	9	10127449407	10127469288	19881	732.35	626.03	688.85	625.13	0.69	89.98	1.00	34.74	2191.04	-1024.67	1416.60
Saccade R	1	9	10127449407	10127469288	19881	732.35	626.03	688.85	625.13	0.69	89.98	1.00	34.74	2191.04	-1024.67	1416.60
Fixation L	1	10	10127469288	10127568650	99362	612.55	623.48	95	4	-1	11.52	11.52
Fixation R	1	10	10127469288	10127568650	99362	612.55	623.48	95	4	-1	12.30	12.30
Saccade L	1	10	10127568650	10127588656	20006	600.73	620.87	593.16	620.76	0.10	7.92	0.00	4.81	137.11	-161.05	136.40
Saccade R	1	10	10127568650	10127588656	20006	600.73	620.87	593.16	620.76	0.10	7.92	0.00	4.81	137.11	-161.05	136.40
Fixation L	1	11	10127588656	10127787513	198857	592.08	618.63	6	3	-1	11.74	11.74
Fixation R	1	11	10127588656	10127787513	198857	592.08	618.63	6	3	-1	12.61	12.61
Saccade L	1	11	10127787513	10127807400	19887	590.74	617.46	625.64	541.56	0.61	84.50	1.00	30.65	2089.14	-1802.15	1594.59
Saccade R	1	11	10127787513	10127807400	19887	590.74	617.46	625.64	541.56	0.61	84.50	1.00	30.65	2089.14	-1802.15	1594.59
Fixation L	1	12	10127807400	10128125648	318248	652.48	514.52	52	32	-1	11.50	11.50
Fixation R	1	12	10127807400	10128125648	318248	652.48	514.52	52	32	-1	12.47	12.47
Saccade L	1	12	10128125648	10128145495	19847	611.10	514.30	501.55	511.09	0.93	110.85	1.00	46.93	2718.56	-2587.45	1970.00
Saccade R	1	12	10128125648	10128145495	19847	611.10	514.30	501.55	511.09	0.93	110.85	1.00	46.93	2718.56	-2587.45	1970.00
Fixation L	1	13	10128145495	10128324482	178987	469.94	529.61	41	27	-1	11.78	11.78
Fixation R	1	13	10128145495	10128324482	178987	469.94	529.61	41	27	-1	12.49	12.49
Saccade L	1	13	10128324482	10128384239	59757	459.56	535.75	608.36	940.77	4.73	242.54	0.67	79.09	6010.09	-5672.07	3460.46
Saccade R	1	13	10128324482	10128384239	59757	459.56	535.75	608.36	940.77	4.73	242.54	0.67	79.09	6010.09	-5672.07	3460.46
Fixation L	1	14	10128384239	10128642731	258492	632.02	967.68	36	57	-1	11.64	11.64
Fixation R	1	14	10128384239	10128642731	258492	632.02	967.68	36	57	-1	12.74	12.74
Saccade L	1	14	10128642731	10128662603	19872	644.70	978.78	760.23	962.81	0.71	117.96	1.00	35.63	2837.23	-2619.94	1912.60
Saccade R	1	14	10128642731	10128662603	19872	644.70	978.78	760.23	962.81	0.71	117.96	1.00	35.63	2837.23	-2619.94	1912.60
Fixation L	1	15	10128662603	10129060448	397845	756.00	941.31	33	50	-1	12.08	12.08
Fixation R	1	15	10128662603	10129060448	397845	756.00	941.31	33	50	-1	12.92	12.92
Saccade L	1	15	10129060448	10129219576	159128	732.26	974.57	472.97	1001.83	5.35	167.66	0.63	33.64	3684.34	-4103.63	1319.78
Saccade R	1	15	10129060448	10129219576	159128	732.26	974.57	472.97	1001.83	5.35	167.66	0.63	33.64	3684.34	-4103.63	1319.78
