[BeGaze]
Converted from:	C:\Documents and Settings\iViewX\Desktop\EXPERIMENTATIONS\Experiments\results\finaleart\S13H22431-finaleart-1.idf
Date:	27.03.2019 15:41:55
Version:	BeGaze 2.5.77
Sample Rate:	50
Subject:	S13H22431
Description:	Jimmy Petit

Table Header for Fixations:
Event Type	Trial	Number	Start	End	Duration	Location X	Location Y	Dispersion X	Dispersion Y	Plane	Avg. Pupil Size X	Avg. Pupil Size Y

Table Header for Saccades:
Event Type	Trial	Number	Start	End	Duration	Start Loc.X	Start Loc.Y	End Loc.X	End Loc.Y	Amplitude	Peak Speed	Peak Speed At	Average Speed	Peak Accel.	Peak Decel.	Average Accel.

Table Header for Blinks:
Event Type	Trial	Number	Start	End	Duration

Table Header for User Events:
Event Type	Trial	Number	Start	Description

UserEvent	1	1	27906435509	# Message: void.jpg
Fixation L	1	1	27906445231	27906862934	417703	455.22	1128.55	52	25	-1	14.58	14.58
Fixation R	1	1	27906445231	27906862934	417703	455.22	1128.55	52	25	-1	16.23	16.23
Blink L	1	1	27906862934	27907081702	218768
Blink R	1	1	27906862934	27907081702	218768
Fixation L	1	2	27907081702	27907260809	179107	921.37	208.31	4	23	-1	13.54	13.54
Fixation R	1	2	27907081702	27907260809	179107	921.37	208.31	4	23	-1	14.88	14.88
Saccade L	1	1	27907260809	27907280678	19869	923.41	213.27	1092.16	202.77	0.93	170.99	1.00	46.94	4211.28	-4176.45	2895.07
Saccade R	1	1	27907260809	27907280678	19869	923.41	213.27	1092.16	202.77	0.93	170.99	1.00	46.94	4211.28	-4176.45	2895.07
Fixation L	1	3	27907280678	27907519287	238609	1105.18	183.60	20	26	-1	13.99	13.99
Fixation R	1	3	27907280678	27907519287	238609	1105.18	183.60	20	26	-1	15.09	15.09
Saccade L	1	2	27907519287	27907579029	59742	1106.32	182.71	872.73	432.35	4.06	210.15	0.67	67.92	5188.76	-4364.11	2561.53
Saccade R	1	2	27907519287	27907579029	59742	1106.32	182.71	872.73	432.35	4.06	210.15	0.67	67.92	5188.76	-4364.11	2561.53
Fixation L	1	4	27907579029	27907837514	258485	841.65	400.31	38	42	-1	14.85	14.85
Fixation R	1	4	27907579029	27907837514	258485	841.65	400.31	38	42	-1	15.58	15.58
Saccade L	1	3	27907837514	27907897263	59749	843.19	390.69	1283.18	215.82	5.42	181.92	1.00	90.71	4377.88	-4383.17	2865.01
Saccade R	1	3	27907837514	27907897263	59749	843.19	390.69	1283.18	215.82	5.42	181.92	1.00	90.71	4377.88	-4383.17	2865.01
Fixation L	1	5	27907897263	27908036512	139249	1324.45	218.77	51	6	-1	14.00	14.00
Fixation R	1	5	27907897263	27908036512	139249	1324.45	218.77	51	6	-1	14.95	14.95
Saccade L	1	4	27908036512	27908076260	39748	1332.60	219.73	1605.65	138.13	2.83	183.28	1.00	71.09	4562.04	-4422.03	3260.28
Saccade R	1	4	27908036512	27908076260	39748	1332.60	219.73	1605.65	138.13	2.83	183.28	1.00	71.09	4562.04	-4422.03	3260.28
Fixation L	1	6	27908076260	27908275129	198869	1641.03	130.83	58	39	-1	13.38	13.38
Fixation R	1	6	27908076260	27908275129	198869	1641.03	130.83	58	39	-1	14.65	14.65
Saccade L	1	5	27908275129	27908434243	159114	1628.38	151.24	1828.86	73.07	11.01	183.40	0.25	69.19	4555.09	-3702.28	2021.39
Saccade R	1	5	27908275129	27908434243	159114	1628.38	151.24	1828.86	73.07	11.01	183.40	0.25	69.19	4555.09	-3702.28	2021.39
