[BeGaze]
Converted from:	C:\Documents and Settings\iViewX\Desktop\EXPERIMENTATIONS\Experiments\results\finaleart\S16F14542-finaleart-1.idf
Date:	27.03.2019 15:46:31
Version:	BeGaze 2.5.77
Sample Rate:	50
Subject:	S16F14542
Description:	Diane Dewez

Table Header for Fixations:
Event Type	Trial	Number	Start	End	Duration	Location X	Location Y	Dispersion X	Dispersion Y	Plane	Avg. Pupil Size X	Avg. Pupil Size Y

Table Header for Saccades:
Event Type	Trial	Number	Start	End	Duration	Start Loc.X	Start Loc.Y	End Loc.X	End Loc.Y	Amplitude	Peak Speed	Peak Speed At	Average Speed	Peak Accel.	Peak Decel.	Average Accel.

Table Header for Blinks:
Event Type	Trial	Number	Start	End	Duration

Table Header for User Events:
Event Type	Trial	Number	Start	Description

UserEvent	1	1	6542255866	# Message: garlic-cloves-and-knife-on-the-corner-of-a-table_caillebotte_1871.jpg
Fixation L	1	1	6542266793	6542704284	437491	893.24	531.51	28	25	-1	16.03	16.03
Fixation R	1	1	6542266793	6542704284	437491	893.24	531.51	28	25	-1	15.56	15.56
Saccade L	1	1	6542704284	6542724263	19979	907.09	529.25	1004.47	663.38	1.05	167.63	1.00	52.48	4102.80	-4066.70	2890.50
Saccade R	1	1	6542704284	6542724263	19979	907.09	529.25	1004.47	663.38	1.05	167.63	1.00	52.48	4102.80	-4066.70	2890.50
Fixation L	1	2	6542724263	6542943004	218741	1001.56	666.14	18	13	-1	15.90	15.90
Fixation R	1	2	6542724263	6542943004	218741	1001.56	666.14	18	13	-1	15.44	15.44
Saccade L	1	2	6542943004	6542962881	19877	992.26	668.25	845.04	776.08	1.00	184.55	1.00	50.25	4602.92	-4550.88	3104.53
Saccade R	1	2	6542943004	6542962881	19877	992.26	668.25	845.04	776.08	1.00	184.55	1.00	50.25	4602.92	-4550.88	3104.53
Fixation L	1	3	6542962881	6543201622	238741	850.82	771.42	10	17	-1	16.14	16.14
Fixation R	1	3	6542962881	6543201622	238741	850.82	771.42	10	17	-1	15.96	15.96
Blink L	1	1	6543201622	6543400476	198854
Blink R	1	1	6543201622	6543400476	198854
Fixation L	1	4	6543400476	6543579467	178991	1255.67	665.92	25	71	-1	16.85	16.85
Fixation R	1	4	6543400476	6543579467	178991	1255.67	665.92	25	71	-1	16.61	16.61
Saccade L	1	3	6543579467	6543599348	19881	1260.87	619.73	1275.82	598.16	0.43	27.77	1.00	21.67	5.54	-305.49	113.85
Saccade R	1	3	6543579467	6543599348	19881	1260.87	619.73	1275.82	598.16	0.43	27.77	1.00	21.67	5.54	-305.49	113.85
Fixation L	1	5	6543599348	6543857968	258620	1266.05	624.05	41	35	-1	16.40	16.40
Fixation R	1	5	6543599348	6543857968	258620	1266.05	624.05	41	35	-1	15.87	15.87
Saccade L	1	4	6543857968	6543877836	19868	1234.03	630.93	1119.59	634.95	0.79	115.83	1.00	39.95	2843.08	-2841.47	2104.47
Saccade R	1	4	6543857968	6543877836	19868	1234.03	630.93	1119.59	634.95	0.79	115.83	1.00	39.95	2843.08	-2841.47	2104.47
Fixation L	1	6	6543877836	6544116576	238740	1114.41	646.96	9	22	-1	15.19	15.19
Fixation R	1	6	6543877836	6544116576	238740	1114.41	646.96	9	22	-1	14.74	14.74
Saccade L	1	5	6544116576	6544156628	40052	1110.42	656.70	868.99	764.45	2.40	202.20	0.50	60.04	4970.56	-4483.88	3121.07
Saccade R	1	5	6544116576	6544156628	40052	1110.42	656.70	868.99	764.45	2.40	202.20	0.50	60.04	4970.56	-4483.88	3121.07
Fixation L	1	7	6544156628	6544394935	238307	856.78	760.56	19	19	-1	14.75	14.75
Fixation R	1	7	6544156628	6544394935	238307	856.78	760.56	19	19	-1	14.51	14.51
Saccade L	1	6	6544394935	6544434805	39870	858.71	772.11	591.01	714.42	2.48	149.18	1.00	62.20	3521.35	-3633.68	3242.02
Saccade R	1	6	6544394935	6544434805	39870	858.71	772.11	591.01	714.42	2.48	149.18	1.00	62.20	3521.35	-3633.68	3242.02
Fixation L	1	8	6544434805	6544613811	179006	566.12	698.44	35	23	-1	14.50	14.50
Fixation R	1	8	6544434805	6544613811	179006	566.12	698.44	35	23	-1	14.61	14.61
Blink L	1	2	6544613811	6544772932	159121
Blink R	1	2	6544613811	6544772932	159121
Fixation L	1	9	6544772932	6545170639	397707	961.31	352.37	12	51	-1	16.39	16.39
Fixation R	1	9	6544772932	6545170639	397707	961.31	352.37	12	51	-1	15.93	15.93
Saccade L	1	7	6545170639	6545290017	119378	968.47	328.22	1208.81	508.33	7.36	196.25	0.33	61.69	4850.85	-3721.21	2402.57
Saccade R	1	7	6545170639	6545290017	119378	968.47	328.22	1208.81	508.33	7.36	196.25	0.33	61.69	4850.85	-3721.21	2402.57
Fixation L	1	10	6545290017	6545488883	198866	1203.59	557.08	25	60	-1	16.64	16.64
Fixation R	1	10	6545290017	6545488883	198866	1203.59	557.08	25	60	-1	15.97	15.97
Blink L	1	3	6545488883	6545667868	178985
Blink R	1	3	6545488883	6545667868	178985
Fixation L	1	11	6545667868	6546105473	437605	1250.73	729.82	39	33	-1	17.75	17.75
Fixation R	1	11	6545667868	6546105473	437605	1250.73	729.82	39	33	-1	17.21	17.21
Saccade L	1	8	6546105473	6546145357	39884	1241.96	731.70	928.92	744.97	2.63	182.83	1.00	65.94	4511.24	-4361.31	3828.52
Saccade R	1	8	6546105473	6546145357	39884	1241.96	731.70	928.92	744.97	2.63	182.83	1.00	65.94	4511.24	-4361.31	3828.52
Fixation L	1	12	6546145357	6546244727	99370	917.20	743.35	19	15	-1	16.62	16.62
Fixation R	1	12	6546145357	6546244727	99370	917.20	743.35	19	15	-1	16.11	16.11
