[BeGaze]
Converted from:	C:\Documents and Settings\iViewX\Desktop\EXPERIMENTATIONS\Experiments\results\finaleart\S12H22222-finaleart-1.idf
Date:	27.03.2019 15:40:23
Version:	BeGaze 2.5.77
Sample Rate:	50
Subject:	S12H22222
Description:	aurele barriere

Table Header for Fixations:
Event Type	Trial	Number	Start	End	Duration	Location X	Location Y	Dispersion X	Dispersion Y	Plane	Avg. Pupil Size X	Avg. Pupil Size Y

Table Header for Saccades:
Event Type	Trial	Number	Start	End	Duration	Start Loc.X	Start Loc.Y	End Loc.X	End Loc.Y	Amplitude	Peak Speed	Peak Speed At	Average Speed	Peak Accel.	Peak Decel.	Average Accel.

Table Header for Blinks:
Event Type	Trial	Number	Start	End	Duration

Table Header for User Events:
Event Type	Trial	Number	Start	Description

UserEvent	1	1	23434228433	# Message: void.jpg
Saccade L	1	1	23434247001	23434465825	218824	837.32	700.99	1516.57	358.29	15.99	223.90	0.27	73.06	5562.75	-3929.23	2501.27
Saccade R	1	1	23434247001	23434465825	218824	837.32	700.99	1516.57	358.29	15.99	223.90	0.27	73.06	5562.75	-3929.23	2501.27
Fixation L	1	1	23434465825	23434744228	278403	1531.80	303.44	20	71	-1	14.28	14.28
Fixation R	1	1	23434465825	23434744228	278403	1531.80	303.44	20	71	-1	13.50	13.50
Saccade L	1	2	23434744228	23434823722	79494	1532.05	306.89	1212.15	361.84	4.41	123.82	0.25	55.50	3057.71	-1333.25	1462.94
Saccade R	1	2	23434744228	23434823722	79494	1532.05	306.89	1212.15	361.84	4.41	123.82	0.25	55.50	3057.71	-1333.25	1462.94
Fixation L	1	2	23434823722	23435221588	397866	1168.25	371.85	56	36	-1	13.83	13.83
Fixation R	1	2	23434823722	23435221588	397866	1168.25	371.85	56	36	-1	13.20	13.20
Saccade L	1	3	23435221588	23435241458	19870	1158.45	390.42	1157.85	407.91	0.20	17.71	1.00	9.91	341.98	-338.71	303.85
Saccade R	1	3	23435221588	23435241458	19870	1158.45	390.42	1157.85	407.91	0.20	17.71	1.00	9.91	341.98	-338.71	303.85
Fixation L	1	3	23435241458	23435400575	159117	1148.02	421.43	61	23	-1	14.29	14.29
Fixation R	1	3	23435241458	23435400575	159117	1148.02	421.43	61	23	-1	13.87	13.87
Saccade L	1	4	23435400575	23435440326	39751	1096.35	431.63	1035.53	448.36	2.10	84.91	0.50	52.71	2072.00	-1225.77	989.23
Saccade R	1	4	23435400575	23435440326	39751	1096.35	431.63	1035.53	448.36	2.10	84.91	0.50	52.71	2072.00	-1225.77	989.23
Fixation L	1	4	23435440326	23436076926	636600	1020.54	505.84	19	71	-1	14.60	14.60
Fixation R	1	4	23435440326	23436076926	636600	1020.54	505.84	19	71	-1	14.11	14.11
Saccade L	1	5	23436076926	23436096802	19876	1018.32	519.80	1019.16	533.05	0.18	13.43	1.00	9.24	162.55	-229.42	147.42
Saccade R	1	5	23436076926	23436096802	19876	1018.32	519.80	1019.16	533.05	0.18	13.43	1.00	9.24	162.55	-229.42	147.42
Fixation L	1	5	23436096802	23436216044	119242	1015.39	522.23	14	23	-1	14.59	14.59
Fixation R	1	5	23436096802	23436216044	119242	1015.39	522.23	14	23	-1	14.00	14.00
