[BeGaze]
Converted from:	C:\Documents and Settings\iViewX\Desktop\EXPERIMENTATIONS\Experiments\results\finaleart\S02123220-finaleart-1.idf
Date:	27.03.2019 15:33:27
Version:	BeGaze 2.5.77
Sample Rate:	50
Subject:	S02123220
Description:	David Xu

Table Header for Fixations:
Event Type	Trial	Number	Start	End	Duration	Location X	Location Y	Dispersion X	Dispersion Y	Plane	Avg. Pupil Size X	Avg. Pupil Size Y

Table Header for Saccades:
Event Type	Trial	Number	Start	End	Duration	Start Loc.X	Start Loc.Y	End Loc.X	End Loc.Y	Amplitude	Peak Speed	Peak Speed At	Average Speed	Peak Accel.	Peak Decel.	Average Accel.

Table Header for Blinks:
Event Type	Trial	Number	Start	End	Duration

Table Header for User Events:
Event Type	Trial	Number	Start	Description

UserEvent	1	1	384859205	# Message: chase-a-study-in-curves-1890.jpg
Fixation L	1	1	384873919	385311519	437600	866.60	456.73	4	15	-1	17.17	17.17
Fixation R	1	1	384873919	385311519	437600	866.60	456.73	4	15	-1	15.83	15.83
Saccade L	1	1	385311519	385351274	39755	866.75	464.16	525.84	603.70	3.10	214.47	0.50	78.02	5344.64	-4976.37	4387.17
Saccade R	1	1	385311519	385351274	39755	866.75	464.16	525.84	603.70	3.10	214.47	0.50	78.02	5344.64	-4976.37	4387.17
Fixation L	1	2	385351274	385490514	139240	537.12	596.73	24	36	-1	16.65	16.65
Fixation R	1	2	385351274	385490514	139240	537.12	596.73	24	36	-1	16.29	16.29
Saccade L	1	2	385490514	385510388	19874	526.28	605.89	409.81	631.89	0.85	120.70	1.00	42.99	2700.46	-2855.34	1932.43
Saccade R	1	2	385490514	385510388	19874	526.28	605.89	409.81	631.89	0.85	120.70	1.00	42.99	2700.46	-2855.34	1932.43
Fixation L	1	3	385510388	385947984	437596	386.56	634.06	29	21	-1	15.88	15.88
Fixation R	1	3	385510388	385947984	437596	386.56	634.06	29	21	-1	16.22	16.22
Saccade L	1	3	385947984	385987732	39748	382.90	629.05	1092.79	640.60	5.78	377.24	0.50	145.43	9392.13	-9228.20	8744.85
Saccade R	1	3	385947984	385987732	39748	382.90	629.05	1092.79	640.60	5.78	377.24	0.50	145.43	9392.13	-9228.20	8744.85
Fixation L	1	4	385987732	386524698	536966	1117.51	663.97	30	55	-1	16.91	16.91
Fixation R	1	4	385987732	386524698	536966	1117.51	663.97	30	55	-1	14.76	14.76
Saccade L	1	4	386524698	386604313	79615	1119.35	686.95	1553.51	489.88	6.17	218.81	0.25	77.45	5198.89	-3859.87	3173.07
Saccade R	1	4	386524698	386604313	79615	1119.35	686.95	1553.51	489.88	6.17	218.81	0.25	77.45	5198.89	-3859.87	3173.07
Fixation L	1	5	386604313	386783308	178995	1510.57	488.92	75	23	-1	17.33	17.33
Fixation R	1	5	386604313	386783308	178995	1510.57	488.92	75	23	-1	11.58	11.58
Saccade L	1	5	386783308	386803179	19871	1504.96	500.40	1497.52	506.02	0.28	25.72	1.00	14.27	125.56	-407.18	286.27
Saccade R	1	5	386783308	386803179	19871	1504.96	500.40	1497.52	506.02	0.28	25.72	1.00	14.27	125.56	-407.18	286.27
Fixation L	1	6	386803179	386942431	139252	1488.70	492.19	20	57	-1	17.64	17.64
Fixation R	1	6	386803179	386942431	139252	1488.70	492.19	20	57	-1	10.60	10.60
Saccade L	1	6	386942431	387002176	59745	1480.35	451.46	1504.47	496.17	2.24	62.69	1.00	37.54	1213.09	-798.30	693.94
Saccade R	1	6	386942431	387002176	59745	1480.35	451.46	1504.47	496.17	2.24	62.69	1.00	37.54	1213.09	-798.30	693.94
Fixation L	1	7	387002176	387141278	139102	1534.87	495.81	64	34	-1	17.72	17.72
Fixation R	1	7	387002176	387141278	139102	1534.87	495.81	64	34	-1	10.36	10.36
Saccade L	1	7	387141278	387161297	20019	1549.54	501.30	1567.02	496.80	0.75	47.38	1.00	37.52	156.14	-727.90	352.02
Saccade R	1	7	387141278	387161297	20019	1549.54	501.30	1567.02	496.80	0.75	47.38	1.00	37.52	156.14	-727.90	352.02
Fixation L	1	8	387161297	387340274	178977	1530.99	510.13	65	32	-1	18.22	18.22
Fixation R	1	8	387161297	387340274	178977	1530.99	510.13	65	32	-1	10.31	10.31
Saccade L	1	8	387340274	387380029	39755	1520.12	528.97	1539.97	538.68	1.28	59.87	1.00	32.11	1274.61	-1186.60	752.86
Saccade R	1	8	387340274	387380029	39755	1520.12	528.97	1539.97	538.68	1.28	59.87	1.00	32.11	1274.61	-1186.60	752.86
Fixation L	1	9	387380029	387479511	99482	1533.68	520.20	61	37	-1	18.20	18.20
Fixation R	1	9	387380029	387479511	99482	1533.68	520.20	61	37	-1	10.70	10.70
Saccade L	1	9	387479511	387519257	39746	1497.53	512.06	1132.92	578.41	3.68	228.71	1.00	92.58	5320.51	-5051.09	3997.65
Saccade R	1	9	387479511	387519257	39746	1497.53	512.06	1132.92	578.41	3.68	228.71	1.00	92.58	5320.51	-5051.09	3997.65
Fixation L	1	10	387519257	387737985	218728	1091.21	595.18	56	25	-1	18.01	18.01
Fixation R	1	10	387519257	387737985	218728	1091.21	595.18	56	25	-1	16.07	16.07
Saccade L	1	10	387737985	387757873	19888	1088.50	594.40	918.27	608.94	0.98	172.78	1.00	49.22	4289.75	-4088.40	2956.47
Saccade R	1	10	387737985	387757873	19888	1088.50	594.40	918.27	608.94	0.98	172.78	1.00	49.22	4289.75	-4088.40	2956.47
Fixation L	1	11	387757873	387936989	179116	925.24	589.18	10	31	-1	17.90	17.90
Fixation R	1	11	387757873	387936989	179116	925.24	589.18	10	31	-1	16.66	16.66
Saccade L	1	11	387936989	387976734	39745	927.09	577.17	389.36	586.06	4.74	293.86	0.50	119.28	7245.60	-6215.28	6421.83
Saccade R	1	11	387936989	387976734	39745	927.09	577.17	389.36	586.06	4.74	293.86	0.50	119.28	7245.60	-6215.28	6421.83
Fixation L	1	12	387976734	388255205	278471	365.80	608.26	50	47	-1	17.32	17.32
Fixation R	1	12	387976734	388255205	278471	365.80	608.26	50	47	-1	17.39	17.39
Saccade L	1	12	388255205	388314837	59632	376.99	630.51	519.45	676.12	1.69	148.70	1.00	28.36	3613.43	-3661.24	1485.08
Saccade R	1	12	388255205	388314837	59632	376.99	630.51	519.45	676.12	1.69	148.70	1.00	28.36	3613.43	-3661.24	1485.08
Fixation L	1	13	388314837	388553567	238730	540.23	707.29	40	55	-1	17.38	17.38
Fixation R	1	13	388314837	388553567	238730	540.23	707.29	40	55	-1	17.22	17.22
Saccade L	1	13	388553567	388692686	139119	559.63	731.75	559.15	948.12	3.44	112.80	1.00	24.75	2762.39	-2726.78	1229.04
Saccade R	1	13	388553567	388692686	139119	559.63	731.75	559.15	948.12	3.44	112.80	1.00	24.75	2762.39	-2726.78	1229.04
Fixation L	1	14	388692686	388851797	159111	558.77	950.50	5	11	-1	17.65	17.65
Fixation R	1	14	388692686	388851797	159111	558.77	950.50	5	11	-1	17.62	17.62
