[BeGaze]
Converted from:	C:\Documents and Settings\iViewX\Desktop\EXPERIMENTATIONS\Experiments\results\finaleart\S21F22332-finaleart-1.idf
Date:	27.03.2019 15:56:21
Version:	BeGaze 2.5.77
Sample Rate:	50
Subject:	S21F22332
Description:	Cyrielle Mailart

Table Header for Fixations:
Event Type	Trial	Number	Start	End	Duration	Location X	Location Y	Dispersion X	Dispersion Y	Plane	Avg. Pupil Size X	Avg. Pupil Size Y

Table Header for Saccades:
Event Type	Trial	Number	Start	End	Duration	Start Loc.X	Start Loc.Y	End Loc.X	End Loc.Y	Amplitude	Peak Speed	Peak Speed At	Average Speed	Peak Accel.	Peak Decel.	Average Accel.

Table Header for Blinks:
Event Type	Trial	Number	Start	End	Duration

Table Header for User Events:
Event Type	Trial	Number	Start	Description

UserEvent	1	1	3150347772	# Message: void.jpg
Fixation L	1	1	3150351875	3150630354	278479	1535.27	1033.00	5	28	-1	16.66	16.66
Fixation R	1	1	3150351875	3150630354	278479	1535.27	1033.00	5	28	-1	15.20	15.20
Saccade L	1	1	3150630354	3150670099	39745	1532.65	1010.85	1376.96	565.51	4.01	373.39	0.50	100.97	9205.95	-9172.99	5865.82
Saccade R	1	1	3150630354	3150670099	39745	1532.65	1010.85	1376.96	565.51	4.01	373.39	0.50	100.97	9205.95	-9172.99	5865.82
Fixation L	1	2	3150670099	3150829248	159149	1378.86	555.33	8	20	-1	16.93	16.93
Fixation R	1	2	3150670099	3150829248	159149	1378.86	555.33	8	20	-1	15.94	15.94
Blink L	1	1	3150829248	3151107709	278461
Blink R	1	1	3150829248	3151107709	278461
Fixation L	1	3	3151107709	3151286702	178993	1011.63	377.49	18	57	-1	17.98	17.98
Fixation R	1	3	3151107709	3151286702	178993	1011.63	377.49	18	57	-1	12.99	12.99
Saccade L	1	2	3151286702	3151406063	119361	1006.17	410.12	998.50	378.65	8.54	297.49	0.33	71.52	26972.34	-7398.49	6945.81
Saccade R	1	2	3151286702	3151406063	119361	1006.17	410.12	998.50	378.65	8.54	297.49	0.33	71.52	26972.34	-7398.49	6945.81
Blink L	1	2	3151406063	3151604923	198860
Blink R	1	2	3151406063	3151604923	198860
Fixation L	1	4	3151604923	3151843667	238744	991.63	437.19	5	20	-1	14.82	14.82
Fixation R	1	4	3151604923	3151843667	238744	991.63	437.19	5	20	-1	13.65	13.65
Saccade L	1	3	3151843667	3151883413	39746	993.86	446.06	832.50	503.10	1.65	130.39	0.50	41.56	3178.69	-2731.93	2005.38
Saccade R	1	3	3151843667	3151883413	39746	993.86	446.06	832.50	503.10	1.65	130.39	0.50	41.56	3178.69	-2731.93	2005.38
Fixation L	1	5	3151883413	3152261267	377854	824.89	531.44	11	36	-1	14.32	14.32
Fixation R	1	5	3151883413	3152261267	377854	824.89	531.44	11	36	-1	13.25	13.25
Saccade L	1	4	3152261267	3152360767	99500	821.38	538.39	934.22	506.11	2.04	77.79	0.20	20.52	1890.95	-1465.18	839.40
Saccade R	1	4	3152261267	3152360767	99500	821.38	538.39	934.22	506.11	2.04	77.79	0.20	20.52	1890.95	-1465.18	839.40
