[BeGaze]
Converted from:	C:\Documents and Settings\iViewX\Desktop\EXPERIMENTATIONS\Experiments\results\finaleart\S14F27123-finaleart-1.idf
Date:	27.03.2019 15:43:58
Version:	BeGaze 2.5.77
Sample Rate:	50
Subject:	S14F27123
Description:	Anne-flore Perrin

Table Header for Fixations:
Event Type	Trial	Number	Start	End	Duration	Location X	Location Y	Dispersion X	Dispersion Y	Plane	Avg. Pupil Size X	Avg. Pupil Size Y

Table Header for Saccades:
Event Type	Trial	Number	Start	End	Duration	Start Loc.X	Start Loc.Y	End Loc.X	End Loc.Y	Amplitude	Peak Speed	Peak Speed At	Average Speed	Peak Accel.	Peak Decel.	Average Accel.

Table Header for Blinks:
Event Type	Trial	Number	Start	End	Duration

Table Header for User Events:
Event Type	Trial	Number	Start	Description

UserEvent	1	1	31565652540	# Message: Bank_Of_A_Lake_Pechstein_1910.jpg
Blink L	1	1	31565669505	31565848491	178986
Blink R	1	1	31565669505	31565848491	178986
Blink L	1	2	31565868372	31566186635	318263
Blink R	1	2	31565868372	31566186635	318263
Saccade L	1	1	31566186635	31566305980	119345	674.96	587.05	675.38	226.23	17.52	898.55	1.00	146.83	5498.27	-22170.14	4934.70
Saccade R	1	1	31566186635	31566305980	119345	674.96	587.05	675.38	226.23	17.52	898.55	1.00	146.83	5498.27	-22170.14	4934.70
Fixation L	1	1	31566305980	31566465095	159115	669.66	205.19	11	77	-1	8.55	8.55
Fixation R	1	1	31566305980	31566465095	159115	669.66	205.19	11	77	-1	8.89	8.89
Saccade L	1	2	31566465095	31566484967	19872	671.31	170.67	667.11	85.20	0.69	86.56	1.00	34.78	1412.34	-1696.02	1079.84
Saccade R	1	2	31566465095	31566484967	19872	671.31	170.67	667.11	85.20	0.69	86.56	1.00	34.78	1412.34	-1696.02	1079.84
Fixation L	1	2	31566484967	31566783332	298365	680.03	117.72	28	52	-1	7.88	7.88
Fixation R	1	2	31566484967	31566783332	298365	680.03	117.72	28	52	-1	8.61	8.61
Saccade L	1	3	31566783332	31566823079	39747	695.24	137.90	1114.79	429.42	4.37	362.35	0.50	109.96	9005.91	-8822.55	6337.24
Saccade R	1	3	31566783332	31566823079	39747	695.24	137.90	1114.79	429.42	4.37	362.35	0.50	109.96	9005.91	-8822.55	6337.24
Fixation L	1	3	31566823079	31567002067	178988	1107.68	445.69	10	29	-1	8.62	8.62
Fixation R	1	3	31566823079	31567002067	178988	1107.68	445.69	10	29	-1	8.93	8.93
Saccade L	1	4	31567002067	31567021948	19881	1104.62	455.98	1156.26	513.92	0.63	78.50	1.00	31.65	1904.33	-1548.74	1484.49
Saccade R	1	4	31567002067	31567021948	19881	1104.62	455.98	1156.26	513.92	0.63	78.50	1.00	31.65	1904.33	-1548.74	1484.49
Fixation L	1	4	31567021948	31567300433	278485	1166.77	534.12	67	27	-1	9.37	9.37
Fixation R	1	4	31567021948	31567300433	278485	1166.77	534.12	67	27	-1	9.44	9.44
Saccade L	1	5	31567300433	31567340313	39880	1185.96	536.49	1503.73	533.39	2.71	315.22	1.00	67.99	7816.98	-7559.02	3904.87
Saccade R	1	5	31567300433	31567340313	39880	1185.96	536.49	1503.73	533.39	2.71	315.22	1.00	67.99	7816.98	-7559.02	3904.87
Fixation L	1	5	31567340313	31567459556	119243	1524.39	536.43	39	15	-1	9.69	9.69
Fixation R	1	5	31567340313	31567459556	119243	1524.39	536.43	39	15	-1	9.57	9.57
Saccade L	1	6	31567459556	31567479418	19862	1542.79	529.06	1572.77	509.02	0.41	36.48	1.00	20.52	595.62	-504.06	414.09
Saccade R	1	6	31567459556	31567479418	19862	1542.79	529.06	1572.77	509.02	0.41	36.48	1.00	20.52	595.62	-504.06	414.09
Fixation L	1	6	31567479418	31567658535	179117	1607.85	508.13	77	21	-1	9.55	9.55
Fixation R	1	6	31567479418	31567658535	179117	1607.85	508.13	77	21	-1	9.85	9.85
Saccade L	1	7	31567658535	31567738037	79502	1622.66	497.22	1342.77	491.56	3.82	177.74	1.00	48.01	4390.63	-4085.05	2297.45
Saccade R	1	7	31567658535	31567738037	79502	1622.66	497.22	1342.77	491.56	3.82	177.74	1.00	48.01	4390.63	-4085.05	2297.45
Fixation L	1	7	31567738037	31567917023	178986	1330.23	463.75	18	44	-1	10.02	10.02
Fixation R	1	7	31567738037	31567917023	178986	1330.23	463.75	18	44	-1	10.03	10.03
Saccade L	1	8	31567917023	31567956779	39756	1324.16	447.09	1187.95	296.47	1.82	126.48	0.50	45.77	3097.92	-2762.09	2376.08
Saccade R	1	8	31567917023	31567956779	39756	1324.16	447.09	1187.95	296.47	1.82	126.48	0.50	45.77	3097.92	-2762.09	2376.08
Fixation L	1	8	31567956779	31568076145	119366	1164.27	283.25	38	25	-1	10.03	10.03
Fixation R	1	8	31567956779	31568076145	119366	1164.27	283.25	38	25	-1	9.81	9.81
Saccade L	1	9	31568076145	31568116021	39876	1156.99	278.30	939.93	216.18	2.26	177.48	1.00	56.59	4176.28	-4000.78	2728.70
Saccade R	1	9	31568076145	31568116021	39876	1156.99	278.30	939.93	216.18	2.26	177.48	1.00	56.59	4176.28	-4000.78	2728.70
Fixation L	1	9	31568116021	31568275136	159115	917.86	205.07	29	33	-1	9.83	9.83
Fixation R	1	9	31568116021	31568275136	159115	917.86	205.07	29	33	-1	10.13	10.13
Saccade L	1	10	31568275136	31568334764	59628	918.76	217.57	455.75	324.15	5.56	244.03	0.67	93.28	6031.32	-5598.60	3942.09
Saccade R	1	10	31568275136	31568334764	59628	918.76	217.57	455.75	324.15	5.56	244.03	0.67	93.28	6031.32	-5598.60	3942.09
Fixation L	1	10	31568334764	31568533630	198866	454.86	311.71	18	79	-1	9.91	9.91
Fixation R	1	10	31568334764	31568533630	198866	454.86	311.71	18	79	-1	10.40	10.40
Saccade L	1	11	31568533630	31568633127	99497	461.11	352.14	321.13	604.45	5.83	148.61	0.40	58.61	2945.60	-2287.19	1687.78
Saccade R	1	11	31568533630	31568633127	99497	461.11	352.14	321.13	604.45	5.83	148.61	0.40	58.61	2945.60	-2287.19	1687.78
Blink L	1	3	31568633127	31568951359	318232
Blink R	1	3	31568633127	31568951359	318232
Blink L	1	4	31568971233	31569110480	139247
Blink R	1	4	31568971233	31569110480	139247
