[BeGaze]
Converted from:	C:\Documents and Settings\iViewX\Desktop\EXPERIMENTATIONS\Experiments\results\finaleart\S02123220-finaleart-1.idf
Date:	27.03.2019 15:33:30
Version:	BeGaze 2.5.77
Sample Rate:	50
Subject:	S02123220
Description:	David Xu

Table Header for Fixations:
Event Type	Trial	Number	Start	End	Duration	Location X	Location Y	Dispersion X	Dispersion Y	Plane	Avg. Pupil Size X	Avg. Pupil Size Y

Table Header for Saccades:
Event Type	Trial	Number	Start	End	Duration	Start Loc.X	Start Loc.Y	End Loc.X	End Loc.Y	Amplitude	Peak Speed	Peak Speed At	Average Speed	Peak Accel.	Peak Decel.	Average Accel.

Table Header for Blinks:
Event Type	Trial	Number	Start	End	Duration

Table Header for User Events:
Event Type	Trial	Number	Start	Description

UserEvent	1	1	518010086	# Message: void.jpg
Fixation L	1	1	518016021	518234869	218848	1612.95	610.68	25	26	-1	14.63	14.63
Fixation R	1	1	518016021	518234869	218848	1612.95	610.68	25	26	-1	11.50	11.50
Saccade L	1	1	518234869	518254749	19880	1615.68	604.94	1691.34	607.38	0.58	76.57	1.00	29.23	1649.67	-1511.21	1219.71
Saccade R	1	1	518234869	518254749	19880	1615.68	604.94	1691.34	607.38	0.58	76.57	1.00	29.23	1649.67	-1511.21	1219.71
Fixation L	1	2	518254749	518572979	318230	1683.14	606.90	47	31	-1	15.38	15.38
Fixation R	1	2	518254749	518572979	318230	1683.14	606.90	47	31	-1	11.25	11.25
Saccade L	1	2	518572979	518612727	39748	1647.92	601.28	1285.81	604.94	3.35	238.27	0.50	84.27	5941.17	-5424.96	4197.89
Saccade R	1	2	518572979	518612727	39748	1647.92	601.28	1285.81	604.94	3.35	238.27	0.50	84.27	5941.17	-5424.96	4197.89
Fixation L	1	3	518612727	518712217	99490	1254.35	594.54	51	19	-1	15.10	15.10
Fixation R	1	3	518612727	518712217	99490	1254.35	594.54	51	19	-1	13.22	13.22
Blink L	1	1	518712217	518831580	119363
Blink R	1	1	518712217	518831580	119363
Blink L	1	2	518851460	518970826	119366
Blink R	1	2	518851460	518970826	119366
Fixation L	1	4	518970826	519428300	457474	1049.59	523.58	13	43	-1	18.26	18.26
Fixation R	1	4	518970826	519428300	457474	1049.59	523.58	13	43	-1	16.42	16.42
Saccade L	1	3	519428300	519448179	19879	1051.59	523.35	964.28	521.55	0.54	88.34	1.00	27.22	2200.70	-2116.09	1576.60
Saccade R	1	3	519428300	519448179	19879	1051.59	523.35	964.28	521.55	0.54	88.34	1.00	27.22	2200.70	-2116.09	1576.60
Fixation L	1	5	519448179	520005007	556828	945.60	522.08	23	9	-1	18.63	18.63
Fixation R	1	5	519448179	520005007	556828	945.60	522.08	23	9	-1	16.82	16.82
