[BeGaze]
Converted from:	C:\Documents and Settings\iViewX\Desktop\EXPERIMENTATIONS\Experiments\results\finaleart\S13H22431-finaleart-1.idf
Date:	27.03.2019 15:42:37
Version:	BeGaze 2.5.77
Sample Rate:	50
Subject:	S13H22431
Description:	Jimmy Petit

Table Header for Fixations:
Event Type	Trial	Number	Start	End	Duration	Location X	Location Y	Dispersion X	Dispersion Y	Plane	Avg. Pupil Size X	Avg. Pupil Size Y

Table Header for Saccades:
Event Type	Trial	Number	Start	End	Duration	Start Loc.X	Start Loc.Y	End Loc.X	End Loc.Y	Amplitude	Peak Speed	Peak Speed At	Average Speed	Peak Accel.	Peak Decel.	Average Accel.

Table Header for Blinks:
Event Type	Trial	Number	Start	End	Duration

Table Header for User Events:
Event Type	Trial	Number	Start	Description

UserEvent	1	1	28434720038	# Message: reclining-nude_renoir_1883.jpg
Fixation L	1	1	28434739754	28434899043	159289	734.36	401.70	4	8	-1	15.41	15.41
Fixation R	1	1	28434739754	28434899043	159289	734.36	401.70	4	8	-1	15.51	15.51
Saccade L	1	1	28434899043	28434978482	79439	734.41	401.38	650.22	568.22	3.12	101.14	0.25	39.33	2471.22	-1106.40	991.63
Saccade R	1	1	28434899043	28434978482	79439	734.41	401.38	650.22	568.22	3.12	101.14	0.25	39.33	2471.22	-1106.40	991.63
Fixation L	1	2	28434978482	28435137651	159169	667.30	527.46	30	65	-1	15.16	15.16
Fixation R	1	2	28434978482	28435137651	159169	667.30	527.46	30	65	-1	15.95	15.95
Saccade L	1	2	28435137651	28435177365	39714	676.34	525.82	697.90	405.57	1.20	105.25	1.00	30.34	2446.42	-2439.96	1336.51
Saccade R	1	2	28435137651	28435177365	39714	676.34	525.82	697.90	405.57	1.20	105.25	1.00	30.34	2446.42	-2439.96	1336.51
Fixation L	1	3	28435177365	28435336472	159107	705.20	397.43	62	19	-1	14.49	14.49
Fixation R	1	3	28435177365	28435336472	159107	705.20	397.43	62	19	-1	15.15	15.15
Saccade L	1	3	28435336472	28435356348	19876	750.83	386.42	757.31	344.38	0.67	43.03	1.00	33.66	857.39	-989.77	637.73
Saccade R	1	3	28435336472	28435356348	19876	750.83	386.42	757.31	344.38	0.67	43.03	1.00	33.66	857.39	-989.77	637.73
Fixation L	1	4	28435356348	28435654708	298360	758.49	290.81	17	80	-1	13.29	13.29
Fixation R	1	4	28435356348	28435654708	298360	758.49	290.81	17	80	-1	13.96	13.96
Saccade L	1	4	28435654708	28435674586	19878	748.23	264.30	749.29	261.82	0.10	9.00	0.00	5.13	16.95	-95.51	44.73
Saccade R	1	4	28435654708	28435674586	19878	748.23	264.30	749.29	261.82	0.10	9.00	0.00	5.13	16.95	-95.51	44.73
Fixation L	1	5	28435674586	28436868049	1193463	761.50	276.66	26	56	-1	14.38	14.38
Fixation R	1	5	28435674586	28436868049	1193463	761.50	276.66	26	56	-1	14.68	14.68
Saccade L	1	5	28436868049	28436907776	39727	768.01	278.62	964.08	435.00	2.40	170.85	0.50	60.40	4187.96	-3392.58	2882.43
Saccade R	1	5	28436868049	28436907776	39727	768.01	278.62	964.08	435.00	2.40	170.85	0.50	60.40	4187.96	-3392.58	2882.43
Fixation L	1	6	28436907776	28437066896	159120	963.18	415.98	24	34	-1	15.39	15.39
Fixation R	1	6	28436907776	28437066896	159120	963.18	415.98	24	34	-1	15.58	15.58
Saccade L	1	6	28437066896	28437166389	99493	977.17	430.63	1204.18	580.35	10.45	325.14	0.40	105.06	7641.14	-4908.31	3318.23
Blink R	1	1	28437066896	28437186268	119372
Fixation L	1	7	28437166389	28437345384	178995	1210.30	615.60	16	55	-1	16.50	16.50
Fixation R	1	7	28437186268	28437345384	159116	1210.98	619.52	16	36	-1	16.45	16.45
Saccade L	1	7	28437345384	28437365256	19872	1219.14	616.27	1308.16	641.92	0.59	93.71	1.00	29.65	2284.93	-1997.47	1489.78
Saccade R	1	6	28437345384	28437365256	19872	1219.14	616.27	1308.16	641.92	0.59	93.71	1.00	29.65	2284.93	-1997.47	1489.78
Fixation L	1	8	28437365256	28437504500	139244	1326.69	658.85	48	35	-1	16.01	16.01
Fixation R	1	8	28437365256	28437504500	139244	1326.69	658.85	48	35	-1	15.85	15.85
Saccade L	1	8	28437504500	28437524376	19876	1357.05	677.52	1383.29	684.64	0.35	31.32	0.00	17.39	567.53	-634.45	554.91
Saccade R	1	7	28437504500	28437524376	19876	1357.05	677.52	1383.29	684.64	0.35	31.32	0.00	17.39	567.53	-634.45	554.91
Fixation L	1	9	28437524376	28437942112	417736	1416.83	687.63	71	24	-1	14.70	14.70
Fixation R	1	9	28437524376	28437942112	417736	1416.83	687.63	71	24	-1	14.74	14.74
Saccade L	1	9	28437942112	28437961981	19869	1451.51	673.97	1455.47	668.51	0.11	8.50	1.00	5.64	29.68	-88.66	53.37
Saccade R	1	8	28437942112	28437961981	19869	1451.51	673.97	1455.47	668.51	0.11	8.50	1.00	5.64	29.68	-88.66	53.37
Fixation L	1	10	28437961981	28438717825	755844	1482.09	665.67	51	25	-1	14.67	14.67
Fixation R	1	10	28437961981	28438717825	755844	1482.09	665.67	51	25	-1	14.40	14.40
