[BeGaze]
Converted from:	C:\Documents and Settings\iViewX\Desktop\EXPERIMENTATIONS\Experiments\results\finaleart\S14F27123-finaleart-1.idf
Date:	27.03.2019 15:43:09
Version:	BeGaze 2.5.77
Sample Rate:	50
Subject:	S14F27123
Description:	Anne-flore Perrin

Table Header for Fixations:
Event Type	Trial	Number	Start	End	Duration	Location X	Location Y	Dispersion X	Dispersion Y	Plane	Avg. Pupil Size X	Avg. Pupil Size Y

Table Header for Saccades:
Event Type	Trial	Number	Start	End	Duration	Start Loc.X	Start Loc.Y	End Loc.X	End Loc.Y	Amplitude	Peak Speed	Peak Speed At	Average Speed	Peak Accel.	Peak Decel.	Average Accel.

Table Header for Blinks:
Event Type	Trial	Number	Start	End	Duration

Table Header for User Events:
Event Type	Trial	Number	Start	Description

UserEvent	1	1	30620063361	# Message: void.jpg
Saccade L	1	1	30620069085	30620128830	59745	662.42	546.89	676.78	526.37	0.92	38.87	1.00	15.37	829.15	0.00	377.90
Saccade R	1	1	30620069085	30620128830	59745	662.42	546.89	676.78	526.37	0.92	38.87	1.00	15.37	829.15	0.00	377.90
Fixation L	1	1	30620128830	30620228300	99470	681.89	486.37	18	75	-1	12.15	12.15
Fixation R	1	1	30620128830	30620228300	99470	681.89	486.37	18	75	-1	12.73	12.73
Saccade L	1	2	30620228300	30620268110	39810	692.99	479.35	699.03	271.70	2.42	187.27	0.50	60.87	4046.32	-3319.58	1990.91
Saccade R	1	2	30620228300	30620268110	39810	692.99	479.35	699.03	271.70	2.42	187.27	0.50	60.87	4046.32	-3319.58	1990.91
Fixation L	1	2	30620268110	30620506686	238576	711.41	239.55	20	75	-1	12.39	12.39
Fixation R	1	2	30620268110	30620506686	238576	711.41	239.55	20	75	-1	12.76	12.76
Saccade L	1	3	30620506686	30620526557	19871	719.97	272.38	729.25	286.86	4.08	787.76	1.00	205.15	19586.73	-434.99	6725.84
Saccade R	1	3	30620506686	30620526557	19871	719.97	272.38	729.25	286.86	4.08	787.76	1.00	205.15	19586.73	-434.99	6725.84
Blink L	1	1	30620526557	30620645927	119370
Blink R	1	1	30620526557	30620645927	119370
Blink L	1	2	30620665821	30621043662	377841
Blink R	1	2	30620665821	30621043662	377841
Fixation L	1	3	30621043662	30621481274	437612	810.17	581.95	67	31	-1	13.63	13.63
Fixation R	1	3	30621043662	30621481274	437612	810.17	581.95	67	31	-1	13.37	13.37
Saccade L	1	4	30621481274	30621501147	19873	767.40	603.14	781.71	630.67	0.52	49.94	0.00	26.21	501.85	-944.38	637.46
Saccade R	1	4	30621481274	30621501147	19873	767.40	603.14	781.71	630.67	0.52	49.94	0.00	26.21	501.85	-944.38	637.46
Fixation L	1	4	30621501147	30622058119	556972	764.11	657.87	24	61	-1	12.45	12.45
Fixation R	1	4	30621501147	30622058119	556972	764.11	657.87	24	61	-1	12.70	12.70
