[BeGaze]
Converted from:	C:\Documents and Settings\iViewX\Desktop\EXPERIMENTATIONS\Experiments\results\finaleart\S21F22332-finaleart-1.idf
Date:	27.03.2019 15:54:28
Version:	BeGaze 2.5.77
Sample Rate:	50
Subject:	S21F22332
Description:	Cyrielle Mailart

Table Header for Fixations:
Event Type	Trial	Number	Start	End	Duration	Location X	Location Y	Dispersion X	Dispersion Y	Plane	Avg. Pupil Size X	Avg. Pupil Size Y

Table Header for Saccades:
Event Type	Trial	Number	Start	End	Duration	Start Loc.X	Start Loc.Y	End Loc.X	End Loc.Y	Amplitude	Peak Speed	Peak Speed At	Average Speed	Peak Accel.	Peak Decel.	Average Accel.

Table Header for Blinks:
Event Type	Trial	Number	Start	End	Duration

Table Header for User Events:
Event Type	Trial	Number	Start	Description

UserEvent	1	1	1714150136	# Message: courbet-the-bathers-1858.jpg
Fixation L	1	1	1714162108	1714321239	159131	761.41	410.00	5	15	-1	16.71	16.71
Fixation R	1	1	1714162108	1714321239	159131	761.41	410.00	5	15	-1	15.96	15.96
Blink L	1	1	1714321239	1714559851	238612
Blink R	1	1	1714321239	1714559851	238612
Saccade L	1	1	1714559851	1714679218	119367	746.66	441.17	558.07	360.69	4.54	111.82	0.83	38.02	2476.02	-2541.62	1372.52
Saccade R	1	1	1714559851	1714679218	119367	746.66	441.17	558.07	360.69	4.54	111.82	0.83	38.02	2476.02	-2541.62	1372.52
Fixation L	1	2	1714679218	1714878060	198842	550.93	352.40	12	49	-1	17.58	17.58
Fixation R	1	2	1714679218	1714878060	198842	550.93	352.40	12	49	-1	16.46	16.46
Saccade L	1	2	1714878060	1714897938	19878	548.56	319.45	552.01	245.20	0.69	75.18	1.00	34.53	1690.26	-1318.69	1005.52
Saccade R	1	2	1714878060	1714897938	19878	548.56	319.45	552.01	245.20	0.69	75.18	1.00	34.53	1690.26	-1318.69	1005.52
Fixation L	1	3	1714897938	1715554400	656462	558.88	203.71	17	66	-1	16.96	16.96
Fixation R	1	3	1714897938	1715554400	656462	558.88	203.71	17	66	-1	16.03	16.03
Saccade L	1	3	1715554400	1715574275	19875	566.63	213.19	735.95	41.13	1.50	244.07	1.00	75.26	6032.13	-5835.95	4265.21
Saccade R	1	3	1715554400	1715574275	19875	566.63	213.19	735.95	41.13	1.50	244.07	1.00	75.26	6032.13	-5835.95	4265.21
Fixation L	1	4	1715574275	1715852755	278480	777.16	16.51	50	46	-1	17.41	17.41
Fixation R	1	4	1715574275	1715852755	278480	777.16	16.51	50	46	-1	16.39	16.39
Saccade L	1	4	1715852755	1715872635	19880	786.68	4.18	790.41	7.76	0.31	33.06	1.00	15.46	579.29	-211.34	290.59
Saccade R	1	4	1715852755	1715872635	19880	786.68	4.18	790.41	7.76	0.31	33.06	1.00	15.46	579.29	-211.34	290.59
Fixation L	1	5	1715872635	1716409604	536969	799.00	-27.87	19	73	-1	18.16	18.16
Fixation R	1	5	1715872635	1716409604	536969	799.00	-27.87	19	73	-1	17.19	17.19
Saccade L	1	5	1716409604	1716449355	39751	790.56	-28.38	883.74	291.12	3.38	282.96	1.00	84.95	6405.46	-6459.60	3542.07
Saccade R	1	5	1716409604	1716449355	39751	790.56	-28.38	883.74	291.12	3.38	282.96	1.00	84.95	6405.46	-6459.60	3542.07
Fixation L	1	6	1716449355	1716787589	338234	875.78	275.14	45	54	-1	19.22	19.22
Fixation R	1	6	1716449355	1716787589	338234	875.78	275.14	45	54	-1	18.16	18.16
Saccade L	1	6	1716787589	1716807458	19869	898.97	273.67	905.69	269.37	0.17	10.84	0.00	8.39	244.27	-141.35	140.03
Saccade R	1	6	1716787589	1716807458	19869	898.97	273.67	905.69	269.37	0.17	10.84	0.00	8.39	244.27	-141.35	140.03
Fixation L	1	7	1716807458	1716906831	99373	905.77	275.64	10	17	-1	19.32	19.32
Fixation R	1	7	1716807458	1716906831	99373	905.77	275.64	10	17	-1	18.76	18.76
Saccade L	1	7	1716906831	1716946704	39873	911.22	283.18	1028.09	725.05	3.98	305.18	0.50	99.91	7527.95	-7308.81	5702.52
Saccade R	1	7	1716906831	1716946704	39873	911.22	283.18	1028.09	725.05	3.98	305.18	0.50	99.91	7527.95	-7308.81	5702.52
Fixation L	1	8	1716946704	1717225068	278364	1013.08	728.46	24	37	-1	19.70	19.70
Fixation R	1	8	1716946704	1717225068	278364	1013.08	728.46	24	37	-1	19.05	19.05
Saccade L	1	8	1717225068	1717245055	19987	1003.14	750.37	838.32	941.18	1.46	254.91	1.00	73.27	6159.03	-6260.77	4320.52
Saccade R	1	8	1717225068	1717245055	19987	1003.14	750.37	838.32	941.18	1.46	254.91	1.00	73.27	6159.03	-6260.77	4320.52
Fixation L	1	9	1717245055	1717404176	159121	837.86	944.06	7	4	-1	19.00	19.00
Fixation R	1	9	1717245055	1717404176	159121	837.86	944.06	7	4	-1	18.04	18.04
Saccade L	1	9	1717404176	1717424053	19877	836.61	945.72	712.89	918.99	0.74	128.03	1.00	37.47	3185.08	-2975.19	2216.97
Saccade R	1	9	1717404176	1717424053	19877	836.61	945.72	712.89	918.99	0.74	128.03	1.00	37.47	3185.08	-2975.19	2216.97
Fixation L	1	10	1717424053	1717782038	357985	726.86	893.87	18	31	-1	18.67	18.67
Fixation R	1	10	1717424053	1717782038	357985	726.86	893.87	18	31	-1	17.67	17.67
Blink L	1	2	1717782038	1717961030	178992
Blink R	1	2	1717782038	1717961030	178992
Saccade L	1	10	1717961030	1718140023	178993	770.58	898.63	1289.15	969.49	9.33	398.59	0.56	52.10	9906.75	-9747.73	2581.23
Saccade R	1	10	1717961030	1718140023	178993	770.58	898.63	1289.15	969.49	9.33	398.59	0.56	52.10	9906.75	-9747.73	2581.23
