[BeGaze]
Converted from:	C:\Documents and Settings\iViewX\Desktop\EXPERIMENTATIONS\Experiments\results\finaleart\S11H21112-finaleart-1.idf
Date:	27.03.2019 15:38:54
Version:	BeGaze 2.5.77
Sample Rate:	50
Subject:	S11H21112
Description:	Clement legrand-Duchenne

Table Header for Fixations:
Event Type	Trial	Number	Start	End	Duration	Location X	Location Y	Dispersion X	Dispersion Y	Plane	Avg. Pupil Size X	Avg. Pupil Size Y

Table Header for Saccades:
Event Type	Trial	Number	Start	End	Duration	Start Loc.X	Start Loc.Y	End Loc.X	End Loc.Y	Amplitude	Peak Speed	Peak Speed At	Average Speed	Peak Accel.	Peak Decel.	Average Accel.

Table Header for Blinks:
Event Type	Trial	Number	Start	End	Duration

Table Header for User Events:
Event Type	Trial	Number	Start	Description

UserEvent	1	1	4361265989	# Message: void.jpg
Fixation L	1	1	4361271948	4361450940	178992	1281.08	700.65	11	27	-1	16.07	16.07
Fixation R	1	1	4361271948	4361450940	178992	1281.08	700.65	11	27	-1	17.26	17.26
Saccade L	1	1	4361450940	4361490675	39735	1283.29	693.63	1067.16	692.22	1.80	148.27	1.00	45.42	3657.65	-3609.24	2660.61
Saccade R	1	1	4361450940	4361490675	39735	1283.29	693.63	1067.16	692.22	1.80	148.27	1.00	45.42	3657.65	-3609.24	2660.61
Fixation L	1	2	4361490675	4361789039	298364	1062.80	695.53	54	25	-1	15.62	15.62
Fixation R	1	2	4361490675	4361789039	298364	1062.80	695.53	54	25	-1	17.32	17.32
Saccade L	1	2	4361789039	4361908407	119368	1015.98	711.82	309.45	755.92	11.29	206.24	0.33	94.58	4886.17	-2640.36	2180.58
Saccade R	1	2	4361789039	4361908407	119368	1015.98	711.82	309.45	755.92	11.29	206.24	0.33	94.58	4886.17	-2640.36	2180.58
Fixation L	1	3	4361908407	4362027782	119375	334.14	770.39	51	42	-1	16.02	16.02
Fixation R	1	3	4361908407	4362027782	119375	334.14	770.39	51	42	-1	18.70	18.70
Saccade L	1	3	4362027782	4362147024	119242	361.10	788.90	245.76	1130.04	5.60	224.73	0.83	46.93	5426.57	-5410.98	1967.61
Saccade R	1	3	4362027782	4362147024	119242	361.10	788.90	245.76	1130.04	5.60	224.73	0.83	46.93	5426.57	-5410.98	1967.61
Fixation L	1	4	4362147024	4362365891	218867	258.02	1139.25	22	18	-1	15.54	15.54
Fixation R	1	4	4362147024	4362365891	218867	258.02	1139.25	22	18	-1	16.58	16.58
Saccade L	1	4	4362365891	4362405644	39753	268.16	1148.60	619.99	1308.07	3.37	248.27	0.50	84.78	6110.19	-5735.41	4759.68
Saccade R	1	4	4362365891	4362405644	39753	268.16	1148.60	619.99	1308.07	3.37	248.27	0.50	84.78	6110.19	-5735.41	4759.68
Fixation L	1	5	4362405644	4362723875	318231	598.63	1285.04	51	41	-1	15.76	15.76
Fixation R	1	5	4362405644	4362723875	318231	598.63	1285.04	51	41	-1	16.87	16.87
Blink L	1	1	4362723875	4362823391	99516
Blink R	1	1	4362723875	4362823391	99516
Fixation L	1	6	4362823391	4363101737	278346	545.04	1273.51	19	29	-1	16.60	16.60
Fixation R	1	6	4362823391	4363101737	278346	545.04	1273.51	19	29	-1	17.81	17.81
Saccade L	1	5	4363101737	4363161483	59746	540.60	1267.36	945.54	888.74	6.45	426.53	0.67	107.95	10566.71	-9437.49	5269.61
Saccade R	1	5	4363101737	4363161483	59746	540.60	1267.36	945.54	888.74	6.45	426.53	0.67	107.95	10566.71	-9437.49	5269.61
Fixation L	1	7	4363161483	4363260863	99380	927.71	845.46	27	58	-1	15.88	15.88
Fixation R	1	7	4363161483	4363260863	99380	927.71	845.46	27	58	-1	18.53	18.53
