[BeGaze]
Converted from:	C:\Documents and Settings\iViewX\Desktop\EXPERIMENTATIONS\Experiments\results\finaleart\S22H22551-finaleart-1.idf
Date:	27.03.2019 15:58:37
Version:	BeGaze 2.5.77
Sample Rate:	50
Subject:	S22H22551
Description:	Mathieu Chambre

Table Header for Fixations:
Event Type	Trial	Number	Start	End	Duration	Location X	Location Y	Dispersion X	Dispersion Y	Plane	Avg. Pupil Size X	Avg. Pupil Size Y

Table Header for Saccades:
Event Type	Trial	Number	Start	End	Duration	Start Loc.X	Start Loc.Y	End Loc.X	End Loc.Y	Amplitude	Peak Speed	Peak Speed At	Average Speed	Peak Accel.	Peak Decel.	Average Accel.

Table Header for Blinks:
Event Type	Trial	Number	Start	End	Duration

Table Header for User Events:
Event Type	Trial	Number	Start	Description

UserEvent	1	1	5640322754	# Message: basket-of-fruits-Manet-1864.jpg
Fixation L	1	1	5640326082	5640763678	437596	1026.32	373.25	14	9	-1	15.74	15.74
Fixation R	1	1	5640326082	5640763678	437596	1026.32	373.25	14	9	-1	15.30	15.30
Saccade L	1	1	5640763678	5640783562	19884	1016.98	373.76	903.39	377.47	0.65	114.95	1.00	32.52	2847.97	-2574.68	1904.06
Saccade R	1	1	5640763678	5640783562	19884	1016.98	373.76	903.39	377.47	0.65	114.95	1.00	32.52	2847.97	-2574.68	1904.06
Fixation L	1	2	5640783562	5641042161	258599	913.75	393.51	21	25	-1	16.18	16.18
Fixation R	1	2	5640783562	5641042161	258599	913.75	393.51	21	25	-1	15.80	15.80
Saccade L	1	2	5641042161	5641081908	39747	909.17	403.27	914.80	850.82	3.84	269.10	0.50	96.60	6651.42	-6127.00	5367.70
Saccade R	1	2	5641042161	5641081908	39747	909.17	403.27	914.80	850.82	3.84	269.10	0.50	96.60	6651.42	-6127.00	5367.70
Fixation L	1	3	5641081908	5641300650	218742	943.06	857.73	37	17	-1	17.08	17.08
Fixation R	1	3	5641081908	5641300650	218742	943.06	857.73	37	17	-1	16.69	16.69
Saccade L	1	3	5641300650	5641320650	20000	952.67	860.92	1057.63	869.54	0.61	106.53	1.00	30.32	2655.19	-2436.73	1786.70
Saccade R	1	3	5641300650	5641320650	20000	952.67	860.92	1057.63	869.54	0.61	106.53	1.00	30.32	2655.19	-2436.73	1786.70
Fixation L	1	4	5641320650	5641837741	517091	1066.31	899.42	41	38	-1	17.02	17.02
Fixation R	1	4	5641320650	5641837741	517091	1066.31	899.42	41	38	-1	16.93	16.93
Saccade L	1	4	5641837741	5641857617	19876	1085.85	908.19	894.42	906.17	1.08	193.59	1.00	54.12	4783.84	-4741.84	3331.24
Saccade R	1	4	5641837741	5641857617	19876	1085.85	908.19	894.42	906.17	1.08	193.59	1.00	54.12	4783.84	-4741.84	3331.24
Fixation L	1	5	5641857617	5642215601	357984	869.65	898.64	30	16	-1	17.86	17.86
Fixation R	1	5	5641857617	5642215601	357984	869.65	898.64	30	16	-1	17.75	17.75
Saccade L	1	5	5642215601	5642235471	19870	881.60	895.96	953.90	897.99	0.48	73.17	1.00	24.41	1820.45	-1601.83	1226.90
Saccade R	1	5	5642215601	5642235471	19870	881.60	895.96	953.90	897.99	0.48	73.17	1.00	24.41	1820.45	-1601.83	1226.90
Fixation L	1	6	5642235471	5642394584	159113	954.29	910.58	7	21	-1	18.25	18.25
Fixation R	1	6	5642235471	5642394584	159113	954.29	910.58	7	21	-1	18.09	18.09
Saccade L	1	6	5642394584	5642414590	20006	955.39	919.34	1092.10	919.21	0.73	138.28	1.00	36.51	3369.51	-3414.18	2263.06
Saccade R	1	6	5642394584	5642414590	20006	955.39	919.34	1092.10	919.21	0.73	138.28	1.00	36.51	3369.51	-3414.18	2263.06
Fixation L	1	7	5642414590	5642553705	139115	1091.87	920.35	2	3	-1	18.46	18.46
Fixation R	1	7	5642414590	5642553705	139115	1091.87	920.35	2	3	-1	18.02	18.02
Saccade L	1	7	5642553705	5642593582	39877	1093.45	919.73	964.39	534.44	3.54	239.97	1.00	88.86	5983.04	-5852.08	5264.47
Saccade R	1	7	5642553705	5642593582	39877	1093.45	919.73	964.39	534.44	3.54	239.97	1.00	88.86	5983.04	-5852.08	5264.47
Fixation L	1	8	5642593582	5642852060	258478	939.31	524.81	48	22	-1	18.03	18.03
Fixation R	1	8	5642593582	5642852060	258478	939.31	524.81	48	22	-1	17.51	17.51
Saccade L	1	8	5642852060	5642872064	20004	915.84	511.70	903.88	493.48	0.31	23.98	0.00	15.28	533.87	-524.19	432.57
Saccade R	1	8	5642852060	5642872064	20004	915.84	511.70	903.88	493.48	0.31	23.98	0.00	15.28	533.87	-524.19	432.57
Fixation L	1	9	5642872064	5643070925	198861	883.62	475.98	30	24	-1	17.07	17.07
Fixation R	1	9	5642872064	5643070925	198861	883.62	475.98	30	24	-1	16.68	16.68
Saccade L	1	9	5643070925	5643090809	19884	872.94	468.61	855.26	419.25	0.36	53.04	1.00	17.88	1303.36	-1258.09	952.59
Saccade R	1	9	5643070925	5643090809	19884	872.94	468.61	855.26	419.25	0.36	53.04	1.00	17.88	1303.36	-1258.09	952.59
Fixation L	1	10	5643090809	5643289663	198854	836.88	399.90	27	29	-1	16.30	16.30
Fixation R	1	10	5643090809	5643289663	198854	836.88	399.90	27	29	-1	15.65	15.65
Saccade L	1	10	5643289663	5643309544	19881	827.41	390.10	959.33	321.97	0.82	150.17	1.00	41.43	3702.51	-3574.87	2494.07
Saccade R	1	10	5643289663	5643309544	19881	827.41	390.10	959.33	321.97	0.82	150.17	1.00	41.43	3702.51	-3574.87	2494.07
Fixation L	1	11	5643309544	5643508526	198982	967.60	309.14	14	17	-1	15.79	15.79
Fixation R	1	11	5643309544	5643508526	198982	967.60	309.14	14	17	-1	15.43	15.43
Saccade L	1	11	5643508526	5643528408	19882	973.71	307.41	1142.47	375.81	1.01	184.14	1.00	51.01	4554.08	-3807.99	2830.68
Saccade R	1	11	5643508526	5643528408	19882	973.71	307.41	1142.47	375.81	1.01	184.14	1.00	51.01	4554.08	-3807.99	2830.68
Fixation L	1	12	5643528408	5643747141	218733	1124.31	420.50	28	63	-1	15.62	15.62
Fixation R	1	12	5643528408	5643747141	218733	1124.31	420.50	28	63	-1	15.30	15.30
Saccade L	1	12	5643747141	5643786893	39752	1118.41	439.67	1308.51	667.72	2.73	239.94	0.50	68.72	5932.76	-5157.52	3469.40
Saccade R	1	12	5643747141	5643786893	39752	1118.41	439.67	1308.51	667.72	2.73	239.94	0.50	68.72	5932.76	-5157.52	3469.40
Fixation L	1	13	5643786893	5644244367	457474	1318.45	713.92	40	53	-1	15.23	15.23
Fixation R	1	13	5643786893	5644244367	457474	1318.45	713.92	40	53	-1	14.62	14.62
Saccade L	1	13	5644244367	5644323990	79623	1336.23	718.31	1325.58	962.18	3.53	193.21	0.50	44.30	4780.60	-4697.13	2091.25
Saccade R	1	13	5644244367	5644323990	79623	1336.23	718.31	1325.58	962.18	3.53	193.21	0.50	44.30	4780.60	-4697.13	2091.25
