[BeGaze]
Converted from:	C:\Documents and Settings\iViewX\Desktop\EXPERIMENTATIONS\Experiments\results\finaleart\S8119532-finaleart-1.idf
Date:	27.03.2019 15:59:48
Version:	BeGaze 2.5.77
Sample Rate:	50
Subject:	S8119532
Description:	Alexandre Drewery

Table Header for Fixations:
Event Type	Trial	Number	Start	End	Duration	Location X	Location Y	Dispersion X	Dispersion Y	Plane	Avg. Pupil Size X	Avg. Pupil Size Y

Table Header for Saccades:
Event Type	Trial	Number	Start	End	Duration	Start Loc.X	Start Loc.Y	End Loc.X	End Loc.Y	Amplitude	Peak Speed	Peak Speed At	Average Speed	Peak Accel.	Peak Decel.	Average Accel.

Table Header for Blinks:
Event Type	Trial	Number	Start	End	Duration

Table Header for User Events:
Event Type	Trial	Number	Start	Description

UserEvent	1	1	2731236565	# Message: parrot-tulips-(II)_matisse_1905.jpg
Fixation L	1	1	2731240072	2731339573	99501	933.79	599.69	44	18	-1	11.48	11.48
Fixation R	1	1	2731240072	2731339573	99501	933.79	599.69	44	18	-1	13.31	13.31
Saccade L	1	1	2731339573	2731386103	46530	906.67	597.65	933.04	657.71	1.35	66.35	1.00	29.06	1233.44	-193.19	510.27
Saccade R	1	1	2731339573	2731386103	46530	906.67	597.65	933.04	657.71	1.35	66.35	1.00	29.06	1233.44	-193.19	510.27
Fixation L	1	2	2731386103	2731797061	410958	917.60	622.90	19	66	-1	12.57	12.57
Fixation R	1	2	2731386103	2731797061	410958	917.60	622.90	19	66	-1	14.31	14.31
Saccade L	1	2	2731797061	2731816916	19855	913.62	622.34	878.44	620.55	0.38	35.63	1.00	18.95	510.28	-616.34	515.16
Saccade R	1	2	2731797061	2731816916	19855	913.62	622.34	878.44	620.55	0.38	35.63	1.00	18.95	510.28	-616.34	515.16
Fixation L	1	3	2731816916	2732035654	218738	857.42	623.72	36	22	-1	13.32	13.32
Fixation R	1	3	2731816916	2732035654	218738	857.42	623.72	36	22	-1	15.23	15.23
Saccade L	1	3	2732035654	2732075403	39749	851.79	616.93	872.95	385.96	1.99	125.84	0.50	50.11	3064.03	-2987.43	2802.24
Saccade R	1	3	2732035654	2732075403	39749	851.79	616.93	872.95	385.96	1.99	125.84	0.50	50.11	3064.03	-2987.43	2802.24
Fixation L	1	4	2732075403	2732393631	318228	890.50	377.59	31	58	-1	11.76	11.76
Fixation R	1	4	2732075403	2732393631	318228	890.50	377.59	31	58	-1	13.05	13.05
Saccade L	1	4	2732393631	2732413625	19994	885.10	386.93	882.89	416.38	0.51	36.92	1.00	25.39	-151.87	-362.91	230.34
Saccade R	1	4	2732393631	2732413625	19994	885.10	386.93	882.89	416.38	0.51	36.92	1.00	25.39	-151.87	-362.91	230.34
Fixation L	1	5	2732413625	2732612495	198870	867.72	424.70	22	28	-1	10.46	10.46
Fixation R	1	5	2732413625	2732612495	198870	867.72	424.70	22	28	-1	11.83	11.83
Saccade L	1	5	2732612495	2732632375	19880	864.37	415.80	941.37	432.05	0.52	79.61	1.00	26.40	1831.60	-855.85	912.55
Saccade R	1	5	2732612495	2732632375	19880	864.37	415.80	941.37	432.05	0.52	79.61	1.00	26.40	1831.60	-855.85	912.55
Fixation L	1	6	2732632375	2732771614	139239	952.26	461.22	17	77	-1	10.58	10.58
Fixation R	1	6	2732632375	2732771614	139239	952.26	461.22	17	77	-1	11.86	11.86
Saccade L	1	6	2732771614	2732811359	39745	956.03	494.51	915.05	717.84	2.34	143.59	1.00	58.77	3440.80	-2842.25	2322.21
Saccade R	1	6	2732771614	2732811359	39745	956.03	494.51	915.05	717.84	2.34	143.59	1.00	58.77	3440.80	-2842.25	2322.21
Fixation L	1	7	2732811359	2732970487	159128	902.08	729.68	39	50	-1	10.89	10.89
Fixation R	1	7	2732811359	2732970487	159128	902.08	729.68	39	50	-1	12.80	12.80
Saccade L	1	7	2732970487	2733010228	39741	901.88	765.15	900.15	937.09	1.92	147.57	1.00	48.23	3341.64	-2601.02	1504.92
Saccade R	1	7	2732970487	2733010228	39741	901.88	765.15	900.15	937.09	1.92	147.57	1.00	48.23	3341.64	-2601.02	1504.92
Fixation L	1	8	2733010228	2733109719	99491	902.34	889.66	9	72	-1	11.88	11.88
Fixation R	1	8	2733010228	2733109719	99491	902.34	889.66	9	72	-1	13.54	13.54
Saccade L	1	8	2733109719	2733169341	59622	906.65	864.58	728.31	963.98	3.36	185.68	1.00	56.39	4130.61	-4274.60	2019.67
Saccade R	1	8	2733109719	2733169341	59622	906.65	864.58	728.31	963.98	3.36	185.68	1.00	56.39	4130.61	-4274.60	2019.67
Fixation L	1	9	2733169341	2733408085	238744	700.71	933.40	41	45	-1	11.49	11.49
Fixation R	1	9	2733169341	2733408085	238744	700.71	933.40	41	45	-1	14.20	14.20
Saccade L	1	9	2733408085	2733467710	59625	686.67	918.64	944.35	522.08	5.47	249.58	0.67	91.69	5966.01	-5035.20	3985.76
Saccade R	1	9	2733408085	2733467710	59625	686.67	918.64	944.35	522.08	5.47	249.58	0.67	91.69	5966.01	-5035.20	3985.76
Fixation L	1	10	2733467710	2733666718	199008	956.83	487.38	20	51	-1	11.64	11.64
Fixation R	1	10	2733467710	2733666718	199008	956.83	487.38	20	51	-1	13.52	13.52
Saccade L	1	10	2733666718	2733706437	39719	961.60	481.77	960.50	392.13	1.61	91.51	1.00	40.45	1108.48	-343.46	804.63
Saccade R	1	10	2733666718	2733706437	39719	961.60	481.77	960.50	392.13	1.61	91.51	1.00	40.45	1108.48	-343.46	804.63
Fixation L	1	11	2733706437	2733865555	159118	957.68	325.98	7	90	-1	11.38	11.38
Fixation R	1	11	2733706437	2733865555	159118	957.68	325.98	7	90	-1	13.34	13.34
Saccade L	1	11	2733865555	2733925191	59636	957.16	328.49	489.90	330.88	5.09	281.48	0.67	85.36	6918.49	-6410.78	4418.52
Saccade R	1	11	2733865555	2733925191	59636	957.16	328.49	489.90	330.88	5.09	281.48	0.67	85.36	6918.49	-6410.78	4418.52
Fixation L	1	12	2733925191	2734104193	179002	510.19	350.94	27	55	-1	11.56	11.56
Fixation R	1	12	2733925191	2734104193	179002	510.19	350.94	27	55	-1	13.81	13.81
Saccade L	1	12	2734104193	2734124173	19980	510.40	360.85	399.94	345.63	0.74	112.79	1.00	37.00	2684.75	-1975.01	1617.95
Saccade R	1	12	2734104193	2734124173	19980	510.40	360.85	399.94	345.63	0.74	112.79	1.00	37.00	2684.75	-1975.01	1617.95
Fixation L	1	13	2734124173	2734263421	139248	395.44	316.91	21	54	-1	10.96	10.96
Fixation R	1	13	2734124173	2734263421	139248	395.44	316.91	21	54	-1	12.79	12.79
Blink L	1	1	2734263421	2734442406	178985
Blink R	1	1	2734263421	2734442406	178985
Fixation L	1	14	2734442406	2734800390	357984	851.41	530.88	10	55	-1	13.34	13.34
Fixation R	1	14	2734442406	2734800390	357984	851.41	530.88	10	55	-1	14.45	14.45
Saccade L	1	13	2734800390	2734840136	39746	857.04	510.81	985.82	503.19	1.17	102.50	1.00	29.53	2437.09	-2450.33	1509.45
Saccade R	1	13	2734800390	2734840136	39746	857.04	510.81	985.82	503.19	1.17	102.50	1.00	29.53	2437.09	-2450.33	1509.45
Fixation L	1	15	2734840136	2735118620	278484	995.43	506.45	14	53	-1	12.94	12.94
Fixation R	1	15	2734840136	2735118620	278484	995.43	506.45	14	53	-1	13.79	13.79
Saccade L	1	14	2735118620	2735138501	19881	993.20	467.74	987.39	430.08	0.54	38.55	1.00	27.25	108.96	-553.30	250.54
Saccade R	1	14	2735118620	2735138501	19881	993.20	467.74	987.39	430.08	0.54	38.55	1.00	27.25	108.96	-553.30	250.54
Fixation L	1	16	2735138501	2735277744	139243	985.48	452.79	9	45	-1	12.60	12.60
Fixation R	1	16	2735138501	2735277744	139243	985.48	452.79	9	45	-1	13.57	13.57
