[BeGaze]
Converted from:	C:\Documents and Settings\iViewX\Desktop\EXPERIMENTATIONS\Experiments\results\finaleart\S21F22332-finaleart-1.idf
Date:	27.03.2019 15:55:13
Version:	BeGaze 2.5.77
Sample Rate:	50
Subject:	S21F22332
Description:	Cyrielle Mailart

Table Header for Fixations:
Event Type	Trial	Number	Start	End	Duration	Location X	Location Y	Dispersion X	Dispersion Y	Plane	Avg. Pupil Size X	Avg. Pupil Size Y

Table Header for Saccades:
Event Type	Trial	Number	Start	End	Duration	Start Loc.X	Start Loc.Y	End Loc.X	End Loc.Y	Amplitude	Peak Speed	Peak Speed At	Average Speed	Peak Accel.	Peak Decel.	Average Accel.

Table Header for Blinks:
Event Type	Trial	Number	Start	End	Duration

Table Header for User Events:
Event Type	Trial	Number	Start	Description

UserEvent	1	1	2510676892	# Message: void.jpg
Fixation L	1	1	2510682058	2510841173	159115	1288.46	860.20	10	17	-1	12.14	12.14
Fixation R	1	1	2510682058	2510841173	159115	1288.46	860.20	10	17	-1	11.70	11.70
Saccade L	1	1	2510841173	2510861037	19864	1291.98	867.57	1404.00	863.57	0.68	113.39	1.00	34.09	2747.24	-2682.40	1861.54
Saccade R	1	1	2510841173	2510861037	19864	1291.98	867.57	1404.00	863.57	0.68	113.39	1.00	34.09	2747.24	-2682.40	1861.54
Fixation L	1	2	2510861037	2511318519	457482	1387.30	865.31	22	26	-1	11.96	11.96
Fixation R	1	2	2510861037	2511318519	457482	1387.30	865.31	22	26	-1	11.41	11.41
Blink L	1	1	2511318519	2511517382	198863
Blink R	1	1	2511318519	2511517382	198863
Fixation L	1	3	2511517382	2511855621	338239	1392.26	777.05	18	42	-1	14.44	14.44
Fixation R	1	3	2511517382	2511855621	338239	1392.26	777.05	18	42	-1	12.94	12.94
Saccade L	1	2	2511855621	2511875495	19874	1383.01	783.77	1169.49	774.22	1.13	216.12	1.00	56.78	5337.56	-5348.14	3564.96
Saccade R	1	2	2511855621	2511875495	19874	1383.01	783.77	1169.49	774.22	1.13	216.12	1.00	56.78	5337.56	-5348.14	3564.96
Fixation L	1	4	2511875495	2512153975	278480	1163.42	756.34	19	42	-1	15.04	15.04
Fixation R	1	4	2511875495	2512153975	278480	1163.42	756.34	19	42	-1	13.22	13.22
Saccade L	1	3	2512153975	2512193725	39750	1152.42	731.66	943.91	715.21	1.86	123.12	0.50	46.81	2947.61	-2928.57	2500.16
Saccade R	1	3	2512153975	2512193725	39750	1152.42	731.66	943.91	715.21	1.86	123.12	0.50	46.81	2947.61	-2928.57	2500.16
Fixation L	1	5	2512193725	2512452231	258506	932.66	688.36	15	54	-1	14.79	14.79
Fixation R	1	5	2512193725	2512452231	258506	932.66	688.36	15	54	-1	13.02	13.02
Saccade L	1	4	2512452231	2512472213	19982	930.48	660.32	918.23	496.67	1.05	165.97	1.00	52.35	3914.85	-4049.39	2771.00
Saccade R	1	4	2512452231	2512472213	19982	930.48	660.32	918.23	496.67	1.05	165.97	1.00	52.35	3914.85	-4049.39	2771.00
Fixation L	1	6	2512472213	2512611471	139258	900.50	532.95	31	67	-1	14.17	14.17
Fixation R	1	6	2512472213	2512611471	139258	900.50	532.95	31	67	-1	12.80	12.80
