[BeGaze]
Converted from:	C:\Documents and Settings\iViewX\Desktop\EXPERIMENTATIONS\Experiments\results\finaleart\S14F27123-finaleart-1.idf
Date:	27.03.2019 15:43:36
Version:	BeGaze 2.5.77
Sample Rate:	50
Subject:	S14F27123
Description:	Anne-flore Perrin

Table Header for Fixations:
Event Type	Trial	Number	Start	End	Duration	Location X	Location Y	Dispersion X	Dispersion Y	Plane	Avg. Pupil Size X	Avg. Pupil Size Y

Table Header for Saccades:
Event Type	Trial	Number	Start	End	Duration	Start Loc.X	Start Loc.Y	End Loc.X	End Loc.Y	Amplitude	Peak Speed	Peak Speed At	Average Speed	Peak Accel.	Peak Decel.	Average Accel.

Table Header for Blinks:
Event Type	Trial	Number	Start	End	Duration

Table Header for User Events:
Event Type	Trial	Number	Start	Description

UserEvent	1	1	31316984803	# Message: courbet-female-nude-with-a-dog-portrait-of-leotine-renaude-1866.jpg
Fixation L	1	1	31316986075	31317443531	457456	771.90	598.68	35	48	-1	12.88	12.88
Fixation R	1	1	31316986075	31317443531	457456	771.90	598.68	35	48	-1	12.94	12.94
Saccade L	1	1	31317443531	31317463412	19881	796.41	559.77	970.26	399.29	1.51	239.21	1.00	76.14	5867.68	-5958.32	4305.13
Saccade R	1	1	31317443531	31317463412	19881	796.41	559.77	970.26	399.29	1.51	239.21	1.00	76.14	5867.68	-5958.32	4305.13
Fixation L	1	2	31317463412	31317622525	159113	977.71	364.96	14	72	-1	12.36	12.36
Fixation R	1	2	31317463412	31317622525	159113	977.71	364.96	14	72	-1	12.26	12.26
Saccade L	1	2	31317622525	31317642405	19880	985.19	326.35	1011.95	332.53	0.38	34.51	1.00	19.20	759.09	-587.45	594.23
Saccade R	1	2	31317622525	31317642405	19880	985.19	326.35	1011.95	332.53	0.38	34.51	1.00	19.20	759.09	-587.45	594.23
Fixation L	1	3	31317642405	31318000507	358102	1049.72	344.50	46	21	-1	12.07	12.07
Fixation R	1	3	31317642405	31318000507	358102	1049.72	344.50	46	21	-1	11.94	11.94
Saccade L	1	3	31318000507	31318020382	19875	1055.64	352.91	855.02	490.17	1.32	245.75	1.00	66.40	6061.58	-5845.44	4060.68
Saccade R	1	3	31318000507	31318020382	19875	1055.64	352.91	855.02	490.17	1.32	245.75	1.00	66.40	6061.58	-5845.44	4060.68
Fixation L	1	4	31318020382	31318258997	238615	841.19	516.74	18	41	-1	13.35	13.35
Fixation R	1	4	31318020382	31318258997	238615	841.19	516.74	18	41	-1	13.29	13.29
Saccade L	1	4	31318258997	31318278898	19901	836.82	523.25	633.24	607.57	1.40	222.81	1.00	70.21	5511.86	-5250.34	4005.00
Saccade R	1	4	31318258997	31318278898	19901	836.82	523.25	633.24	607.57	1.40	222.81	1.00	70.21	5511.86	-5250.34	4005.00
Fixation L	1	5	31318278898	31318656853	377955	609.48	632.13	41	52	-1	13.32	13.32
Fixation R	1	5	31318278898	31318656853	377955	609.48	632.13	41	52	-1	13.33	13.33
Saccade L	1	5	31318656853	31318696606	39753	598.88	613.18	1140.94	794.11	5.05	332.59	0.50	127.01	8222.80	-7151.21	6719.65
Saccade R	1	5	31318656853	31318696606	39753	598.88	613.18	1140.94	794.11	5.05	332.59	0.50	127.01	8222.80	-7151.21	6719.65
Fixation L	1	6	31318696606	31318955214	258608	1158.83	835.79	29	51	-1	13.37	13.37
Fixation R	1	6	31318696606	31318955214	258608	1158.83	835.79	29	51	-1	13.31	13.31
Saccade L	1	6	31318955214	31318975096	19882	1157.78	835.29	1156.14	557.10	1.72	281.20	1.00	86.38	7001.71	-6993.52	5179.78
Saccade R	1	6	31318955214	31318975096	19882	1157.78	835.29	1156.14	557.10	1.72	281.20	1.00	86.38	7001.71	-6993.52	5179.78
Fixation L	1	7	31318975096	31319273456	298360	1152.17	492.69	16	76	-1	12.96	12.96
Fixation R	1	7	31318975096	31319273456	298360	1152.17	492.69	16	76	-1	12.86	12.86
Saccade L	1	7	31319273456	31319293331	19875	1139.24	488.86	1132.06	490.74	0.15	13.63	1.00	7.67	249.03	-59.68	116.73
Saccade R	1	7	31319273456	31319293331	19875	1139.24	488.86	1132.06	490.74	0.15	13.63	1.00	7.67	249.03	-59.68	116.73
Fixation L	1	8	31319293331	31319452444	159113	1121.69	504.03	17	42	-1	12.93	12.93
Fixation R	1	8	31319293331	31319452444	159113	1121.69	504.03	17	42	-1	12.88	12.88
Saccade L	1	8	31319452444	31319492191	39747	1114.15	533.37	1431.57	439.02	3.27	173.21	0.50	82.34	3888.02	-3976.21	3691.61
Saccade R	1	8	31319452444	31319492191	39747	1114.15	533.37	1431.57	439.02	3.27	173.21	0.50	82.34	3888.02	-3976.21	3691.61
Fixation L	1	9	31319492191	31319671188	178997	1421.87	422.91	14	20	-1	12.99	12.99
Fixation R	1	9	31319492191	31319671188	178997	1421.87	422.91	14	20	-1	13.04	13.04
Saccade L	1	9	31319671188	31319691073	19885	1423.36	422.76	1428.08	301.11	0.78	123.13	1.00	39.39	3030.24	-2216.81	2009.88
Saccade R	1	9	31319671188	31319691073	19885	1423.36	422.76	1428.08	301.11	0.78	123.13	1.00	39.39	3030.24	-2216.81	2009.88
Fixation L	1	10	31319691073	31319870181	179108	1433.44	309.27	15	51	-1	13.22	13.22
Fixation R	1	10	31319691073	31319870181	179108	1433.44	309.27	15	51	-1	13.24	13.24
Saccade L	1	10	31319870181	31319890053	19872	1423.37	281.15	1324.33	215.15	0.88	120.39	1.00	44.41	2868.64	-2718.12	2044.33
Saccade R	1	10	31319870181	31319890053	19872	1423.37	281.15	1324.33	215.15	0.88	120.39	1.00	44.41	2868.64	-2718.12	2044.33
Fixation L	1	11	31319890053	31320049174	159121	1337.14	195.92	25	40	-1	12.98	12.98
Fixation R	1	11	31319890053	31320049174	159121	1337.14	195.92	25	40	-1	13.21	13.21
Saccade L	1	11	31320049174	31320088917	39743	1339.72	174.93	1033.59	153.13	2.67	214.25	1.00	67.24	5159.77	-5068.34	3737.55
Saccade R	1	11	31320049174	31320088917	39743	1339.72	174.93	1033.59	153.13	2.67	214.25	1.00	67.24	5159.77	-5068.34	3737.55
Fixation L	1	12	31320088917	31320248034	159117	1038.72	143.42	7	39	-1	13.75	13.75
Fixation R	1	12	31320088917	31320248034	159117	1038.72	143.42	7	39	-1	13.93	13.93
Saccade L	1	12	31320248034	31320307658	59624	1039.38	145.38	530.16	211.80	5.81	361.41	0.67	97.39	8628.68	-8567.45	4483.31
Saccade R	1	12	31320248034	31320307658	59624	1039.38	145.38	530.16	211.80	5.81	361.41	0.67	97.39	8628.68	-8567.45	4483.31
Fixation L	1	13	31320307658	31320566276	258618	545.25	246.41	20	62	-1	14.16	14.16
Fixation R	1	13	31320307658	31320566276	258618	545.25	246.41	20	62	-1	14.37	14.37
Saccade L	1	13	31320566276	31320625896	59620	546.93	273.86	455.24	992.16	8.87	371.94	0.33	148.83	9126.88	-6636.65	6196.73
Saccade R	1	13	31320566276	31320625896	59620	546.93	273.86	455.24	992.16	8.87	371.94	0.33	148.83	9126.88	-6636.65	6196.73
Fixation L	1	14	31320625896	31320924262	298366	452.60	1009.70	65	32	-1	14.46	14.46
Fixation R	1	14	31320625896	31320924262	298366	452.60	1009.70	65	32	-1	14.99	14.99
Saccade L	1	14	31320924262	31320984011	59749	508.05	1018.69	767.30	1064.33	6.27	361.43	0.33	104.98	8942.58	-6612.63	4215.06
Saccade R	1	14	31320924262	31320984011	59749	508.05	1018.69	767.30	1064.33	6.27	361.43	0.33	104.98	8942.58	-6612.63	4215.06
