[BeGaze]
Converted from:	C:\Documents and Settings\iViewX\Desktop\EXPERIMENTATIONS\Experiments\results\finaleart\S14F27123-finaleart-1.idf
Date:	27.03.2019 15:42:49
Version:	BeGaze 2.5.77
Sample Rate:	50
Subject:	S14F27123
Description:	Anne-flore Perrin

Table Header for Fixations:
Event Type	Trial	Number	Start	End	Duration	Location X	Location Y	Dispersion X	Dispersion Y	Plane	Avg. Pupil Size X	Avg. Pupil Size Y

Table Header for Saccades:
Event Type	Trial	Number	Start	End	Duration	Start Loc.X	Start Loc.Y	End Loc.X	End Loc.Y	Amplitude	Peak Speed	Peak Speed At	Average Speed	Peak Accel.	Peak Decel.	Average Accel.

Table Header for Blinks:
Event Type	Trial	Number	Start	End	Duration

Table Header for User Events:
Event Type	Trial	Number	Start	Description

UserEvent	1	1	30333070575	# Message: morning_Daubigny_1858.jpg
Fixation L	1	1	30333085937	30333523417	437480	821.78	724.85	12	36	-1	14.39	14.39
Fixation R	1	1	30333085937	30333523417	437480	821.78	724.85	12	36	-1	14.54	14.54
Saccade L	1	1	30333523417	30333543283	19866	826.81	736.29	823.81	973.91	1.27	240.26	1.00	64.05	5928.59	-5764.55	3898.13
Saccade R	1	1	30333523417	30333543283	19866	826.81	736.29	823.81	973.91	1.27	240.26	1.00	64.05	5928.59	-5764.55	3898.13
Fixation L	1	2	30333543283	30333762178	218895	822.19	954.74	26	30	-1	16.75	16.75
Fixation R	1	2	30333543283	30333762178	218895	822.19	954.74	26	30	-1	13.91	13.91
Saccade L	1	2	30333762178	30333801917	39739	830.34	943.57	426.18	953.19	3.42	236.18	0.50	85.96	5834.12	-5665.86	4942.03
Saccade R	1	2	30333762178	30333801917	39739	830.34	943.57	426.18	953.19	3.42	236.18	0.50	85.96	5834.12	-5665.86	4942.03
Fixation L	1	3	30333801917	30334100259	298342	448.42	967.65	33	44	-1	19.07	19.07
Fixation R	1	3	30333801917	30334100259	298342	448.42	967.65	33	44	-1	10.88	10.88
Saccade L	1	3	30334100259	30334159881	59622	451.25	986.17	808.68	972.76	4.29	236.17	0.67	72.02	5663.33	-5566.74	2989.21
Saccade R	1	3	30334100259	30334159881	59622	451.25	986.17	808.68	972.76	4.29	236.17	0.67	72.02	5663.33	-5566.74	2989.21
Fixation L	1	4	30334159881	30334259376	99495	807.70	935.90	13	60	-1	25.03	25.03
Fixation R	1	4	30334159881	30334259376	99495	807.70	935.90	13	60	-1	10.81	10.81
Blink L	1	1	30334259376	30334339007	79631
Blink R	1	1	30334259376	30334339007	79631
Saccade L	1	4	30334339007	30334398642	59635	812.62	915.87	1154.73	734.91	16.43	1206.63	1.00	275.45	1745.32	-24380.39	6665.61
Saccade R	1	4	30334339007	30334398642	59635	812.62	915.87	1154.73	734.91	16.43	1206.63	1.00	275.45	1745.32	-24380.39	6665.61
Fixation L	1	5	30334398642	30334577619	178977	1162.01	720.94	11	65	-1	21.77	20.87
Fixation R	1	5	30334398642	30334577619	178977	1162.01	720.94	11	65	-1	10.63	10.63
Saccade L	1	5	30334577619	30334617383	39764	1160.95	725.82	1412.41	738.28	2.69	217.58	1.00	67.64	5316.69	-5022.04	2757.39
Saccade R	1	5	30334577619	30334617383	39764	1160.95	725.82	1412.41	738.28	2.69	217.58	1.00	67.64	5316.69	-5022.04	2757.39
Fixation L	1	6	30334617383	30334756623	139240	1416.29	750.52	12	60	-1	21.60	19.10
Fixation R	1	6	30334617383	30334756623	139240	1416.29	750.52	12	60	-1	10.75	10.75
Blink L	1	2	30334756623	30334915723	159100
Blink R	1	2	30334756623	30334915723	159100
Saccade L	1	6	30334915723	30334955602	39879	1637.79	967.76	1625.81	1021.69	2.23	98.59	0.00	55.88	433.27	-1960.30	988.20
Saccade R	1	6	30334915723	30334955602	39879	1637.79	967.76	1625.81	1021.69	2.23	98.59	0.00	55.88	433.27	-1960.30	988.20
Fixation L	1	7	30334955602	30335154478	198876	1604.03	1046.61	49	48	-1	10.70	10.70
Fixation R	1	7	30334955602	30335154478	198876	1604.03	1046.61	49	48	-1	21.17	18.89
Saccade L	1	7	30335154478	30335174343	19865	1580.85	1062.88	1575.14	1071.05	0.30	28.23	0.00	15.02	-185.42	-607.89	328.96
Saccade R	1	7	30335154478	30335174343	19865	1580.85	1062.88	1575.14	1071.05	0.30	28.23	0.00	15.02	-185.42	-607.89	328.96
Fixation L	1	8	30335174343	30335432964	258621	1566.98	1073.44	22	11	-1	12.09	12.09
Fixation R	1	8	30335174343	30335432964	258621	1566.98	1073.44	22	11	-1	21.84	20.91
Saccade L	1	8	30335432964	30335452833	19869	1572.67	1074.40	1676.71	1064.92	0.72	105.68	1.00	36.28	2375.89	-2491.40	1802.14
Saccade R	1	8	30335432964	30335452833	19869	1572.67	1074.40	1676.71	1064.92	0.72	105.68	1.00	36.28	2375.89	-2491.40	1802.14
Fixation L	1	9	30335452833	30335691449	238616	1676.95	1065.55	35	14	-1	12.88	12.88
Fixation R	1	9	30335452833	30335691449	238616	1676.95	1065.55	35	14	-1	14.63	14.63
Blink L	1	3	30335691449	30335810815	119366
Blink R	1	3	30335691449	30335810815	119366
Fixation L	1	10	30335810815	30335910311	99496	1373.48	745.25	12	4	-1	13.33	13.33
Fixation R	1	10	30335810815	30335910311	99496	1373.48	745.25	12	4	-1	12.90	12.90
Saccade L	1	9	30335910311	30335930181	19870	1369.57	745.03	1027.30	689.34	1.97	350.37	1.00	99.15	8721.03	-8267.75	5975.56
Saccade R	1	9	30335910311	30335930181	19870	1369.57	745.03	1027.30	689.34	1.97	350.37	1.00	99.15	8721.03	-8267.75	5975.56
Fixation L	1	11	30335930181	30336148925	218744	989.13	709.09	47	40	-1	13.01	13.01
Fixation R	1	11	30335930181	30336148925	218744	989.13	709.09	47	40	-1	12.64	12.64
Saccade L	1	10	30336148925	30336168795	19870	980.01	707.10	767.23	711.31	1.15	215.20	1.00	57.99	5310.77	-5004.91	3525.59
Saccade R	1	10	30336148925	30336168795	19870	980.01	707.10	767.23	711.31	1.15	215.20	1.00	57.99	5310.77	-5004.91	3525.59
Fixation L	1	12	30336168795	30336487034	318239	732.84	725.10	43	31	-1	12.80	12.80
Fixation R	1	12	30336168795	30336487034	318239	732.84	725.10	43	31	-1	12.86	12.86
Saccade L	1	11	30336487034	30336526911	39877	732.80	716.32	503.28	712.55	1.97	144.21	0.50	49.38	3537.31	-3412.91	2775.92
Saccade R	1	11	30336487034	30336526911	39877	732.80	716.32	503.28	712.55	1.97	144.21	0.50	49.38	3537.31	-3412.91	2775.92
Fixation L	1	13	30336526911	30336765536	238625	504.69	716.87	14	24	-1	11.53	11.53
Fixation R	1	13	30336526911	30336765536	238625	504.69	716.87	14	24	-1	12.28	12.28
Saccade L	1	12	30336765536	30336825274	59738	508.47	702.35	1336.03	730.16	8.75	386.26	0.33	146.40	9582.20	-7290.81	6785.28
Saccade R	1	12	30336765536	30336825274	59738	508.47	702.35	1336.03	730.16	8.75	386.26	0.33	146.40	9582.20	-7290.81	6785.28
Fixation L	1	14	30336825274	30336984410	159136	1332.92	745.70	13	27	-1	11.41	11.41
Fixation R	1	14	30336825274	30336984410	159136	1332.92	745.70	13	27	-1	11.92	11.92
Saccade L	1	13	30336984410	30337063880	79470	1338.83	749.24	1801.86	990.03	8.28	379.18	0.50	104.17	9423.11	-8452.21	4168.83
Saccade R	1	13	30336984410	30337063880	79470	1338.83	749.24	1801.86	990.03	8.28	379.18	0.50	104.17	9423.11	-8452.21	4168.83
