[BeGaze]
Converted from:	C:\Documents and Settings\iViewX\Desktop\EXPERIMENTATIONS\Experiments\results\finaleart\S13H22431-finaleart-1.idf
Date:	27.03.2019 15:42:31
Version:	BeGaze 2.5.77
Sample Rate:	50
Subject:	S13H22431
Description:	Jimmy Petit

Table Header for Fixations:
Event Type	Trial	Number	Start	End	Duration	Location X	Location Y	Dispersion X	Dispersion Y	Plane	Avg. Pupil Size X	Avg. Pupil Size Y

Table Header for Saccades:
Event Type	Trial	Number	Start	End	Duration	Start Loc.X	Start Loc.Y	End Loc.X	End Loc.Y	Amplitude	Peak Speed	Peak Speed At	Average Speed	Peak Accel.	Peak Decel.	Average Accel.

Table Header for Blinks:
Event Type	Trial	Number	Start	End	Duration

Table Header for User Events:
Event Type	Trial	Number	Start	Description

UserEvent	1	1	28373624174	# Message: morning_in_a_pine_forest_Ivan_Shishkin_1889.jpg
Fixation L	1	1	28373637415	28374214250	576835	594.29	974.27	16	32	-1	16.85	16.85
Fixation R	1	1	28373637415	28374214250	576835	594.29	974.27	16	32	-1	17.66	17.66
Saccade L	1	1	28374214250	28374254002	39752	603.40	953.73	1032.08	742.22	4.15	313.94	0.50	104.35	7732.21	-7286.79	5791.08
Saccade R	1	1	28374214250	28374254002	39752	603.40	953.73	1032.08	742.22	4.15	313.94	0.50	104.35	7732.21	-7286.79	5791.08
Fixation L	1	2	28374254002	28374353497	99495	1043.89	721.15	17	31	-1	16.37	16.37
Fixation R	1	2	28374254002	28374353497	99495	1043.89	721.15	17	31	-1	16.80	16.80
Saccade L	1	2	28374353497	28374373385	19888	1049.73	710.75	1216.66	712.61	0.92	168.84	1.00	46.29	4193.02	-4131.33	2798.64
Saccade R	1	2	28374353497	28374373385	19888	1049.73	710.75	1216.66	712.61	0.92	168.84	1.00	46.29	4193.02	-4131.33	2798.64
Fixation L	1	3	28374373385	28374870593	497208	1208.99	725.70	29	25	-1	15.93	15.93
Fixation R	1	3	28374373385	28374870593	497208	1208.99	725.70	29	25	-1	15.85	15.85
Saccade L	1	3	28374870593	28374910346	39753	1191.06	719.92	929.16	538.22	3.13	219.40	0.50	78.64	5432.39	-4763.17	4181.98
Saccade R	1	3	28374870593	28374910346	39753	1191.06	719.92	929.16	538.22	3.13	219.40	0.50	78.64	5432.39	-4763.17	4181.98
Fixation L	1	4	28374910346	28375168962	258616	910.07	502.35	34	58	-1	14.87	14.87
Fixation R	1	4	28374910346	28375168962	258616	910.07	502.35	34	58	-1	14.81	14.81
Saccade L	1	4	28375168962	28375188831	19869	895.09	479.98	884.29	472.80	0.27	28.11	1.00	13.68	-45.20	-374.63	231.35
Saccade R	1	4	28375168962	28375188831	19869	895.09	479.98	884.29	472.80	0.27	28.11	1.00	13.68	-45.20	-374.63	231.35
Fixation L	1	5	28375188831	28375347950	159119	884.01	479.16	9	13	-1	14.81	14.81
Fixation R	1	5	28375188831	28375347950	159119	884.01	479.16	9	13	-1	14.58	14.58
Saccade L	1	5	28375347950	28375387715	39765	878.49	472.77	707.25	586.04	2.17	128.41	0.50	54.54	3089.40	-2635.04	2630.36
Saccade R	1	5	28375347950	28375387715	39765	878.49	472.77	707.25	586.04	2.17	128.41	0.50	54.54	3089.40	-2635.04	2630.36
Fixation L	1	6	28375387715	28376083924	696209	743.45	590.78	62	34	-1	15.37	15.37
Fixation R	1	6	28375387715	28376083924	696209	743.45	590.78	62	34	-1	15.71	15.71
Saccade L	1	6	28376083924	28376123670	39746	770.02	610.56	772.84	445.02	1.58	104.59	1.00	39.79	2570.10	-2488.82	1865.29
Saccade R	1	6	28376083924	28376123670	39746	770.02	610.56	772.84	445.02	1.58	104.59	1.00	39.79	2570.10	-2488.82	1865.29
Fixation L	1	7	28376123670	28376422035	298365	778.44	470.58	11	40	-1	15.34	15.34
Fixation R	1	7	28376123670	28376422035	298365	778.44	470.58	11	40	-1	16.10	16.10
Saccade L	1	7	28376422035	28376441906	19871	780.06	443.03	776.59	316.71	0.81	127.81	1.00	40.86	3079.29	-3126.24	2213.73
Saccade R	1	7	28376422035	28376441906	19871	780.06	443.03	776.59	316.71	0.81	127.81	1.00	40.86	3079.29	-3126.24	2213.73
Fixation L	1	8	28376441906	28376680649	238743	771.14	321.05	8	14	-1	15.06	15.06
Fixation R	1	8	28376441906	28376680649	238743	771.14	321.05	8	14	-1	15.70	15.70
Saccade L	1	8	28376680649	28376720397	39748	770.71	327.33	863.85	569.31	2.17	143.98	0.50	54.61	3535.64	-3469.56	3164.21
Saccade R	1	8	28376680649	28376720397	39748	770.71	327.33	863.85	569.31	2.17	143.98	0.50	54.61	3535.64	-3469.56	3164.21
Fixation L	1	9	28376720397	28376919259	198862	869.98	568.47	10	12	-1	15.66	15.66
Fixation R	1	9	28376720397	28376919259	198862	869.98	568.47	10	12	-1	16.29	16.29
Saccade L	1	9	28376919259	28377038628	119369	873.02	560.33	861.91	831.52	4.50	172.28	1.00	37.73	3986.67	-3767.98	1621.94
Saccade R	1	9	28376919259	28377038628	119369	873.02	560.33	861.91	831.52	4.50	172.28	1.00	37.73	3986.67	-3767.98	1621.94
Fixation L	1	10	28377038628	28377297238	258610	837.22	822.59	78	17	-1	15.63	15.63
Fixation R	1	10	28377038628	28377297238	258610	837.22	822.59	78	17	-1	16.50	16.50
Saccade L	1	10	28377297238	28377317125	19887	783.37	814.20	770.36	802.57	0.46	42.83	0.00	23.06	318.73	-398.82	281.67
Saccade R	1	10	28377297238	28377317125	19887	783.37	814.20	770.36	802.57	0.46	42.83	0.00	23.06	318.73	-398.82	281.67
Fixation L	1	11	28377317125	28377615485	298360	748.85	774.87	29	42	-1	16.41	16.41
Fixation R	1	11	28377317125	28377615485	298360	748.85	774.87	29	42	-1	17.24	17.24
