[BeGaze]
Converted from:	C:\Documents and Settings\iViewX\Desktop\EXPERIMENTATIONS\Experiments\results\finaleart\S19F21442-finaleart-1.idf
Date:	27.03.2019 15:51:34
Version:	BeGaze 2.5.77
Sample Rate:	50
Subject:	S19F21442
Description:	Juliette Veuillez

Table Header for Fixations:
Event Type	Trial	Number	Start	End	Duration	Location X	Location Y	Dispersion X	Dispersion Y	Plane	Avg. Pupil Size X	Avg. Pupil Size Y

Table Header for Saccades:
Event Type	Trial	Number	Start	End	Duration	Start Loc.X	Start Loc.Y	End Loc.X	End Loc.Y	Amplitude	Peak Speed	Peak Speed At	Average Speed	Peak Accel.	Peak Decel.	Average Accel.

Table Header for Blinks:
Event Type	Trial	Number	Start	End	Duration

Table Header for User Events:
Event Type	Trial	Number	Start	Description

UserEvent	1	1	7701641432	# Message: void.jpg
Fixation L	1	1	7701643427	7701782652	139225	537.57	302.82	16	23	-1	10.06	10.06
Fixation R	1	1	7701643427	7701782652	139225	537.57	302.82	16	23	-1	11.88	11.88
Saccade L	1	1	7701782652	7701802533	19881	540.16	307.69	544.54	84.18	1.41	226.03	1.00	70.77	5552.96	-5510.82	4025.46
Saccade R	1	1	7701782652	7701802533	19881	540.16	307.69	544.54	84.18	1.41	226.03	1.00	70.77	5552.96	-5510.82	4025.46
Fixation L	1	2	7701802533	7702299777	497244	556.59	71.89	29	60	-1	10.13	10.13
Fixation R	1	2	7701802533	7702299777	497244	556.59	71.89	29	60	-1	12.12	12.12
Saccade L	1	2	7702299777	7702319647	19870	572.01	92.82	577.17	104.13	0.17	12.58	1.00	8.73	196.29	-53.35	129.05
Saccade R	1	2	7702299777	7702319647	19870	572.01	92.82	577.17	104.13	0.17	12.58	1.00	8.73	196.29	-53.35	129.05
Fixation L	1	3	7702319647	7702677618	357971	587.75	145.60	17	65	-1	11.25	11.25
Fixation R	1	3	7702319647	7702677618	357971	587.75	145.60	17	65	-1	13.27	13.27
Saccade L	1	3	7702677618	7702717497	39879	591.62	165.70	708.32	234.88	1.25	101.97	1.00	31.28	2437.63	-2091.45	1556.52
Saccade R	1	3	7702677618	7702717497	39879	591.62	165.70	708.32	234.88	1.25	101.97	1.00	31.28	2437.63	-2091.45	1556.52
Fixation L	1	4	7702717497	7703035742	318245	721.07	256.42	19	56	-1	12.13	12.13
Fixation R	1	4	7702717497	7703035742	318245	721.07	256.42	19	56	-1	13.94	13.94
Saccade L	1	4	7703035742	7703075485	39743	723.95	276.68	766.01	561.85	2.70	166.16	0.50	68.03	3947.80	-3401.57	3297.32
Saccade R	1	4	7703035742	7703075485	39743	723.95	276.68	766.01	561.85	2.70	166.16	0.50	68.03	3947.80	-3401.57	3297.32
Fixation L	1	5	7703075485	7703234600	159115	783.73	537.30	26	39	-1	12.66	12.66
Fixation R	1	5	7703075485	7703234600	159115	783.73	537.30	26	39	-1	14.40	14.40
Saccade L	1	5	7703234600	7703254492	19892	792.47	522.84	791.81	468.12	0.56	55.36	1.00	28.33	1283.12	-1258.76	1201.94
Saccade R	1	5	7703234600	7703254492	19892	792.47	522.84	791.81	468.12	0.56	55.36	1.00	28.33	1283.12	-1258.76	1201.94
Fixation L	1	6	7703254492	7703632456	377964	790.49	509.87	7	65	-1	12.01	12.01
Fixation R	1	6	7703254492	7703632456	377964	790.49	509.87	7	65	-1	13.77	13.77
