[BeGaze]
Converted from:	C:\Documents and Settings\iViewX\Desktop\EXPERIMENTATIONS\Experiments\results\finaleart\S7121223-finaleart-1.idf
Date:	27.03.2019 15:36:30
Version:	BeGaze 2.5.77
Sample Rate:	50
Subject:	S7121223
Description:	Gregoire pacreau

Table Header for Fixations:
Event Type	Trial	Number	Start	End	Duration	Location X	Location Y	Dispersion X	Dispersion Y	Plane	Avg. Pupil Size X	Avg. Pupil Size Y

Table Header for Saccades:
Event Type	Trial	Number	Start	End	Duration	Start Loc.X	Start Loc.Y	End Loc.X	End Loc.Y	Amplitude	Peak Speed	Peak Speed At	Average Speed	Peak Accel.	Peak Decel.	Average Accel.

Table Header for Blinks:
Event Type	Trial	Number	Start	End	Duration

Table Header for User Events:
Event Type	Trial	Number	Start	Description

UserEvent	1	1	3667205120	# Message: REJECTED_cezanne-still-life-with-bread-and-eggs-1865.jpg
Fixation L	1	1	3667216599	3668112570	895971	882.67	541.88	19	53	-1	16.44	16.44
Fixation R	1	1	3667216599	3668112570	895971	882.67	541.88	19	53	-1	17.59	17.59
Saccade L	1	1	3668112570	3668152424	39854	877.51	564.52	1093.11	585.00	1.87	164.65	1.00	46.85	4101.09	-3967.37	2608.17
Saccade R	1	1	3668112570	3668152424	39854	877.51	564.52	1093.11	585.00	1.87	164.65	1.00	46.85	4101.09	-3967.37	2608.17
Fixation L	1	2	3668152424	3668849384	696960	1103.04	578.46	32	20	-1	17.05	17.05
Fixation R	1	2	3668152424	3668849384	696960	1103.04	578.46	32	20	-1	17.81	17.81
Saccade L	1	2	3668849384	3668889264	39880	1114.88	582.39	1248.23	725.73	1.94	131.97	1.00	48.56	3270.10	-3135.68	2665.83
Saccade R	1	2	3668849384	3668889264	39880	1114.88	582.39	1248.23	725.73	1.94	131.97	1.00	48.56	3270.10	-3135.68	2665.83
Fixation L	1	3	3668889264	3669148116	258852	1250.22	715.77	6	14	-1	16.83	16.83
Fixation R	1	3	3668889264	3669148116	258852	1250.22	715.77	6	14	-1	17.29	17.29
Saccade L	1	3	3669148116	3669167982	19866	1247.87	712.57	1363.36	721.34	0.68	117.15	1.00	33.99	2796.62	-2786.33	1875.24
Saccade R	1	3	3669148116	3669167982	19866	1247.87	712.57	1363.36	721.34	0.68	117.15	1.00	33.99	2796.62	-2786.33	1875.24
Fixation L	1	4	3669167982	3669546351	378369	1376.77	734.44	43	52	-1	17.02	17.02
Fixation R	1	4	3669167982	3669546351	378369	1376.77	734.44	43	52	-1	17.03	17.03
Saccade L	1	4	3669546351	3669566246	19895	1404.00	771.56	1412.88	760.04	0.25	15.65	0.00	12.47	4.76	-265.45	175.45
Saccade R	1	4	3669546351	3669566246	19895	1404.00	771.56	1412.88	760.04	0.25	15.65	0.00	12.47	4.76	-265.45	175.45
Fixation L	1	5	3669566246	3669745460	179214	1422.94	763.24	14	7	-1	17.52	17.52
Fixation R	1	5	3669566246	3669745460	179214	1422.94	763.24	14	7	-1	17.26	17.26
Saccade L	1	5	3669745460	3669765333	19873	1424.46	764.94	1328.72	913.45	0.96	178.70	1.00	48.53	4455.44	-4332.38	3001.19
Saccade R	1	5	3669745460	3669765333	19873	1424.46	764.94	1328.72	913.45	0.96	178.70	1.00	48.53	4455.44	-4332.38	3001.19
Fixation L	1	6	3669765333	3670522098	756765	1325.37	909.87	18	27	-1	17.78	17.78
Fixation R	1	6	3669765333	3670522098	756765	1325.37	909.87	18	27	-1	17.96	17.96
Saccade L	1	6	3670522098	3670561798	39700	1322.59	915.34	829.12	820.64	4.53	267.62	0.50	114.15	6580.82	-6004.93	6017.66
Saccade R	1	6	3670522098	3670561798	39700	1322.59	915.34	829.12	820.64	4.53	267.62	0.50	114.15	6580.82	-6004.93	6017.66
Fixation L	1	7	3670561798	3670681288	119490	790.78	796.21	49	37	-1	17.51	17.51
Fixation R	1	7	3670561798	3670681288	119490	790.78	796.21	49	37	-1	18.55	18.55
Saccade L	1	7	3670681288	3670701292	20004	779.16	785.06	762.53	778.04	0.16	18.27	1.00	8.01	298.56	-312.88	245.93
Saccade R	1	7	3670681288	3670701292	20004	779.16	785.06	762.53	778.04	0.16	18.27	1.00	8.01	298.56	-312.88	245.93
Fixation L	1	8	3670701292	3671199008	497716	751.51	761.72	17	27	-1	16.95	16.95
Fixation R	1	8	3670701292	3671199008	497716	751.51	761.72	17	27	-1	17.97	17.97
