[BeGaze]
Converted from:	C:\Documents and Settings\iViewX\Desktop\EXPERIMENTATIONS\Experiments\results\finaleart\S14F27123-finaleart-1.idf
Date:	27.03.2019 15:44:05
Version:	BeGaze 2.5.77
Sample Rate:	50
Subject:	S14F27123
Description:	Anne-flore Perrin

Table Header for Fixations:
Event Type	Trial	Number	Start	End	Duration	Location X	Location Y	Dispersion X	Dispersion Y	Plane	Avg. Pupil Size X	Avg. Pupil Size Y

Table Header for Saccades:
Event Type	Trial	Number	Start	End	Duration	Start Loc.X	Start Loc.Y	End Loc.X	End Loc.Y	Amplitude	Peak Speed	Peak Speed At	Average Speed	Peak Accel.	Peak Decel.	Average Accel.

Table Header for Blinks:
Event Type	Trial	Number	Start	End	Duration

Table Header for User Events:
Event Type	Trial	Number	Start	Description

UserEvent	1	1	31721293837	# Message: void.jpg
Fixation L	1	1	31721306754	31721426136	119382	759.33	880.03	67	28	-1	13.22	13.22
Fixation R	1	1	31721306754	31721426136	119382	759.33	880.03	67	28	-1	13.04	13.04
Saccade L	1	1	31721426136	31721445980	19844	703.95	860.03	658.76	849.53	0.66	74.34	0.00	33.27	1084.70	-1651.92	1232.27
Saccade R	1	1	31721426136	31721445980	19844	703.95	860.03	658.76	849.53	0.66	74.34	0.00	33.27	1084.70	-1651.92	1232.27
Fixation L	1	2	31721445980	31721784093	338113	656.23	843.31	14	24	-1	12.95	12.95
Fixation R	1	2	31721445980	31721784093	338113	656.23	843.31	14	24	-1	12.95	12.95
Blink L	1	1	31721784093	31721883584	99491
Blink R	1	1	31721784093	31721883584	99491
Blink L	1	2	31721903487	31722241573	338086
Blink R	1	2	31721903487	31722241573	338086
Fixation L	1	3	31722241573	31722539941	298368	578.24	766.00	19	19	-1	14.37	14.37
Fixation R	1	3	31722241573	31722539941	298368	578.24	766.00	19	19	-1	13.79	13.79
Saccade L	1	2	31722539941	31722619573	79632	582.86	777.60	702.34	993.50	17.27	1212.41	1.00	216.93	29701.93	-3955.26	11871.39
Saccade R	1	2	31722539941	31722619573	79632	582.86	777.60	702.34	993.50	17.27	1212.41	1.00	216.93	29701.93	-3955.26	11871.39
Blink L	1	3	31722619573	31722699055	79482
Blink R	1	3	31722619573	31722699055	79482
Blink L	1	4	31722699055	31722818423	119368
Blink R	1	4	31722699055	31722818423	119368
Fixation L	1	4	31722977540	31723256031	278491	672.71	1000.72	14	13	-1	19.67	19.67
Fixation R	1	4	31722977540	31723256031	278491	672.71	1000.72	14	13	-1	13.13	13.13
