[BeGaze]
Converted from:	C:\Documents and Settings\iViewX\Desktop\EXPERIMENTATIONS\Experiments\results\finaleart\S18F56223-finaleart-1.idf
Date:	27.03.2019 15:49:33
Version:	BeGaze 2.5.77
Sample Rate:	50
Subject:	S18F56223
Description:	Pascale Sebillot

Table Header for Fixations:
Event Type	Trial	Number	Start	End	Duration	Location X	Location Y	Dispersion X	Dispersion Y	Plane	Avg. Pupil Size X	Avg. Pupil Size Y

Table Header for Saccades:
Event Type	Trial	Number	Start	End	Duration	Start Loc.X	Start Loc.Y	End Loc.X	End Loc.Y	Amplitude	Peak Speed	Peak Speed At	Average Speed	Peak Accel.	Peak Decel.	Average Accel.

Table Header for Blinks:
Event Type	Trial	Number	Start	End	Duration

Table Header for User Events:
Event Type	Trial	Number	Start	Description

UserEvent	1	1	3003161398	# Message: The_Orchard_Vlaminck_1905.jpg
Fixation L	1	1	3003172242	3003649597	477355	699.97	668.50	34	49	-1	13.58	13.58
Fixation R	1	1	3003172242	3003649597	477355	699.97	668.50	34	49	-1	12.78	12.78
Saccade L	1	1	3003649597	3003808709	159112	691.11	666.84	916.70	390.62	11.61	236.52	1.00	72.94	5768.26	-5814.48	3400.64
Saccade R	1	1	3003649597	3003808709	159112	691.11	666.84	916.70	390.62	11.61	236.52	1.00	72.94	5768.26	-5814.48	3400.64
Fixation L	1	2	3003808709	3004007593	198884	904.03	361.87	21	36	-1	12.50	12.50
Fixation R	1	2	3003808709	3004007593	198884	904.03	361.87	21	36	-1	11.74	11.74
Saccade L	1	2	3004007593	3004047323	39730	903.73	363.14	1210.06	370.15	2.53	186.46	0.50	63.77	4555.95	-4609.37	3766.91
Saccade R	1	2	3004007593	3004047323	39730	903.73	363.14	1210.06	370.15	2.53	186.46	0.50	63.77	4555.95	-4609.37	3766.91
Fixation L	1	3	3004047323	3004405307	357984	1219.89	372.99	28	15	-1	11.24	11.24
Fixation R	1	3	3004047323	3004405307	357984	1219.89	372.99	28	15	-1	10.24	10.24
Saccade L	1	3	3004405307	3004465056	59749	1211.80	366.85	564.46	360.24	6.81	327.33	0.67	113.96	8130.42	-7531.40	5133.93
Saccade R	1	3	3004405307	3004465056	59749	1211.80	366.85	564.46	360.24	6.81	327.33	0.67	113.96	8130.42	-7531.40	5133.93
Fixation L	1	4	3004465056	3004743543	278487	583.33	342.58	27	27	-1	10.31	10.31
Fixation R	1	4	3004465056	3004743543	278487	583.33	342.58	27	27	-1	10.28	10.28
Saccade L	1	4	3004743543	3004902658	159115	586.57	343.43	1326.04	912.13	15.17	355.90	0.25	95.34	8769.94	-7805.58	3131.43
Saccade R	1	4	3004743543	3004902658	159115	586.57	343.43	1326.04	912.13	15.17	355.90	0.25	95.34	8769.94	-7805.58	3131.43
Fixation L	1	5	3004902658	3005121402	218744	1299.75	929.02	40	37	-1	11.13	11.13
Fixation R	1	5	3004902658	3005121402	218744	1299.75	929.02	40	37	-1	10.31	10.31
Saccade L	1	5	3005121402	3005141285	19883	1306.92	921.48	1417.77	924.96	1.00	112.18	1.00	50.37	2075.85	-2399.15	1554.31
Saccade R	1	5	3005121402	3005141285	19883	1306.92	921.48	1417.77	924.96	1.00	112.18	1.00	50.37	2075.85	-2399.15	1554.31
Fixation L	1	6	3005141285	3005439636	298351	1398.79	950.07	26	45	-1	10.61	10.61
Fixation R	1	6	3005141285	3005439636	298351	1398.79	950.07	26	45	-1	10.29	10.29
Saccade L	1	6	3005439636	3005459514	19878	1391.33	970.56	1219.06	970.29	1.14	174.23	1.00	57.54	3968.24	-3953.06	2825.36
Saccade R	1	6	3005439636	3005459514	19878	1391.33	970.56	1219.06	970.29	1.14	174.23	1.00	57.54	3968.24	-3953.06	2825.36
Fixation L	1	7	3005459514	3005678399	218885	1227.02	987.71	15	30	-1	11.41	11.41
Fixation R	1	7	3005459514	3005678399	218885	1227.02	987.71	15	30	-1	10.14	10.14
Saccade L	1	7	3005678399	3005698253	19854	1234.41	989.80	1161.04	964.76	0.61	78.43	1.00	30.78	1796.32	-1576.55	1337.63
Saccade R	1	7	3005678399	3005698253	19854	1234.41	989.80	1161.04	964.76	0.61	78.43	1.00	30.78	1796.32	-1576.55	1337.63
Fixation L	1	8	3005698253	3005837497	139244	1148.01	968.20	30	19	-1	11.56	11.56
Fixation R	1	8	3005698253	3005837497	139244	1148.01	968.20	30	19	-1	10.74	10.74
Saccade L	1	8	3005837497	3005956736	119239	1146.96	970.69	433.26	373.56	13.10	258.10	0.33	109.90	6434.01	-4523.32	2947.65
Saccade R	1	8	3005837497	3005956736	119239	1146.96	970.69	433.26	373.56	13.10	258.10	0.33	109.90	6434.01	-4523.32	2947.65
Fixation L	1	9	3005956736	3006394344	437608	426.98	371.49	51	21	-1	10.93	10.93
Fixation R	1	9	3005956736	3006394344	437608	426.98	371.49	51	21	-1	10.58	10.58
Saccade L	1	9	3006394344	3006414213	19869	459.73	378.70	680.95	376.42	1.40	223.69	1.00	70.25	5336.86	-5263.90	3814.45
Saccade R	1	9	3006394344	3006414213	19869	459.73	378.70	680.95	376.42	1.40	223.69	1.00	70.25	5336.86	-5263.90	3814.45
Fixation L	1	10	3006414213	3006573338	159125	690.36	395.75	24	30	-1	10.90	10.90
Fixation R	1	10	3006414213	3006573338	159125	690.36	395.75	24	30	-1	10.65	10.65
Saccade L	1	10	3006573338	3006613209	39871	701.52	407.02	821.97	238.25	2.12	156.19	1.00	53.13	3807.03	-3674.96	2300.77
Saccade R	1	10	3006573338	3006613209	39871	701.52	407.02	821.97	238.25	2.12	156.19	1.00	53.13	3807.03	-3674.96	2300.77
Fixation L	1	11	3006613209	3006851821	238612	860.92	261.93	49	31	-1	10.78	10.78
Fixation R	1	11	3006613209	3006851821	238612	860.92	261.93	49	31	-1	10.48	10.48
Saccade L	1	11	3006851821	3006891574	39753	863.36	269.34	1102.31	372.73	2.62	232.35	0.50	66.01	5692.74	-4575.76	2819.28
Saccade R	1	11	3006851821	3006891574	39753	863.36	269.34	1102.31	372.73	2.62	232.35	0.50	66.01	5692.74	-4575.76	2819.28
Fixation L	1	12	3006891574	3007150188	258614	1127.51	339.56	38	54	-1	11.17	11.17
Fixation R	1	12	3006891574	3007150188	258614	1127.51	339.56	38	54	-1	10.41	10.41
