[BeGaze]
Converted from:	C:\Documents and Settings\iViewX\Desktop\EXPERIMENTATIONS\Experiments\results\finaleart\S13H22431-finaleart-1.idf
Date:	27.03.2019 15:42:11
Version:	BeGaze 2.5.77
Sample Rate:	50
Subject:	S13H22431
Description:	Jimmy Petit

Table Header for Fixations:
Event Type	Trial	Number	Start	End	Duration	Location X	Location Y	Dispersion X	Dispersion Y	Plane	Avg. Pupil Size X	Avg. Pupil Size Y

Table Header for Saccades:
Event Type	Trial	Number	Start	End	Duration	Start Loc.X	Start Loc.Y	End Loc.X	End Loc.Y	Amplitude	Peak Speed	Peak Speed At	Average Speed	Peak Accel.	Peak Decel.	Average Accel.

Table Header for Blinks:
Event Type	Trial	Number	Start	End	Duration

Table Header for User Events:
Event Type	Trial	Number	Start	Description

UserEvent	1	1	28093405421	# Message: goya-still-life-plucked-turkey-and-pan-with-fish-1812.jpg
Fixation L	1	1	28093412211	28093591386	179175	692.02	542.66	37	55	-1	15.36	15.36
Fixation R	1	1	28093412211	28093591386	179175	692.02	542.66	37	55	-1	16.52	16.52
Saccade L	1	1	28093591386	28093611074	19688	678.45	559.73	677.04	566.26	0.11	9.41	1.00	5.82	-66.45	-112.50	94.74
Saccade R	1	1	28093591386	28093611074	19688	678.45	559.73	677.04	566.26	0.11	9.41	1.00	5.82	-66.45	-112.50	94.74
Fixation L	1	2	28093611074	28093790065	178991	679.27	567.90	24	9	-1	15.82	15.82
Fixation R	1	2	28093611074	28093790065	178991	679.27	567.90	24	9	-1	16.87	16.87
Saccade L	1	2	28093790065	28093810078	20013	699.59	573.22	955.13	567.13	1.58	258.41	1.00	78.76	6413.67	-6362.36	4346.81
Saccade R	1	2	28093790065	28093810078	20013	699.59	573.22	955.13	567.13	1.58	258.41	1.00	78.76	6413.67	-6362.36	4346.81
Fixation L	1	3	28093810078	28094028803	218725	988.03	554.04	44	19	-1	15.95	15.95
Fixation R	1	3	28093810078	28094028803	218725	988.03	554.04	44	19	-1	17.19	17.19
Saccade L	1	3	28094028803	28094068547	39744	1000.08	549.18	736.65	813.75	3.37	190.81	1.00	84.75	4668.90	-4607.91	4390.49
Saccade R	1	3	28094028803	28094068547	39744	1000.08	549.18	736.65	813.75	3.37	190.81	1.00	84.75	4668.90	-4607.91	4390.49
Fixation L	1	4	28094068547	28094227673	159126	723.11	854.76	18	52	-1	16.06	16.06
Fixation R	1	4	28094068547	28094227673	159126	723.11	854.76	18	52	-1	17.73	17.73
Saccade L	1	4	28094227673	28094247547	19874	718.61	866.39	602.62	936.75	0.73	137.21	1.00	36.67	3315.73	-3203.54	2199.54
Saccade R	1	4	28094227673	28094247547	19874	718.61	866.39	602.62	936.75	0.73	137.21	1.00	36.67	3315.73	-3203.54	2199.54
Fixation L	1	5	28094247547	28094406660	159113	611.20	951.73	13	24	-1	16.38	16.38
Fixation R	1	5	28094247547	28094406660	159113	611.20	951.73	13	24	-1	17.68	17.68
Saccade L	1	5	28094406660	28094446534	39874	616.49	961.43	839.54	967.49	2.21	148.47	1.00	55.37	3633.39	-3559.52	2463.30
Saccade R	1	5	28094406660	28094446534	39874	616.49	961.43	839.54	967.49	2.21	148.47	1.00	55.37	3633.39	-3559.52	2463.30
Fixation L	1	6	28094446534	28094685144	238610	886.21	978.48	75	24	-1	16.44	16.44
Fixation R	1	6	28094446534	28094685144	238610	886.21	978.48	75	24	-1	17.79	17.79
Saccade L	1	6	28094685144	28094705045	19901	912.74	991.77	922.80	992.12	0.14	11.16	1.00	7.14	-22.96	-185.02	77.44
Saccade R	1	6	28094685144	28094705045	19901	912.74	991.77	922.80	992.12	0.14	11.16	1.00	7.14	-22.96	-185.02	77.44
Fixation L	1	7	28094705045	28095023264	318219	937.77	1011.81	27	34	-1	16.27	16.27
Fixation R	1	7	28094705045	28095023264	318219	937.77	1011.81	27	34	-1	17.63	17.63
Saccade L	1	7	28095023264	28095043131	19867	944.81	1014.60	936.98	869.64	0.85	146.83	1.00	42.68	3618.88	-3568.57	2434.01
Saccade R	1	7	28095023264	28095043131	19867	944.81	1014.60	936.98	869.64	0.85	146.83	1.00	42.68	3618.88	-3568.57	2434.01
Fixation L	1	8	28095043131	28095301752	258621	923.33	867.94	29	17	-1	16.43	16.43
Fixation R	1	8	28095043131	28095301752	258621	923.33	867.94	29	17	-1	17.52	17.52
Saccade L	1	8	28095301752	28095321622	19870	944.16	855.79	970.96	751.95	0.73	108.47	1.00	36.87	2630.65	-2224.05	1788.72
Saccade R	1	8	28095301752	28095321622	19870	944.16	855.79	970.96	751.95	0.73	108.47	1.00	36.87	2630.65	-2224.05	1788.72
Fixation L	1	9	28095321622	28095440994	119372	975.45	738.21	24	27	-1	16.81	16.81
Fixation R	1	9	28095321622	28095440994	119372	975.45	738.21	24	27	-1	17.38	17.38
Saccade L	1	9	28095440994	28095500612	59618	988.70	735.57	1417.42	289.95	6.70	323.05	0.33	112.38	7944.94	-5767.19	5193.46
Saccade R	1	9	28095440994	28095500612	59618	988.70	735.57	1417.42	289.95	6.70	323.05	0.33	112.38	7944.94	-5767.19	5193.46
Fixation L	1	10	28095500612	28095679737	179125	1419.24	328.43	24	63	-1	16.22	16.22
Fixation R	1	10	28095500612	28095679737	179125	1419.24	328.43	24	63	-1	16.86	16.86
Saccade L	1	10	28095679737	28095719477	39740	1408.02	353.36	1587.83	173.92	2.17	150.18	0.50	54.69	3735.65	-3483.29	2929.55
Saccade R	1	10	28095679737	28095719477	39740	1408.02	353.36	1587.83	173.92	2.17	150.18	0.50	54.69	3735.65	-3483.29	2929.55
Fixation L	1	11	28095719477	28095918344	198867	1565.07	196.81	49	40	-1	14.94	14.94
Fixation R	1	11	28095719477	28095918344	198867	1565.07	196.81	49	40	-1	16.01	16.01
Saccade L	1	11	28095918344	28095997970	79626	1548.22	208.76	698.58	915.01	13.28	419.76	0.25	166.84	10388.00	-5801.65	6136.36
Saccade R	1	11	28095918344	28095997970	79626	1548.22	208.76	698.58	915.01	13.28	419.76	0.25	166.84	10388.00	-5801.65	6136.36
Fixation L	1	12	28095997970	28096117218	119248	672.72	938.30	39	34	-1	16.36	16.36
Fixation R	1	12	28095997970	28096117218	119248	672.72	938.30	39	34	-1	17.49	17.49
Saccade L	1	12	28096117218	28096137084	19866	659.31	944.04	625.30	1017.67	0.59	82.04	1.00	29.58	1971.92	-1681.57	1395.23
Saccade R	1	12	28096117218	28096137084	19866	659.31	944.04	625.30	1017.67	0.59	82.04	1.00	29.58	1971.92	-1681.57	1395.23
Fixation L	1	13	28096137084	28096554819	417735	612.94	1015.32	34	40	-1	17.03	17.03
Fixation R	1	13	28096137084	28096554819	417735	612.94	1015.32	34	40	-1	18.35	18.35
Saccade L	1	13	28096554819	28096594576	39757	627.93	1000.61	479.49	786.68	2.42	138.29	1.00	60.86	3360.52	-3026.82	3135.83
Saccade R	1	13	28096554819	28096594576	39757	627.93	1000.61	479.49	786.68	2.42	138.29	1.00	60.86	3360.52	-3026.82	3135.83
Fixation L	1	14	28096594576	28097330537	735961	465.53	813.57	53	36	-1	17.25	17.25
Fixation R	1	14	28096594576	28097330537	735961	465.53	813.57	53	36	-1	18.93	18.93
Saccade L	1	14	28097330537	28097390284	59747	494.96	805.56	1063.46	450.32	8.45	300.58	0.33	141.37	7273.96	-4911.64	4682.26
Saccade R	1	14	28097330537	28097390284	59747	494.96	805.56	1063.46	450.32	8.45	300.58	0.33	141.37	7273.96	-4911.64	4682.26
