[BeGaze]
Converted from:	C:\Documents and Settings\iViewX\Desktop\EXPERIMENTATIONS\Experiments\results\finaleart\S16F14542-finaleart-1.idf
Date:	27.03.2019 15:46:05
Version:	BeGaze 2.5.77
Sample Rate:	50
Subject:	S16F14542
Description:	Diane Dewez

Table Header for Fixations:
Event Type	Trial	Number	Start	End	Duration	Location X	Location Y	Dispersion X	Dispersion Y	Plane	Avg. Pupil Size X	Avg. Pupil Size Y

Table Header for Saccades:
Event Type	Trial	Number	Start	End	Duration	Start Loc.X	Start Loc.Y	End Loc.X	End Loc.Y	Amplitude	Peak Speed	Peak Speed At	Average Speed	Peak Accel.	Peak Decel.	Average Accel.

Table Header for Blinks:
Event Type	Trial	Number	Start	End	Duration

Table Header for User Events:
Event Type	Trial	Number	Start	Description

UserEvent	1	1	6248852070	# Message: REJECTED_after-the-bath_degas_1885.jpg
Fixation L	1	1	6248858195	6249335551	477356	1009.13	545.82	15	9	-1	13.13	13.13
Fixation R	1	1	6248858195	6249335551	477356	1009.13	545.82	15	9	-1	13.56	13.56
Saccade L	1	1	6249335551	6249395279	59728	1017.15	548.57	528.43	503.70	5.08	197.23	0.67	85.12	4877.23	-4726.92	3473.31
Saccade R	1	1	6249335551	6249395279	59728	1017.15	548.57	528.43	503.70	5.08	197.23	0.67	85.12	4877.23	-4726.92	3473.31
Fixation L	1	2	6249395279	6249554391	159112	521.71	475.45	15	79	-1	12.05	12.05
Fixation R	1	2	6249395279	6249554391	159112	521.71	475.45	15	79	-1	12.44	12.44
Saccade L	1	2	6249554391	6249574302	19911	512.49	428.79	503.61	414.31	0.36	44.74	1.00	17.95	155.82	-688.72	325.31
Saccade R	1	2	6249554391	6249574302	19911	512.49	428.79	503.61	414.31	0.36	44.74	1.00	17.95	155.82	-688.72	325.31
Fixation L	1	3	6249574302	6249912379	338077	487.30	426.24	24	27	-1	10.96	10.96
Fixation R	1	3	6249574302	6249912379	338077	487.30	426.24	24	27	-1	11.26	11.26
Saccade L	1	3	6249912379	6249952127	39748	489.36	428.12	935.21	391.07	3.97	240.20	0.50	99.89	5824.37	-5287.41	5252.60
Saccade R	1	3	6249912379	6249952127	39748	489.36	428.12	935.21	391.07	3.97	240.20	0.50	99.89	5824.37	-5287.41	5252.60
Fixation L	1	4	6249952127	6250170991	218864	966.88	363.05	40	38	-1	10.57	10.57
Fixation R	1	4	6249952127	6250170991	218864	966.88	363.05	40	38	-1	11.08	11.08
Saccade L	1	4	6250170991	6250230608	59617	973.38	352.99	458.79	373.23	5.33	270.00	0.67	89.45	6636.78	-6619.57	3895.28
Saccade R	1	4	6250170991	6250230608	59617	973.38	352.99	458.79	373.23	5.33	270.00	0.67	89.45	6636.78	-6619.57	3895.28
Fixation L	1	5	6250230608	6250489225	258617	442.35	365.67	41	54	-1	10.59	10.59
Fixation R	1	5	6250230608	6250489225	258617	442.35	365.67	41	54	-1	11.54	11.54
Saccade L	1	5	6250489225	6250509096	19871	417.62	353.17	282.55	371.98	0.89	137.93	1.00	45.02	3376.89	-3197.79	2253.84
Saccade R	1	5	6250489225	6250509096	19871	417.62	353.17	282.55	371.98	0.89	137.93	1.00	45.02	3376.89	-3197.79	2253.84
Fixation L	1	6	6250509096	6250767587	258491	292.28	368.12	39	18	-1	11.28	11.28
Fixation R	1	6	6250509096	6250767587	258491	292.28	368.12	39	18	-1	12.66	12.66
Saccade L	1	6	6250767587	6250787576	19989	319.02	369.27	477.28	359.89	1.10	160.34	1.00	55.24	3901.22	-3851.48	2591.82
Saccade R	1	6	6250767587	6250787576	19989	319.02	369.27	477.28	359.89	1.10	160.34	1.00	55.24	3901.22	-3851.48	2591.82
Fixation L	1	7	6250787576	6250946698	159122	499.16	379.16	29	30	-1	12.69	12.69
Fixation R	1	7	6250787576	6250946698	159122	499.16	379.16	29	30	-1	13.58	13.58
Saccade L	1	7	6250946698	6251006325	59627	506.75	390.03	1036.50	371.77	5.51	254.98	0.67	92.33	6297.56	-6126.95	4519.37
Saccade R	1	7	6250946698	6251006325	59627	506.75	390.03	1036.50	371.77	5.51	254.98	0.67	92.33	6297.56	-6126.95	4519.37
Fixation L	1	8	6251006325	6251284815	278490	1037.92	371.80	8	37	-1	13.22	13.22
Fixation R	1	8	6251006325	6251284815	278490	1037.92	371.80	8	37	-1	14.01	14.01
Saccade L	1	8	6251284815	6251304687	19872	1041.44	395.07	1108.88	405.21	0.48	68.99	1.00	24.15	1622.53	-1262.28	1032.60
Saccade R	1	8	6251284815	6251304687	19872	1041.44	395.07	1108.88	405.21	0.48	68.99	1.00	24.15	1622.53	-1262.28	1032.60
Fixation L	1	9	6251304687	6251662674	357987	1136.84	406.12	77	12	-1	13.24	13.24
Fixation R	1	9	6251304687	6251662674	357987	1136.84	406.12	77	12	-1	14.10	14.10
Saccade L	1	9	6251662674	6251682545	19871	1186.87	406.87	1377.10	405.73	1.27	192.37	1.00	63.91	4689.24	-3735.61	3074.68
Saccade R	1	9	6251662674	6251682545	19871	1186.87	406.87	1377.10	405.73	1.27	192.37	1.00	63.91	4689.24	-3735.61	3074.68
Fixation L	1	10	6251682545	6251782031	99486	1415.01	398.75	63	27	-1	13.06	13.06
Fixation R	1	10	6251682545	6251782031	99486	1415.01	398.75	63	27	-1	13.57	13.57
Saccade L	1	10	6251782031	6251801919	19888	1436.36	381.93	1433.33	352.66	0.41	29.77	1.00	20.76	210.43	-565.61	274.62
Saccade R	1	10	6251782031	6251801919	19888	1436.36	381.93	1433.33	352.66	0.41	29.77	1.00	20.76	210.43	-565.61	274.62
Fixation L	1	11	6251801919	6252000776	198857	1436.18	357.05	14	16	-1	13.48	13.48
Fixation R	1	11	6251801919	6252000776	198857	1436.18	357.05	14	16	-1	14.08	14.08
Blink L	1	1	6252000776	6252219643	218867
Blink R	1	1	6252000776	6252219643	218867
Saccade L	1	11	6252219643	6252319014	99371	1436.88	413.86	1660.17	225.56	5.69	177.00	0.80	57.27	3541.02	-4147.61	1586.24
Saccade R	1	11	6252219643	6252319014	99371	1436.88	413.86	1660.17	225.56	5.69	177.00	0.80	57.27	3541.02	-4147.61	1586.24
Fixation L	1	12	6252319014	6252418506	99492	1648.75	253.50	19	60	-1	15.63	15.63
Fixation R	1	12	6252319014	6252418506	99492	1648.75	253.50	19	60	-1	15.01	15.01
Saccade L	1	12	6252418506	6252438379	19873	1649.18	272.97	1617.40	298.36	0.51	41.15	1.00	25.46	679.03	-802.83	693.21
Saccade R	1	12	6252418506	6252438379	19873	1649.18	272.97	1617.40	298.36	0.51	41.15	1.00	25.46	679.03	-802.83	693.21
Fixation L	1	13	6252438379	6252577620	139241	1625.77	277.47	24	52	-1	14.93	14.93
Fixation R	1	13	6252438379	6252577620	139241	1625.77	277.47	24	52	-1	14.47	14.47
Saccade L	1	13	6252577620	6252597487	19867	1614.92	253.25	1603.54	236.99	0.27	20.08	1.00	13.73	319.64	56.49	224.54
Saccade R	1	13	6252577620	6252597487	19867	1614.92	253.25	1603.54	236.99	0.27	20.08	1.00	13.73	319.64	56.49	224.54
Fixation L	1	14	6252597487	6252736741	139254	1602.64	230.98	16	31	-1	14.70	14.70
Fixation R	1	14	6252597487	6252736741	139254	1602.64	230.98	16	31	-1	14.12	14.12
Saccade L	1	14	6252736741	6252836232	99491	1595.62	227.47	964.44	236.47	9.23	301.72	0.40	92.81	7464.37	-7423.35	4194.62
Saccade R	1	14	6252736741	6252836232	99491	1595.62	227.47	964.44	236.47	9.23	301.72	0.40	92.81	7464.37	-7423.35	4194.62
