[BeGaze]
Converted from:	C:\Documents and Settings\iViewX\Desktop\EXPERIMENTATIONS\Experiments\results\finaleart\S19F21442-finaleart-1.idf
Date:	27.03.2019 15:50:07
Version:	BeGaze 2.5.77
Sample Rate:	50
Subject:	S19F21442
Description:	Juliette Veuillez

Table Header for Fixations:
Event Type	Trial	Number	Start	End	Duration	Location X	Location Y	Dispersion X	Dispersion Y	Plane	Avg. Pupil Size X	Avg. Pupil Size Y

Table Header for Saccades:
Event Type	Trial	Number	Start	End	Duration	Start Loc.X	Start Loc.Y	End Loc.X	End Loc.Y	Amplitude	Peak Speed	Peak Speed At	Average Speed	Peak Accel.	Peak Decel.	Average Accel.

Table Header for Blinks:
Event Type	Trial	Number	Start	End	Duration

Table Header for User Events:
Event Type	Trial	Number	Start	Description

UserEvent	1	1	5518897283	# Message: void.jpg
Saccade L	1	1	5518899685	5518919572	19887	1270.48	370.94	1274.10	354.11	0.56	67.19	1.00	28.20	1679.65	-241.37	640.34
Saccade R	1	1	5518899685	5518919572	19887	1270.48	370.94	1274.10	354.11	0.56	67.19	1.00	28.20	1679.65	-241.37	640.34
Fixation L	1	1	5518919572	5519019045	99473	1334.93	349.51	79	17	-1	16.82	16.82
Fixation R	1	1	5518919572	5519019045	99473	1334.93	349.51	79	17	-1	18.31	18.31
Saccade L	1	2	5519019045	5519038921	19876	1353.14	341.25	1356.99	336.48	0.07	6.20	1.00	3.49	75.87	-136.70	91.62
Saccade R	1	2	5519019045	5519038921	19876	1353.14	341.25	1356.99	336.48	0.07	6.20	1.00	3.49	75.87	-136.70	91.62
Fixation L	1	2	5519038921	5519377029	338108	1356.00	340.79	41	48	-1	17.20	17.20
Fixation R	1	2	5519038921	5519377029	338108	1356.00	340.79	41	48	-1	18.31	18.31
Saccade L	1	3	5519377029	5519416767	39738	1320.08	369.11	1060.93	396.19	2.47	187.24	0.50	62.26	4357.61	-4518.98	2978.54
Saccade R	1	3	5519377029	5519416767	39738	1320.08	369.11	1060.93	396.19	2.47	187.24	0.50	62.26	4357.61	-4518.98	2978.54
Fixation L	1	3	5519416767	5519675387	258620	1059.57	438.14	22	72	-1	17.09	17.09
Fixation R	1	3	5519416767	5519675387	258620	1059.57	438.14	22	72	-1	18.79	18.79
Saccade L	1	4	5519675387	5519735022	59635	1075.13	464.23	838.14	361.58	3.77	179.80	0.67	63.25	4164.14	-2978.29	2470.10
Saccade R	1	4	5519675387	5519735022	59635	1075.13	464.23	838.14	361.58	3.77	179.80	0.67	63.25	4164.14	-2978.29	2470.10
Fixation L	1	4	5519735022	5520451115	716093	850.28	415.64	15	74	-1	17.16	17.16
Fixation R	1	4	5519735022	5520451115	716093	850.28	415.64	15	74	-1	19.18	19.18
Saccade L	1	5	5520451115	5520610227	159112	848.11	433.45	0.99	0.00	32.88	1067.37	1.00	206.67	21462.99	-26680.02	9808.01
Saccade R	1	5	5520451115	5520510741	59626	848.11	433.45	876.08	466.11	1.05	37.10	0.67	17.67	710.88	-552.35	527.04
Blink R	1	1	5520510741	5520649972	139231
