[BeGaze]
Converted from:	C:\Documents and Settings\iViewX\Desktop\EXPERIMENTATIONS\Experiments\results\finaleart\S13H22431-finaleart-1.idf
Date:	27.03.2019 15:42:39
Version:	BeGaze 2.5.77
Sample Rate:	50
Subject:	S13H22431
Description:	Jimmy Petit

Table Header for Fixations:
Event Type	Trial	Number	Start	End	Duration	Location X	Location Y	Dispersion X	Dispersion Y	Plane	Avg. Pupil Size X	Avg. Pupil Size Y

Table Header for Saccades:
Event Type	Trial	Number	Start	End	Duration	Start Loc.X	Start Loc.Y	End Loc.X	End Loc.Y	Amplitude	Peak Speed	Peak Speed At	Average Speed	Peak Accel.	Peak Decel.	Average Accel.

Table Header for Blinks:
Event Type	Trial	Number	Start	End	Duration

Table Header for User Events:
Event Type	Trial	Number	Start	Description

UserEvent	1	1	28463198290	# Message: void.jpg
Fixation L	1	1	28463202521	28463401383	198862	375.79	469.87	38	20	-1	15.42	15.42
Fixation R	1	1	28463202521	28463401383	198862	375.79	469.87	38	20	-1	16.22	16.22
Saccade L	1	1	28463401383	28463421253	19870	402.68	482.90	582.47	659.01	1.63	254.43	1.00	82.01	6273.48	-6269.21	4483.58
Saccade R	1	1	28463401383	28463421253	19870	402.68	482.90	582.47	659.01	1.63	254.43	1.00	82.01	6273.48	-6269.21	4483.58
Fixation L	1	2	28463421253	28463759492	338239	624.79	684.57	48	45	-1	15.66	15.66
Fixation R	1	2	28463421253	28463759492	338239	624.79	684.57	48	45	-1	16.42	16.42
Saccade L	1	2	28463759492	28463838980	79488	624.49	664.15	982.68	241.24	7.30	180.51	0.50	91.82	4376.79	-3709.33	2224.03
Saccade R	1	2	28463759492	28463838980	79488	624.49	664.15	982.68	241.24	7.30	180.51	0.50	91.82	4376.79	-3709.33	2224.03
Fixation L	1	3	28463838980	28463938474	99494	977.14	291.19	11	67	-1	15.29	15.29
Fixation R	1	3	28463838980	28463938474	99494	977.14	291.19	11	67	-1	15.53	15.53
Blink L	1	1	28463938474	28464097597	159123
Blink R	1	1	28463938474	28464097597	159123
Fixation L	1	4	28464097597	28464495330	397733	855.63	82.24	8	83	-1	15.38	15.38
Fixation R	1	4	28464097597	28464495330	397733	855.63	82.24	8	83	-1	15.83	15.83
Saccade L	1	3	28464495330	28464535201	39871	858.39	104.41	816.36	452.20	2.95	245.57	0.50	73.99	6108.88	-5947.08	4304.85
Saccade R	1	3	28464495330	28464535201	39871	858.39	104.41	816.36	452.20	2.95	245.57	0.50	73.99	6108.88	-5947.08	4304.85
Fixation L	1	5	28464535201	28464773821	238620	785.31	463.18	66	28	-1	16.38	16.38
Fixation R	1	5	28464535201	28464773821	238620	785.31	463.18	66	28	-1	17.01	17.01
Saccade L	1	4	28464773821	28464793689	19868	751.39	480.75	741.63	481.99	0.30	31.08	1.00	15.03	137.18	-528.54	243.19
Saccade R	1	4	28464773821	28464793689	19868	751.39	480.75	741.63	481.99	0.30	31.08	1.00	15.03	137.18	-528.54	243.19
Fixation L	1	6	28464793689	28465171671	377982	716.92	506.03	36	44	-1	15.79	15.79
Fixation R	1	6	28464793689	28465171671	377982	716.92	506.03	36	44	-1	16.59	16.59
Saccade L	1	5	28465171671	28465191551	19880	717.43	526.22	793.65	523.74	0.55	77.14	1.00	27.43	1841.77	0.00	920.88
Saccade R	1	5	28465171671	28465191551	19880	717.43	526.22	793.65	523.74	0.55	77.14	1.00	27.43	1841.77	0.00	920.88
