[BeGaze]
Converted from:	C:\Documents and Settings\iViewX\Desktop\EXPERIMENTATIONS\Experiments\results\finaleart\S18F56223-finaleart-1.idf
Date:	27.03.2019 15:49:19
Version:	BeGaze 2.5.77
Sample Rate:	50
Subject:	S18F56223
Description:	Pascale Sebillot

Table Header for Fixations:
Event Type	Trial	Number	Start	End	Duration	Location X	Location Y	Dispersion X	Dispersion Y	Plane	Avg. Pupil Size X	Avg. Pupil Size Y

Table Header for Saccades:
Event Type	Trial	Number	Start	End	Duration	Start Loc.X	Start Loc.Y	End Loc.X	End Loc.Y	Amplitude	Peak Speed	Peak Speed At	Average Speed	Peak Accel.	Peak Decel.	Average Accel.

Table Header for Blinks:
Event Type	Trial	Number	Start	End	Duration

Table Header for User Events:
Event Type	Trial	Number	Start	Description

UserEvent	1	1	2897116348	# Message: void.jpg
Fixation L	1	1	2897118156	2897297123	178967	993.82	1001.89	8	23	-1	15.39	15.39
Fixation R	1	1	2897118156	2897297123	178967	993.82	1001.89	8	23	-1	14.03	14.03
Saccade L	1	1	2897297123	2897336871	39748	992.38	1003.40	1315.92	983.56	3.13	192.37	1.00	78.74	4593.62	-4498.16	3608.47
Saccade R	1	1	2897297123	2897336871	39748	992.38	1003.40	1315.92	983.56	3.13	192.37	1.00	78.74	4593.62	-4498.16	3608.47
Fixation L	1	2	2897336871	2897555728	218857	1347.05	977.29	50	44	-1	15.19	15.19
Fixation R	1	2	2897336871	2897555728	218857	1347.05	977.29	50	44	-1	14.17	14.17
Saccade L	1	2	2897555728	2897615351	59623	1315.01	961.71	1045.37	550.09	5.75	294.42	0.33	96.44	7254.04	-4315.69	3583.17
Saccade R	1	2	2897555728	2897615351	59623	1315.01	961.71	1045.37	550.09	5.75	294.42	0.33	96.44	7254.04	-4315.69	3583.17
Fixation L	1	3	2897615351	2897913728	298377	1015.77	551.50	41	43	-1	14.76	14.76
Fixation R	1	3	2897615351	2897913728	298377	1015.77	551.50	41	43	-1	12.74	12.74
Saccade L	1	3	2897913728	2898072846	159118	1003.59	571.99	206.00	502.02	13.04	294.61	0.88	81.95	7232.41	-7117.09	3773.78
Saccade R	1	3	2897913728	2898072846	159118	1003.59	571.99	206.00	502.02	13.04	294.61	0.88	81.95	7232.41	-7117.09	3773.78
Fixation L	1	4	2898072846	2898371208	298362	213.24	508.36	20	48	-1	13.79	13.79
Fixation R	1	4	2898072846	2898371208	298362	213.24	508.36	20	48	-1	12.87	12.87
Saccade L	1	4	2898371208	2898430819	59611	219.38	505.70	785.49	492.78	5.97	254.68	0.67	100.07	6248.78	-5832.80	3967.04
Saccade R	1	4	2898371208	2898430819	59611	219.38	505.70	785.49	492.78	5.97	254.68	0.67	100.07	6248.78	-5832.80	3967.04
Fixation L	1	5	2898430819	2898769056	338237	785.49	433.33	21	78	-1	14.31	14.31
Fixation R	1	5	2898430819	2898769056	338237	785.49	433.33	21	78	-1	13.13	13.13
Saccade L	1	5	2898769056	2898788935	19879	773.86	414.51	772.98	411.98	0.08	6.17	0.00	3.87	28.97	-27.76	25.43
Saccade R	1	5	2898769056	2898788935	19879	773.86	414.51	772.98	411.98	0.08	6.17	0.00	3.87	28.97	-27.76	25.43
Fixation L	1	6	2898788935	2898908182	119247	774.79	413.95	8	15	-1	14.47	14.47
Fixation R	1	6	2898788935	2898908182	119247	774.79	413.95	8	15	-1	13.34	13.34
Saccade L	1	6	2898908182	2898928176	19994	769.94	424.91	761.94	553.08	0.76	129.88	1.00	37.88	3093.23	-3144.68	2153.86
Saccade R	1	6	2898908182	2898928176	19994	769.94	424.91	761.94	553.08	0.76	129.88	1.00	37.88	3093.23	-3144.68	2153.86
Fixation L	1	7	2898928176	2899107174	178998	764.55	564.27	14	27	-1	15.09	15.09
Fixation R	1	7	2898928176	2899107174	178998	764.55	564.27	14	27	-1	13.23	13.23
