[BeGaze]
Converted from:	C:\Documents and Settings\iViewX\Desktop\EXPERIMENTATIONS\Experiments\results\finaleart\S02123220-finaleart-1.idf
Date:	27.03.2019 15:33:36
Version:	BeGaze 2.5.77
Sample Rate:	50
Subject:	S02123220
Description:	David Xu

Table Header for Fixations:
Event Type	Trial	Number	Start	End	Duration	Location X	Location Y	Dispersion X	Dispersion Y	Plane	Avg. Pupil Size X	Avg. Pupil Size Y

Table Header for Saccades:
Event Type	Trial	Number	Start	End	Duration	Start Loc.X	Start Loc.Y	End Loc.X	End Loc.Y	Amplitude	Peak Speed	Peak Speed At	Average Speed	Peak Accel.	Peak Decel.	Average Accel.

Table Header for Blinks:
Event Type	Trial	Number	Start	End	Duration

Table Header for User Events:
Event Type	Trial	Number	Start	Description

UserEvent	1	1	1147883979	# Message: void.jpg
Saccade L	1	1	1147887799	1147947573	59774	921.51	663.99	1285.45	690.30	5.00	282.58	1.00	83.59	6673.60	-6515.12	3366.36
Saccade R	1	1	1147887799	1147947573	59774	921.51	663.99	1285.45	690.30	5.00	282.58	1.00	83.59	6673.60	-6515.12	3366.36
Fixation L	1	1	1147947573	1148385136	437563	1312.78	726.60	49	48	-1	11.91	11.91
Fixation R	1	1	1147947573	1148385136	437563	1312.78	726.60	49	48	-1	12.12	12.12
Saccade L	1	2	1148385136	1148444759	59623	1279.27	724.10	885.61	282.51	6.66	255.68	0.33	111.69	6226.84	-4233.35	3845.07
Saccade R	1	2	1148385136	1148444759	59623	1279.27	724.10	885.61	282.51	6.66	255.68	0.33	111.69	6226.84	-4233.35	3845.07
Fixation L	1	2	1148444759	1148603875	159116	887.42	271.32	46	24	-1	12.10	12.10
Fixation R	1	2	1148444759	1148603875	159116	887.42	271.32	46	24	-1	12.89	12.89
Saccade L	1	3	1148603875	1148663509	59634	912.10	257.68	870.22	275.63	1.39	52.10	0.67	23.25	1122.83	-982.52	511.97
Saccade R	1	3	1148603875	1148663509	59634	912.10	257.68	870.22	275.63	1.39	52.10	0.67	23.25	1122.83	-982.52	511.97
Fixation L	1	3	1148663509	1148762996	99487	865.61	314.65	12	81	-1	12.22	12.22
Fixation R	1	3	1148663509	1148762996	99487	865.61	314.65	12	81	-1	12.97	12.97
Saccade L	1	4	1148762996	1148782869	19873	870.76	349.54	873.58	360.58	0.32	37.78	1.00	16.14	18.86	-656.37	276.87
Saccade R	1	4	1148762996	1148782869	19873	870.76	349.54	873.58	360.58	0.32	37.78	1.00	16.14	18.86	-656.37	276.87
Fixation L	1	4	1148782869	1149658065	875196	883.31	384.38	39	54	-1	13.64	13.64
Fixation R	1	4	1148782869	1149658065	875196	883.31	384.38	39	54	-1	14.58	14.58
Saccade L	1	5	1149658065	1149677935	19870	850.52	411.95	782.67	413.32	0.60	68.65	1.00	30.12	1618.51	-1706.81	1242.66
Saccade R	1	5	1149658065	1149677935	19870	850.52	411.95	782.67	413.32	0.60	68.65	1.00	30.12	1618.51	-1706.81	1242.66
Fixation L	1	5	1149677935	1149876798	198863	795.38	418.46	15	9	-1	14.69	14.69
Fixation R	1	5	1149677935	1149876798	198863	795.38	418.46	15	9	-1	15.63	15.63
