[BeGaze]
Converted from:	C:\Documents and Settings\iViewX\Desktop\EXPERIMENTATIONS\Experiments\results\finaleart\S02123220-finaleart-1.idf
Date:	27.03.2019 15:33:28
Version:	BeGaze 2.5.77
Sample Rate:	50
Subject:	S02123220
Description:	David Xu

Table Header for Fixations:
Event Type	Trial	Number	Start	End	Duration	Location X	Location Y	Dispersion X	Dispersion Y	Plane	Avg. Pupil Size X	Avg. Pupil Size Y

Table Header for Saccades:
Event Type	Trial	Number	Start	End	Duration	Start Loc.X	Start Loc.Y	End Loc.X	End Loc.Y	Amplitude	Peak Speed	Peak Speed At	Average Speed	Peak Accel.	Peak Decel.	Average Accel.

Table Header for Blinks:
Event Type	Trial	Number	Start	End	Duration

Table Header for User Events:
Event Type	Trial	Number	Start	Description

UserEvent	1	1	390960320	# Message: nature_morte_aux_oranges_Vlaminck_1909.jpg
Fixation L	1	1	390980048	391576769	596721	872.47	468.97	7	17	-1	18.02	18.02
Fixation R	1	1	390980048	391576769	596721	872.47	468.97	7	17	-1	17.11	17.11
Saccade L	1	1	391576769	391596634	19865	868.49	466.85	789.86	570.63	1.03	131.69	1.00	51.62	3238.17	-2972.96	2624.58
Saccade R	1	1	391576769	391596634	19865	868.49	466.85	789.86	570.63	1.03	131.69	1.00	51.62	3238.17	-2972.96	2624.58
Fixation L	1	2	391596634	391755755	159121	733.91	571.29	67	16	-1	16.79	16.79
Fixation R	1	2	391596634	391755755	159121	733.91	571.29	67	16	-1	15.93	15.93
Saccade L	1	2	391755755	391795507	39752	727.84	572.34	500.02	723.94	2.42	160.54	1.00	60.87	3784.96	-3533.00	3198.27
Saccade R	1	2	391755755	391795507	39752	727.84	572.34	500.02	723.94	2.42	160.54	1.00	60.87	3784.96	-3533.00	3198.27
Fixation L	1	3	391795507	391974629	179122	503.34	724.17	25	43	-1	15.95	15.95
Fixation R	1	3	391795507	391974629	179122	503.34	724.17	25	43	-1	15.73	15.73
Saccade L	1	3	391974629	392073994	99365	523.40	720.20	631.51	240.48	8.61	278.32	0.20	86.61	6832.57	-5873.73	3673.55
Saccade R	1	3	391974629	392073994	99365	523.40	720.20	631.51	240.48	8.61	278.32	0.20	86.61	6832.57	-5873.73	3673.55
Fixation L	1	4	392073994	392213216	139222	635.79	236.82	24	27	-1	15.58	15.58
Fixation R	1	4	392073994	392213216	139222	635.79	236.82	24	27	-1	14.93	14.93
Saccade L	1	4	392213216	392312707	99491	623.72	222.16	1214.00	547.95	12.31	320.17	0.60	123.71	6689.23	-6842.85	4250.77
Saccade R	1	4	392213216	392312707	99491	623.72	222.16	1214.00	547.95	12.31	320.17	0.60	123.71	6689.23	-6842.85	4250.77
Fixation L	1	5	392312707	392531445	218738	1198.01	583.30	25	69	-1	15.24	15.24
Fixation R	1	5	392312707	392531445	218738	1198.01	583.30	25	69	-1	12.99	12.99
Saccade L	1	5	392531445	392571200	39755	1195.23	602.77	1326.60	337.02	2.61	189.47	0.50	65.56	4440.12	-4530.63	3568.29
Saccade R	1	5	392531445	392571200	39755	1195.23	602.77	1326.60	337.02	2.61	189.47	0.50	65.56	4440.12	-4530.63	3568.29
Fixation L	1	6	392571200	393207681	636481	1326.92	340.61	25	29	-1	15.28	15.28
Fixation R	1	6	392571200	393207681	636481	1326.92	340.61	25	29	-1	12.92	12.92
Saccade L	1	6	393207681	393247537	39856	1309.56	360.09	1183.96	726.17	3.78	252.78	0.50	94.83	6245.99	-5491.27	4529.69
Saccade R	1	6	393207681	393247537	39856	1309.56	360.09	1183.96	726.17	3.78	252.78	0.50	94.83	6245.99	-5491.27	4529.69
Fixation L	1	7	393247537	393645264	397727	1154.76	704.32	37	33	-1	16.34	16.34
Fixation R	1	7	393247537	393645264	397727	1154.76	704.32	37	33	-1	13.02	13.02
Saccade L	1	7	393645264	393665128	19864	1153.45	710.41	1153.45	762.94	0.50	53.14	1.00	25.07	1256.51	-1212.22	1054.79
Saccade R	1	7	393645264	393665128	19864	1153.45	710.41	1153.45	762.94	0.50	53.14	1.00	25.07	1256.51	-1212.22	1054.79
Fixation L	1	8	393665128	394341470	676342	1169.81	772.84	41	54	-1	15.82	15.82
Fixation R	1	8	393665128	394341470	676342	1169.81	772.84	41	54	-1	12.34	12.34
Saccade L	1	8	394341470	394361335	19865	1177.13	753.63	1183.08	738.08	0.26	28.01	1.00	13.06	690.72	-26.63	320.99
Saccade R	1	8	394341470	394361335	19865	1177.13	753.63	1183.08	738.08	0.26	28.01	1.00	13.06	690.72	-26.63	320.99
Fixation L	1	9	394361335	394699431	338096	1170.64	761.81	20	46	-1	15.55	15.55
Fixation R	1	9	394361335	394699431	338096	1170.64	761.81	20	46	-1	11.88	11.88
Saccade L	1	9	394699431	394739190	39759	1166.82	770.34	789.22	1022.31	3.90	277.18	0.50	98.11	6726.39	-6801.98	5329.21
Saccade R	1	9	394699431	394739190	39759	1166.82	770.34	789.22	1022.31	3.90	277.18	0.50	98.11	6726.39	-6801.98	5329.21
Fixation L	1	10	394739190	394898297	159107	783.77	1035.40	24	58	-1	15.52	15.52
Fixation R	1	10	394739190	394898297	159107	783.77	1035.40	24	58	-1	14.21	14.21
Saccade L	1	10	394898297	394958045	59748	767.37	1024.81	552.13	699.82	5.30	230.64	0.33	88.79	5573.65	-5174.41	3467.28
Saccade R	1	10	394898297	394958045	59748	767.37	1024.81	552.13	699.82	5.30	230.64	0.33	88.79	5573.65	-5174.41	3467.28
