[BeGaze]
Converted from:	C:\Documents and Settings\iViewX\Desktop\EXPERIMENTATIONS\Experiments\results\finaleart\S14F27123-finaleart-1.idf
Date:	27.03.2019 15:42:55
Version:	BeGaze 2.5.77
Sample Rate:	50
Subject:	S14F27123
Description:	Anne-flore Perrin

Table Header for Fixations:
Event Type	Trial	Number	Start	End	Duration	Location X	Location Y	Dispersion X	Dispersion Y	Plane	Avg. Pupil Size X	Avg. Pupil Size Y

Table Header for Saccades:
Event Type	Trial	Number	Start	End	Duration	Start Loc.X	Start Loc.Y	End Loc.X	End Loc.Y	Amplitude	Peak Speed	Peak Speed At	Average Speed	Peak Accel.	Peak Decel.	Average Accel.

Table Header for Blinks:
Event Type	Trial	Number	Start	End	Duration

Table Header for User Events:
Event Type	Trial	Number	Start	Description

UserEvent	1	1	30392234418	# Message: void.jpg
Fixation L	1	1	30392239118	30392517475	278357	1621.33	847.15	37	35	-1	15.54	15.54
Fixation R	1	1	30392239118	30392517475	278357	1621.33	847.15	37	35	-1	14.59	14.59
Saccade L	1	1	30392517475	30392557353	39878	1638.19	843.52	1224.16	827.18	4.08	310.24	0.50	102.30	7731.88	-6597.00	5403.32
Saccade R	1	1	30392517475	30392557353	39878	1638.19	843.52	1224.16	827.18	4.08	310.24	0.50	102.30	7731.88	-6597.00	5403.32
Fixation L	1	2	30392557353	30392696587	139234	1209.72	796.19	24	41	-1	15.40	15.40
Fixation R	1	2	30392557353	30392696587	139234	1209.72	796.19	24	41	-1	14.98	14.98
Blink L	1	1	30392696587	30393014831	318244
Blink R	1	1	30392696587	30393014831	318244
Fixation L	1	3	30393034697	30393969542	934845	744.56	528.10	17	32	-1	13.91	13.91
Fixation R	1	3	30393034697	30393969542	934845	744.56	528.10	17	32	-1	14.26	14.26
Saccade L	1	2	30393969542	30393989407	19865	754.44	532.28	901.67	551.00	1.14	150.11	1.00	57.42	3348.54	-2884.47	2452.04
Saccade R	1	2	30393969542	30393989407	19865	754.44	532.28	901.67	551.00	1.14	150.11	1.00	57.42	3348.54	-2884.47	2452.04
Fixation L	1	4	30393989407	30394228024	238617	896.45	578.63	12	52	-1	14.02	14.02
Fixation R	1	4	30393989407	30394228024	238617	896.45	578.63	12	52	-1	14.04	14.04
