[BeGaze]
Converted from:	C:\Documents and Settings\iViewX\Desktop\EXPERIMENTATIONS\Experiments\results\finaleart\S21F22332-finaleart-1.idf
Date:	27.03.2019 15:54:26
Version:	BeGaze 2.5.77
Sample Rate:	50
Subject:	S21F22332
Description:	Cyrielle Mailart

Table Header for Fixations:
Event Type	Trial	Number	Start	End	Duration	Location X	Location Y	Dispersion X	Dispersion Y	Plane	Avg. Pupil Size X	Avg. Pupil Size Y

Table Header for Saccades:
Event Type	Trial	Number	Start	End	Duration	Start Loc.X	Start Loc.Y	End Loc.X	End Loc.Y	Amplitude	Peak Speed	Peak Speed At	Average Speed	Peak Accel.	Peak Decel.	Average Accel.

Table Header for Blinks:
Event Type	Trial	Number	Start	End	Duration

Table Header for User Events:
Event Type	Trial	Number	Start	Description

UserEvent	1	1	1701945081	# Message: parrot-tulips-(II)_matisse_1905.jpg
Fixation L	1	1	1701949614	1702148480	198866	984.22	415.84	17	34	-1	18.91	18.91
Fixation R	1	1	1701949614	1702148480	198866	984.22	415.84	17	34	-1	17.98	17.98
Saccade L	1	1	1702148480	1702168476	19996	969.10	420.23	795.02	442.15	1.15	177.44	1.00	57.56	4416.35	-4000.15	2935.51
Saccade R	1	1	1702148480	1702168476	19996	969.10	420.23	795.02	442.15	1.15	177.44	1.00	57.56	4416.35	-4000.15	2935.51
Fixation L	1	2	1702168476	1702486729	318253	794.66	485.82	11	63	-1	18.85	18.85
Fixation R	1	2	1702168476	1702486729	318253	794.66	485.82	11	63	-1	17.82	17.82
Saccade L	1	2	1702486729	1702506582	19853	795.38	502.28	828.89	567.15	0.58	73.85	1.00	29.30	1635.72	-1560.36	1265.70
Saccade R	1	2	1702486729	1702506582	19853	795.38	502.28	828.89	567.15	0.58	73.85	1.00	29.30	1635.72	-1560.36	1265.70
Fixation L	1	3	1702506582	1702705442	198860	869.19	585.32	57	27	-1	16.70	16.70
Fixation R	1	3	1702506582	1702705442	198860	869.19	585.32	57	27	-1	15.81	15.81
Saccade L	1	3	1702705442	1702725324	19882	871.88	582.57	696.48	356.52	1.80	289.20	1.00	90.33	7114.53	-7070.45	5035.62
Saccade R	1	3	1702705442	1702725324	19882	871.88	582.57	696.48	356.52	1.80	289.20	1.00	90.33	7114.53	-7070.45	5035.62
Fixation L	1	4	1702725324	1702824819	99495	685.31	299.29	17	81	-1	15.00	15.00
Fixation R	1	4	1702725324	1702824819	99495	685.31	299.29	17	81	-1	14.20	14.20
Saccade L	1	4	1702824819	1702944177	119358	678.94	279.32	460.71	214.15	5.84	268.33	0.83	48.90	6515.33	-6139.90	2168.60
Saccade R	1	4	1702824819	1702944177	119358	678.94	279.32	460.71	214.15	5.84	268.33	0.83	48.90	6515.33	-6139.90	2168.60
Fixation L	1	5	1702944177	1703143051	198874	463.79	192.33	10	69	-1	15.02	15.02
Fixation R	1	5	1702944177	1703143051	198874	463.79	192.33	10	69	-1	14.36	14.36
Saccade L	1	5	1703143051	1703182814	39763	468.47	182.71	726.57	364.13	3.31	204.53	1.00	83.34	4244.06	-4675.94	3727.71
Saccade R	1	5	1703143051	1703182814	39763	468.47	182.71	726.57	364.13	3.31	204.53	1.00	83.34	4244.06	-4675.94	3727.71
Fixation L	1	6	1703182814	1703381658	198844	769.70	373.52	69	22	-1	15.28	15.28
Fixation R	1	6	1703182814	1703381658	198844	769.70	373.52	69	22	-1	14.69	14.69
Saccade L	1	6	1703381658	1703401666	20008	796.44	372.18	964.71	614.33	1.72	298.03	1.00	86.18	7406.60	-7121.20	5011.27
Saccade R	1	6	1703381658	1703401666	20008	796.44	372.18	964.71	614.33	1.72	298.03	1.00	86.18	7406.60	-7121.20	5011.27
Fixation L	1	7	1703401666	1703580651	178985	975.41	633.72	16	32	-1	15.72	15.72
Fixation R	1	7	1703401666	1703580651	178985	975.41	633.72	16	32	-1	15.21	15.21
Saccade L	1	7	1703580651	1703620401	39750	979.88	636.55	600.87	635.81	3.13	260.66	1.00	78.72	6364.49	-6382.52	4693.02
Saccade R	1	7	1703580651	1703620401	39750	979.88	636.55	600.87	635.81	3.13	260.66	1.00	78.72	6364.49	-6382.52	4693.02
Fixation L	1	8	1703620401	1704018254	397853	589.54	648.39	28	25	-1	15.62	15.62
Fixation R	1	8	1703620401	1704018254	397853	589.54	648.39	28	25	-1	15.11	15.11
Saccade L	1	8	1704018254	1704038133	19879	574.31	658.36	507.34	663.57	0.46	67.96	1.00	23.19	1629.54	-1548.44	1065.54
Saccade R	1	8	1704018254	1704038133	19879	574.31	658.36	507.34	663.57	0.46	67.96	1.00	23.19	1629.54	-1548.44	1065.54
Fixation L	1	9	1704038133	1704256875	218742	491.75	677.34	20	27	-1	15.27	15.27
Fixation R	1	9	1704038133	1704256875	218742	491.75	677.34	20	27	-1	15.07	15.07
Saccade L	1	9	1704256875	1704276744	19869	488.36	691.33	615.18	928.69	1.55	272.04	1.00	78.01	6690.24	-6248.25	4564.87
Saccade R	1	9	1704256875	1704276744	19869	488.36	691.33	615.18	928.69	1.55	272.04	1.00	78.01	6690.24	-6248.25	4564.87
Fixation L	1	10	1704276744	1704575104	298360	599.46	913.74	21	30	-1	15.35	15.35
Fixation R	1	10	1704276744	1704575104	298360	599.46	913.74	21	30	-1	15.27	15.27
Saccade L	1	10	1704575104	1704614850	39746	596.73	910.68	971.11	1011.11	3.25	247.74	0.50	81.79	6154.88	-5894.87	4729.87
Saccade R	1	10	1704575104	1704614850	39746	596.73	910.68	971.11	1011.11	3.25	247.74	0.50	81.79	6154.88	-5894.87	4729.87
Fixation L	1	11	1704614850	1704793840	178990	965.42	996.49	8	43	-1	15.86	15.86
Fixation R	1	11	1704614850	1704793840	178990	965.42	996.49	8	43	-1	15.67	15.67
Saccade L	1	11	1704793840	1704813841	20001	967.43	1000.91	1156.42	1018.94	1.18	191.98	1.00	58.87	4622.86	-4656.44	3233.64
Saccade R	1	11	1704793840	1704813841	20001	967.43	1000.91	1156.42	1018.94	1.18	191.98	1.00	58.87	4622.86	-4656.44	3233.64
Fixation L	1	12	1704813841	1704953085	139244	1184.75	1029.50	35	22	-1	15.70	15.70
Fixation R	1	12	1704813841	1704953085	139244	1184.75	1029.50	35	22	-1	15.11	15.11
Saccade L	1	12	1704953085	1704972951	19866	1189.96	1041.87	1473.19	1041.39	1.49	286.29	1.00	74.95	7075.18	-7061.09	4716.94
Saccade R	1	12	1704953085	1704972951	19866	1189.96	1041.87	1473.19	1041.39	1.49	286.29	1.00	74.95	7075.18	-7061.09	4716.94
Fixation L	1	13	1704972951	1705271315	298364	1487.88	1029.44	28	61	-1	15.45	15.45
Fixation R	1	13	1704972951	1705271315	298364	1487.88	1029.44	28	61	-1	14.46	14.46
Saccade L	1	13	1705271315	1705291181	19866	1501.97	981.04	1505.44	970.85	0.18	12.59	0.00	8.96	115.47	-162.72	145.72
Saccade R	1	13	1705271315	1705291181	19866	1501.97	981.04	1505.44	970.85	0.18	12.59	0.00	8.96	115.47	-162.72	145.72
Fixation L	1	14	1705291181	1705390559	99378	1507.49	973.19	11	8	-1	15.55	15.55
Fixation R	1	14	1705291181	1705390559	99378	1507.49	973.19	11	8	-1	14.11	14.11
Saccade L	1	14	1705390559	1705430423	39864	1513.42	969.46	1547.17	527.50	3.98	288.54	0.50	99.86	7091.45	-6396.77	5262.29
Saccade R	1	14	1705390559	1705430423	39864	1513.42	969.46	1547.17	527.50	3.98	288.54	0.50	99.86	7091.45	-6396.77	5262.29
Fixation L	1	15	1705430423	1705629298	198875	1566.66	534.10	29	33	-1	15.54	15.54
Fixation R	1	15	1705430423	1705629298	198875	1566.66	534.10	29	33	-1	14.07	14.07
Saccade L	1	15	1705629298	1705708799	79501	1573.50	526.08	1574.10	138.43	6.99	381.40	0.25	87.92	9510.24	-8399.10	4032.39
Saccade R	1	15	1705629298	1705708799	79501	1573.50	526.08	1574.10	138.43	6.99	381.40	0.25	87.92	9510.24	-8399.10	4032.39
Fixation L	1	16	1705708799	1705848037	139238	1557.19	160.54	31	49	-1	15.17	15.17
Fixation R	1	16	1705708799	1705848037	139238	1557.19	160.54	31	49	-1	14.33	14.33
Saccade L	1	16	1705848037	1705927658	79621	1544.35	187.75	1541.67	193.32	0.92	21.62	0.25	11.58	242.96	-131.43	92.89
Saccade R	1	16	1705848037	1705927658	79621	1544.35	187.75	1541.67	193.32	0.92	21.62	0.25	11.58	242.96	-131.43	92.89
