[BeGaze]
Converted from:	C:\Documents and Settings\iViewX\Desktop\EXPERIMENTATIONS\Experiments\results\finaleart\S11H21112-finaleart-1.idf
Date:	27.03.2019 15:39:32
Version:	BeGaze 2.5.77
Sample Rate:	50
Subject:	S11H21112
Description:	Clement legrand-Duchenne

Table Header for Fixations:
Event Type	Trial	Number	Start	End	Duration	Location X	Location Y	Dispersion X	Dispersion Y	Plane	Avg. Pupil Size X	Avg. Pupil Size Y

Table Header for Saccades:
Event Type	Trial	Number	Start	End	Duration	Start Loc.X	Start Loc.Y	End Loc.X	End Loc.Y	Amplitude	Peak Speed	Peak Speed At	Average Speed	Peak Accel.	Peak Decel.	Average Accel.

Table Header for Blinks:
Event Type	Trial	Number	Start	End	Duration

Table Header for User Events:
Event Type	Trial	Number	Start	Description

UserEvent	1	1	5586665702	# Message: void.jpg
Fixation L	1	1	5586670637	5586849766	179129	471.52	378.83	10	15	-1	12.91	12.91
Fixation R	1	1	5586670637	5586849766	179129	471.52	378.83	10	15	-1	15.32	15.32
Saccade L	1	1	5586849766	5586909498	59732	469.47	376.63	1093.36	365.23	6.42	297.83	0.67	107.41	7333.62	-7285.39	5155.71
Saccade R	1	1	5586849766	5586909498	59732	469.47	376.63	1093.36	365.23	6.42	297.83	0.67	107.41	7333.62	-7285.39	5155.71
Fixation L	1	2	5586909498	5587247729	338231	1103.23	342.40	15	46	-1	13.47	13.47
Fixation R	1	2	5586909498	5587247729	338231	1103.23	342.40	15	46	-1	15.54	15.54
Blink L	1	1	5587247729	5587426845	179116
Blink R	1	1	5587247729	5587426845	179116
Saccade L	1	2	5587426845	5587486470	59625	1669.30	105.93	1646.24	118.82	3.44	206.89	1.00	57.62	594.77	-4222.83	1140.72
Saccade R	1	2	5587426845	5587486470	59625	1669.30	105.93	1646.24	118.82	3.44	206.89	1.00	57.62	594.77	-4222.83	1140.72
Fixation L	1	3	5587486470	5587645714	159244	1619.10	147.86	44	54	-1	13.91	13.91
Fixation R	1	3	5587486470	5587645714	159244	1619.10	147.86	44	54	-1	15.20	15.20
Saccade L	1	3	5587645714	5587844706	198992	1608.78	143.54	1694.69	222.18	11.58	110.09	0.20	58.19	2644.76	-1671.49	1090.58
Saccade R	1	3	5587645714	5587844706	198992	1608.78	143.54	1694.69	222.18	11.58	110.09	0.20	58.19	2644.76	-1671.49	1090.58
Fixation L	1	4	5587844706	5587964069	119363	1703.49	245.58	22	33	-1	13.44	13.44
Fixation R	1	4	5587844706	5587964069	119363	1703.49	245.58	22	33	-1	14.71	14.71
Saccade L	1	4	5587964069	5587984075	20006	1706.47	252.88	1684.92	301.85	0.58	54.12	1.00	29.04	1120.32	-656.40	953.24
Saccade R	1	4	5587964069	5587984075	20006	1706.47	252.88	1684.92	301.85	0.58	54.12	1.00	29.04	1120.32	-656.40	953.24
Fixation L	1	5	5587984075	5588083567	99492	1692.99	280.65	19	43	-1	13.63	13.63
Fixation R	1	5	5587984075	5588083567	99492	1692.99	280.65	19	43	-1	14.92	14.92
Saccade L	1	5	5588083567	5588103461	19894	1683.67	301.11	1659.18	336.04	0.44	43.16	1.00	22.14	919.03	-586.41	555.16
Saccade R	1	5	5588083567	5588103461	19894	1683.67	301.11	1659.18	336.04	0.44	43.16	1.00	22.14	919.03	-586.41	555.16
Fixation L	1	6	5588103461	5588242685	139224	1668.39	332.78	32	39	-1	14.12	14.12
Fixation R	1	6	5588103461	5588242685	139224	1668.39	332.78	32	39	-1	14.49	14.49
