[BeGaze]
Converted from:	C:\Documents and Settings\iViewX\Desktop\EXPERIMENTATIONS\Experiments\results\finaleart\S7121223-finaleart-1.idf
Date:	27.03.2019 15:36:34
Version:	BeGaze 2.5.77
Sample Rate:	50
Subject:	S7121223
Description:	Gregoire pacreau

Table Header for Fixations:
Event Type	Trial	Number	Start	End	Duration	Location X	Location Y	Dispersion X	Dispersion Y	Plane	Avg. Pupil Size X	Avg. Pupil Size Y

Table Header for Saccades:
Event Type	Trial	Number	Start	End	Duration	Start Loc.X	Start Loc.Y	End Loc.X	End Loc.Y	Amplitude	Peak Speed	Peak Speed At	Average Speed	Peak Accel.	Peak Decel.	Average Accel.

Table Header for Blinks:
Event Type	Trial	Number	Start	End	Duration

Table Header for User Events:
Event Type	Trial	Number	Start	Description

UserEvent	1	1	3722263111	# Message: marquet-fruit-knife-and-napkin-1898.jpg
Fixation L	1	1	3722274733	3722892007	617274	1030.79	497.79	11	69	-1	17.80	17.80
Fixation R	1	1	3722274733	3722892007	617274	1030.79	497.79	11	69	-1	17.26	17.26
Saccade L	1	1	3722892007	3722911953	19946	1033.64	510.79	1057.04	542.25	0.47	40.67	1.00	23.50	951.55	-528.44	731.71
Saccade R	1	1	3722892007	3722911953	19946	1033.64	510.79	1057.04	542.25	0.47	40.67	1.00	23.50	951.55	-528.44	731.71
Fixation L	1	2	3722911953	3723130949	218996	1100.20	566.68	54	41	-1	14.63	14.63
Fixation R	1	2	3722911953	3723130949	218996	1100.20	566.68	54	41	-1	13.06	13.06
Saccade L	1	2	3723130949	3723150816	19867	1110.16	577.29	1105.46	616.79	0.38	40.24	1.00	19.28	915.04	-950.66	783.30
Saccade R	1	2	3723130949	3723150816	19867	1110.16	577.29	1105.46	616.79	0.38	40.24	1.00	19.28	915.04	-950.66	783.30
Fixation L	1	3	3723150816	3723588915	438099	1081.79	645.95	33	47	-1	14.46	14.46
Fixation R	1	3	3723150816	3723588915	438099	1081.79	645.95	33	47	-1	13.06	13.06
Saccade L	1	3	3723588915	3723628773	39858	1080.45	649.09	732.98	640.33	2.94	200.93	0.50	73.64	4981.63	-4721.01	4264.79
Saccade R	1	3	3723588915	3723628773	39858	1080.45	649.09	732.98	640.33	2.94	200.93	0.50	73.64	4981.63	-4721.01	4264.79
Fixation L	1	4	3723628773	3723967266	338493	742.89	625.20	15	25	-1	15.34	15.34
Fixation R	1	4	3723628773	3723967266	338493	742.89	625.20	15	25	-1	14.66	14.66
Saccade L	1	4	3723967266	3723987136	19870	736.91	624.88	580.87	670.59	1.10	164.45	1.00	55.47	4024.93	-3643.90	2974.06
Saccade R	1	4	3723967266	3723987136	19870	736.91	624.88	580.87	670.59	1.10	164.45	1.00	55.47	4024.93	-3643.90	2974.06
Fixation L	1	5	3723987136	3724245996	258860	542.97	707.87	46	53	-1	15.24	15.24
Fixation R	1	5	3723987136	3724245996	258860	542.97	707.87	46	53	-1	15.17	15.17
Saccade L	1	5	3724245996	3724265996	20000	538.47	713.96	524.35	720.50	0.23	23.03	1.00	11.52	525.79	182.43	322.89
Saccade R	1	5	3724245996	3724265996	20000	538.47	713.96	524.35	720.50	0.23	23.03	1.00	11.52	525.79	182.43	322.89
Fixation L	1	6	3724265996	3724445108	179112	498.22	756.70	38	59	-1	15.31	15.31
Fixation R	1	6	3724265996	3724445108	179112	498.22	756.70	38	59	-1	15.44	15.44
Saccade L	1	6	3724445108	3724564612	119504	485.56	772.73	1022.89	763.18	8.01	327.89	0.83	67.03	8148.89	-8087.19	3297.05
Saccade R	1	6	3724445108	3724564612	119504	485.56	772.73	1022.89	763.18	8.01	327.89	0.83	67.03	8148.89	-8087.19	3297.05
Fixation L	1	7	3724564612	3724803595	238983	1036.20	764.59	22	23	-1	16.03	16.03
Fixation R	1	7	3724564612	3724803595	238983	1036.20	764.59	22	23	-1	16.03	16.03
Saccade L	1	7	3724803595	3724843460	39865	1044.00	762.68	1215.25	599.98	2.37	140.26	1.00	59.42	3413.82	-3159.19	3110.14
Saccade R	1	7	3724803595	3724843460	39865	1044.00	762.68	1215.25	599.98	2.37	140.26	1.00	59.42	3413.82	-3159.19	3110.14
Fixation L	1	8	3724843460	3725261580	418120	1253.28	587.33	66	30	-1	15.54	15.54
Fixation R	1	8	3724843460	3725261580	418120	1253.28	587.33	66	30	-1	14.43	14.43
Saccade L	1	8	3725261580	3725281451	19871	1282.07	584.35	1291.57	582.85	0.21	13.17	1.00	10.48	167.55	-172.66	137.08
Saccade R	1	8	3725261580	3725281451	19871	1282.07	584.35	1291.57	582.85	0.21	13.17	1.00	10.48	167.55	-172.66	137.08
Fixation L	1	9	3725281451	3725580181	298730	1304.83	576.19	18	11	-1	15.58	15.58
Fixation R	1	9	3725281451	3725580181	298730	1304.83	576.19	18	11	-1	14.49	14.49
Saccade L	1	9	3725580181	3725759412	179231	1304.66	578.98	1449.07	727.50	7.49	132.00	0.11	41.77	3271.30	-2847.79	1606.06
Saccade R	1	9	3725580181	3725759412	179231	1304.66	578.98	1449.07	727.50	7.49	132.00	0.11	41.77	3271.30	-2847.79	1606.06
Fixation L	1	10	3725759412	3725978417	219005	1446.72	736.06	12	83	-1	16.38	16.38
Fixation R	1	10	3725759412	3725978417	219005	1446.72	736.06	12	83	-1	13.31	13.31
Saccade L	1	10	3725978417	3725998408	19991	1452.02	718.70	1461.96	713.91	0.44	61.23	1.00	21.76	1421.21	22.02	700.48
Saccade R	1	10	3725978417	3725998408	19991	1452.02	718.70	1461.96	713.91	0.44	61.23	1.00	21.76	1421.21	22.02	700.48
Fixation L	1	11	3725998408	3726257268	258860	1458.73	749.72	8	74	-1	16.66	16.66
Fixation R	1	11	3725998408	3726257268	258860	1458.73	749.72	8	74	-1	13.66	13.66
