[BeGaze]
Converted from:	C:\Documents and Settings\iViewX\Desktop\EXPERIMENTATIONS\Experiments\results\finaleart\S15H25531-finaleart-1.idf
Date:	27.03.2019 15:45:21
Version:	BeGaze 2.5.77
Sample Rate:	50
Subject:	S15H25531
Description:	Mikail Demirdelen

Table Header for Fixations:
Event Type	Trial	Number	Start	End	Duration	Location X	Location Y	Dispersion X	Dispersion Y	Plane	Avg. Pupil Size X	Avg. Pupil Size Y

Table Header for Saccades:
Event Type	Trial	Number	Start	End	Duration	Start Loc.X	Start Loc.Y	End Loc.X	End Loc.Y	Amplitude	Peak Speed	Peak Speed At	Average Speed	Peak Accel.	Peak Decel.	Average Accel.

Table Header for Blinks:
Event Type	Trial	Number	Start	End	Duration

Table Header for User Events:
Event Type	Trial	Number	Start	Description

UserEvent	1	1	4282510588	# Message: Morning,_An_Overcast_Day_Rouen_Pissaro_1896.jpg
Fixation L	1	1	4282520195	4282898188	377993	997.76	793.39	18	43	-1	14.82	14.82
Fixation R	1	1	4282520195	4282898188	377993	997.76	793.39	18	43	-1	15.96	15.96
Saccade L	1	1	4282898188	4282937916	39728	1010.64	827.67	972.47	756.78	2.00	124.37	0.50	50.40	3036.45	-2017.75	1887.40
Saccade R	1	1	4282898188	4282937916	39728	1010.64	827.67	972.47	756.78	2.00	124.37	0.50	50.40	3036.45	-2017.75	1887.40
Fixation L	1	2	4282937916	4283156654	218738	951.55	714.06	29	57	-1	13.94	13.94
Fixation R	1	2	4282937916	4283156654	218738	951.55	714.06	29	57	-1	14.97	14.97
Saccade L	1	2	4283156654	4283176535	19881	945.22	702.13	815.11	685.63	0.98	132.65	1.00	49.18	3067.33	-3004.68	2413.45
Saccade R	1	2	4283156654	4283176535	19881	945.22	702.13	815.11	685.63	0.98	132.65	1.00	49.18	3067.33	-3004.68	2413.45
Fixation L	1	3	4283176535	4283355645	179110	768.25	686.34	60	11	-1	11.59	11.59
Fixation R	1	3	4283176535	4283355645	179110	768.25	686.34	60	11	-1	12.51	12.51
Saccade L	1	3	4283355645	4283415268	59623	764.82	691.06	1401.47	368.10	7.62	291.54	0.67	127.74	7147.55	-6631.50	5330.19
Saccade R	1	3	4283355645	4283415268	59623	764.82	691.06	1401.47	368.10	7.62	291.54	0.67	127.74	7147.55	-6631.50	5330.19
Fixation L	1	4	4283415268	4283574388	159120	1403.44	342.93	9	42	-1	10.58	10.58
Fixation R	1	4	4283415268	4283574388	159120	1403.44	342.93	9	42	-1	11.23	11.23
Saccade L	1	4	4283574388	4283594254	19866	1400.50	354.40	1464.80	345.06	0.42	65.73	1.00	21.06	1613.23	-1381.12	1056.53
Saccade R	1	4	4283574388	4283594254	19866	1400.50	354.40	1464.80	345.06	0.42	65.73	1.00	21.06	1613.23	-1381.12	1056.53
Fixation L	1	5	4283594254	4283753377	159123	1480.08	339.25	21	12	-1	10.39	10.39
Fixation R	1	5	4283594254	4283753377	159123	1480.08	339.25	21	12	-1	11.09	11.09
Saccade L	1	5	4283753377	4283793123	39746	1486.47	332.50	1015.51	683.31	4.88	393.60	0.50	122.87	9796.21	-9548.27	7273.76
Saccade R	1	5	4283753377	4283793123	39746	1486.47	332.50	1015.51	683.31	4.88	393.60	0.50	122.87	9796.21	-9548.27	7273.76
Fixation L	1	6	4283793123	4284131362	338239	1006.27	688.56	16	29	-1	10.55	10.55
Fixation R	1	6	4283793123	4284131362	338239	1006.27	688.56	16	29	-1	10.74	10.74
Saccade L	1	6	4284131362	4284151252	19890	999.17	696.83	851.33	672.76	1.01	151.49	1.00	50.57	3649.85	-3349.18	2578.23
Saccade R	1	6	4284131362	4284151252	19890	999.17	696.83	851.33	672.76	1.01	151.49	1.00	50.57	3649.85	-3349.18	2578.23
Fixation L	1	7	4284151252	4284449591	298339	842.29	643.87	15	39	-1	11.22	11.22
Fixation R	1	7	4284151252	4284449591	298339	842.29	643.87	15	39	-1	12.36	12.36
Saccade L	1	7	4284449591	4284469464	19873	843.59	644.52	695.30	640.43	0.79	150.04	1.00	39.90	3695.06	-3651.37	2499.78
Saccade R	1	7	4284449591	4284469464	19873	843.59	644.52	695.30	640.43	0.79	150.04	1.00	39.90	3695.06	-3651.37	2499.78
Fixation L	1	8	4284469464	4284767837	298373	675.85	641.62	40	8	-1	11.33	11.33
Fixation R	1	8	4284469464	4284767837	298373	675.85	641.62	40	8	-1	12.31	12.31
Saccade L	1	8	4284767837	4284807576	39739	665.41	636.65	438.90	634.12	1.86	115.96	0.50	46.82	2845.23	-2857.13	2792.68
Saccade R	1	8	4284767837	4284807576	39739	665.41	636.65	438.90	634.12	1.86	115.96	0.50	46.82	2845.23	-2857.13	2792.68
Fixation L	1	9	4284807576	4284966696	159120	443.01	641.10	19	20	-1	11.41	11.41
Fixation R	1	9	4284807576	4284966696	159120	443.01	641.10	19	20	-1	12.38	12.38
Saccade L	1	9	4284966696	4285026319	59623	456.63	654.18	1015.41	615.57	5.97	300.70	0.67	100.17	7121.17	-7192.06	4803.00
Saccade R	1	9	4284966696	4285026319	59623	456.63	654.18	1015.41	615.57	5.97	300.70	0.67	100.17	7121.17	-7192.06	4803.00
Fixation L	1	10	4285026319	4285225306	198987	1005.98	596.90	14	27	-1	11.36	11.36
Fixation R	1	10	4285026319	4285225306	198987	1005.98	596.90	14	27	-1	12.18	12.18
Saccade L	1	10	4285225306	4285245179	19873	1009.52	588.23	1301.09	477.44	1.77	315.22	1.00	88.83	7656.06	-7126.59	4955.71
Saccade R	1	10	4285225306	4285245179	19873	1009.52	588.23	1301.09	477.44	1.77	315.22	1.00	88.83	7656.06	-7126.59	4955.71
Fixation L	1	11	4285245179	4285384423	139244	1336.20	475.77	46	9	-1	11.12	11.12
Fixation R	1	11	4285245179	4285384423	139244	1336.20	475.77	46	9	-1	11.83	11.83
Saccade L	1	11	4285384423	4285404301	19878	1346.61	469.79	1512.70	269.33	1.62	263.17	1.00	81.41	6518.24	-5975.18	4604.86
Saccade R	1	11	4285384423	4285404301	19878	1346.61	469.79	1512.70	269.33	1.62	263.17	1.00	81.41	6518.24	-5975.18	4604.86
Fixation L	1	12	4285404301	4285642905	238604	1518.81	202.14	14	81	-1	10.29	10.29
Fixation R	1	12	4285404301	4285642905	238604	1518.81	202.14	14	81	-1	10.98	10.98
Saccade L	1	12	4285642905	4285702652	59747	1520.44	194.65	985.20	642.60	7.34	337.38	0.33	122.84	8361.19	-5443.65	5463.37
Saccade R	1	12	4285642905	4285702652	59747	1520.44	194.65	985.20	642.60	7.34	337.38	0.33	122.84	8361.19	-5443.65	5463.37
Fixation L	1	13	4285702652	4286020895	318243	979.00	690.76	21	76	-1	10.17	10.17
Fixation R	1	13	4285702652	4286020895	318243	979.00	690.76	21	76	-1	10.64	10.64
Saccade L	1	13	4286020895	4286040766	19871	984.30	694.78	869.92	811.98	1.04	165.62	1.00	52.28	4054.80	-4009.62	2896.25
Saccade R	1	13	4286020895	4286040766	19871	984.30	694.78	869.92	811.98	1.04	165.62	1.00	52.28	4054.80	-4009.62	2896.25
Fixation L	1	14	4286040766	4286259509	218743	842.05	852.26	33	64	-1	10.25	10.25
Fixation R	1	14	4286040766	4286259509	218743	842.05	852.26	33	64	-1	11.30	11.30
Saccade L	1	14	4286259509	4286498240	238731	838.59	853.86	700.03	818.60	57.65	1597.88	0.25	241.51	38756.18	-39947.10	11915.43
Saccade R	1	14	4286259509	4286498240	238731	838.59	853.86	700.03	818.60	57.65	1597.88	0.25	241.51	38756.18	-39947.10	11915.43
