[BeGaze]
Converted from:	C:\Documents and Settings\iViewX\Desktop\EXPERIMENTATIONS\Experiments\results\finaleart\S11H21112-finaleart-1.idf
Date:	27.03.2019 15:38:34
Version:	BeGaze 2.5.77
Sample Rate:	50
Subject:	S11H21112
Description:	Clement legrand-Duchenne

Table Header for Fixations:
Event Type	Trial	Number	Start	End	Duration	Location X	Location Y	Dispersion X	Dispersion Y	Plane	Avg. Pupil Size X	Avg. Pupil Size Y

Table Header for Saccades:
Event Type	Trial	Number	Start	End	Duration	Start Loc.X	Start Loc.Y	End Loc.X	End Loc.Y	Amplitude	Peak Speed	Peak Speed At	Average Speed	Peak Accel.	Peak Decel.	Average Accel.

Table Header for Blinks:
Event Type	Trial	Number	Start	End	Duration

Table Header for User Events:
Event Type	Trial	Number	Start	Description

UserEvent	1	1	3942534279	# Message: void.jpg
Fixation L	1	1	3942553014	3942692284	139270	1145.99	317.28	6	10	-1	12.14	12.14
Fixation R	1	1	3942553014	3942692284	139270	1145.99	317.28	6	10	-1	12.86	12.86
Saccade L	1	1	3942692284	3942732136	39852	1148.81	323.12	1397.27	325.02	2.18	183.14	0.50	54.73	4504.33	-4339.70	3019.56
Saccade R	1	1	3942692284	3942732136	39852	1148.81	323.12	1397.27	325.02	2.18	183.14	0.50	54.73	4504.33	-4339.70	3019.56
Fixation L	1	2	3942732136	3943308864	576728	1386.89	338.51	28	41	-1	12.34	12.34
Fixation R	1	2	3942732136	3943308864	576728	1386.89	338.51	28	41	-1	12.89	12.89
Saccade L	1	2	3943308864	3943328745	19881	1378.37	359.33	1221.57	356.27	0.86	158.61	1.00	43.28	3721.41	-3576.26	2454.34
Saccade R	1	2	3943308864	3943328745	19881	1378.37	359.33	1221.57	356.27	0.86	158.61	1.00	43.28	3721.41	-3576.26	2454.34
Fixation L	1	3	3943328745	3943786222	457477	1219.51	323.57	22	48	-1	13.32	13.32
Fixation R	1	3	3943328745	3943786222	457477	1219.51	323.57	22	48	-1	14.06	14.06
Saccade L	1	3	3943786222	3943845966	59744	1206.44	325.32	998.77	411.57	2.89	100.63	0.33	48.40	2382.29	-1580.64	1671.45
Saccade R	1	3	3943786222	3943845966	59744	1206.44	325.32	998.77	411.57	2.89	100.63	0.33	48.40	2382.29	-1580.64	1671.45
Fixation L	1	4	3943845966	3944522163	676197	979.91	454.30	30	65	-1	15.18	15.18
Fixation R	1	4	3943845966	3944522163	676197	979.91	454.30	30	65	-1	16.47	16.47
