[BeGaze]
Converted from:	C:\Documents and Settings\iViewX\Desktop\EXPERIMENTATIONS\Experiments\results\finaleart\S20H24222-finaleart-1.idf
Date:	27.03.2019 15:54:12
Version:	BeGaze 2.5.77
Sample Rate:	50
Subject:	S20H24222
Description:	Hugo Brument

Table Header for Fixations:
Event Type	Trial	Number	Start	End	Duration	Location X	Location Y	Dispersion X	Dispersion Y	Plane	Avg. Pupil Size X	Avg. Pupil Size Y

Table Header for Saccades:
Event Type	Trial	Number	Start	End	Duration	Start Loc.X	Start Loc.Y	End Loc.X	End Loc.Y	Amplitude	Peak Speed	Peak Speed At	Average Speed	Peak Accel.	Peak Decel.	Average Accel.

Table Header for Blinks:
Event Type	Trial	Number	Start	End	Duration

Table Header for User Events:
Event Type	Trial	Number	Start	Description

UserEvent	1	1	12378687328	# Message: delacroix-still-life-with-lobsters-1827.jpg
Saccade L	1	1	12378704455	12378803963	99508	924.88	555.71	809.07	562.70	2.00	102.45	1.00	20.09	2352.03	-2510.13	783.43
Saccade R	1	1	12378704455	12378803963	99508	924.88	555.71	809.07	562.70	2.00	102.45	1.00	20.09	2352.03	-2510.13	783.43
Fixation L	1	1	12378803963	12379261458	457495	809.24	584.41	11	35	-1	13.70	13.70
Fixation R	1	1	12378803963	12379261458	457495	809.24	584.41	11	35	-1	12.74	12.74
Saccade L	1	2	12379261458	12379281308	19850	810.43	588.73	854.65	646.25	0.56	73.38	1.00	27.96	1669.45	-931.59	968.44
Saccade R	1	2	12379261458	12379281308	19850	810.43	588.73	854.65	646.25	0.56	73.38	1.00	27.96	1669.45	-931.59	968.44
Fixation L	1	2	12379281308	12379440418	159110	879.11	658.40	41	55	-1	12.07	12.07
Fixation R	1	2	12379281308	12379440418	159110	879.11	658.40	41	55	-1	11.20	11.20
Saccade L	1	3	12379440418	12379500059	59641	895.77	664.56	1244.16	803.94	4.17	260.55	0.67	69.98	6448.80	-5824.49	3575.13
Saccade R	1	3	12379440418	12379500059	59641	895.77	664.56	1244.16	803.94	4.17	260.55	0.67	69.98	6448.80	-5824.49	3575.13
Fixation L	1	3	12379500059	12379878027	377968	1260.75	812.09	26	34	-1	11.01	11.01
Fixation R	1	3	12379500059	12379878027	377968	1260.75	812.09	26	34	-1	10.10	10.10
Saccade L	1	4	12379878027	12379897897	19870	1255.84	818.61	1084.52	821.43	1.08	173.28	1.00	54.52	4292.71	-4186.49	3000.61
Saccade R	1	4	12379878027	12379897897	19870	1255.84	818.61	1084.52	821.43	1.08	173.28	1.00	54.52	4292.71	-4186.49	3000.61
Fixation L	1	4	12379897897	12380514504	616607	1084.16	821.30	50	28	-1	10.90	10.90
Fixation R	1	4	12379897897	12380514504	616607	1084.16	821.30	50	28	-1	9.71	9.71
Saccade L	1	5	12380514504	12380554251	39747	1099.68	813.67	834.03	757.34	2.46	140.88	1.00	62.01	3347.81	-3128.62	3138.12
Saccade R	1	5	12380514504	12380554251	39747	1099.68	813.67	834.03	757.34	2.46	140.88	1.00	62.01	3347.81	-3128.62	3138.12
Fixation L	1	5	12380554251	12380912232	357981	820.90	741.69	34	64	-1	10.70	10.70
Fixation R	1	5	12380554251	12380912232	357981	820.90	741.69	34	64	-1	9.85	9.85
Saccade L	1	6	12380912232	12380932131	19899	799.26	698.22	800.25	689.94	0.43	48.45	0.00	21.77	224.83	-650.29	297.44
Saccade R	1	6	12380912232	12380932131	19899	799.26	698.22	800.25	689.94	0.43	48.45	0.00	21.77	224.83	-650.29	297.44
Fixation L	1	6	12380932131	12381170841	238710	777.56	684.68	29	33	-1	10.37	10.37
Fixation R	1	6	12380932131	12381170841	238710	777.56	684.68	29	33	-1	9.88	9.88
Saccade L	1	7	12381170841	12381210593	39752	772.06	676.98	634.73	870.38	2.55	155.19	0.50	64.12	3860.87	-2729.57	2929.19
Saccade R	1	7	12381170841	12381210593	39752	772.06	676.98	634.73	870.38	2.55	155.19	0.50	64.12	3860.87	-2729.57	2929.19
Fixation L	1	7	12381210593	12381409589	198996	621.62	835.54	26	61	-1	10.79	10.79
Fixation R	1	7	12381210593	12381409589	198996	621.62	835.54	26	61	-1	10.18	10.18
Saccade L	1	8	12381409589	12381429471	19882	612.13	828.54	704.13	823.25	0.54	93.22	1.00	27.37	2208.44	-2276.16	1506.95
Saccade R	1	8	12381409589	12381429471	19882	612.13	828.54	704.13	823.25	0.54	93.22	1.00	27.37	2208.44	-2276.16	1506.95
Fixation L	1	8	12381429471	12381628345	198874	705.56	813.82	9	27	-1	10.95	10.95
Fixation R	1	8	12381429471	12381628345	198874	705.56	813.82	9	27	-1	10.37	10.37
Saccade L	1	9	12381628345	12381668073	39728	700.50	795.43	577.51	601.14	2.18	180.88	0.50	54.80	4509.43	-4448.59	3023.35
Saccade R	1	9	12381628345	12381668073	39728	700.50	795.43	577.51	601.14	2.18	180.88	0.50	54.80	4509.43	-4448.59	3023.35
Fixation L	1	9	12381668073	12382085806	417733	578.26	594.45	17	46	-1	10.59	10.59
Fixation R	1	9	12381668073	12382085806	417733	578.26	594.45	17	46	-1	10.37	10.37
Saccade L	1	10	12382085806	12382105687	19881	587.07	561.47	598.89	495.82	0.67	67.48	1.00	33.73	1530.02	-1322.35	1122.98
Saccade R	1	10	12382085806	12382105687	19881	587.07	561.47	598.89	495.82	0.67	67.48	1.00	33.73	1530.02	-1322.35	1122.98
Fixation L	1	10	12382105687	12382483539	377852	637.58	491.66	69	20	-1	11.27	11.27
Fixation R	1	10	12382105687	12382483539	377852	637.58	491.66	69	20	-1	11.03	11.03
Saccade L	1	11	12382483539	12382523411	39872	668.55	498.02	1250.19	475.28	4.96	351.94	0.50	124.40	8753.01	-8436.32	7033.32
Saccade R	1	11	12382483539	12382523411	39872	668.55	498.02	1250.19	475.28	4.96	351.94	0.50	124.40	8753.01	-8436.32	7033.32
Fixation L	1	11	12382523411	12382682533	159122	1257.86	453.14	11	39	-1	11.71	11.71
Fixation R	1	11	12382523411	12382682533	159122	1257.86	453.14	11	39	-1	10.95	10.95
