[BeGaze]
Converted from:	C:\Documents and Settings\iViewX\Desktop\EXPERIMENTATIONS\Experiments\results\finaleart\S02123220-finaleart-1.idf
Date:	27.03.2019 15:33:42
Version:	BeGaze 2.5.77
Sample Rate:	50
Subject:	S02123220
Description:	David Xu

Table Header for Fixations:
Event Type	Trial	Number	Start	End	Duration	Location X	Location Y	Dispersion X	Dispersion Y	Plane	Avg. Pupil Size X	Avg. Pupil Size Y

Table Header for Saccades:
Event Type	Trial	Number	Start	End	Duration	Start Loc.X	Start Loc.Y	End Loc.X	End Loc.Y	Amplitude	Peak Speed	Peak Speed At	Average Speed	Peak Accel.	Peak Decel.	Average Accel.

Table Header for Blinks:
Event Type	Trial	Number	Start	End	Duration

Table Header for User Events:
Event Type	Trial	Number	Start	Description

UserEvent	1	1	1777250341	# Message: Rapids_on_the_Petite_Creuse_at_Fresselines_Monet_1889.jpg
Fixation L	1	1	1777260292	1777518763	258471	967.97	573.42	44	30	-1	14.35	14.35
Fixation R	1	1	1777260292	1777518763	258471	967.97	573.42	44	30	-1	14.14	14.14
Saccade L	1	1	1777518763	1777538636	19873	995.74	553.12	1005.87	534.37	0.33	24.95	1.00	16.51	170.18	-171.00	142.03
Saccade R	1	1	1777518763	1777538636	19873	995.74	553.12	1005.87	534.37	0.33	24.95	1.00	16.51	170.18	-171.00	142.03
Fixation L	1	2	1777538636	1777777390	238754	1012.03	518.71	24	24	-1	14.63	14.63
Fixation R	1	2	1777538636	1777777390	238754	1012.03	518.71	24	24	-1	14.34	14.34
Saccade L	1	2	1777777390	1777797261	19871	1015.03	516.71	899.32	572.88	0.92	130.10	1.00	46.49	3219.20	-3091.41	2518.86
Saccade R	1	2	1777777390	1777797261	19871	1015.03	516.71	899.32	572.88	0.92	130.10	1.00	46.49	3219.20	-3091.41	2518.86
Fixation L	1	3	1777797261	1777956361	159100	870.44	596.99	36	49	-1	13.63	13.63
Fixation R	1	3	1777797261	1777956361	159100	870.44	596.99	36	49	-1	13.39	13.39
Saccade L	1	3	1777956361	1777976243	19882	867.81	571.00	722.93	590.74	0.95	147.89	1.00	47.79	3348.68	-3597.03	2362.55
Saccade R	1	3	1777956361	1777976243	19882	867.81	571.00	722.93	590.74	0.95	147.89	1.00	47.79	3348.68	-3597.03	2362.55
Fixation L	1	4	1777976243	1778195101	218858	715.30	589.02	14	17	-1	11.86	11.86
Fixation R	1	4	1777976243	1778195101	218858	715.30	589.02	14	17	-1	12.54	12.54
Saccade L	1	4	1778195101	1778254721	59620	713.07	593.67	911.62	298.27	4.02	193.98	0.67	67.37	4695.68	-4514.32	2805.00
Saccade R	1	4	1778195101	1778254721	59620	713.07	593.67	911.62	298.27	4.02	193.98	0.67	67.37	4695.68	-4514.32	2805.00
Fixation L	1	5	1778254721	1778513330	258609	929.68	303.65	79	15	-1	11.67	11.67
Fixation R	1	5	1778254721	1778513330	258609	929.68	303.65	79	15	-1	11.76	11.76
Saccade L	1	5	1778513330	1778553069	39739	990.80	294.49	1254.97	209.57	3.05	185.61	0.50	76.70	4612.28	-3914.78	2999.77
Saccade R	1	5	1778513330	1778553069	39739	990.80	294.49	1254.97	209.57	3.05	185.61	0.50	76.70	4612.28	-3914.78	2999.77
Fixation L	1	6	1778553069	1778891182	338113	1232.40	214.71	30	20	-1	11.42	11.42
Fixation R	1	6	1778553069	1778891182	338113	1232.40	214.71	30	20	-1	11.30	11.30
Saccade L	1	6	1778891182	1779269163	377981	1239.51	217.57	1396.12	751.48	35.69	365.55	0.11	94.42	8973.41	-8208.37	2422.02
Saccade R	1	6	1778891182	1779269163	377981	1239.51	217.57	1396.12	751.48	35.69	365.55	0.11	94.42	8973.41	-8208.37	2422.02
Fixation L	1	7	1779269163	1779567510	298347	1381.72	762.15	25	16	-1	12.13	12.13
Fixation R	1	7	1779269163	1779567510	298347	1381.72	762.15	25	16	-1	10.75	10.75
Saccade L	1	7	1779567510	1779587401	19891	1373.34	765.39	1239.45	769.78	0.84	135.49	1.00	42.16	3169.73	-3161.54	2229.08
Saccade R	1	7	1779567510	1779587401	19891	1373.34	765.39	1239.45	769.78	0.84	135.49	1.00	42.16	3169.73	-3161.54	2229.08
Fixation L	1	8	1779587401	1779806130	218729	1216.13	803.07	39	58	-1	12.09	12.09
Fixation R	1	8	1779587401	1779806130	218729	1216.13	803.07	39	58	-1	10.94	10.94
Saccade L	1	8	1779806130	1779865749	59619	1201.67	828.00	750.74	638.34	5.13	250.95	0.67	86.01	6234.14	-5938.59	3865.32
Saccade R	1	8	1779806130	1779865749	59619	1201.67	828.00	750.74	638.34	5.13	250.95	0.67	86.01	6234.14	-5938.59	3865.32
Fixation L	1	9	1779865749	1780283473	417724	764.55	596.90	23	69	-1	11.63	11.63
Fixation R	1	9	1779865749	1780283473	417724	764.55	596.90	23	69	-1	11.87	11.87
Saccade L	1	9	1780283473	1780323219	39746	774.47	569.16	1000.33	435.37	2.35	141.47	1.00	59.24	3352.73	-3341.82	3301.31
Saccade R	1	9	1780283473	1780323219	39746	774.47	569.16	1000.33	435.37	2.35	141.47	1.00	59.24	3352.73	-3341.82	3301.31
Fixation L	1	10	1780323219	1780661464	338245	999.14	432.71	8	22	-1	11.52	11.52
Fixation R	1	10	1780323219	1780661464	338245	999.14	432.71	8	22	-1	11.89	11.89
Saccade L	1	10	1780661464	1780701197	39733	1000.94	439.72	1207.28	459.38	1.99	167.85	0.50	50.10	4167.98	-3300.96	2298.35
Saccade R	1	10	1780661464	1780701197	39733	1000.94	439.72	1207.28	459.38	1.99	167.85	0.50	50.10	4167.98	-3300.96	2298.35
Fixation L	1	11	1780701197	1780979679	278482	1250.32	474.99	54	26	-1	12.58	12.58
Fixation R	1	11	1780701197	1780979679	278482	1250.32	474.99	54	26	-1	12.20	12.20
Saccade L	1	11	1780979679	1781039316	59637	1260.59	485.53	1332.21	532.65	1.34	50.58	1.00	22.39	526.96	-828.17	435.68
Saccade R	1	11	1780979679	1781039316	59637	1260.59	485.53	1332.21	532.65	1.34	50.58	1.00	22.39	526.96	-828.17	435.68
Fixation L	1	12	1781039316	1781198419	159103	1343.27	548.12	24	29	-1	13.18	13.18
Fixation R	1	12	1781039316	1781198419	159103	1343.27	548.12	24	29	-1	12.46	12.46
Saccade L	1	12	1781198419	1781238159	39740	1327.98	560.10	1071.50	570.57	2.83	189.20	0.50	71.22	4692.09	0.00	1953.47
Saccade R	1	12	1781198419	1781238159	39740	1327.98	560.10	1071.50	570.57	2.83	189.20	0.50	71.22	4692.09	0.00	1953.47
