[BeGaze]
Converted from:	C:\Documents and Settings\iViewX\Desktop\EXPERIMENTATIONS\Experiments\results\finaleart\S22H22551-finaleart-1.idf
Date:	27.03.2019 15:58:54
Version:	BeGaze 2.5.77
Sample Rate:	50
Subject:	S22H22551
Description:	Mathieu Chambre

Table Header for Fixations:
Event Type	Trial	Number	Start	End	Duration	Location X	Location Y	Dispersion X	Dispersion Y	Plane	Avg. Pupil Size X	Avg. Pupil Size Y

Table Header for Saccades:
Event Type	Trial	Number	Start	End	Duration	Start Loc.X	Start Loc.Y	End Loc.X	End Loc.Y	Amplitude	Peak Speed	Peak Speed At	Average Speed	Peak Accel.	Peak Decel.	Average Accel.

Table Header for Blinks:
Event Type	Trial	Number	Start	End	Duration

Table Header for User Events:
Event Type	Trial	Number	Start	Description

UserEvent	1	1	5788022864	# Message: void.jpg
Saccade L	1	1	5788028766	5788108390	79624	1457.22	570.84	403.90	1074.73	15.91	365.97	0.25	199.81	8513.92	-7958.62	4299.74
Saccade R	1	1	5788028766	5788108390	79624	1457.22	570.84	403.90	1074.73	15.91	365.97	0.25	199.81	8513.92	-7958.62	4299.74
Fixation L	1	1	5788108390	5788267499	159109	395.13	1080.22	55	42	-1	14.19	14.19
Fixation R	1	1	5788108390	5788267499	159109	395.13	1080.22	55	42	-1	14.15	14.15
Saccade L	1	2	5788267499	5788287370	19871	351.03	1108.75	327.19	1093.78	0.45	50.77	0.00	22.52	607.82	-1102.07	706.60
Saccade R	1	2	5788267499	5788287370	19871	351.03	1108.75	327.19	1093.78	0.45	50.77	0.00	22.52	607.82	-1102.07	706.60
Fixation L	1	2	5788287370	5788446495	159125	315.53	1101.27	16	11	-1	13.42	13.42
Fixation R	1	2	5788287370	5788446495	159125	315.53	1101.27	16	11	-1	13.84	13.84
Blink L	1	1	5788446495	5788744862	298367
Blink R	1	1	5788446495	5788744862	298367
Fixation L	1	3	5788744862	5788884096	139234	1122.79	401.93	17	36	-1	14.86	14.86
Fixation R	1	3	5788744862	5788884096	139234	1122.79	401.93	17	36	-1	15.00	15.00
Blink L	1	2	5788884096	5789063083	178987
Blink R	1	2	5788884096	5789063083	178987
Fixation L	1	4	5789063083	5789739308	676225	1032.54	426.46	65	33	-1	15.54	15.54
Fixation R	1	4	5789063083	5789739308	676225	1032.54	426.46	65	33	-1	15.88	15.88
Saccade L	1	3	5789739308	5789759176	19868	993.93	439.53	992.82	439.75	0.04	3.71	1.00	2.15	45.16	-6.26	28.52
Saccade R	1	3	5789739308	5789759176	19868	993.93	439.53	992.82	439.75	0.04	3.71	1.00	2.15	45.16	-6.26	28.52
Fixation L	1	5	5789759176	5790057538	298362	974.78	444.25	36	17	-1	15.07	15.07
Fixation R	1	5	5789759176	5790057538	298362	974.78	444.25	36	17	-1	15.13	15.13
