[BeGaze]
Converted from:	C:\Documents and Settings\iViewX\Desktop\EXPERIMENTATIONS\Experiments\results\finaleart\S3121421-finaleart-1.idf
Date:	27.03.2019 15:34:12
Version:	BeGaze 2.5.77
Sample Rate:	50
Subject:	S3121421
Description:	Jean Jouve

Table Header for Fixations:
Event Type	Trial	Number	Start	End	Duration	Location X	Location Y	Dispersion X	Dispersion Y	Plane	Avg. Pupil Size X	Avg. Pupil Size Y

Table Header for Saccades:
Event Type	Trial	Number	Start	End	Duration	Start Loc.X	Start Loc.Y	End Loc.X	End Loc.Y	Amplitude	Peak Speed	Peak Speed At	Average Speed	Peak Accel.	Peak Decel.	Average Accel.

Table Header for Blinks:
Event Type	Trial	Number	Start	End	Duration

Table Header for User Events:
Event Type	Trial	Number	Start	Description

UserEvent	1	1	5502741331	# Message: lying-nude_ury_1889.jpg
Fixation L	1	1	5502756476	5503213827	457351	964.42	397.23	12	67	-1	9.09	9.09
Fixation R	1	1	5502756476	5503213827	457351	964.42	397.23	12	67	-1	9.88	9.88
Blink L	1	1	5503213827	5503313312	99485
Saccade R	1	1	5503213827	5503273572	59745	968.15	406.58	528.29	601.13	5.35	210.16	0.33	89.63	5140.14	-3277.44	3459.71
Fixation R	1	2	5503273572	5503512162	238590	522.33	590.97	10	41	-1	10.40	10.40
Fixation L	1	2	5503313312	5503512162	198850	521.61	592.41	9	30	-1	11.31	11.31
Saccade L	1	1	5503512162	5503532053	19891	519.20	587.97	340.78	634.00	1.11	186.34	1.00	56.05	4523.30	-4638.51	3128.75
Saccade R	1	2	5503512162	5503532053	19891	519.20	587.97	340.78	634.00	1.11	186.34	1.00	56.05	4523.30	-4638.51	3128.75
Fixation L	1	3	5503532053	5504069147	537094	357.72	687.07	32	67	-1	10.80	10.80
Fixation R	1	3	5503532053	5504069147	537094	357.72	687.07	32	67	-1	10.16	10.16
Saccade L	1	2	5504069147	5504089002	19855	372.83	701.46	382.89	708.31	0.15	12.32	1.00	7.33	209.04	-215.63	187.88
Saccade R	1	3	5504069147	5504089002	19855	372.83	701.46	382.89	708.31	0.15	12.32	1.00	7.33	209.04	-215.63	187.88
Fixation L	1	4	5504089002	5504287877	198875	384.04	701.26	23	14	-1	10.81	10.81
Fixation R	1	4	5504089002	5504287877	198875	384.04	701.26	23	14	-1	10.30	10.30
Saccade L	1	3	5504287877	5504427120	139243	399.55	693.33	647.55	554.55	6.52	211.47	0.14	46.79	5243.45	-5215.46	1814.94
Saccade R	1	4	5504287877	5504427120	139243	399.55	693.33	647.55	554.55	6.52	211.47	0.14	46.79	5243.45	-5215.46	1814.94
Fixation L	1	5	5504427120	5504606106	178986	683.95	580.76	53	42	-1	10.99	10.99
Fixation R	1	5	5504427120	5504606106	178986	683.95	580.76	53	42	-1	10.35	10.35
Saccade L	1	4	5504606106	5504665734	59628	701.02	597.27	1063.31	577.28	4.06	158.94	0.67	68.09	3674.08	-3581.30	2563.61
Saccade R	1	5	5504606106	5504665734	59628	701.02	597.27	1063.31	577.28	4.06	158.94	0.67	68.09	3674.08	-3581.30	2563.61
Fixation L	1	6	5504665734	5504884594	218860	1059.40	577.07	6	25	-1	10.77	10.77
Fixation R	1	6	5504665734	5504884594	218860	1059.40	577.07	6	25	-1	9.47	9.47
Saccade L	1	5	5504884594	5504944219	59625	1058.13	575.14	1620.46	688.16	6.08	255.07	0.67	102.00	6189.56	-5996.34	4645.75
Saccade R	1	6	5504884594	5504944219	59625	1058.13	575.14	1620.46	688.16	6.08	255.07	0.67	102.00	6189.56	-5996.34	4645.75
Fixation L	1	7	5504944219	5505222696	278477	1603.26	713.45	26	73	-1	10.64	10.64
Fixation R	1	7	5504944219	5505222696	278477	1603.26	713.45	26	73	-1	8.41	8.41
Saccade L	1	6	5505222696	5505342069	119373	1597.85	734.62	1036.71	346.54	10.74	284.66	0.67	89.98	7042.08	-4267.00	2838.19
Saccade R	1	7	5505222696	5505342069	119373	1597.85	734.62	1036.71	346.54	10.74	284.66	0.67	89.98	7042.08	-4267.00	2838.19
Fixation L	1	8	5505342069	5505580675	238606	1034.83	328.30	10	25	-1	10.49	10.49
Fixation R	1	8	5505342069	5505580675	238606	1034.83	328.30	10	25	-1	9.10	9.10
Saccade L	1	7	5505580675	5505640299	59624	1041.27	327.03	1015.19	749.74	4.79	214.38	0.67	80.41	5301.91	-4109.58	3043.06
Saccade R	1	8	5505580675	5505640299	59624	1041.27	327.03	1015.19	749.74	4.79	214.38	0.67	80.41	5301.91	-4109.58	3043.06
Fixation L	1	9	5505640299	5505739792	99493	993.81	785.97	33	59	-1	10.90	10.90
Fixation R	1	9	5505640299	5505739792	99493	993.81	785.97	33	59	-1	9.36	9.36
Saccade L	1	8	5505739792	5505759662	19870	981.65	771.96	973.47	794.61	0.56	54.54	1.00	28.01	922.47	221.66	520.36
Saccade R	1	9	5505739792	5505759662	19870	981.65	771.96	973.47	794.61	0.56	54.54	1.00	28.01	922.47	221.66	520.36
Fixation L	1	10	5505759662	5505879028	119366	967.89	777.56	10	57	-1	11.12	11.12
Fixation R	1	10	5505759662	5505879028	119366	967.89	777.56	10	57	-1	9.70	9.70
Saccade L	1	9	5505879028	5505918795	39767	963.50	793.11	686.53	670.82	3.31	175.93	0.50	83.30	3235.12	-4063.36	3134.42
Saccade R	1	10	5505879028	5505918795	39767	963.50	793.11	686.53	670.82	3.31	175.93	0.50	83.30	3235.12	-4063.36	3134.42
Fixation L	1	11	5505918795	5506157506	238711	684.40	658.04	18	17	-1	11.00	11.00
Fixation R	1	11	5505918795	5506157506	238711	684.40	658.04	18	17	-1	10.08	10.08
Saccade L	1	10	5506157506	5506197258	39752	674.96	655.13	414.66	653.89	2.30	164.16	0.50	57.97	4046.89	-3626.57	3096.48
Saccade R	1	11	5506157506	5506197258	39752	674.96	655.13	414.66	653.89	2.30	164.16	0.50	57.97	4046.89	-3626.57	3096.48
Fixation L	1	12	5506197258	5506475733	278475	396.33	645.02	43	54	-1	10.44	10.44
Fixation R	1	12	5506197258	5506475733	278475	396.33	645.02	43	54	-1	9.69	9.69
Saccade L	1	11	5506475733	5506495624	19891	371.00	689.83	353.84	709.92	0.53	59.54	0.00	26.73	586.07	-1053.89	651.72
Saccade R	1	12	5506475733	5506495624	19891	371.00	689.83	353.84	709.92	0.53	59.54	0.00	26.73	586.07	-1053.89	651.72
Fixation L	1	13	5506495624	5506734227	238603	338.13	696.94	21	41	-1	10.30	10.30
Fixation R	1	13	5506495624	5506734227	238603	338.13	696.94	21	41	-1	9.73	9.73
