[BeGaze]
Converted from:	C:\Documents and Settings\iViewX\Desktop\EXPERIMENTATIONS\Experiments\results\finaleart\S16F14542-finaleart-1.idf
Date:	27.03.2019 15:46:44
Version:	BeGaze 2.5.77
Sample Rate:	50
Subject:	S16F14542
Description:	Diane Dewez

Table Header for Fixations:
Event Type	Trial	Number	Start	End	Duration	Location X	Location Y	Dispersion X	Dispersion Y	Plane	Avg. Pupil Size X	Avg. Pupil Size Y

Table Header for Saccades:
Event Type	Trial	Number	Start	End	Duration	Start Loc.X	Start Loc.Y	End Loc.X	End Loc.Y	Amplitude	Peak Speed	Peak Speed At	Average Speed	Peak Accel.	Peak Decel.	Average Accel.

Table Header for Blinks:
Event Type	Trial	Number	Start	End	Duration

Table Header for User Events:
Event Type	Trial	Number	Start	Description

UserEvent	1	1	6759705032	# Message: Matisse-Nature-morte-a-la-cruche-bleue.jpg
Fixation L	1	1	6759716409	6760193761	477352	977.78	528.75	7	17	-1	11.89	11.89
Fixation R	1	1	6759716409	6760193761	477352	977.78	528.75	7	17	-1	11.51	11.51
Saccade L	1	1	6760193761	6760213619	19858	980.44	520.87	974.61	392.96	0.78	129.51	1.00	39.49	3150.45	-2800.25	2129.98
Saccade R	1	1	6760193761	6760213619	19858	980.44	520.87	974.61	392.96	0.78	129.51	1.00	39.49	3150.45	-2800.25	2129.98
Fixation L	1	2	6760213619	6760472233	258614	936.66	383.75	74	19	-1	13.04	13.04
Fixation R	1	2	6760213619	6760472233	258614	936.66	383.75	74	19	-1	12.67	12.67
Saccade L	1	2	6760472233	6760492118	19885	900.10	384.91	842.66	376.38	0.48	58.74	1.00	24.04	1399.40	-1228.79	1026.85
Saccade R	1	2	6760472233	6760492118	19885	900.10	384.91	842.66	376.38	0.48	58.74	1.00	24.04	1399.40	-1228.79	1026.85
Fixation L	1	3	6760492118	6760750596	258478	827.39	387.74	19	17	-1	13.31	13.31
Fixation R	1	3	6760492118	6760750596	258478	827.39	387.74	19	17	-1	13.46	13.46
Saccade L	1	3	6760750596	6760790479	39883	823.82	393.43	1131.07	551.98	3.04	178.75	0.50	76.25	4457.20	-4162.60	4152.14
Saccade R	1	3	6760750596	6760790479	39883	823.82	393.43	1131.07	551.98	3.04	178.75	0.50	76.25	4457.20	-4162.60	4152.14
Fixation L	1	4	6760790479	6761148450	357971	1152.38	558.14	28	31	-1	14.72	14.72
Fixation R	1	4	6760790479	6761148450	357971	1152.38	558.14	28	31	-1	14.40	14.40
Saccade L	1	4	6761148450	6761168330	19880	1152.64	574.80	1041.79	716.11	1.05	181.62	1.00	52.61	4413.59	-4379.50	2966.23
Saccade R	1	4	6761148450	6761168330	19880	1152.64	574.80	1041.79	716.11	1.05	181.62	1.00	52.61	4413.59	-4379.50	2966.23
Fixation L	1	5	6761168330	6761327457	159127	1037.89	737.48	6	48	-1	15.41	15.41
Fixation R	1	5	6761168330	6761327457	159127	1037.89	737.48	6	48	-1	15.03	15.03
Blink L	1	1	6761327457	6761566177	238720
Blink R	1	1	6761327457	6761566177	238720
Fixation L	1	6	6761566177	6761804794	238617	987.44	535.59	6	33	-1	16.42	16.42
Fixation R	1	6	6761566177	6761804794	238617	987.44	535.59	6	33	-1	16.55	16.55
Saccade L	1	5	6761804794	6761844662	39868	990.82	535.55	1177.43	557.54	1.70	99.16	1.00	42.59	2420.57	-2275.95	2227.62
Saccade R	1	5	6761804794	6761844662	39868	990.82	535.55	1177.43	557.54	1.70	99.16	1.00	42.59	2420.57	-2275.95	2227.62
Fixation L	1	7	6761844662	6761983919	139257	1162.45	577.06	20	28	-1	16.28	16.28
Fixation R	1	7	6761844662	6761983919	139257	1162.45	577.06	20	28	-1	16.47	16.47
Saccade L	1	6	6761983919	6762023681	39762	1157.33	583.37	1172.94	818.24	2.12	172.43	0.50	53.20	4196.23	-4004.63	2915.92
Saccade R	1	6	6761983919	6762023681	39762	1157.33	583.37	1172.94	818.24	2.12	172.43	0.50	53.20	4196.23	-4004.63	2915.92
Fixation L	1	8	6762023681	6762282145	258464	1187.86	836.47	20	23	-1	16.59	16.59
Fixation R	1	8	6762023681	6762282145	258464	1187.86	836.47	20	23	-1	16.64	16.64
Saccade L	1	7	6762282145	6762302150	20005	1189.19	838.85	1047.61	847.17	0.86	143.44	1.00	43.10	3551.05	-3472.28	2513.26
Saccade R	1	7	6762282145	6762302150	20005	1189.19	838.85	1047.61	847.17	0.86	143.44	1.00	43.10	3551.05	-3472.28	2513.26
Fixation L	1	9	6762302150	6762779507	477357	1061.67	853.51	23	17	-1	15.66	15.66
Fixation R	1	9	6762302150	6762779507	477357	1061.67	853.51	23	17	-1	15.62	15.62
Blink L	1	2	6762779507	6762978369	198862
Blink R	1	2	6762779507	6762978369	198862
Saccade L	1	8	6762978369	6762998241	19872	878.02	511.95	858.84	432.61	5.66	1027.11	1.00	284.87	-85.69	-23613.62	8478.73
Saccade R	1	8	6762978369	6762998241	19872	878.02	511.95	858.84	432.61	5.66	1027.11	1.00	284.87	-85.69	-23613.62	8478.73
Fixation L	1	10	6762998241	6763296598	298357	861.30	440.08	9	48	-1	15.10	15.10
Fixation R	1	10	6762998241	6763296598	298357	861.30	440.08	9	48	-1	14.20	14.20
Saccade L	1	9	6763296598	6763316473	19875	864.94	434.85	962.62	436.99	0.53	98.83	1.00	26.61	2456.25	-2280.54	1628.65
Saccade R	1	9	6763296598	6763316473	19875	864.94	434.85	962.62	436.99	0.53	98.83	1.00	26.61	2456.25	-2280.54	1628.65
Fixation L	1	11	6763316473	6763654586	338113	951.50	440.75	82	9	-1	15.06	15.06
Fixation R	1	11	6763316473	6763654586	338113	951.50	440.75	82	9	-1	14.42	14.42
Saccade L	1	10	6763654586	6763694463	39877	1023.01	440.35	1138.53	459.49	2.15	124.61	0.50	54.03	3029.45	-1716.35	1581.93
Saccade R	1	10	6763654586	6763694463	39877	1023.01	440.35	1138.53	459.49	2.15	124.61	0.50	54.03	3029.45	-1716.35	1581.93
