[BeGaze]
Converted from:	C:\Documents and Settings\iViewX\Desktop\EXPERIMENTATIONS\Experiments\results\finaleart\S1022551-finaleart-1.idf
Date:	27.03.2019 15:37:57
Version:	BeGaze 2.5.77
Sample Rate:	50
Subject:	S1022551
Description:	Alexis Nebout

Table Header for Fixations:
Event Type	Trial	Number	Start	End	Duration	Location X	Location Y	Dispersion X	Dispersion Y	Plane	Avg. Pupil Size X	Avg. Pupil Size Y

Table Header for Saccades:
Event Type	Trial	Number	Start	End	Duration	Start Loc.X	Start Loc.Y	End Loc.X	End Loc.Y	Amplitude	Peak Speed	Peak Speed At	Average Speed	Peak Accel.	Peak Decel.	Average Accel.

Table Header for Blinks:
Event Type	Trial	Number	Start	End	Duration

Table Header for User Events:
Event Type	Trial	Number	Start	Description

UserEvent	1	1	8226677081	# Message: Naked_man_reversed_on_the_ground_Gericault_1817.jpg
Fixation L	1	1	8226677732	8227037468	359736	961.07	594.79	23	33	-1	10.39	10.39
Fixation R	1	1	8226677732	8227037468	359736	961.07	594.79	23	33	-1	10.31	10.31
Saccade L	1	1	8227037468	8227075435	37967	967.38	603.99	886.45	596.85	0.95	82.18	1.00	24.97	2010.91	-1918.06	1429.98
Saccade R	1	1	8227037468	8227075435	37967	967.38	603.99	886.45	596.85	0.95	82.18	1.00	24.97	2010.91	-1918.06	1429.98
Fixation L	1	2	8227075435	8227532933	457498	882.71	575.98	7	27	-1	10.85	10.85
Fixation R	1	2	8227075435	8227532933	457498	882.71	575.98	7	27	-1	10.86	10.86
Saccade L	1	2	8227532933	8227556268	23335	882.93	573.42	953.37	572.19	0.51	71.27	1.00	22.00	1746.30	-1454.12	1149.23
Saccade R	1	2	8227532933	8227556268	23335	882.93	573.42	953.37	572.19	0.51	71.27	1.00	22.00	1746.30	-1454.12	1149.23
Fixation L	1	3	8227556268	8227811402	255134	952.90	570.47	16	12	-1	10.66	10.66
Fixation R	1	3	8227556268	8227811402	255134	952.90	570.47	16	12	-1	10.78	10.78
Saccade L	1	3	8227811402	8227831285	19883	955.90	562.06	855.82	558.60	0.56	101.29	1.00	28.14	2480.23	-2475.10	1659.77
Saccade R	1	3	8227811402	8227831285	19883	955.90	562.06	855.82	558.60	0.56	101.29	1.00	28.14	2480.23	-2475.10	1659.77
Fixation L	1	4	8227831285	8228209275	377990	849.62	550.37	16	14	-1	11.02	11.02
Fixation R	1	4	8227831285	8228209275	377990	849.62	550.37	16	14	-1	10.92	10.92
Saccade L	1	4	8228209275	8228229141	19866	862.47	550.22	977.25	550.73	0.68	116.11	1.00	34.03	2869.63	-2823.09	2023.24
Saccade R	1	4	8228209275	8228229141	19866	862.47	550.22	977.25	550.73	0.68	116.11	1.00	34.03	2869.63	-2823.09	2023.24
Fixation L	1	5	8228229141	8228686615	457474	978.89	531.20	13	82	-1	11.79	11.79
Fixation R	1	5	8228229141	8228686615	457474	978.89	531.20	13	82	-1	11.49	11.49
Saccade L	1	5	8228686615	8228726354	39739	985.92	479.09	571.36	316.63	4.05	402.01	1.00	101.88	10009.67	-9843.76	5284.71
Saccade R	1	5	8228686615	8228726354	39739	985.92	479.09	571.36	316.63	4.05	402.01	1.00	101.88	10009.67	-9843.76	5284.71
Fixation L	1	6	8228726354	8229163956	437602	518.69	315.90	62	20	-1	11.14	11.14
Fixation R	1	6	8228726354	8229163956	437602	518.69	315.90	62	20	-1	10.98	10.98
Saccade L	1	6	8229163956	8229183842	19886	509.22	300.72	470.97	104.83	1.31	201.83	1.00	65.90	5000.23	-4498.67	3464.35
Saccade R	1	6	8229163956	8229183842	19886	509.22	300.72	470.97	104.83	1.31	201.83	1.00	65.90	5000.23	-4498.67	3464.35
Fixation L	1	7	8229183842	8229422574	238732	448.38	99.81	33	60	-1	10.27	10.27
Fixation R	1	7	8229183842	8229422574	238732	448.38	99.81	33	60	-1	10.71	10.71
Saccade L	1	7	8229422574	8229482193	59619	463.12	128.82	923.88	368.48	5.64	376.04	0.67	94.68	9161.65	-9181.19	5117.27
Saccade R	1	7	8229422574	8229482193	59619	463.12	128.82	923.88	368.48	5.64	376.04	0.67	94.68	9161.65	-9181.19	5117.27
Fixation L	1	8	8229482193	8229959551	477358	937.74	381.30	37	34	-1	10.64	10.64
Fixation R	1	8	8229482193	8229959551	477358	937.74	381.30	37	34	-1	10.84	10.84
Saccade L	1	8	8229959551	8229979428	19877	960.96	403.38	1023.01	452.72	0.66	80.19	1.00	33.08	1948.98	-1720.35	1261.11
Saccade R	1	8	8229959551	8229979428	19877	960.96	403.38	1023.01	452.72	0.66	80.19	1.00	33.08	1948.98	-1720.35	1261.11
Fixation L	1	9	8229979428	8230138536	159108	1026.45	445.55	17	28	-1	11.01	11.01
Fixation R	1	9	8229979428	8230138536	159108	1026.45	445.55	17	28	-1	11.10	11.10
Saccade L	1	9	8230138536	8230178288	39752	1027.54	460.64	1229.05	512.02	1.91	138.72	0.50	48.10	3323.66	-3094.88	2434.01
Saccade R	1	9	8230138536	8230178288	39752	1027.54	460.64	1229.05	512.02	1.91	138.72	0.50	48.10	3323.66	-3094.88	2434.01
Fixation L	1	10	8230178288	8230417033	238745	1242.85	545.62	17	51	-1	11.22	11.22
Fixation R	1	10	8230178288	8230417033	238745	1242.85	545.62	17	51	-1	10.96	10.96
Saccade L	1	10	8230417033	8230436903	19870	1246.61	563.37	1388.34	565.01	0.78	143.36	1.00	39.39	3530.12	-3463.05	2336.21
Saccade R	1	10	8230417033	8230436903	19870	1246.61	563.37	1388.34	565.01	0.78	143.36	1.00	39.39	3530.12	-3463.05	2336.21
Fixation L	1	11	8230436903	8230655643	218740	1391.21	575.06	63	28	-1	11.35	11.35
Fixation R	1	11	8230436903	8230655643	218740	1391.21	575.06	63	28	-1	10.88	10.88
Saccade L	1	11	8230655643	8230695519	39876	1446.21	593.58	1467.57	633.82	1.14	59.74	0.00	28.54	671.35	-1089.68	587.01
Saccade R	1	11	8230655643	8230695519	39876	1446.21	593.58	1467.57	633.82	1.14	59.74	0.00	28.54	671.35	-1089.68	587.01
