[BeGaze]
Converted from:	C:\Documents and Settings\iViewX\Desktop\EXPERIMENTATIONS\Experiments\results\finaleart\S14F27123-finaleart-1.idf
Date:	27.03.2019 15:42:50
Version:	BeGaze 2.5.77
Sample Rate:	50
Subject:	S14F27123
Description:	Anne-flore Perrin

Table Header for Fixations:
Event Type	Trial	Number	Start	End	Duration	Location X	Location Y	Dispersion X	Dispersion Y	Plane	Avg. Pupil Size X	Avg. Pupil Size Y

Table Header for Saccades:
Event Type	Trial	Number	Start	End	Duration	Start Loc.X	Start Loc.Y	End Loc.X	End Loc.Y	Amplitude	Peak Speed	Peak Speed At	Average Speed	Peak Accel.	Peak Decel.	Average Accel.

Table Header for Blinks:
Event Type	Trial	Number	Start	End	Duration

Table Header for User Events:
Event Type	Trial	Number	Start	Description

UserEvent	1	1	30343251169	# Message: void.jpg
Fixation L	1	1	30343269624	30343428732	159108	1298.28	716.21	33	16	-1	15.85	15.85
Fixation R	1	1	30343269624	30343428732	159108	1298.28	716.21	33	16	-1	16.30	16.30
Saccade L	1	1	30343428732	30343468491	39759	1271.95	715.00	625.30	804.10	5.85	444.09	0.50	147.25	11021.83	-10422.23	7697.15
Saccade R	1	1	30343428732	30343468491	39759	1271.95	715.00	625.30	804.10	5.85	444.09	0.50	147.25	11021.83	-10422.23	7697.15
Fixation L	1	2	30343468491	30343687346	218855	641.60	791.44	23	72	-1	15.20	15.20
Fixation R	1	2	30343468491	30343687346	218855	641.60	791.44	23	72	-1	15.85	15.85
Saccade L	1	2	30343687346	30343746970	59624	648.49	796.30	644.70	822.28	10.89	1045.28	1.00	182.68	32941.85	-74.66	11879.11
Saccade R	1	2	30343687346	30343746970	59624	648.49	796.30	644.70	822.28	10.89	1045.28	1.00	182.68	32941.85	-74.66	11879.11
Blink L	1	1	30343746970	30343826593	79623
Blink R	1	1	30343746970	30343826593	79623
Blink L	1	2	30343846471	30344323819	477348
Blink R	1	2	30343846471	30344323819	477348
Fixation L	1	3	30344323819	30345238803	914984	838.19	767.59	29	50	-1	13.79	13.79
Fixation R	1	3	30344323819	30345238803	914984	838.19	767.59	29	50	-1	13.70	13.70
