[BeGaze]
Converted from:	C:\Documents and Settings\iViewX\Desktop\EXPERIMENTATIONS\Experiments\results\finaleart\S16F14542-finaleart-1.idf
Date:	27.03.2019 15:47:37
Version:	BeGaze 2.5.77
Sample Rate:	50
Subject:	S16F14542
Description:	Diane Dewez

Table Header for Fixations:
Event Type	Trial	Number	Start	End	Duration	Location X	Location Y	Dispersion X	Dispersion Y	Plane	Avg. Pupil Size X	Avg. Pupil Size Y

Table Header for Saccades:
Event Type	Trial	Number	Start	End	Duration	Start Loc.X	Start Loc.Y	End Loc.X	End Loc.Y	Amplitude	Peak Speed	Peak Speed At	Average Speed	Peak Accel.	Peak Decel.	Average Accel.

Table Header for Blinks:
Event Type	Trial	Number	Start	End	Duration

Table Header for User Events:
Event Type	Trial	Number	Start	Description

UserEvent	1	1	7298962863	# Message: lying-nude_ury_1889.jpg
Fixation L	1	1	7298972149	7299190878	218729	964.96	472.26	35	15	-1	9.69	9.69
Fixation R	1	1	7298972149	7299190878	218729	964.96	472.26	35	15	-1	10.51	10.51
Saccade L	1	1	7299190878	7299210755	19877	935.81	482.55	866.01	499.08	0.53	72.55	1.00	26.85	1773.98	-1633.18	1330.60
Saccade R	1	1	7299190878	7299210755	19877	935.81	482.55	866.01	499.08	0.53	72.55	1.00	26.85	1773.98	-1633.18	1330.60
Fixation L	1	2	7299210755	7299449504	238749	858.88	501.78	46	19	-1	10.60	10.60
Fixation R	1	2	7299210755	7299449504	238749	858.88	501.78	46	19	-1	11.36	11.36
Saccade L	1	2	7299449504	7299489262	39758	819.94	503.40	526.14	538.36	2.90	251.87	0.50	72.92	6226.29	-5684.90	3283.64
Saccade R	1	2	7299449504	7299489262	39758	819.94	503.40	526.14	538.36	2.90	251.87	0.50	72.92	6226.29	-5684.90	3283.64
Fixation L	1	3	7299489262	7299747862	258600	487.10	530.57	52	41	-1	11.30	11.30
Fixation R	1	3	7299489262	7299747862	258600	487.10	530.57	52	41	-1	11.92	11.92
Saccade L	1	3	7299747862	7299767747	19885	475.57	516.57	419.01	641.64	0.96	138.83	1.00	48.21	3355.06	-3248.40	2602.77
Saccade R	1	3	7299747862	7299767747	19885	475.57	516.57	419.01	641.64	0.96	138.83	1.00	48.21	3355.06	-3248.40	2602.77
Fixation L	1	4	7299767747	7299946733	178986	364.54	658.97	67	20	-1	11.41	11.41
Fixation R	1	4	7299767747	7299946733	178986	364.54	658.97	67	20	-1	12.13	12.13
Saccade L	1	4	7299946733	7299966595	19862	354.55	661.11	350.04	674.58	0.10	14.37	1.00	4.79	331.97	-198.60	201.14
Saccade R	1	4	7299946733	7299966595	19862	354.55	661.11	350.04	674.58	0.10	14.37	1.00	4.79	331.97	-198.60	201.14
Fixation L	1	5	7299966595	7300284830	318235	353.11	702.50	15	45	-1	11.72	11.72
Fixation R	1	5	7299966595	7300284830	318235	353.11	702.50	15	45	-1	12.66	12.66
Saccade L	1	5	7300284830	7300324578	39748	361.45	719.24	693.70	721.43	2.85	195.91	1.00	71.67	4856.24	-4428.46	3943.18
Saccade R	1	5	7300284830	7300324578	39748	361.45	719.24	693.70	721.43	2.85	195.91	1.00	71.67	4856.24	-4428.46	3943.18
Fixation L	1	6	7300324578	7300603067	278489	738.89	708.24	64	26	-1	12.25	12.25
Fixation R	1	6	7300324578	7300603067	278489	738.89	708.24	64	26	-1	13.49	13.49
Saccade L	1	6	7300603067	7300622937	19870	758.41	698.11	894.99	640.42	1.00	149.96	1.00	50.27	3545.30	-3525.51	2653.28
Saccade R	1	6	7300603067	7300622937	19870	758.41	698.11	894.99	640.42	1.00	149.96	1.00	50.27	3545.30	-3525.51	2653.28
Fixation L	1	7	7300622937	7300762184	139247	913.36	603.77	23	46	-1	12.31	12.31
Fixation R	1	7	7300622937	7300762184	139247	913.36	603.77	23	46	-1	12.89	12.89
Saccade L	1	7	7300762184	7300782055	19871	917.71	594.08	918.29	473.43	0.91	122.04	1.00	46.02	3024.56	-2965.81	2487.46
Saccade R	1	7	7300762184	7300782055	19871	917.71	594.08	918.29	473.43	0.91	122.04	1.00	46.02	3024.56	-2965.81	2487.46
Fixation L	1	8	7300782055	7300901416	119361	927.79	409.75	15	83	-1	11.99	11.99
Fixation R	1	8	7300782055	7300901416	119361	927.79	409.75	15	83	-1	12.36	12.36
Saccade L	1	8	7300901416	7300921314	19898	934.07	390.20	932.40	388.68	0.08	6.93	1.00	4.10	60.54	-9.57	31.08
Saccade R	1	8	7300901416	7300921314	19898	934.07	390.20	932.40	388.68	0.08	6.93	1.00	4.10	60.54	-9.57	31.08
Fixation L	1	9	7300921314	7301279407	358093	940.62	386.65	11	11	-1	11.63	11.63
Fixation R	1	9	7300921314	7301279407	358093	940.62	386.65	11	11	-1	11.94	11.94
Saccade L	1	9	7301279407	7301339031	59624	944.36	387.17	1339.71	429.89	4.26	170.10	0.67	71.45	4222.44	-3891.52	3019.05
Saccade R	1	9	7301279407	7301339031	59624	944.36	387.17	1339.71	429.89	4.26	170.10	0.67	71.45	4222.44	-3891.52	3019.05
Fixation L	1	10	7301339031	7301498138	159107	1343.11	437.14	33	32	-1	12.20	12.20
Fixation R	1	10	7301339031	7301498138	159107	1343.11	437.14	33	32	-1	12.49	12.49
Saccade L	1	10	7301498138	7301537893	39755	1368.43	422.03	1680.61	692.78	3.91	271.96	0.50	98.26	6485.53	-6461.90	4819.43
Saccade R	1	10	7301498138	7301537893	39755	1368.43	422.03	1680.61	692.78	3.91	271.96	0.50	98.26	6485.53	-6461.90	4819.43
Fixation L	1	11	7301537893	7301716882	178989	1682.35	677.20	44	33	-1	12.93	12.93
Fixation R	1	11	7301537893	7301716882	178989	1682.35	677.20	44	33	-1	13.03	13.03
Saccade L	1	11	7301716882	7301736766	19884	1716.26	659.26	1634.63	674.53	0.67	84.00	1.00	33.68	2053.66	-2061.16	1500.79
Saccade R	1	11	7301716882	7301736766	19884	1716.26	659.26	1634.63	674.53	0.67	84.00	1.00	33.68	2053.66	-2061.16	1500.79
Fixation L	1	12	7301736766	7302074991	338225	1595.27	672.44	53	16	-1	12.96	12.96
Fixation R	1	12	7301736766	7302074991	338225	1595.27	672.44	53	16	-1	12.92	12.92
Saccade L	1	12	7302074991	7302134616	59625	1581.39	677.93	875.16	581.84	7.50	297.59	0.33	125.84	7302.80	-5929.92	5381.72
Saccade R	1	12	7302074991	7302134616	59625	1581.39	677.93	875.16	581.84	7.50	297.59	0.33	125.84	7302.80	-5929.92	5381.72
Fixation L	1	13	7302134616	7302253989	119373	860.90	609.29	19	59	-1	11.87	11.87
Fixation R	1	13	7302134616	7302253989	119373	860.90	609.29	19	59	-1	12.79	12.79
Saccade L	1	13	7302253989	7302313614	59625	856.31	616.53	368.46	695.12	5.38	252.34	0.67	90.29	6116.51	-6186.24	4348.22
Saccade R	1	13	7302253989	7302313614	59625	856.31	616.53	368.46	695.12	5.38	252.34	0.67	90.29	6116.51	-6186.24	4348.22
Fixation L	1	14	7302313614	7302810843	497229	358.58	705.83	19	45	-1	12.22	12.22
Fixation R	1	14	7302313614	7302810843	497229	358.58	705.83	19	45	-1	13.17	13.17
Saccade L	1	14	7302810843	7302950076	139233	357.05	731.58	477.16	711.67	28.29	854.03	0.57	203.15	19859.96	-21229.02	10371.84
Saccade R	1	14	7302810843	7302950076	139233	357.05	731.58	477.16	711.67	28.29	854.03	0.57	203.15	19859.96	-21229.02	10371.84
