[BeGaze]
Converted from:	C:\Documents and Settings\iViewX\Desktop\EXPERIMENTATIONS\Experiments\results\finaleart\S8119532-finaleart-1.idf
Date:	27.03.2019 16:00:25
Version:	BeGaze 2.5.77
Sample Rate:	50
Subject:	S8119532
Description:	Alexandre Drewery

Table Header for Fixations:
Event Type	Trial	Number	Start	End	Duration	Location X	Location Y	Dispersion X	Dispersion Y	Plane	Avg. Pupil Size X	Avg. Pupil Size Y

Table Header for Saccades:
Event Type	Trial	Number	Start	End	Duration	Start Loc.X	Start Loc.Y	End Loc.X	End Loc.Y	Amplitude	Peak Speed	Peak Speed At	Average Speed	Peak Accel.	Peak Decel.	Average Accel.

Table Header for Blinks:
Event Type	Trial	Number	Start	End	Duration

Table Header for User Events:
Event Type	Trial	Number	Start	Description

UserEvent	1	1	3089450077	# Message: The_Orchard_Vlaminck_1905.jpg
Fixation L	1	1	3089451403	3089912304	460901	768.62	365.36	20	37	-1	14.68	14.68
Fixation R	1	1	3089451403	3089912304	460901	768.62	365.36	20	37	-1	16.81	16.81
Saccade L	1	1	3089912304	3089976259	63955	779.34	391.77	846.96	384.59	1.92	68.78	1.00	30.01	1573.62	-1120.91	975.32
Saccade R	1	1	3089912304	3089976259	63955	779.34	391.77	846.96	384.59	1.92	68.78	1.00	30.01	1573.62	-1120.91	975.32
Fixation L	1	2	3089976259	3090207217	230958	843.17	385.89	19	29	-1	15.19	15.19
Fixation R	1	2	3089976259	3090207217	230958	843.17	385.89	19	29	-1	17.47	17.47
Saccade L	1	2	3090207217	3090227092	19875	853.79	399.00	859.16	549.94	1.05	152.76	1.00	52.82	3536.01	-3597.24	2507.03
Saccade R	1	2	3090207217	3090227092	19875	853.79	399.00	859.16	549.94	1.05	152.76	1.00	52.82	3536.01	-3597.24	2507.03
Fixation L	1	3	3090227092	3090444752	217660	872.71	524.33	21	44	-1	15.35	15.35
Fixation R	1	3	3090227092	3090444752	217660	872.71	524.33	21	44	-1	17.45	17.45
Saccade L	1	3	3090444752	3090465721	20969	876.75	522.95	1092.92	823.43	2.17	373.93	1.00	103.61	8948.12	-8612.03	5890.25
Saccade R	1	3	3090444752	3090465721	20969	876.75	522.95	1092.92	823.43	2.17	373.93	1.00	103.61	8948.12	-8612.03	5890.25
Fixation L	1	4	3090465721	3090604966	139245	1090.57	833.39	13	30	-1	13.84	13.84
Fixation R	1	4	3090465721	3090604966	139245	1090.57	833.39	13	30	-1	15.09	15.09
Saccade L	1	4	3090604966	3090644700	39734	1096.27	832.64	1337.73	948.29	2.61	195.17	1.00	65.59	4542.40	-4862.85	3369.92
Saccade R	1	4	3090604966	3090644700	39734	1096.27	832.64	1337.73	948.29	2.61	195.17	1.00	65.59	4542.40	-4862.85	3369.92
Fixation L	1	5	3090644700	3090963061	318361	1338.44	951.83	20	36	-1	12.28	12.28
Fixation R	1	5	3090644700	3090963061	318361	1338.44	951.83	20	36	-1	12.87	12.87
Saccade L	1	5	3090963061	3090982933	19872	1345.54	950.05	1446.99	955.90	0.66	102.80	1.00	33.12	2408.43	-2489.31	1632.81
Saccade R	1	5	3090963061	3090982933	19872	1345.54	950.05	1446.99	955.90	0.66	102.80	1.00	33.12	2408.43	-2489.31	1632.81
Fixation L	1	6	3090982933	3091142048	159115	1449.20	973.59	9	32	-1	11.50	11.50
Fixation R	1	6	3090982933	3091142048	159115	1449.20	973.59	9	32	-1	11.63	11.63
Saccade L	1	6	3091142048	3091161919	19871	1442.27	976.12	1217.79	941.27	1.45	229.69	1.00	72.94	5586.64	-4688.71	3750.28
Saccade R	1	6	3091142048	3091161919	19871	1442.27	976.12	1217.79	941.27	1.45	229.69	1.00	72.94	5586.64	-4688.71	3750.28
Fixation L	1	7	3091161919	3091480154	318235	1214.65	917.17	19	76	-1	11.55	11.55
Fixation R	1	7	3091161919	3091480154	318235	1214.65	917.17	19	76	-1	12.05	12.05
Saccade L	1	7	3091480154	3091500024	19870	1221.62	924.41	1238.60	849.26	0.97	77.93	1.00	48.86	848.86	-562.75	548.54
Saccade R	1	7	3091480154	3091500024	19870	1221.62	924.41	1238.60	849.26	0.97	77.93	1.00	48.86	848.86	-562.75	548.54
Fixation L	1	8	3091500024	3091619398	119374	1233.82	849.19	27	61	-1	11.40	11.40
Fixation R	1	8	3091500024	3091619398	119374	1233.82	849.19	27	61	-1	11.72	11.72
Saccade L	1	8	3091619398	3091718894	99496	1243.81	850.93	771.86	395.19	11.53	249.37	0.40	115.93	5605.36	-2766.60	2839.26
Saccade R	1	8	3091619398	3091718894	99496	1243.81	850.93	771.86	395.19	11.53	249.37	0.40	115.93	5605.36	-2766.60	2839.26
Fixation L	1	9	3091718894	3091838285	119391	762.89	443.90	14	79	-1	11.24	11.24
Fixation R	1	9	3091718894	3091838285	119391	762.89	443.90	14	79	-1	12.41	12.41
Saccade L	1	9	3091838285	3091878006	39721	766.30	458.59	672.83	499.60	1.66	95.08	1.00	41.87	2062.77	-2285.69	1150.53
Saccade R	1	9	3091838285	3091878006	39721	766.30	458.59	672.83	499.60	1.66	95.08	1.00	41.87	2062.77	-2285.69	1150.53
Fixation L	1	10	3091878006	3092136499	258493	694.85	510.98	38	30	-1	11.29	11.29
Fixation R	1	10	3091878006	3092136499	258493	694.85	510.98	38	30	-1	12.58	12.58
Saccade L	1	10	3092136499	3092156501	20002	702.94	510.12	714.90	387.89	0.90	124.23	1.00	44.80	2744.60	-2551.83	1777.77
Saccade R	1	10	3092136499	3092156501	20002	702.94	510.12	714.90	387.89	0.90	124.23	1.00	44.80	2744.60	-2551.83	1777.77
Fixation L	1	11	3092156501	3092355365	198864	733.00	367.61	31	40	-1	11.63	11.63
Fixation R	1	11	3092156501	3092355365	198864	733.00	367.61	31	40	-1	13.12	13.12
Saccade L	1	11	3092355365	3092395111	39746	743.90	367.78	1025.54	281.38	2.68	187.87	0.50	67.35	4494.37	-4287.71	3551.47
Saccade R	1	11	3092355365	3092395111	39746	743.90	367.78	1025.54	281.38	2.68	187.87	0.50	67.35	4494.37	-4287.71	3551.47
Fixation L	1	12	3092395111	3092574116	179005	1008.11	289.05	23	47	-1	12.01	12.01
Fixation R	1	12	3092395111	3092574116	179005	1008.11	289.05	23	47	-1	13.46	13.46
Saccade L	1	12	3092574116	3092593982	19866	1014.08	275.37	1157.57	289.20	0.97	145.80	1.00	48.96	3287.11	-3423.89	2473.66
Saccade R	1	12	3092574116	3092593982	19866	1014.08	275.37	1157.57	289.20	0.97	145.80	1.00	48.96	3287.11	-3423.89	2473.66
Fixation L	1	13	3092593982	3092892338	298356	1162.56	302.87	25	52	-1	12.40	12.40
Fixation R	1	13	3092593982	3092892338	298356	1162.56	302.87	25	52	-1	13.93	13.93
Saccade L	1	13	3092892338	3092932208	39870	1159.51	314.58	831.20	296.94	2.82	226.67	1.00	70.72	5485.78	-4999.11	3857.71
Saccade R	1	13	3092892338	3092932208	39870	1159.51	314.58	831.20	296.94	2.82	226.67	1.00	70.72	5485.78	-4999.11	3857.71
Fixation L	1	14	3092932208	3093111197	178989	825.64	280.20	51	36	-1	12.15	12.15
Fixation R	1	14	3092932208	3093111197	178989	825.64	280.20	51	36	-1	13.67	13.67
Saccade L	1	14	3093111197	3093131079	19882	783.44	275.63	532.09	285.39	1.64	254.29	1.00	82.26	6167.89	-6182.75	4307.61
Saccade R	1	14	3093111197	3093131079	19882	783.44	275.63	532.09	285.39	1.64	254.29	1.00	82.26	6167.89	-6182.75	4307.61
Fixation L	1	15	3093131079	3093449319	318240	502.38	287.17	38	35	-1	12.05	12.05
Fixation R	1	15	3093131079	3093449319	318240	502.38	287.17	38	35	-1	13.47	13.47
