[BeGaze]
Converted from:	C:\Documents and Settings\iViewX\Desktop\EXPERIMENTATIONS\Experiments\results\finaleart\S11H21112-finaleart-1.idf
Date:	27.03.2019 15:39:17
Version:	BeGaze 2.5.77
Sample Rate:	50
Subject:	S11H21112
Description:	Clement legrand-Duchenne

Table Header for Fixations:
Event Type	Trial	Number	Start	End	Duration	Location X	Location Y	Dispersion X	Dispersion Y	Plane	Avg. Pupil Size X	Avg. Pupil Size Y

Table Header for Saccades:
Event Type	Trial	Number	Start	End	Duration	Start Loc.X	Start Loc.Y	End Loc.X	End Loc.Y	Amplitude	Peak Speed	Peak Speed At	Average Speed	Peak Accel.	Peak Decel.	Average Accel.

Table Header for Blinks:
Event Type	Trial	Number	Start	End	Duration

Table Header for User Events:
Event Type	Trial	Number	Start	Description

UserEvent	1	1	5297315914	# Message: void.jpg
Saccade L	1	1	5297321297	5297400889	79592	591.58	273.24	1063.16	329.44	6.96	259.77	0.75	87.50	5904.49	-6097.28	3112.04
Saccade R	1	1	5297321297	5297400889	79592	591.58	273.24	1063.16	329.44	6.96	259.77	0.75	87.50	5904.49	-6097.28	3112.04
Fixation L	1	1	5297400889	5297619755	218866	1076.42	331.77	24	45	-1	12.51	12.51
Fixation R	1	1	5297400889	5297619755	218866	1076.42	331.77	24	45	-1	14.46	14.46
Saccade L	1	2	5297619755	5297639758	20003	1087.58	352.35	1219.51	427.48	0.86	153.55	1.00	43.18	3809.21	-3623.34	2534.64
Saccade R	1	2	5297619755	5297639758	20003	1087.58	352.35	1219.51	427.48	0.86	153.55	1.00	43.18	3809.21	-3623.34	2534.64
Fixation L	1	2	5297639758	5297978122	338364	1210.53	440.93	23	28	-1	12.74	12.74
Fixation R	1	2	5297639758	5297978122	338364	1210.53	440.93	23	28	-1	14.67	14.67
Saccade L	1	3	5297978122	5298077608	99486	1227.18	433.51	1698.40	381.11	6.45	115.35	1.00	64.83	2019.82	-2647.03	1493.43
Saccade R	1	3	5297978122	5298077608	99486	1227.18	433.51	1698.40	381.11	6.45	115.35	1.00	64.83	2019.82	-2647.03	1493.43
Fixation L	1	3	5298077608	5298336480	258872	1707.29	365.43	36	62	-1	13.57	13.57
Fixation R	1	3	5298077608	5298336480	258872	1707.29	365.43	36	62	-1	15.18	15.18
Saccade L	1	4	5298336480	5298356348	19868	1688.01	400.45	1672.98	431.76	0.46	43.51	0.00	22.91	747.68	-893.13	788.57
Saccade R	1	4	5298336480	5298356348	19868	1688.01	400.45	1672.98	431.76	0.46	43.51	0.00	22.91	747.68	-893.13	788.57
Fixation L	1	4	5298356348	5298734714	378366	1644.34	445.80	53	45	-1	13.89	13.89
Fixation R	1	4	5298356348	5298734714	378366	1644.34	445.80	53	45	-1	15.57	15.57
Saccade L	1	5	5298734714	5298754592	19878	1623.41	453.80	1611.97	465.75	0.25	18.90	0.00	12.60	228.53	-293.35	251.41
Saccade R	1	5	5298734714	5298754592	19878	1623.41	453.80	1611.97	465.75	0.25	18.90	0.00	12.60	228.53	-293.35	251.41
Fixation L	1	5	5298754592	5299312184	557592	1606.34	467.81	17	41	-1	14.65	14.65
Fixation R	1	5	5298754592	5299312184	557592	1606.34	467.81	17	41	-1	16.25	16.25
