[BeGaze]
Converted from:	C:\Documents and Settings\iViewX\Desktop\EXPERIMENTATIONS\Experiments\results\finaleart\S22H22551-finaleart-1.idf
Date:	27.03.2019 15:58:53
Version:	BeGaze 2.5.77
Sample Rate:	50
Subject:	S22H22551
Description:	Mathieu Chambre

Table Header for Fixations:
Event Type	Trial	Number	Start	End	Duration	Location X	Location Y	Dispersion X	Dispersion Y	Plane	Avg. Pupil Size X	Avg. Pupil Size Y

Table Header for Saccades:
Event Type	Trial	Number	Start	End	Duration	Start Loc.X	Start Loc.Y	End Loc.X	End Loc.Y	Amplitude	Peak Speed	Peak Speed At	Average Speed	Peak Accel.	Peak Decel.	Average Accel.

Table Header for Blinks:
Event Type	Trial	Number	Start	End	Duration

Table Header for User Events:
Event Type	Trial	Number	Start	Description

UserEvent	1	1	5781922200	# Message: void.jpg
Fixation L	1	1	5781922586	5782041958	119372	1201.35	152.91	14	16	-1	16.93	16.93
Fixation R	1	1	5781922586	5782041958	119372	1201.35	152.91	14	16	-1	17.11	17.11
Saccade L	1	1	5782041958	5782101576	59618	1196.27	159.71	967.75	594.46	5.25	314.42	0.67	88.03	7815.20	-7507.71	4211.24
Saccade R	1	1	5782041958	5782101576	59618	1196.27	159.71	967.75	594.46	5.25	314.42	0.67	88.03	7815.20	-7507.71	4211.24
Fixation L	1	2	5782101576	5782340307	238731	977.26	607.94	15	19	-1	16.44	16.44
Fixation R	1	2	5782101576	5782340307	238731	977.26	607.94	15	19	-1	16.65	16.65
Blink L	1	1	5782340307	5782598790	258483
Blink R	1	1	5782340307	5782598790	258483
Fixation L	1	3	5782598790	5782757910	159120	1050.18	338.29	7	69	-1	14.86	14.86
Fixation R	1	3	5782598790	5782757910	159120	1050.18	338.29	7	69	-1	14.54	14.54
Blink L	1	2	5782757910	5782996645	238735
Blink R	1	2	5782757910	5782996645	238735
Fixation L	1	4	5782996645	5783394379	397734	1104.59	353.92	47	38	-1	15.29	15.29
Fixation R	1	4	5782996645	5783394379	397734	1104.59	353.92	47	38	-1	14.88	14.88
Saccade L	1	2	5783394379	5783414384	20005	1064.35	368.84	1046.15	369.71	0.32	34.89	0.00	16.10	319.41	-736.83	437.29
Saccade R	1	2	5783394379	5783414384	20005	1064.35	368.84	1046.15	369.71	0.32	34.89	0.00	16.10	319.41	-736.83	437.29
Fixation L	1	5	5783414384	5783911598	497214	1020.83	383.60	76	20	-1	14.77	14.77
Fixation R	1	5	5783414384	5783911598	497214	1020.83	383.60	76	20	-1	14.48	14.48
