[BeGaze]
Converted from:	C:\Documents and Settings\iViewX\Desktop\EXPERIMENTATIONS\Experiments\results\finaleart\S6124332-finaleart-1.idf
Date:	27.03.2019 15:36:06
Version:	BeGaze 2.5.77
Sample Rate:	50
Subject:	S6124332
Description:	Romain Ferrand

Table Header for Fixations:
Event Type	Trial	Number	Start	End	Duration	Location X	Location Y	Dispersion X	Dispersion Y	Plane	Avg. Pupil Size X	Avg. Pupil Size Y

Table Header for Saccades:
Event Type	Trial	Number	Start	End	Duration	Start Loc.X	Start Loc.Y	End Loc.X	End Loc.Y	Amplitude	Peak Speed	Peak Speed At	Average Speed	Peak Accel.	Peak Decel.	Average Accel.

Table Header for Blinks:
Event Type	Trial	Number	Start	End	Duration

Table Header for User Events:
Event Type	Trial	Number	Start	Description

UserEvent	1	1	12343110100	# Message: Le_port_d-Anvers_Braque_1906.jpg
Fixation L	1	1	12343120880	12343439105	318225	798.04	611.55	34	51	-1	19.80	19.80
Fixation R	1	1	12343120880	12343439105	318225	798.04	611.55	34	51	-1	17.93	17.93
Saccade L	1	1	12343439105	12343458987	19882	805.78	594.71	804.19	575.28	0.16	19.72	1.00	8.23	390.38	-315.96	285.73
Saccade R	1	1	12343439105	12343458987	19882	805.78	594.71	804.19	575.28	0.16	19.72	1.00	8.23	390.38	-315.96	285.73
Fixation L	1	2	12343458987	12343618095	159108	798.01	571.86	52	34	-1	19.25	19.25
Fixation R	1	2	12343458987	12343618095	159108	798.01	571.86	52	34	-1	17.60	17.60
Saccade L	1	2	12343618095	12343637966	19871	753.01	547.81	706.16	537.75	0.60	53.95	0.00	30.35	1171.43	-1175.84	1087.27
Saccade R	1	2	12343618095	12343637966	19871	753.01	547.81	706.16	537.75	0.60	53.95	0.00	30.35	1171.43	-1175.84	1087.27
Fixation L	1	3	12343637966	12343856828	218862	691.01	514.42	54	45	-1	18.40	18.40
Fixation R	1	3	12343637966	12343856828	218862	691.01	514.42	54	45	-1	17.23	17.23
Saccade L	1	3	12343856828	12343876707	19879	651.96	494.64	649.00	490.69	0.26	26.25	1.00	12.86	-31.14	-531.39	243.04
Saccade R	1	3	12343856828	12343876707	19879	651.96	494.64	649.00	490.69	0.26	26.25	1.00	12.86	-31.14	-531.39	243.04
Fixation L	1	4	12343876707	12344015969	139262	637.39	477.07	16	28	-1	17.08	17.08
Fixation R	1	4	12343876707	12344015969	139262	637.39	477.07	16	28	-1	16.28	16.28
Saccade L	1	4	12344015969	12344055684	39715	632.57	462.63	941.63	528.65	2.85	201.00	1.00	71.80	4800.42	-4840.21	3721.93
Saccade R	1	4	12344015969	12344055684	39715	632.57	462.63	941.63	528.65	2.85	201.00	1.00	71.80	4800.42	-4840.21	3721.93
Fixation L	1	5	12344055684	12344811515	755831	970.26	533.35	37	44	-1	16.76	16.76
Fixation R	1	5	12344055684	12344811515	755831	970.26	533.35	37	44	-1	16.23	16.23
Saccade L	1	5	12344811515	12345189363	377848	976.72	531.83	846.17	1038.98	23.79	242.40	0.05	62.96	5989.55	-4540.66	1742.56
Saccade R	1	5	12344811515	12345189363	377848	976.72	531.83	846.17	1038.98	23.79	242.40	0.05	62.96	5989.55	-4540.66	1742.56
Fixation L	1	6	12345189363	12345428107	238744	824.61	1077.79	32	58	-1	16.76	16.76
Fixation R	1	6	12345189363	12345428107	238744	824.61	1077.79	32	58	-1	14.43	14.43
Saccade L	1	6	12345428107	12345467857	39750	821.86	1083.94	766.69	1172.80	1.27	79.13	0.50	31.89	1897.66	-1338.65	1272.46
Saccade R	1	6	12345428107	12345467857	39750	821.86	1083.94	766.69	1172.80	1.27	79.13	0.50	31.89	1897.66	-1338.65	1272.46
Fixation L	1	7	12345467857	12345686596	218739	750.42	1207.40	23	63	-1	17.43	17.43
Fixation R	1	7	12345467857	12345686596	218739	750.42	1207.40	23	63	-1	16.23	16.23
Saccade L	1	7	12345686596	12345766205	79609	750.91	1231.19	869.48	583.65	8.38	264.24	0.50	105.21	6454.59	-5361.58	3886.20
Saccade R	1	7	12345686596	12345766205	79609	750.91	1231.19	869.48	583.65	8.38	264.24	0.50	105.21	6454.59	-5361.58	3886.20
Fixation L	1	8	12345766205	12346084442	318237	865.95	578.27	13	30	-1	17.55	17.55
Fixation R	1	8	12345766205	12346084442	318237	865.95	578.27	13	30	-1	16.24	16.24
Saccade L	1	8	12346084442	12346124191	39749	868.24	580.59	1084.40	571.22	2.14	124.44	0.50	53.82	3016.80	-2086.46	2353.77
Saccade R	1	8	12346084442	12346124191	39749	868.24	580.59	1084.40	571.22	2.14	124.44	0.50	53.82	3016.80	-2086.46	2353.77
Fixation L	1	9	12346124191	12346283320	159129	1120.41	539.54	43	52	-1	16.18	16.18
Fixation R	1	9	12346124191	12346283320	159129	1120.41	539.54	43	52	-1	16.26	16.26
Saccade L	1	9	12346283320	12346323055	39735	1126.12	528.15	1483.68	373.60	3.27	254.01	0.50	82.26	6298.48	-6032.23	4636.05
Saccade R	1	9	12346283320	12346323055	39735	1126.12	528.15	1483.68	373.60	3.27	254.01	0.50	82.26	6298.48	-6032.23	4636.05
Fixation L	1	10	12346323055	12346541913	218858	1452.65	388.16	50	40	-1	16.13	16.13
Fixation R	1	10	12346323055	12346541913	218858	1452.65	388.16	50	40	-1	14.54	14.54
Saccade L	1	10	12346541913	12346601545	59632	1437.60	401.22	1430.21	421.47	1.05	47.65	1.00	17.59	2010.62	-302.72	680.57
Saccade R	1	10	12346541913	12346740773	198860	1437.60	401.22	1467.28	185.17	11.34	216.27	0.60	57.00	4215.52	-5066.22	1883.44
Blink L	1	1	12346601545	12346701031	99486
Saccade L	1	11	12346701031	12346740773	39742	1468.46	224.27	1467.28	185.17	2.67	190.27	1.00	67.17	1383.73	-4444.20	1811.26
Fixation L	1	11	12346740773	12346840279	99506	1486.19	171.69	26	72	-1	16.33	16.33
Fixation R	1	11	12346740773	12346840279	99506	1486.19	171.69	26	72	-1	14.70	14.70
Saccade L	1	12	12346840279	12346860140	19861	1488.62	195.23	1489.32	202.62	0.15	14.92	1.00	7.80	49.68	-185.04	130.96
Saccade R	1	11	12346840279	12346860140	19861	1488.62	195.23	1489.32	202.62	0.15	14.92	1.00	7.80	49.68	-185.04	130.96
Fixation L	1	12	12346860140	12347059007	198867	1498.36	201.89	76	9	-1	16.20	16.20
Fixation R	1	12	12346860140	12347059007	198867	1498.36	201.89	76	9	-1	14.57	14.57
Saccade L	1	13	12347059007	12347098762	39755	1557.46	200.44	1577.83	163.39	1.11	58.61	1.00	27.91	173.27	-814.40	329.22
Saccade R	1	12	12347059007	12347098762	39755	1557.46	200.44	1577.83	163.39	1.11	58.61	1.00	27.91	173.27	-814.40	329.22
