[BeGaze]
Converted from:	C:\Documents and Settings\iViewX\Desktop\EXPERIMENTATIONS\Experiments\results\finaleart\S13H22431-finaleart-1.idf
Date:	27.03.2019 15:41:54
Version:	BeGaze 2.5.77
Sample Rate:	50
Subject:	S13H22431
Description:	Jimmy Petit

Table Header for Fixations:
Event Type	Trial	Number	Start	End	Duration	Location X	Location Y	Dispersion X	Dispersion Y	Plane	Avg. Pupil Size X	Avg. Pupil Size Y

Table Header for Saccades:
Event Type	Trial	Number	Start	End	Duration	Start Loc.X	Start Loc.Y	End Loc.X	End Loc.Y	Amplitude	Peak Speed	Peak Speed At	Average Speed	Peak Accel.	Peak Decel.	Average Accel.

Table Header for Blinks:
Event Type	Trial	Number	Start	End	Duration

Table Header for User Events:
Event Type	Trial	Number	Start	Description

UserEvent	1	1	27888121326	# Message: void.jpg
Fixation L	1	1	27888126382	27888265654	139272	677.76	189.90	14	37	-1	13.85	13.85
Fixation R	1	1	27888126382	27888265654	139272	677.76	189.90	14	37	-1	13.07	13.07
Saccade L	1	1	27888265654	27888345240	79586	684.59	204.18	1607.12	192.91	11.46	348.77	0.50	144.02	8336.11	-7517.32	5391.18
Saccade R	1	1	27888265654	27888345240	79586	684.59	204.18	1607.12	192.91	11.46	348.77	0.50	144.02	8336.11	-7517.32	5391.18
Fixation L	1	2	27888345240	27888544107	198867	1581.67	215.69	40	39	-1	14.27	14.27
Fixation R	1	2	27888345240	27888544107	198867	1581.67	215.69	40	39	-1	14.81	14.81
Blink L	1	1	27888544107	27888782868	238761
Blink R	1	1	27888544107	27888782868	238761
Fixation L	1	3	27888782868	27888941968	159100	441.29	433.66	57	28	-1	14.88	14.88
Fixation R	1	3	27888782868	27888941968	159100	441.29	433.66	57	28	-1	15.06	15.06
Saccade L	1	2	27888941968	27889001585	59617	453.91	443.79	295.90	847.41	4.89	212.30	0.67	82.05	5242.64	-5084.45	3901.69
Saccade R	1	2	27888941968	27889001585	59617	453.91	443.79	295.90	847.41	4.89	212.30	0.67	82.05	5242.64	-5084.45	3901.69
Fixation L	1	4	27889001585	27889120959	119374	294.50	860.23	9	28	-1	14.82	14.82
Fixation R	1	4	27889001585	27889120959	119374	294.50	860.23	9	28	-1	15.29	15.29
