[BeGaze]
Converted from:	C:\Documents and Settings\iViewX\Desktop\EXPERIMENTATIONS\Experiments\results\finaleart\S15H25531-finaleart-1.idf
Date:	27.03.2019 15:45:39
Version:	BeGaze 2.5.77
Sample Rate:	50
Subject:	S15H25531
Description:	Mikail Demirdelen

Table Header for Fixations:
Event Type	Trial	Number	Start	End	Duration	Location X	Location Y	Dispersion X	Dispersion Y	Plane	Avg. Pupil Size X	Avg. Pupil Size Y

Table Header for Saccades:
Event Type	Trial	Number	Start	End	Duration	Start Loc.X	Start Loc.Y	End Loc.X	End Loc.Y	Amplitude	Peak Speed	Peak Speed At	Average Speed	Peak Accel.	Peak Decel.	Average Accel.

Table Header for Blinks:
Event Type	Trial	Number	Start	End	Duration

Table Header for User Events:
Event Type	Trial	Number	Start	Description

UserEvent	1	1	4541517733	# Message: still-life-with-fish_bazille_1866.jpg
Fixation L	1	1	4541536682	4541655963	119281	786.04	453.32	5	10	-1	13.34	13.34
Fixation R	1	1	4541536682	4541655963	119281	786.04	453.32	5	10	-1	15.01	15.01
Saccade L	1	1	4541655963	4541676182	20219	784.28	453.65	956.52	455.71	1.26	174.20	1.00	62.30	4132.49	-4286.06	3245.10
Saccade R	1	1	4541655963	4541676182	20219	784.28	453.65	956.52	455.71	1.26	174.20	1.00	62.30	4132.49	-4286.06	3245.10
Fixation L	1	2	4541676182	4541974166	297984	1012.86	447.12	67	17	-1	13.63	13.63
Fixation R	1	2	4541676182	4541974166	297984	1012.86	447.12	67	17	-1	15.23	15.23
Saccade L	1	2	4541974166	4542014041	39875	1023.62	437.82	709.25	443.60	2.63	205.91	0.50	65.92	5065.94	-4989.92	3865.08
Saccade R	1	2	4541974166	4542014041	39875	1023.62	437.82	709.25	443.60	2.63	205.91	0.50	65.92	5065.94	-4989.92	3865.08
Fixation L	1	3	4542014041	4542312405	298364	707.53	443.28	12	35	-1	14.25	14.25
Fixation R	1	3	4542014041	4542312405	298364	707.53	443.28	12	35	-1	15.65	15.65
Saccade L	1	3	4542312405	4542332272	19867	704.47	464.25	665.80	655.69	1.47	197.50	1.00	74.22	4874.65	-4580.18	3363.86
Saccade R	1	3	4542312405	4542332272	19867	704.47	464.25	665.80	655.69	1.47	197.50	1.00	74.22	4874.65	-4580.18	3363.86
Fixation L	1	4	4542332272	4542451638	119366	652.74	714.57	25	72	-1	14.64	14.64
Fixation R	1	4	4542332272	4542451638	119366	652.74	714.57	25	72	-1	16.16	16.16
Saccade L	1	4	4542451638	4542471515	19877	640.66	726.11	639.11	730.28	0.08	4.49	1.00	3.98	39.00	-39.94	28.51
Saccade R	1	4	4542451638	4542471515	19877	640.66	726.11	639.11	730.28	0.08	4.49	1.00	3.98	39.00	-39.94	28.51
Fixation L	1	5	4542471515	4542690255	218740	626.07	758.72	25	53	-1	14.90	14.90
Fixation R	1	5	4542471515	4542690255	218740	626.07	758.72	25	53	-1	16.56	16.56
Saccade L	1	5	4542690255	4542710121	19866	618.77	730.45	590.82	646.85	0.82	89.16	1.00	41.44	2174.96	-2120.69	1499.92
Saccade R	1	5	4542690255	4542710121	19866	618.77	730.45	590.82	646.85	0.82	89.16	1.00	41.44	2174.96	-2120.69	1499.92
Fixation L	1	6	4542710121	4543127858	417737	571.56	624.82	27	51	-1	14.65	14.65
Fixation R	1	6	4542710121	4543127858	417737	571.56	624.82	27	51	-1	16.98	16.98
Saccade L	1	6	4543127858	4543147730	19872	587.60	642.10	637.53	638.91	0.41	50.61	1.00	20.39	1217.84	-1061.21	794.76
Saccade R	1	6	4543127858	4543147730	19872	587.60	642.10	637.53	638.91	0.41	50.61	1.00	20.39	1217.84	-1061.21	794.76
Fixation L	1	7	4543147730	4543406348	258618	656.46	633.83	31	16	-1	14.76	14.76
Fixation R	1	7	4543147730	4543406348	258618	656.46	633.83	31	16	-1	17.27	17.27
Saccade L	1	7	4543406348	4543426215	19867	669.47	624.77	680.69	756.98	0.86	134.20	1.00	43.04	3325.87	-3157.98	2381.78
Saccade R	1	7	4543406348	4543426215	19867	669.47	624.77	680.69	756.98	0.86	134.20	1.00	43.04	3325.87	-3157.98	2381.78
Fixation L	1	8	4543426215	4543764328	338113	668.22	773.42	17	28	-1	15.39	15.39
Fixation R	1	8	4543426215	4543764328	338113	668.22	773.42	17	28	-1	17.68	17.68
Saccade L	1	8	4543764328	4543784202	19874	663.16	781.82	593.53	803.47	0.55	73.76	1.00	27.66	1732.39	-1289.90	1229.10
Saccade R	1	8	4543764328	4543784202	19874	663.16	781.82	593.53	803.47	0.55	73.76	1.00	27.66	1732.39	-1289.90	1229.10
Fixation L	1	9	4543784202	4544002943	218741	570.89	842.37	29	51	-1	15.74	15.74
Fixation R	1	9	4543784202	4544002943	218741	570.89	842.37	29	51	-1	17.63	17.63
Saccade L	1	9	4544002943	4544042815	39872	566.23	855.43	592.50	619.90	2.48	209.70	0.50	62.08	5188.75	-4947.10	3463.88
Saccade R	1	9	4544002943	4544042815	39872	566.23	855.43	592.50	619.90	2.48	209.70	0.50	62.08	5188.75	-4947.10	3463.88
Fixation L	1	10	4544042815	4544500288	457473	614.08	596.87	58	38	-1	15.08	15.08
Fixation R	1	10	4544042815	4544500288	457473	614.08	596.87	58	38	-1	17.48	17.48
Saccade L	1	10	4544500288	4544520166	19878	642.43	581.46	645.68	580.39	0.06	6.80	0.00	3.06	62.57	-144.44	75.33
Saccade R	1	10	4544500288	4544520166	19878	642.43	581.46	645.68	580.39	0.06	6.80	0.00	3.06	62.57	-144.44	75.33
Fixation L	1	11	4544520166	4544659404	139238	647.10	582.95	20	9	-1	15.33	15.33
Fixation R	1	11	4544520166	4544659404	139238	647.10	582.95	20	9	-1	17.57	17.57
Saccade L	1	11	4544659404	4544679284	19880	630.57	590.11	571.28	601.63	0.46	61.10	1.00	23.32	1510.09	-1429.49	1079.10
Saccade R	1	11	4544659404	4544679284	19880	630.57	590.11	571.28	601.63	0.46	61.10	1.00	23.32	1510.09	-1429.49	1079.10
Fixation L	1	12	4544679284	4545236132	556848	537.05	610.49	55	16	-1	15.54	15.54
Fixation R	1	12	4544679284	4545236132	556848	537.05	610.49	55	16	-1	17.64	17.64
Saccade L	1	12	4545236132	4545256129	19997	526.17	616.49	637.52	612.02	0.72	112.72	1.00	35.80	2729.43	-2615.53	1927.88
Saccade R	1	12	4545236132	4545256129	19997	526.17	616.49	637.52	612.02	0.72	112.72	1.00	35.80	2729.43	-2615.53	1927.88
Fixation L	1	13	4545256129	4545514612	258483	624.82	595.80	21	33	-1	15.22	15.22
Fixation R	1	13	4545256129	4545514612	258483	624.82	595.80	21	33	-1	17.56	17.56
