[BeGaze]
Converted from:	C:\Documents and Settings\iViewX\Desktop\EXPERIMENTATIONS\Experiments\results\finaleart\S3121421-finaleart-1.idf
Date:	27.03.2019 15:34:04
Version:	BeGaze 2.5.77
Sample Rate:	50
Subject:	S3121421
Description:	Jean Jouve

Table Header for Fixations:
Event Type	Trial	Number	Start	End	Duration	Location X	Location Y	Dispersion X	Dispersion Y	Plane	Avg. Pupil Size X	Avg. Pupil Size Y

Table Header for Saccades:
Event Type	Trial	Number	Start	End	Duration	Start Loc.X	Start Loc.Y	End Loc.X	End Loc.Y	Amplitude	Peak Speed	Peak Speed At	Average Speed	Peak Accel.	Peak Decel.	Average Accel.

Table Header for Blinks:
Event Type	Trial	Number	Start	End	Duration

Table Header for User Events:
Event Type	Trial	Number	Start	Description

UserEvent	1	1	4916179332	# Message: the-wood_cross_907.jpg
Fixation L	1	1	4916185896	4916623536	437640	900.86	379.15	12	25	-1	10.79	10.79
Fixation R	1	1	4916185896	4916623536	437640	900.86	379.15	12	25	-1	11.44	11.44
Saccade L	1	1	4916623536	4916683126	59590	902.13	391.14	1076.37	767.50	4.56	215.17	0.67	76.49	5284.74	-5258.49	3258.64
Saccade R	1	1	4916623536	4916683126	59590	902.13	391.14	1076.37	767.50	4.56	215.17	0.67	76.49	5284.74	-5258.49	3258.64
Fixation L	1	2	4916683126	4917339445	656319	1085.00	750.80	52	44	-1	10.62	10.62
Fixation R	1	2	4916683126	4917339445	656319	1085.00	750.80	52	44	-1	10.72	10.72
Saccade L	1	2	4917339445	4917359320	19875	1115.12	740.07	1117.05	723.51	0.17	16.86	1.00	8.77	238.75	-134.51	136.14
Saccade R	1	2	4917339445	4917359320	19875	1115.12	740.07	1117.05	723.51	0.17	16.86	1.00	8.77	238.75	-134.51	136.14
Fixation L	1	3	4917359320	4917478685	119365	1116.57	725.28	3	54	-1	10.11	10.11
Fixation R	1	3	4917359320	4917478685	119365	1116.57	725.28	3	54	-1	9.98	9.98
Saccade L	1	3	4917478685	4917498579	19894	1114.57	713.18	1112.31	795.73	0.95	83.54	1.00	47.65	1691.61	-1172.83	1024.20
Saccade R	1	3	4917478685	4917498579	19894	1114.57	713.18	1112.31	795.73	0.95	83.54	1.00	47.65	1691.61	-1172.83	1024.20
Fixation L	1	4	4917498579	4917896285	397706	1110.72	733.25	6	87	-1	9.91	9.91
Fixation R	1	4	4917498579	4917896285	397706	1110.72	733.25	6	87	-1	10.08	10.08
Saccade L	1	4	4917896285	4917936165	39880	1106.69	715.09	966.35	396.20	3.18	238.61	0.50	79.67	5551.99	-5588.85	4179.28
Saccade R	1	4	4917896285	4917936165	39880	1106.69	715.09	966.35	396.20	3.18	238.61	0.50	79.67	5551.99	-5588.85	4179.28
Fixation L	1	5	4917936165	4918393510	457345	943.19	405.43	32	17	-1	9.47	9.47
Fixation R	1	5	4917936165	4918393510	457345	943.19	405.43	32	17	-1	9.92	9.92
Saccade L	1	5	4918393510	4918473141	79631	941.65	407.81	921.14	810.04	4.95	183.92	0.25	62.16	4385.42	-4194.69	2282.20
Saccade R	1	5	4918393510	4918473141	79631	941.65	407.81	921.14	810.04	4.95	183.92	0.25	62.16	4385.42	-4194.69	2282.20
Fixation L	1	6	4918473141	4918691877	218736	906.22	810.37	22	74	-1	9.68	9.68
Fixation R	1	6	4918473141	4918691877	218736	906.22	810.37	22	74	-1	9.71	9.71
Saccade L	1	6	4918691877	4918711736	19859	900.17	813.94	900.05	891.96	0.84	78.93	1.00	42.38	1355.06	-1181.08	1096.41
Saccade R	1	6	4918691877	4918711736	19859	900.17	813.94	900.05	891.96	0.84	78.93	1.00	42.38	1355.06	-1181.08	1096.41
Fixation L	1	7	4918711736	4918811235	99499	902.08	830.93	4	94	-1	9.78	9.78
Fixation R	1	7	4918711736	4918811235	99499	902.08	830.93	4	94	-1	9.65	9.65
Saccade L	1	7	4918811235	4919010096	198861	904.50	822.62	1471.16	705.49	14.71	292.41	0.70	73.99	5301.26	-6391.00	2180.80
Saccade R	1	7	4918811235	4919010096	198861	904.50	822.62	1471.16	705.49	14.71	292.41	0.70	73.99	5301.26	-6391.00	2180.80
Fixation L	1	8	4919010096	4919189084	178988	1476.06	696.09	23	46	-1	9.75	9.75
Fixation R	1	8	4919010096	4919189084	178988	1476.06	696.09	23	46	-1	9.79	9.79
Saccade L	1	8	4919189084	4919209076	19992	1478.69	682.50	1482.36	575.39	0.78	108.41	1.00	38.77	2348.25	-2225.89	1544.51
Saccade R	1	8	4919189084	4919209076	19992	1478.69	682.50	1482.36	575.39	0.78	108.41	1.00	38.77	2348.25	-2225.89	1544.51
Fixation L	1	9	4919209076	4919865424	656348	1531.33	577.63	59	27	-1	9.54	9.54
Fixation R	1	9	4919209076	4919865424	656348	1531.33	577.63	59	27	-1	9.58	9.58
Saccade L	1	9	4919865424	4919925047	59623	1541.94	580.93	1535.65	161.47	4.38	239.82	0.67	73.45	5955.48	-5708.00	3472.25
Saccade R	1	9	4919865424	4919925047	59623	1541.94	580.93	1535.65	161.47	4.38	239.82	0.67	73.45	5955.48	-5708.00	3472.25
Fixation L	1	10	4919925047	4920024532	99485	1511.43	194.32	42	55	-1	9.39	9.39
Fixation R	1	10	4919925047	4920024532	99485	1511.43	194.32	42	55	-1	9.73	9.73
Saccade L	1	10	4920024532	4920044410	19878	1496.33	216.75	1485.98	220.68	0.18	16.54	1.00	9.24	84.84	-228.00	148.77
Saccade R	1	10	4920024532	4920044410	19878	1496.33	216.75	1485.98	220.68	0.18	16.54	1.00	9.24	84.84	-228.00	148.77
Fixation L	1	11	4920044410	4920223402	178992	1478.97	225.16	13	8	-1	9.26	9.26
Fixation R	1	11	4920044410	4920223402	178992	1478.97	225.16	13	8	-1	9.58	9.58
