[BeGaze]
Converted from:	C:\Documents and Settings\iViewX\Desktop\EXPERIMENTATIONS\Experiments\results\finaleart\S9H29221-finaleart-1.idf
Date:	27.03.2019 16:03:22
Version:	BeGaze 2.5.77
Sample Rate:	50
Subject:	S9H29221
Description:	steven

Table Header for Fixations:
Event Type	Trial	Number	Start	End	Duration	Location X	Location Y	Dispersion X	Dispersion Y	Plane	Avg. Pupil Size X	Avg. Pupil Size Y

Table Header for Saccades:
Event Type	Trial	Number	Start	End	Duration	Start Loc.X	Start Loc.Y	End Loc.X	End Loc.Y	Amplitude	Peak Speed	Peak Speed At	Average Speed	Peak Accel.	Peak Decel.	Average Accel.

Table Header for Blinks:
Event Type	Trial	Number	Start	End	Duration

Table Header for User Events:
Event Type	Trial	Number	Start	Description

UserEvent	1	1	6372959505	# Message: The_Gardener_Vlaminck_1904.jpg
Saccade L	1	1	6372959998	6372979877	19879	1169.34	367.50	1171.59	354.05	0.96	131.56	1.00	48.45	10719.00	0.00	4669.35
Saccade R	1	1	6372959998	6372979877	19879	1169.34	367.50	1171.59	354.05	0.96	131.56	1.00	48.45	10719.00	0.00	4669.35
Blink L	1	1	6372979877	6375976354	2996477
Blink R	1	1	6372979877	6375976354	2996477
Fixation L	1	1	6375976354	6376115592	139238	1083.24	502.27	7	5	-1	11.15	11.15
Fixation R	1	1	6375976354	6376135589	159235	1077.95	502.65	53	5	-1	10.67	10.67
Blink L	1	2	6376115592	6376215089	99497
Saccade R	1	2	6376135589	6376195217	59628	1035.59	505.73	891.08	590.03	4.16	186.86	0.33	69.81	4497.17	-2583.79	2280.93
Fixation R	1	2	6376195217	6376354336	159119	905.80	597.52	26	17	-1	9.87	9.87
Fixation L	1	2	6376215089	6376354336	139247	907.64	598.45	20	17	-1	9.58	9.58
Saccade L	1	2	6376354336	6376394076	39740	916.21	601.03	1258.21	375.33	3.64	231.64	0.50	91.60	5731.02	-4953.61	4827.25
Saccade R	1	3	6376354336	6376394076	39740	916.21	601.03	1258.21	375.33	3.64	231.64	0.50	91.60	5731.02	-4953.61	4827.25
Fixation L	1	3	6376394076	6376692456	298380	1261.47	378.48	37	59	-1	8.89	8.89
Fixation R	1	3	6376394076	6376692456	298380	1261.47	378.48	37	59	-1	9.36	9.36
Saccade L	1	3	6376692456	6376712319	19863	1260.06	330.40	1263.72	320.51	0.35	33.31	1.00	17.73	57.80	-566.29	372.44
Saccade R	1	4	6376692456	6376712319	19863	1260.06	330.40	1263.72	320.51	0.35	33.31	1.00	17.73	57.80	-566.29	372.44
Fixation L	1	4	6376712319	6376951053	238734	1275.20	313.37	27	28	-1	8.45	8.45
Fixation R	1	4	6376712319	6376951053	238734	1275.20	313.37	27	28	-1	8.92	8.92
Saccade L	1	4	6376951053	6376990801	39748	1281.92	301.53	1022.16	282.80	2.80	185.02	1.00	70.34	4318.09	0.00	2050.41
Saccade R	1	5	6376951053	6376990801	39748	1281.92	301.53	1022.16	282.80	2.80	185.02	1.00	70.34	4318.09	0.00	2050.41
