[BeGaze]
Converted from:	C:\Documents and Settings\iViewX\Desktop\EXPERIMENTATIONS\Experiments\results\finaleart\S11H21112-finaleart-1.idf
Date:	27.03.2019 15:39:37
Version:	BeGaze 2.5.77
Sample Rate:	50
Subject:	S11H21112
Description:	Clement legrand-Duchenne

Table Header for Fixations:
Event Type	Trial	Number	Start	End	Duration	Location X	Location Y	Dispersion X	Dispersion Y	Plane	Avg. Pupil Size X	Avg. Pupil Size Y

Table Header for Saccades:
Event Type	Trial	Number	Start	End	Duration	Start Loc.X	Start Loc.Y	End Loc.X	End Loc.Y	Amplitude	Peak Speed	Peak Speed At	Average Speed	Peak Accel.	Peak Decel.	Average Accel.

Table Header for Blinks:
Event Type	Trial	Number	Start	End	Duration

Table Header for User Events:
Event Type	Trial	Number	Start	Description

UserEvent	1	1	6092687964	# Message: the_kiss_gericault_1816.jpg
Saccade L	1	1	6092703421	6092783046	79625	957.48	170.01	897.43	229.02	2.39	56.90	1.00	30.07	876.92	-1380.84	659.52
Saccade R	1	1	6092703421	6092783046	79625	957.48	170.01	897.43	229.02	2.39	56.90	1.00	30.07	876.92	-1380.84	659.52
Fixation L	1	1	6092783046	6092882528	99482	868.06	266.08	37	48	-1	13.31	13.31
Fixation R	1	1	6092783046	6092882528	99482	868.06	266.08	37	48	-1	14.71	14.71
Saccade L	1	2	6092882528	6092922395	39867	859.90	276.00	796.04	279.07	1.08	75.63	1.00	27.16	1819.47	-1732.86	1501.79
Saccade R	1	2	6092882528	6092922395	39867	859.90	276.00	796.04	279.07	1.08	75.63	1.00	27.16	1819.47	-1732.86	1501.79
Fixation L	1	2	6092922395	6093081539	159144	795.56	286.09	21	20	-1	13.67	13.67
Fixation R	1	2	6092922395	6093081539	159144	795.56	286.09	21	20	-1	14.69	14.69
Saccade L	1	3	6093081539	6093101435	19896	810.99	297.85	969.41	415.22	1.20	199.37	1.00	60.09	4878.46	-4516.12	3136.14
Saccade R	1	3	6093081539	6093101435	19896	810.99	297.85	969.41	415.22	1.20	199.37	1.00	60.09	4878.46	-4516.12	3136.14
Fixation L	1	3	6093101435	6093360148	258713	997.08	402.44	34	60	-1	13.33	13.33
Fixation R	1	3	6093101435	6093360148	258713	997.08	402.44	34	60	-1	14.64	14.64
Saccade L	1	4	6093360148	6093380007	19859	1002.07	422.97	1133.63	418.47	0.94	133.15	1.00	47.12	3281.19	-3093.61	2520.06
Saccade R	1	4	6093360148	6093380007	19859	1002.07	422.97	1133.63	418.47	0.94	133.15	1.00	47.12	3281.19	-3093.61	2520.06
Fixation L	1	4	6093380007	6093539251	159244	1182.42	405.18	59	30	-1	12.91	12.91
Fixation R	1	4	6093380007	6093539251	159244	1182.42	405.18	59	30	-1	14.20	14.20
Saccade L	1	5	6093539251	6093658618	119367	1191.98	394.99	1199.56	274.97	2.27	97.76	1.00	18.99	2258.34	-2181.59	593.23
Saccade R	1	5	6093539251	6093658618	119367	1191.98	394.99	1199.56	274.97	2.27	97.76	1.00	18.99	2258.34	-2181.59	593.23
Fixation L	1	5	6093658618	6094613712	955094	1184.59	252.77	36	59	-1	12.45	12.45
Fixation R	1	5	6093658618	6094613712	955094	1184.59	252.77	36	59	-1	13.22	13.22
Saccade L	1	6	6094613712	6094633582	19870	1173.46	239.94	1172.03	229.35	0.16	10.82	1.00	7.97	125.80	-184.07	135.81
Saccade R	1	6	6094613712	6094633582	19870	1173.46	239.94	1172.03	229.35	0.16	10.82	1.00	7.97	125.80	-184.07	135.81
Fixation L	1	6	6094633582	6095409543	775961	1174.73	257.88	14	65	-1	13.23	13.23
Fixation R	1	6	6094633582	6095409543	775961	1174.73	257.88	14	65	-1	13.77	13.77
Saccade L	1	7	6095409543	6095449417	39874	1170.10	263.39	1082.06	407.88	2.46	104.95	0.50	61.68	1800.09	-1472.63	1474.05
Saccade R	1	7	6095409543	6095449417	39874	1170.10	263.39	1082.06	407.88	2.46	104.95	0.50	61.68	1800.09	-1472.63	1474.05
Fixation L	1	7	6095449417	6095728027	278610	1083.75	474.66	15	78	-1	13.51	13.51
Fixation R	1	7	6095449417	6095728027	278610	1083.75	474.66	15	78	-1	14.63	14.63
Saccade L	1	8	6095728027	6095747908	19881	1076.45	474.42	861.98	503.83	1.45	218.89	1.00	73.00	5433.35	-5458.41	4053.96
Saccade R	1	8	6095728027	6095747908	19881	1076.45	474.42	861.98	503.83	1.45	218.89	1.00	73.00	5433.35	-5458.41	4053.96
Fixation L	1	8	6095747908	6095986642	238734	866.80	562.64	9	71	-1	13.66	13.66
Fixation R	1	8	6095747908	6095986642	238734	866.80	562.64	9	71	-1	14.64	14.64
Saccade L	1	9	6095986642	6096006523	19881	862.91	568.08	914.76	569.34	0.47	52.47	1.00	23.72	1179.02	-1223.09	1073.72
Saccade R	1	9	6095986642	6096006523	19881	862.91	568.08	914.76	569.34	0.47	52.47	1.00	23.72	1179.02	-1223.09	1073.72
Fixation L	1	9	6096006523	6096205514	198991	948.87	581.14	41	21	-1	13.74	13.74
Fixation R	1	9	6096006523	6096205514	198991	948.87	581.14	41	21	-1	14.57	14.57
Saccade L	1	10	6096205514	6096225379	19865	953.27	571.99	829.50	600.08	0.77	128.37	1.00	38.79	3138.95	-2775.48	2101.18
Saccade R	1	10	6096205514	6096225379	19865	953.27	571.99	829.50	600.08	0.77	128.37	1.00	38.79	3138.95	-2775.48	2101.18
Fixation L	1	10	6096225379	6096543745	318366	825.83	618.60	9	24	-1	13.39	13.39
Fixation R	1	10	6096225379	6096543745	318366	825.83	618.60	9	24	-1	14.48	14.48
Saccade L	1	11	6096543745	6096563743	19998	831.91	622.49	1084.05	627.61	1.69	254.96	1.00	84.29	6321.91	-6251.84	4696.64
Saccade R	1	11	6096543745	6096563743	19998	831.91	622.49	1084.05	627.61	1.69	254.96	1.00	84.29	6321.91	-6251.84	4696.64
Fixation L	1	11	6096563743	6096683126	119383	1143.62	638.50	72	20	-1	13.51	13.51
Fixation R	1	11	6096563743	6096683126	119383	1143.62	638.50	72	20	-1	14.26	14.26
