[BeGaze]
Converted from:	C:\Documents and Settings\iViewX\Desktop\EXPERIMENTATIONS\Experiments\results\finaleart\S9H29221-finaleart-1.idf
Date:	27.03.2019 16:03:09
Version:	BeGaze 2.5.77
Sample Rate:	50
Subject:	S9H29221
Description:	steven

Table Header for Fixations:
Event Type	Trial	Number	Start	End	Duration	Location X	Location Y	Dispersion X	Dispersion Y	Plane	Avg. Pupil Size X	Avg. Pupil Size Y

Table Header for Saccades:
Event Type	Trial	Number	Start	End	Duration	Start Loc.X	Start Loc.Y	End Loc.X	End Loc.Y	Amplitude	Peak Speed	Peak Speed At	Average Speed	Peak Accel.	Peak Decel.	Average Accel.

Table Header for Blinks:
Event Type	Trial	Number	Start	End	Duration

Table Header for User Events:
Event Type	Trial	Number	Start	Description

UserEvent	1	1	6296728589	# Message: void.jpg
Fixation L	1	1	6296745149	6297023633	278484	1229.85	466.86	23	54	-1	13.05	13.05
Fixation R	1	1	6296745149	6297023633	278484	1229.85	466.86	23	54	-1	11.99	11.99
Blink L	1	1	6297023633	6297321986	298353
Blink R	1	1	6297023633	6297321986	298353
Fixation L	1	2	6297321986	6297520872	198886	1227.98	567.80	21	30	-1	13.63	13.63
Fixation R	1	2	6297321986	6297520872	198886	1227.98	567.80	21	30	-1	13.29	13.29
Saccade L	1	1	6297520872	6297560613	39741	1214.18	577.84	1009.08	569.05	1.93	157.39	0.50	48.51	3799.31	-3564.74	2249.42
Saccade R	1	1	6297520872	6297560613	39741	1214.18	577.84	1009.08	569.05	1.93	157.39	0.50	48.51	3799.31	-3564.74	2249.42
Fixation L	1	3	6297560613	6297870306	309693	999.21	539.11	36	44	-1	13.66	13.66
Fixation R	1	3	6297560613	6297870306	309693	999.21	539.11	36	44	-1	13.16	13.16
Saccade L	1	2	6297870306	6298037963	167657	972.84	524.49	957.62	449.54	4.73	105.14	0.17	28.20	26505.64	-2451.39	3550.60
Saccade R	1	2	6297870306	6298037963	167657	972.84	524.49	957.62	449.54	4.73	105.14	0.17	28.20	26505.64	-2451.39	3550.60
Blink L	1	2	6298037963	6298296580	258617
Blink R	1	2	6298037963	6298296580	258617
Fixation L	1	4	6298296580	6298614827	318247	1114.95	336.36	30	10	-1	14.96	14.96
Fixation R	1	4	6298296580	6298614827	318247	1114.95	336.36	30	10	-1	13.95	13.95
