[BeGaze]
Converted from:	C:\Documents and Settings\iViewX\Desktop\EXPERIMENTATIONS\Experiments\results\finaleart\S11H21112-finaleart-1.idf
Date:	27.03.2019 15:38:39
Version:	BeGaze 2.5.77
Sample Rate:	50
Subject:	S11H21112
Description:	Clement legrand-Duchenne

Table Header for Fixations:
Event Type	Trial	Number	Start	End	Duration	Location X	Location Y	Dispersion X	Dispersion Y	Plane	Avg. Pupil Size X	Avg. Pupil Size Y

Table Header for Saccades:
Event Type	Trial	Number	Start	End	Duration	Start Loc.X	Start Loc.Y	End Loc.X	End Loc.Y	Amplitude	Peak Speed	Peak Speed At	Average Speed	Peak Accel.	Peak Decel.	Average Accel.

Table Header for Blinks:
Event Type	Trial	Number	Start	End	Duration

Table Header for User Events:
Event Type	Trial	Number	Start	Description

UserEvent	1	1	3998923430	# Message: void.jpg
Fixation L	1	1	3998941545	3999180167	238622	897.67	839.75	4	16	-1	14.32	14.32
Fixation R	1	1	3998941545	3999180167	238622	897.67	839.75	4	16	-1	17.45	17.45
Saccade L	1	1	3999180167	3999239902	59735	898.39	833.63	1136.44	788.12	2.72	194.10	0.33	45.50	4726.38	-3739.13	1909.96
Saccade R	1	1	3999180167	3999239902	59735	898.39	833.63	1136.44	788.12	2.72	194.10	0.33	45.50	4726.38	-3739.13	1909.96
Fixation L	1	2	3999239902	3999597885	357983	1134.10	779.76	16	48	-1	14.48	14.48
Fixation R	1	2	3999239902	3999597885	357983	1134.10	779.76	16	48	-1	16.34	16.34
Blink L	1	1	3999597885	3999876373	278488
Blink R	1	1	3999597885	3999876373	278488
Saccade L	1	2	3999876373	3999916125	39752	1817.36	348.91	1788.94	383.78	2.09	81.72	0.00	52.53	-66.39	-1073.03	594.69
Saccade R	1	2	3999876373	3999916125	39752	1817.36	348.91	1788.94	383.78	2.09	81.72	0.00	52.53	-66.39	-1073.03	594.69
Fixation L	1	3	3999916125	4000234359	318234	1764.19	396.55	47	49	-1	14.76	14.76
Fixation R	1	3	3999916125	4000234359	318234	1764.19	396.55	47	49	-1	17.00	17.00
Saccade L	1	3	4000234359	4000254240	19881	1741.70	415.99	1735.49	417.01	0.29	19.72	0.00	14.51	83.92	-234.01	135.05
Saccade R	1	3	4000234359	4000254240	19881	1741.70	415.99	1735.49	417.01	0.29	19.72	0.00	14.51	83.92	-234.01	135.05
Fixation L	1	4	4000254240	4000473103	218863	1721.26	443.13	35	44	-1	15.05	15.05
Fixation R	1	4	4000254240	4000473103	218863	1721.26	443.13	35	44	-1	16.72	16.72
Saccade L	1	4	4000473103	4000691844	218741	1701.98	428.41	1766.00	295.95	8.30	142.53	0.73	37.96	3410.12	-3430.31	1299.28
Saccade R	1	4	4000473103	4000691844	218741	1701.98	428.41	1766.00	295.95	8.30	142.53	0.73	37.96	3410.12	-3430.31	1299.28
Fixation L	1	5	4000691844	4000910583	218739	1738.43	295.81	50	33	-1	14.85	14.85
Fixation R	1	5	4000691844	4000910583	218739	1738.43	295.81	50	33	-1	16.86	16.86
