[BeGaze]
Converted from:	C:\Documents and Settings\iViewX\Desktop\EXPERIMENTATIONS\Experiments\results\finaleart\S8119532-finaleart-1.idf
Date:	27.03.2019 16:01:34
Version:	BeGaze 2.5.77
Sample Rate:	50
Subject:	S8119532
Description:	Alexandre Drewery

Table Header for Fixations:
Event Type	Trial	Number	Start	End	Duration	Location X	Location Y	Dispersion X	Dispersion Y	Plane	Avg. Pupil Size X	Avg. Pupil Size Y

Table Header for Saccades:
Event Type	Trial	Number	Start	End	Duration	Start Loc.X	Start Loc.Y	End Loc.X	End Loc.Y	Amplitude	Peak Speed	Peak Speed At	Average Speed	Peak Accel.	Peak Decel.	Average Accel.

Table Header for Blinks:
Event Type	Trial	Number	Start	End	Duration

Table Header for User Events:
Event Type	Trial	Number	Start	Description

UserEvent	1	1	3749753562	# Message: goya-Pavo-muerto-1812.jpg
Fixation L	1	1	3749754383	3749973213	218830	946.73	539.32	29	64	-1	12.41	12.41
Fixation R	1	1	3749754383	3749973213	218830	946.73	539.32	29	64	-1	14.54	14.54
Saccade L	1	1	3749973213	3750172104	198891	925.29	507.39	889.23	441.22	11.51	103.64	0.80	57.90	1577.58	-2057.60	1038.26
Saccade R	1	1	3749973213	3750172104	198891	925.29	507.39	889.23	441.22	11.51	103.64	0.80	57.90	1577.58	-2057.60	1038.26
Fixation L	1	2	3750172104	3750291474	119370	899.80	442.56	20	74	-1	13.92	13.92
Fixation R	1	2	3750172104	3750291474	119370	899.80	442.56	20	74	-1	15.84	15.84
Saccade L	1	2	3750291474	3750390836	99362	899.18	421.44	913.69	584.63	6.29	154.58	1.00	63.34	1368.79	-3325.01	1011.03
Saccade R	1	2	3750291474	3750390836	99362	899.18	421.44	913.69	584.63	6.29	154.58	1.00	63.34	1368.79	-3325.01	1011.03
Fixation L	1	3	3750390836	3750609955	219119	907.68	559.74	19	71	-1	13.84	13.84
Fixation R	1	3	3750390836	3750609955	219119	907.68	559.74	19	71	-1	15.77	15.77
Saccade L	1	3	3750609955	3750649452	39497	911.53	563.06	944.78	531.54	1.09	46.35	1.00	27.54	890.84	-694.00	737.18
Saccade R	1	3	3750609955	3750649452	39497	911.53	563.06	944.78	531.54	1.09	46.35	1.00	27.54	890.84	-694.00	737.18
Fixation L	1	4	3750649452	3750967672	318220	988.16	535.92	56	40	-1	13.88	13.88
Fixation R	1	4	3750649452	3750967672	318220	988.16	535.92	56	40	-1	15.67	15.67
Saccade L	1	4	3750967672	3750987543	19871	990.57	543.00	890.26	515.38	0.68	105.23	1.00	34.28	2252.04	-2225.46	1561.16
Saccade R	1	4	3750967672	3750987543	19871	990.57	543.00	890.26	515.38	0.68	105.23	1.00	34.28	2252.04	-2225.46	1561.16
Fixation L	1	5	3750987543	3751126796	139253	887.36	492.97	6	37	-1	13.97	13.97
Fixation R	1	5	3750987543	3751126796	139253	887.36	492.97	6	37	-1	15.76	15.76
Saccade L	1	5	3751126796	3751166544	39748	887.19	480.95	570.25	833.85	4.32	297.13	1.00	108.80	7338.07	-7125.14	5517.26
Saccade R	1	5	3751126796	3751166544	39748	887.19	480.95	570.25	833.85	4.32	297.13	1.00	108.80	7338.07	-7125.14	5517.26
Fixation L	1	6	3751166544	3751484778	318234	525.14	858.15	57	38	-1	13.18	13.18
Fixation R	1	6	3751166544	3751484778	318234	525.14	858.15	57	38	-1	15.98	15.98
Saccade L	1	6	3751484778	3751524643	39865	512.80	857.77	618.93	690.06	2.55	166.60	1.00	64.09	4008.76	-3976.75	2905.07
Saccade R	1	6	3751484778	3751524643	39865	512.80	857.77	618.93	690.06	2.55	166.60	1.00	64.09	4008.76	-3976.75	2905.07
Fixation L	1	7	3751524643	3751683763	159120	623.52	665.99	17	41	-1	12.67	12.67
Fixation R	1	7	3751524643	3751683763	159120	623.52	665.99	17	41	-1	15.45	15.45
Saccade L	1	7	3751683763	3751723510	39747	626.60	651.38	932.19	514.64	3.39	195.24	1.00	85.30	4454.53	-4587.49	4041.58
Saccade R	1	7	3751683763	3751723510	39747	626.60	651.38	932.19	514.64	3.39	195.24	1.00	85.30	4454.53	-4587.49	4041.58
Fixation L	1	8	3751723510	3751922386	198876	965.71	479.76	46	43	-1	13.24	13.24
Fixation R	1	8	3751723510	3751922386	198876	965.71	479.76	46	43	-1	15.70	15.70
Saccade L	1	8	3751922386	3751942254	19868	975.01	471.54	978.69	448.31	0.26	23.79	1.00	12.91	452.31	-202.54	316.26
Saccade R	1	8	3751922386	3751942254	19868	975.01	471.54	978.69	448.31	0.26	23.79	1.00	12.91	452.31	-202.54	316.26
Fixation L	1	9	3751942254	3752121240	178986	981.68	437.38	9	81	-1	13.05	13.05
Fixation R	1	9	3751942254	3752121240	178986	981.68	437.38	9	81	-1	15.54	15.54
Saccade L	1	9	3752121240	3752280361	159121	985.39	422.53	336.78	281.62	16.06	321.75	0.38	100.92	6665.50	-5716.91	2967.31
Saccade R	1	9	3752121240	3752280361	159121	985.39	422.53	336.78	281.62	16.06	321.75	0.38	100.92	6665.50	-5716.91	2967.31
Fixation L	1	10	3752280361	3752538980	258619	358.92	333.89	33	64	-1	13.36	13.36
Fixation R	1	10	3752280361	3752538980	258619	358.92	333.89	33	64	-1	15.93	15.93
Saccade L	1	10	3752538980	3752638474	99494	370.14	343.62	605.13	513.82	4.02	271.65	1.00	40.42	6673.90	-6696.54	1948.31
Saccade R	1	10	3752538980	3752638474	99494	370.14	343.62	605.13	513.82	4.02	271.65	1.00	40.42	6673.90	-6696.54	1948.31
Fixation L	1	11	3752638474	3752757714	119240	614.10	529.61	15	46	-1	13.90	13.90
Fixation R	1	11	3752638474	3752757714	119240	614.10	529.61	15	46	-1	16.58	16.58
Saccade L	1	11	3752757714	3752797586	39872	620.69	560.56	724.83	558.70	1.83	89.03	1.00	45.90	1599.85	-1866.92	1254.24
Saccade R	1	11	3752757714	3752797586	39872	620.69	560.56	724.83	558.70	1.83	89.03	1.00	45.90	1599.85	-1866.92	1254.24
Fixation L	1	12	3752797586	3752936830	139244	714.63	589.69	27	64	-1	14.37	14.37
Fixation R	1	12	3752797586	3752936830	139244	714.63	589.69	27	64	-1	16.77	16.77
Saccade L	1	12	3752936830	3753274944	338114	722.40	581.19	993.61	550.09	19.79	141.82	0.41	58.54	2459.64	-3147.26	1352.83
Saccade R	1	12	3752936830	3753274944	338114	722.40	581.19	993.61	550.09	19.79	141.82	0.41	58.54	2459.64	-3147.26	1352.83
Fixation L	1	13	3753274944	3753553431	278487	993.27	561.07	15	82	-1	14.59	14.59
Fixation R	1	13	3753274944	3753553431	278487	993.27	561.07	15	82	-1	16.40	16.40
Saccade L	1	13	3753553431	3753752288	198857	983.81	561.76	361.76	213.44	16.95	380.11	0.50	85.22	8353.71	-7769.84	2875.85
Saccade R	1	13	3753553431	3753752288	198857	983.81	561.76	361.76	213.44	16.95	380.11	0.50	85.22	8353.71	-7769.84	2875.85
