[BeGaze]
Converted from:	C:\Documents and Settings\iViewX\Desktop\EXPERIMENTATIONS\Experiments\results\finaleart\S01A22542-finaleart-1.idf
Date:	27.03.2019 15:33:25
Version:	BeGaze 2.5.77
Sample Rate:	50
Subject:	S01A22542
Description:	Thibault Seve Minnaert

Table Header for Fixations:
Event Type	Trial	Number	Start	End	Duration	Location X	Location Y	Dispersion X	Dispersion Y	Plane	Avg. Pupil Size X	Avg. Pupil Size Y

Table Header for Saccades:
Event Type	Trial	Number	Start	End	Duration	Start Loc.X	Start Loc.Y	End Loc.X	End Loc.Y	Amplitude	Peak Speed	Peak Speed At	Average Speed	Peak Accel.	Peak Decel.	Average Accel.

Table Header for Blinks:
Event Type	Trial	Number	Start	End	Duration

Table Header for User Events:
Event Type	Trial	Number	Start	Description

UserEvent	1	1	9879134721	# Message: void.jpg
Saccade L	1	1	9879142931	9879262420	119489	1226.83	700.96	1503.44	886.23	7.19	239.98	0.83	60.15	5911.72	-4678.07	2337.18
Saccade R	1	1	9879142931	9879262420	119489	1226.83	700.96	1503.44	886.23	7.19	239.98	0.83	60.15	5911.72	-4678.07	2337.18
Fixation L	1	1	9879262420	9879640667	378247	1530.72	870.53	39	37	-1	13.68	13.68
Fixation R	1	1	9879262420	9879640667	378247	1530.72	870.53	39	37	-1	12.46	12.46
Blink L	1	1	9879640667	9879919372	278705
Blink R	1	1	9879640667	9879919372	278705
Fixation L	1	2	9879919372	9880675087	755715	1072.95	647.87	19	68	-1	16.66	16.66
Fixation R	1	2	9879919372	9880675087	755715	1072.95	647.87	19	68	-1	14.65	14.65
Saccade L	1	2	9880675087	9880695082	19995	1080.65	684.23	1099.37	697.79	0.32	23.38	1.00	15.89	269.40	-286.42	231.41
Saccade R	1	2	9880675087	9880695082	19995	1080.65	684.23	1099.37	697.79	0.32	23.38	1.00	15.89	269.40	-286.42	231.41
Fixation L	1	3	9880695082	9880933696	238614	1120.32	714.70	29	31	-1	16.70	16.70
Fixation R	1	3	9880695082	9880933696	238614	1120.32	714.70	29	31	-1	15.07	15.07
Saccade L	1	3	9880933696	9880953577	19881	1128.65	724.01	1009.00	713.08	0.73	121.52	1.00	36.55	2958.06	-2927.21	2054.34
Saccade R	1	3	9880933696	9880953577	19881	1128.65	724.01	1009.00	713.08	0.73	121.52	1.00	36.55	2958.06	-2927.21	2054.34
Fixation L	1	4	9880953577	9881132560	178983	996.10	691.55	19	31	-1	16.69	16.69
Fixation R	1	4	9880953577	9881132560	178983	996.10	691.55	19	31	-1	15.23	15.23
