[BeGaze]
Converted from:	C:\Documents and Settings\iViewX\Desktop\EXPERIMENTATIONS\Experiments\results\finaleart\S01A22542-finaleart-1.idf
Date:	27.03.2019 15:33:25
Version:	BeGaze 2.5.77
Sample Rate:	50
Subject:	S01A22542
Description:	Thibault Seve Minnaert

Table Header for Fixations:
Event Type	Trial	Number	Start	End	Duration	Location X	Location Y	Dispersion X	Dispersion Y	Plane	Avg. Pupil Size X	Avg. Pupil Size Y

Table Header for Saccades:
Event Type	Trial	Number	Start	End	Duration	Start Loc.X	Start Loc.Y	End Loc.X	End Loc.Y	Amplitude	Peak Speed	Peak Speed At	Average Speed	Peak Accel.	Peak Decel.	Average Accel.

Table Header for Blinks:
Event Type	Trial	Number	Start	End	Duration

Table Header for User Events:
Event Type	Trial	Number	Start	Description

UserEvent	1	1	10033700136	# Message: Niagara_Falls_Hale_1902.jpg
Fixation L	1	1	10033715158	10033914022	198864	1119.55	588.43	10	22	-1	13.14	13.14
Fixation R	1	1	10033715158	10033914022	198864	1119.55	588.43	10	22	-1	13.15	13.15
Saccade L	1	1	10033914022	10033953874	39852	1113.04	598.32	905.92	616.74	1.82	106.92	1.00	45.74	2594.30	-2588.30	2499.35
Saccade R	1	1	10033914022	10033953874	39852	1113.04	598.32	905.92	616.74	1.82	106.92	1.00	45.74	2594.30	-2588.30	2499.35
Fixation L	1	2	10033953874	10034172609	218735	903.63	643.82	6	37	-1	13.24	13.24
Fixation R	1	2	10033953874	10034172609	218735	903.63	643.82	6	37	-1	13.67	13.67
Saccade L	1	2	10034172609	10034212375	39766	903.70	652.35	900.98	358.51	2.62	201.55	1.00	65.94	5027.93	-4612.30	3405.51
Saccade R	1	2	10034172609	10034212375	39766	903.70	652.35	900.98	358.51	2.62	201.55	1.00	65.94	5027.93	-4612.30	3405.51
Fixation L	1	3	10034212375	10034371487	159112	896.83	329.17	9	42	-1	12.26	12.26
Fixation R	1	3	10034212375	10034371487	159112	896.83	329.17	9	42	-1	12.98	12.98
Saccade L	1	3	10034371487	10034391355	19868	891.83	320.12	890.52	233.98	0.58	87.14	1.00	29.01	1940.83	-1894.89	1315.62
Saccade R	1	3	10034371487	10034391355	19868	891.83	320.12	890.52	233.98	0.58	87.14	1.00	29.01	1940.83	-1894.89	1315.62
Fixation L	1	4	10034391355	10034530600	139245	881.60	203.45	18	52	-1	11.02	11.02
Fixation R	1	4	10034391355	10034530600	139245	881.60	203.45	18	52	-1	11.81	11.81
Saccade L	1	4	10034530600	10034570354	39754	877.74	191.72	1073.58	62.05	2.17	150.54	0.50	54.67	3426.54	-3701.62	2869.81
Saccade R	1	4	10034530600	10034570354	39754	877.74	191.72	1073.58	62.05	2.17	150.54	0.50	54.67	3426.54	-3701.62	2869.81
Fixation L	1	5	10034570354	10034789344	218990	1066.20	68.24	11	14	-1	10.41	10.41
Fixation R	1	5	10034570354	10034789344	218990	1066.20	68.24	11	14	-1	11.20	11.20
Saccade L	1	5	10034789344	10034809214	19870	1064.20	74.31	1173.62	68.58	0.85	110.83	1.00	42.80	2743.36	-2663.75	2244.02
Saccade R	1	5	10034789344	10034809214	19870	1064.20	74.31	1173.62	68.58	0.85	110.83	1.00	42.80	2743.36	-2663.75	2244.02
Fixation L	1	6	10034809214	10035068068	258854	1229.38	73.15	63	33	-1	10.76	10.76
Fixation R	1	6	10034809214	10035068068	258854	1229.38	73.15	63	33	-1	11.42	11.42
Saccade L	1	6	10035068068	10035107828	39760	1233.67	88.38	826.59	405.02	4.42	267.92	0.50	111.13	6449.22	-6275.16	6191.02
Saccade R	1	6	10035068068	10035107828	39760	1233.67	88.38	826.59	405.02	4.42	267.92	0.50	111.13	6449.22	-6275.16	6191.02
Fixation L	1	7	10035107828	10035287071	179243	804.90	434.13	28	45	-1	11.59	11.59
Fixation R	1	7	10035107828	10035287071	179243	804.90	434.13	28	45	-1	12.12	12.12
Saccade L	1	7	10035287071	10035326931	39860	798.45	435.12	773.46	225.62	1.80	124.93	0.50	45.03	3078.50	-2942.96	2541.36
Saccade R	1	7	10035287071	10035326931	39860	798.45	435.12	773.46	225.62	1.80	124.93	0.50	45.03	3078.50	-2942.96	2541.36
Fixation L	1	8	10035326931	10035486179	159248	764.37	217.01	15	17	-1	11.25	11.25
Fixation R	1	8	10035326931	10035486179	159248	764.37	217.01	15	17	-1	12.03	12.03
Saccade L	1	8	10035486179	10035506059	19880	757.88	208.25	597.40	207.94	1.19	162.30	1.00	59.97	4012.05	-3894.71	3201.02
Saccade R	1	8	10035486179	10035506059	19880	757.88	208.25	597.40	207.94	1.19	162.30	1.00	59.97	4012.05	-3894.71	3201.02
Fixation L	1	9	10035506059	10035625554	119495	538.90	193.78	72	19	-1	11.27	11.27
Fixation R	1	9	10035506059	10035625554	119495	538.90	193.78	72	19	-1	11.79	11.79
Saccade L	1	9	10035625554	10035665425	39871	525.00	192.55	637.80	731.58	4.62	312.44	0.50	115.84	7762.93	-7438.55	6729.74
Saccade R	1	9	10035625554	10035665425	39871	525.00	192.55	637.80	731.58	4.62	312.44	0.50	115.84	7762.93	-7438.55	6729.74
Fixation L	1	10	10035665425	10035884413	218988	652.37	743.57	23	40	-1	12.05	12.05
Fixation R	1	10	10035665425	10035884413	218988	652.37	743.57	23	40	-1	13.15	13.15
Saccade L	1	10	10035884413	10035924165	39752	657.07	758.16	864.08	475.23	2.95	180.12	1.00	74.19	4303.53	-4449.78	4335.79
Saccade R	1	10	10035884413	10035924165	39752	657.07	758.16	864.08	475.23	2.95	180.12	1.00	74.19	4303.53	-4449.78	4335.79
Fixation L	1	11	10035924165	10036143150	218985	864.45	472.38	6	16	-1	12.23	12.23
Fixation R	1	11	10035924165	10036143150	218985	864.45	472.38	6	16	-1	13.00	13.00
Saccade L	1	11	10036143150	10036183017	39867	864.31	463.65	670.08	686.82	2.69	174.88	0.50	67.41	4158.00	-3853.43	3578.54
Saccade R	1	11	10036143150	10036183017	39867	864.31	463.65	670.08	686.82	2.69	174.88	0.50	67.41	4158.00	-3853.43	3578.54
Fixation L	1	12	10036183017	10036461757	278740	657.14	675.71	24	20	-1	12.31	12.31
Fixation R	1	12	10036183017	10036461757	278740	657.14	675.71	24	20	-1	12.96	12.96
Saccade L	1	12	10036461757	10036501627	39870	649.05	684.21	974.99	682.56	2.75	175.90	1.00	68.88	4338.75	-4229.60	3987.29
Saccade R	1	12	10036461757	10036501627	39870	649.05	684.21	974.99	682.56	2.75	175.90	1.00	68.88	4338.75	-4229.60	3987.29
Fixation L	1	13	10036501627	10036680772	179145	995.17	676.48	27	15	-1	12.49	12.49
Fixation R	1	13	10036501627	10036680772	179145	995.17	676.48	27	15	-1	12.95	12.95
Saccade L	1	13	10036680772	10036720617	39845	1002.47	668.53	1214.02	611.93	1.89	129.63	1.00	47.36	3204.85	-3054.84	2646.92
Saccade R	1	13	10036680772	10036720617	39845	1002.47	668.53	1214.02	611.93	1.89	129.63	1.00	47.36	3204.85	-3054.84	2646.92
Fixation L	1	14	10036720617	10036840119	119502	1211.62	617.65	4	14	-1	12.10	12.10
Fixation R	1	14	10036720617	10036840119	119502	1211.62	617.65	4	14	-1	12.68	12.68
Saccade L	1	14	10036840119	10036879856	39737	1211.09	616.24	1544.35	480.94	3.08	223.43	1.00	77.40	5492.45	-5407.24	4465.41
Saccade R	1	14	10036840119	10036879856	39737	1211.09	616.24	1544.35	480.94	3.08	223.43	1.00	77.40	5492.45	-5407.24	4465.41
Fixation L	1	15	10036879856	10037059100	179244	1553.79	477.77	15	8	-1	11.44	11.44
Fixation R	1	15	10036879856	10037059100	179244	1553.79	477.77	15	8	-1	11.93	11.93
Saccade L	1	15	10037059100	10037078980	19880	1553.80	482.31	1560.73	378.06	0.83	105.68	1.00	41.53	2585.91	-2383.71	2105.51
Saccade R	1	15	10037059100	10037078980	19880	1553.80	482.31	1560.73	378.06	0.83	105.68	1.00	41.53	2585.91	-2383.71	2105.51
Fixation L	1	16	10037078980	10037198481	119501	1573.19	339.73	22	62	-1	11.26	11.26
Fixation R	1	16	10037078980	10037198481	119501	1573.19	339.73	22	62	-1	11.26	11.26
Saccade L	1	16	10037198481	10037258227	59746	1583.49	353.42	975.30	416.07	6.66	265.82	0.67	111.41	6424.77	-6348.44	4659.50
Saccade R	1	16	10037198481	10037258227	59746	1583.49	353.42	975.30	416.07	6.66	265.82	0.67	111.41	6424.77	-6348.44	4659.50
Fixation L	1	17	10037258227	10037556825	298598	959.40	408.38	21	15	-1	11.11	11.11
Fixation R	1	17	10037258227	10037556825	298598	959.40	408.38	21	15	-1	11.06	11.06
Saccade L	1	17	10037556825	10037696195	139370	955.69	413.83	937.08	473.10	38.56	1084.67	0.86	276.71	27116.64	-26596.43	11816.12
Saccade R	1	17	10037556825	10037696195	139370	955.69	413.83	937.08	473.10	38.56	1084.67	0.86	276.71	27116.64	-26596.43	11816.12
