[BeGaze]
Converted from:	C:\Documents and Settings\iViewX\Desktop\EXPERIMENTATIONS\Experiments\results\finaleart\S20H24222-finaleart-1.idf
Date:	27.03.2019 15:54:02
Version:	BeGaze 2.5.77
Sample Rate:	50
Subject:	S20H24222
Description:	Hugo Brument

Table Header for Fixations:
Event Type	Trial	Number	Start	End	Duration	Location X	Location Y	Dispersion X	Dispersion Y	Plane	Avg. Pupil Size X	Avg. Pupil Size Y

Table Header for Saccades:
Event Type	Trial	Number	Start	End	Duration	Start Loc.X	Start Loc.Y	End Loc.X	End Loc.Y	Amplitude	Peak Speed	Peak Speed At	Average Speed	Peak Accel.	Peak Decel.	Average Accel.

Table Header for Blinks:
Event Type	Trial	Number	Start	End	Duration

Table Header for User Events:
Event Type	Trial	Number	Start	Description

UserEvent	1	1	12303280541	# Message: void.jpg
Saccade L	1	1	12303281250	12303301135	19885	883.70	651.65	1050.79	614.40	1.29	173.12	1.00	64.93	541.98	-3890.63	1477.53
Saccade R	1	1	12303281250	12303301135	19885	883.70	651.65	1050.79	614.40	1.29	173.12	1.00	64.93	541.98	-3890.63	1477.53
Fixation L	1	1	12303301135	12303460238	159103	1081.01	590.84	38	54	-1	10.89	10.89
Fixation R	1	1	12303301135	12303460238	159103	1081.01	590.84	38	54	-1	11.51	11.51
Saccade L	1	2	12303460238	12303480101	19863	1089.52	559.99	1093.26	539.82	0.36	25.25	1.00	17.88	286.15	-456.21	322.72
Saccade R	1	2	12303460238	12303480101	19863	1089.52	559.99	1093.26	539.82	0.36	25.25	1.00	17.88	286.15	-456.21	322.72
Fixation L	1	2	12303480101	12303798334	318233	1088.99	563.49	13	38	-1	10.67	10.67
Fixation R	1	2	12303480101	12303798334	318233	1088.99	563.49	13	38	-1	11.06	11.06
Blink L	1	1	12303798334	12303957452	159118
Blink R	1	1	12303798334	12303957452	159118
Fixation L	1	3	12303957452	12304395065	437613	1343.21	459.79	50	47	-1	11.85	11.85
Fixation R	1	3	12303957452	12304395065	437613	1343.21	459.79	50	47	-1	12.85	12.85
Saccade L	1	3	12304395065	12304434808	39743	1325.45	468.96	801.33	473.96	4.46	310.14	0.50	112.26	7493.59	-7523.51	6392.24
Saccade R	1	3	12304395065	12304434808	39743	1325.45	468.96	801.33	473.96	4.46	310.14	0.50	112.26	7493.59	-7523.51	6392.24
Fixation L	1	4	12304434808	12304971906	537098	798.50	471.50	23	53	-1	12.70	12.70
Fixation R	1	4	12304434808	12304971906	537098	798.50	471.50	23	53	-1	13.96	13.96
Saccade L	1	4	12304971906	12304991790	19884	788.62	510.77	788.34	536.34	0.38	38.26	1.00	18.88	140.04	-378.66	276.19
Saccade R	1	4	12304971906	12304991790	19884	788.62	510.77	788.34	536.34	0.38	38.26	1.00	18.88	140.04	-378.66	276.19
Fixation L	1	5	12304991790	12305270156	278366	791.92	557.26	7	40	-1	13.00	13.00
Fixation R	1	5	12304991790	12305270156	278366	791.92	557.26	7	40	-1	14.35	14.35
