[BeGaze]
Converted from:	C:\Documents and Settings\iViewX\Desktop\EXPERIMENTATIONS\Experiments\results\finaleart\S02123220-finaleart-1.idf
Date:	27.03.2019 15:33:43
Version:	BeGaze 2.5.77
Sample Rate:	50
Subject:	S02123220
Description:	David Xu

Table Header for Fixations:
Event Type	Trial	Number	Start	End	Duration	Location X	Location Y	Dispersion X	Dispersion Y	Plane	Avg. Pupil Size X	Avg. Pupil Size Y

Table Header for Saccades:
Event Type	Trial	Number	Start	End	Duration	Start Loc.X	Start Loc.Y	End Loc.X	End Loc.Y	Amplitude	Peak Speed	Peak Speed At	Average Speed	Peak Accel.	Peak Decel.	Average Accel.

Table Header for Blinks:
Event Type	Trial	Number	Start	End	Duration

Table Header for User Events:
Event Type	Trial	Number	Start	Description

UserEvent	1	1	1811943810	# Message: void.jpg
Fixation L	1	1	1811948054	1812087301	139247	603.08	407.48	18	42	-1	15.43	15.43
Fixation R	1	1	1811948054	1812087301	139247	603.08	407.48	18	42	-1	14.18	14.18
Saccade L	1	1	1812087301	1812107243	19942	591.01	438.74	546.52	605.15	1.14	174.20	1.00	57.33	4252.12	-4247.23	3038.36
Saccade R	1	1	1812087301	1812107243	19942	591.01	438.74	546.52	605.15	1.14	174.20	1.00	57.33	4252.12	-4247.23	3038.36
Fixation L	1	2	1812107243	1812365650	258407	555.59	613.69	51	14	-1	15.81	15.81
Fixation R	1	2	1812107243	1812365650	258407	555.59	613.69	51	14	-1	14.83	14.83
Saccade L	1	2	1812365650	1812425395	59745	588.88	604.58	1032.92	504.25	5.01	220.26	0.33	83.94	5477.27	-3769.19	3495.16
Saccade R	1	2	1812365650	1812425395	59745	588.88	604.58	1032.92	504.25	5.01	220.26	0.33	83.94	5477.27	-3769.19	3495.16
Fixation L	1	3	1812425395	1812922619	497224	1026.75	493.16	62	36	-1	13.83	13.83
Fixation R	1	3	1812425395	1812922619	497224	1026.75	493.16	62	36	-1	12.30	12.30
Saccade L	1	3	1812922619	1812942490	19871	975.08	469.25	903.93	466.29	0.62	72.04	1.00	31.26	1722.12	-1627.30	1326.32
Saccade R	1	3	1812922619	1812942490	19871	975.08	469.25	903.93	466.29	0.62	72.04	1.00	31.26	1722.12	-1627.30	1326.32
Fixation L	1	4	1812942490	1813380090	437600	865.62	490.07	52	44	-1	13.76	13.76
Fixation R	1	4	1812942490	1813380090	437600	865.62	490.07	52	44	-1	12.33	12.33
Saccade L	1	4	1813380090	1813399982	19892	859.29	510.97	856.58	517.31	0.07	6.97	1.00	3.61	137.21	-159.14	100.10
Saccade R	1	4	1813380090	1813399982	19892	859.29	510.97	856.58	517.31	0.07	6.97	1.00	3.61	137.21	-159.14	100.10
Fixation L	1	5	1813399982	1813956958	556976	863.25	518.70	16	35	-1	15.25	15.25
Fixation R	1	5	1813399982	1813956958	556976	863.25	518.70	16	35	-1	13.58	13.58
