[BeGaze]
Converted from:	C:\Documents and Settings\iViewX\Desktop\EXPERIMENTATIONS\Experiments\results\finaleart\S13H22431-finaleart-1.idf
Date:	27.03.2019 15:41:56
Version:	BeGaze 2.5.77
Sample Rate:	50
Subject:	S13H22431
Description:	Jimmy Petit

Table Header for Fixations:
Event Type	Trial	Number	Start	End	Duration	Location X	Location Y	Dispersion X	Dispersion Y	Plane	Avg. Pupil Size X	Avg. Pupil Size Y

Table Header for Saccades:
Event Type	Trial	Number	Start	End	Duration	Start Loc.X	Start Loc.Y	End Loc.X	End Loc.Y	Amplitude	Peak Speed	Peak Speed At	Average Speed	Peak Accel.	Peak Decel.	Average Accel.

Table Header for Blinks:
Event Type	Trial	Number	Start	End	Duration

Table Header for User Events:
Event Type	Trial	Number	Start	Description

UserEvent	1	1	27914596316	# Message: Still-life-of-Sheep-s-Ribs-and-Head-The-Butchers-conter_Goya_1812.jpg
Saccade L	1	1	27914600233	27914620102	19869	767.66	334.78	735.28	448.21	1.04	119.32	1.00	52.32	940.97	-1937.94	959.63
Saccade R	1	1	27914600233	27914620102	19869	767.66	334.78	735.28	448.21	1.04	119.32	1.00	52.32	940.97	-1937.94	959.63
Fixation L	1	1	27914620102	27914938341	318239	746.10	408.08	17	81	-1	15.36	15.36
Fixation R	1	1	27914620102	27914938341	318239	746.10	408.08	17	81	-1	16.44	16.44
Saccade L	1	2	27914938341	27914997983	59642	741.95	409.36	973.24	517.28	3.08	185.73	0.67	51.58	4477.84	-3874.83	2277.66
Saccade R	1	2	27914938341	27914997983	59642	741.95	409.36	973.24	517.28	3.08	185.73	0.67	51.58	4477.84	-3874.83	2277.66
Fixation L	1	2	27914997983	27915196949	198966	999.90	523.11	32	13	-1	15.01	15.01
Fixation R	1	2	27914997983	27915196949	198966	999.90	523.11	32	13	-1	16.62	16.62
Saccade L	1	3	27915196949	27915236751	39802	1004.89	522.60	493.35	594.73	4.33	282.42	0.50	108.73	7006.34	-6766.19	6397.94
Saccade R	1	3	27915196949	27915236751	39802	1004.89	522.60	493.35	594.73	4.33	282.42	0.50	108.73	7006.34	-6766.19	6397.94
Fixation L	1	3	27915236751	27915753804	517053	466.60	622.86	53	45	-1	14.85	14.85
Fixation R	1	3	27915236751	27915753804	517053	466.60	622.86	53	45	-1	16.51	16.51
Saccade L	1	4	27915753804	27915873169	119365	440.52	624.58	1031.25	552.04	8.82	279.55	0.67	73.86	6911.55	-5260.44	3118.45
Saccade R	1	4	27915753804	27915873169	119365	440.52	624.58	1031.25	552.04	8.82	279.55	0.67	73.86	6911.55	-5260.44	3118.45
Fixation L	1	4	27915873169	27916012414	139245	1028.70	532.54	5	28	-1	15.40	15.40
Fixation R	1	4	27915873169	27916012414	139245	1028.70	532.54	5	28	-1	16.95	16.95
Blink L	1	1	27916012414	27916151654	139240
Blink R	1	1	27916012414	27916151654	139240
Fixation L	1	5	27916151654	27916330650	178996	1162.25	410.26	18	59	-1	15.56	15.56
Fixation R	1	5	27916151654	27916330650	178996	1162.25	410.26	18	59	-1	16.53	16.53
Saccade L	1	5	27916330650	27916350525	19875	1153.29	457.19	1152.46	481.78	0.40	49.90	0.00	20.21	559.43	-1158.91	762.04
Saccade R	1	5	27916330650	27916350525	19875	1153.29	457.19	1152.46	481.78	0.40	49.90	0.00	20.21	559.43	-1158.91	762.04
Fixation L	1	6	27916350525	27916589151	238626	1141.66	484.01	18	21	-1	15.53	15.53
Fixation R	1	6	27916350525	27916589151	238626	1141.66	484.01	18	21	-1	16.12	16.12
Saccade L	1	6	27916589151	27916609140	19989	1152.31	494.17	1260.75	643.86	1.09	186.92	1.00	54.64	4573.79	-4471.51	3153.83
Saccade R	1	6	27916589151	27916609140	19989	1152.31	494.17	1260.75	643.86	1.09	186.92	1.00	54.64	4573.79	-4471.51	3153.83
Fixation L	1	7	27916609140	27916808021	198881	1271.31	637.22	41	43	-1	15.65	15.65
Fixation R	1	7	27916609140	27916808021	198881	1271.31	637.22	41	43	-1	16.31	16.31
Saccade L	1	7	27916808021	27916827874	19853	1297.04	669.59	1318.28	671.86	0.51	41.19	0.00	25.91	5.44	-543.34	329.74
Saccade R	1	7	27916808021	27916827874	19853	1297.04	669.59	1318.28	671.86	0.51	41.19	0.00	25.91	5.44	-543.34	329.74
Fixation L	1	8	27916827874	27917066618	238744	1315.08	697.00	11	37	-1	15.23	15.23
Fixation R	1	8	27916827874	27917066618	238744	1315.08	697.00	11	37	-1	15.98	15.98
Saccade L	1	8	27917066618	27917106366	39748	1309.03	709.28	1131.13	535.71	2.15	137.53	0.50	53.97	3393.31	-3209.99	3024.01
Saccade R	1	8	27917066618	27917106366	39748	1309.03	709.28	1131.13	535.71	2.15	137.53	0.50	53.97	3393.31	-3209.99	3024.01
Fixation L	1	9	27917106366	27917444473	338107	1116.68	520.52	19	25	-1	15.24	15.24
Fixation R	1	9	27917106366	27917444473	338107	1116.68	520.52	19	25	-1	15.81	15.81
Saccade L	1	9	27917444473	27917523974	79501	1119.36	513.95	545.47	543.13	6.77	217.43	0.75	85.12	4054.65	-5256.41	3077.71
Saccade R	1	9	27917444473	27917523974	79501	1119.36	513.95	545.47	543.13	6.77	217.43	0.75	85.12	4054.65	-5256.41	3077.71
Fixation L	1	10	27917523974	27917683097	159123	540.23	554.37	40	31	-1	15.33	15.33
Fixation R	1	10	27917523974	27917683097	159123	540.23	554.37	40	31	-1	16.15	16.15
Saccade L	1	10	27917683097	27917703084	19987	510.64	569.88	464.87	615.88	0.73	65.63	1.00	36.43	1523.88	-1205.63	945.40
Saccade R	1	10	27917683097	27917703084	19987	510.64	569.88	464.87	615.88	0.73	65.63	1.00	36.43	1523.88	-1205.63	945.40
Fixation L	1	11	27917703084	27918379315	676231	465.19	651.09	48	49	-1	16.26	16.26
Fixation R	1	11	27917703084	27918379315	676231	465.19	651.09	48	49	-1	17.55	17.55
Saccade L	1	11	27918379315	27918438936	59621	467.49	623.72	1033.05	383.49	7.02	315.46	0.67	117.81	7757.36	-6199.27	4557.91
Saccade R	1	11	27918379315	27918438936	59621	467.49	623.72	1033.05	383.49	7.02	315.46	0.67	117.81	7757.36	-6199.27	4557.91
Fixation L	1	12	27918438936	27918598058	159122	1074.27	379.16	66	9	-1	16.70	16.70
Fixation R	1	12	27918438936	27918598058	159122	1074.27	379.16	66	9	-1	17.72	17.72
