[BeGaze]
Converted from:	C:\Documents and Settings\iViewX\Desktop\EXPERIMENTATIONS\Experiments\results\finaleart\S1022551-finaleart-1.idf
Date:	27.03.2019 15:37:49
Version:	BeGaze 2.5.77
Sample Rate:	50
Subject:	S1022551
Description:	Alexis Nebout

Table Header for Fixations:
Event Type	Trial	Number	Start	End	Duration	Location X	Location Y	Dispersion X	Dispersion Y	Plane	Avg. Pupil Size X	Avg. Pupil Size Y

Table Header for Saccades:
Event Type	Trial	Number	Start	End	Duration	Start Loc.X	Start Loc.Y	End Loc.X	End Loc.Y	Amplitude	Peak Speed	Peak Speed At	Average Speed	Peak Accel.	Peak Decel.	Average Accel.

Table Header for Blinks:
Event Type	Trial	Number	Start	End	Duration

Table Header for User Events:
Event Type	Trial	Number	Start	Description

UserEvent	1	1	7975783034	# Message: Turner-snow-storm-boat-off-a-harbours-mouth-1842.jpg
Fixation L	1	1	7975784593	7976838783	1054190	881.79	511.85	67	27	-1	14.22	14.22
Fixation R	1	1	7975784593	7976838783	1054190	881.79	511.85	67	27	-1	12.42	12.42
Saccade L	1	1	7976838783	7976878535	39752	908.87	500.14	1078.45	502.85	1.51	134.49	1.00	37.88	3178.75	-3140.36	1977.55
Saccade R	1	1	7976838783	7976878535	39752	908.87	500.14	1078.45	502.85	1.51	134.49	1.00	37.88	3178.75	-3140.36	1977.55
Fixation L	1	2	7976878535	7977077402	198867	1075.88	517.57	5	22	-1	12.98	12.98
Fixation R	1	2	7976878535	7977097274	218739	1075.95	520.45	5	49	-1	11.48	11.48
Blink L	1	1	7977077402	7977256388	178986
Saccade R	1	2	7977097274	7977176906	79632	1076.68	552.16	1012.64	635.69	8.66	249.26	1.00	108.70	4800.79	-5640.83	3294.56
Fixation R	1	3	7977176906	7978191236	1014330	1013.57	635.72	43	54	-1	11.54	11.54
Fixation L	1	3	7977256388	7978191236	934848	1013.69	634.84	43	33	-1	12.96	12.96
Saccade L	1	2	7978191236	7978211104	19868	1037.49	627.21	1040.09	549.52	0.53	78.62	1.00	26.65	1937.88	-1854.56	1265.83
Saccade R	1	3	7978191236	7978211104	19868	1037.49	627.21	1040.09	549.52	0.53	78.62	1.00	26.65	1937.88	-1854.56	1265.83
Fixation L	1	4	7978211104	7978688569	477465	1046.84	527.77	11	65	-1	12.26	12.26
Fixation R	1	4	7978211104	7978688569	477465	1046.84	527.77	11	65	-1	10.97	10.97
Saccade L	1	3	7978688569	7978728328	39759	1044.36	503.86	1109.79	326.67	1.58	140.06	1.00	39.73	3469.42	-3435.22	2336.42
Saccade R	1	4	7978688569	7978728328	39759	1044.36	503.86	1109.79	326.67	1.58	140.06	1.00	39.73	3469.42	-3435.22	2336.42
Fixation L	1	5	7978728328	7979145926	417598	1114.13	351.52	16	37	-1	11.19	11.19
Fixation R	1	5	7978728328	7979145926	417598	1114.13	351.52	16	37	-1	10.45	10.45
Saccade L	1	4	7979145926	7979165928	20002	1102.99	350.06	1058.43	180.91	1.04	176.90	1.00	52.05	4391.62	-4191.82	2891.63
Saccade R	1	5	7979145926	7979165928	20002	1102.99	350.06	1058.43	180.91	1.04	176.90	1.00	52.05	4391.62	-4191.82	2891.63
Fixation L	1	6	7979165928	7979364793	198865	1056.33	194.97	42	27	-1	11.00	11.00
Fixation R	1	6	7979165928	7979364793	198865	1056.33	194.97	42	27	-1	10.08	10.08
Saccade L	1	5	7979364793	7979384664	19871	1088.86	174.55	1253.32	-11.84	1.57	251.30	1.00	79.05	6231.24	-6240.98	4490.34
Saccade R	1	6	7979364793	7979384664	19871	1088.86	174.55	1253.32	-11.84	1.57	251.30	1.00	79.05	6231.24	-6240.98	4490.34
Fixation L	1	7	7979384664	7979484164	99500	1251.42	-3.12	4	12	-1	10.73	10.73
Fixation R	1	7	7979384664	7979484164	99500	1251.42	-3.12	4	12	-1	10.19	10.19
Saccade L	1	6	7979484164	7979782520	298356	1253.21	-1.06	1254.48	8.44	24.30	149.35	0.87	81.46	3701.66	-3646.81	1949.98
Saccade R	1	7	7979484164	7979782520	298356	1253.21	-1.06	1254.48	8.44	24.30	149.35	0.87	81.46	3701.66	-3646.81	1949.98
