[BeGaze]
Converted from:	C:\Documents and Settings\iViewX\Desktop\EXPERIMENTATIONS\Experiments\results\finaleart\S6124332-finaleart-1.idf
Date:	27.03.2019 15:36:20
Version:	BeGaze 2.5.77
Sample Rate:	50
Subject:	S6124332
Description:	Romain Ferrand

Table Header for Fixations:
Event Type	Trial	Number	Start	End	Duration	Location X	Location Y	Dispersion X	Dispersion Y	Plane	Avg. Pupil Size X	Avg. Pupil Size Y

Table Header for Saccades:
Event Type	Trial	Number	Start	End	Duration	Start Loc.X	Start Loc.Y	End Loc.X	End Loc.Y	Amplitude	Peak Speed	Peak Speed At	Average Speed	Peak Accel.	Peak Decel.	Average Accel.

Table Header for Blinks:
Event Type	Trial	Number	Start	End	Duration

Table Header for User Events:
Event Type	Trial	Number	Start	Description

UserEvent	1	1	12644961459	# Message: luxe-calme-et-volupté_matisse_1905.jpg
Saccade L	1	1	12644979675	12645099036	119361	974.66	520.11	964.26	554.33	3.88	81.26	0.67	32.52	1519.29	-1002.03	649.36
Saccade R	1	1	12644979675	12645099036	119361	974.66	520.11	964.26	554.33	3.88	81.26	0.67	32.52	1519.29	-1002.03	649.36
Fixation L	1	1	12645099036	12645496764	397728	953.66	578.67	35	37	-1	19.03	19.03
Fixation R	1	1	12645099036	12645496764	397728	953.66	578.67	35	37	-1	17.13	17.13
Saccade L	1	2	12645496764	12645516757	19993	981.77	591.94	1052.39	579.06	0.67	72.61	1.00	33.60	1790.00	-1241.20	1019.33
Saccade R	1	2	12645496764	12645516757	19993	981.77	591.94	1052.39	579.06	0.67	72.61	1.00	33.60	1790.00	-1241.20	1019.33
Fixation L	1	2	12645516757	12645636002	119245	1096.07	593.71	63	32	-1	17.51	17.51
Fixation R	1	2	12645516757	12645636002	119245	1096.07	593.71	63	32	-1	14.69	14.69
Saccade L	1	3	12645636002	12645655996	19994	1115.70	611.96	1116.28	617.29	0.15	10.21	1.00	7.60	93.01	-119.57	88.38
Saccade R	1	3	12645636002	12645655996	19994	1115.70	611.96	1116.28	617.29	0.15	10.21	1.00	7.60	93.01	-119.57	88.38
Fixation L	1	3	12645655996	12646093465	437469	1140.58	640.60	44	42	-1	15.38	15.38
Fixation R	1	3	12645655996	12646093465	437469	1140.58	640.60	44	42	-1	13.74	13.74
Saccade L	1	4	12646093465	12646113339	19874	1159.88	657.76	1090.96	854.99	1.21	211.26	1.00	60.73	5243.33	-4844.23	3502.41
Saccade R	1	4	12646093465	12646113339	19874	1159.88	657.76	1090.96	854.99	1.21	211.26	1.00	60.73	5243.33	-4844.23	3502.41
Fixation L	1	4	12646113339	12646292462	179123	1065.52	892.46	34	60	-1	14.96	14.96
Fixation R	1	4	12646113339	12646292462	179123	1065.52	892.46	34	60	-1	14.38	14.38
Saccade L	1	5	12646292462	12646312335	19873	1056.32	915.56	1055.13	921.69	0.12	7.63	0.00	5.95	52.93	-48.72	50.11
Saccade R	1	5	12646292462	12646312335	19873	1056.32	915.56	1055.13	921.69	0.12	7.63	0.00	5.95	52.93	-48.72	50.11
Fixation L	1	5	12646312335	12646491324	178989	1065.76	907.69	25	26	-1	15.20	15.20
Fixation R	1	5	12646312335	12646491324	178989	1065.76	907.69	25	26	-1	14.60	14.60
Saccade L	1	6	12646491324	12646531074	39750	1078.15	899.56	1098.29	684.68	1.94	169.13	1.00	48.72	4056.50	-3823.10	2470.46
Saccade R	1	6	12646491324	12646531074	39750	1078.15	899.56	1098.29	684.68	1.94	169.13	1.00	48.72	4056.50	-3823.10	2470.46
Fixation L	1	6	12646531074	12647008420	477346	1138.84	673.05	50	25	-1	15.15	15.15
Fixation R	1	6	12646531074	12647008420	477346	1138.84	673.05	50	25	-1	14.10	14.10
Saccade L	1	7	12647008420	12647068160	59740	1141.64	676.91	497.94	735.91	6.69	257.70	0.67	111.96	6286.99	-6259.06	4781.91
Saccade R	1	7	12647008420	12647068160	59740	1141.64	676.91	497.94	735.91	6.69	257.70	0.67	111.96	6286.99	-6259.06	4781.91
Fixation L	1	7	12647068160	12647306778	238618	485.97	768.41	17	56	-1	15.09	15.09
Fixation R	1	7	12647068160	12647306778	238618	485.97	768.41	17	56	-1	15.03	15.03
Saccade L	1	8	12647306778	12647346516	39738	483.02	787.15	699.27	734.15	1.97	124.94	0.50	49.47	3037.34	-2818.26	2584.97
Saccade R	1	8	12647306778	12647346516	39738	483.02	787.15	699.27	734.15	1.97	124.94	0.50	49.47	3037.34	-2818.26	2584.97
Fixation L	1	8	12647346516	12647764247	417731	706.42	687.97	9	60	-1	15.13	15.13
Fixation R	1	8	12647346516	12647764247	417731	706.42	687.97	9	60	-1	15.14	15.14
Saccade L	1	9	12647764247	12647803999	39752	700.72	674.94	327.72	546.98	3.30	231.14	0.50	82.99	5703.87	-5690.89	4895.50
Saccade R	1	9	12647764247	12647803999	39752	700.72	674.94	327.72	546.98	3.30	231.14	0.50	82.99	5703.87	-5690.89	4895.50
Fixation L	1	9	12647803999	12648261466	457467	349.48	563.02	41	57	-1	14.58	14.58
Fixation R	1	9	12647803999	12648261466	457467	349.48	563.02	41	57	-1	15.02	15.02
Saccade L	1	10	12648261466	12648281345	19879	367.12	594.76	370.61	599.73	0.07	6.14	1.00	3.31	92.66	-111.83	73.72
Saccade R	1	10	12648261466	12648281345	19879	367.12	594.76	370.61	599.73	0.07	6.14	1.00	3.31	92.66	-111.83	73.72
Fixation L	1	10	12648281345	12648400712	119367	372.63	603.58	3	7	-1	14.51	14.51
Fixation R	1	10	12648281345	12648400712	119367	372.63	603.58	3	7	-1	15.35	15.35
Saccade L	1	11	12648400712	12648460458	59746	372.29	606.81	865.33	954.57	6.47	299.38	0.67	108.26	7392.18	-7104.67	4746.78
Saccade R	1	11	12648400712	12648460458	59746	372.29	606.81	865.33	954.57	6.47	299.38	0.67	108.26	7392.18	-7104.67	4746.78
Fixation L	1	11	12648460458	12648559845	99387	861.41	950.22	5	17	-1	15.29	15.29
Fixation R	1	11	12648460458	12648559845	99387	861.41	950.22	5	17	-1	15.72	15.72
Saccade L	1	12	12648559845	12648639444	79599	859.78	957.68	891.18	936.96	3.08	113.39	0.25	38.75	2799.43	-2348.28	1678.72
Saccade R	1	12	12648559845	12648639444	79599	859.78	957.68	891.18	936.96	3.08	113.39	0.25	38.75	2799.43	-2348.28	1678.72
Fixation L	1	12	12648639444	12648778688	139244	889.92	917.83	22	63	-1	15.56	15.56
Fixation R	1	12	12648639444	12648778688	139244	889.92	917.83	22	63	-1	15.89	15.89
Saccade L	1	13	12648778688	12648798556	19868	897.92	882.94	896.40	852.70	0.22	30.63	1.00	11.24	745.49	-342.55	380.91
Saccade R	1	13	12648778688	12648798556	19868	897.92	882.94	896.40	852.70	0.22	30.63	1.00	11.24	745.49	-342.55	380.91
Fixation L	1	13	12648798556	12648957668	159112	895.97	856.91	19	27	-1	15.72	15.72
Fixation R	1	13	12648798556	12648957668	159112	895.97	856.91	19	27	-1	15.60	15.60
