[BeGaze]
Converted from:	C:\Documents and Settings\iViewX\Desktop\EXPERIMENTATIONS\Experiments\results\finaleart\S21F22332-finaleart-1.idf
Date:	27.03.2019 15:56:33
Version:	BeGaze 2.5.77
Sample Rate:	50
Subject:	S21F22332
Description:	Cyrielle Mailart

Table Header for Fixations:
Event Type	Trial	Number	Start	End	Duration	Location X	Location Y	Dispersion X	Dispersion Y	Plane	Avg. Pupil Size X	Avg. Pupil Size Y

Table Header for Saccades:
Event Type	Trial	Number	Start	End	Duration	Start Loc.X	Start Loc.Y	End Loc.X	End Loc.Y	Amplitude	Peak Speed	Peak Speed At	Average Speed	Peak Accel.	Peak Decel.	Average Accel.

Table Header for Blinks:
Event Type	Trial	Number	Start	End	Duration

Table Header for User Events:
Event Type	Trial	Number	Start	Description

UserEvent	1	1	3232088251	# Message: plate-of-peaches-Fantin-Latour-1862.jpg
Fixation L	1	1	3232099617	3232318348	218731	975.56	483.48	10	13	-1	13.60	13.60
Fixation R	1	1	3232099617	3232318348	218731	975.56	483.48	10	13	-1	12.38	12.38
Saccade L	1	1	3232318348	3232338225	19877	970.08	488.90	882.14	488.96	0.49	88.96	1.00	24.45	2178.21	-2132.74	1457.03
Saccade R	1	1	3232318348	3232338225	19877	970.08	488.90	882.14	488.96	0.49	88.96	1.00	24.45	2178.21	-2132.74	1457.03
Fixation L	1	2	3232338225	3232537223	198998	885.41	497.91	9	18	-1	13.91	13.91
Fixation R	1	2	3232338225	3232537223	198998	885.41	497.91	9	18	-1	12.52	12.52
Saccade L	1	2	3232537223	3232557097	19874	879.12	502.22	821.08	371.89	0.83	144.29	1.00	41.67	3567.97	-3546.19	2416.19
Saccade R	1	2	3232537223	3232557097	19874	879.12	502.22	821.08	371.89	0.83	144.29	1.00	41.67	3567.97	-3546.19	2416.19
Fixation L	1	3	3232557097	3232795701	238604	809.54	359.96	17	18	-1	13.65	13.65
Fixation R	1	3	3232557097	3232795701	238604	809.54	359.96	17	18	-1	12.63	12.63
Saccade L	1	3	3232795701	3232835449	39748	803.99	362.20	1091.84	345.27	2.40	163.26	1.00	60.38	4013.28	-3628.16	3469.77
Saccade R	1	3	3232795701	3232835449	39748	803.99	362.20	1091.84	345.27	2.40	163.26	1.00	60.38	4013.28	-3628.16	3469.77
Fixation L	1	4	3232835449	3233193559	358110	1097.79	340.02	13	25	-1	13.77	13.77
Fixation R	1	4	3232835449	3233193559	358110	1097.79	340.02	13	25	-1	13.06	13.06
Saccade L	1	4	3233193559	3233233308	39749	1105.78	326.49	846.44	301.25	2.38	144.95	0.50	59.80	3468.25	-3059.18	3057.84
Saccade R	1	4	3233193559	3233233308	39749	1105.78	326.49	846.44	301.25	2.38	144.95	0.50	59.80	3468.25	-3059.18	3057.84
Fixation L	1	5	3233233308	3233412292	178984	857.23	299.41	17	27	-1	14.21	14.21
Fixation R	1	5	3233233308	3233412292	178984	857.23	299.41	17	27	-1	13.30	13.30
Saccade L	1	5	3233412292	3233452046	39754	853.94	287.19	628.29	565.69	3.25	273.47	0.50	81.67	6814.84	-6739.16	4901.04
Saccade R	1	5	3233412292	3233452046	39754	853.94	287.19	628.29	565.69	3.25	273.47	0.50	81.67	6814.84	-6739.16	4901.04
Fixation L	1	6	3233452046	3233690788	238742	616.96	568.78	48	46	-1	14.15	14.15
Fixation R	1	6	3233452046	3233690788	238742	616.96	568.78	48	46	-1	13.47	13.47
Saccade L	1	6	3233690788	3233730530	39742	580.06	532.87	291.94	183.37	4.58	253.50	0.50	115.14	6309.36	-4935.03	4915.33
Saccade R	1	6	3233690788	3233730530	39742	580.06	532.87	291.94	183.37	4.58	253.50	0.50	115.14	6309.36	-4935.03	4915.33
Fixation L	1	7	3233730530	3233830022	99492	276.40	166.85	37	61	-1	13.63	13.63
Fixation R	1	7	3233730530	3233830022	99492	276.40	166.85	37	61	-1	13.05	13.05
Saccade L	1	7	3233830022	3233869768	39746	279.86	156.83	298.41	283.30	1.99	78.48	1.00	50.11	765.82	-909.38	599.58
Saccade R	1	7	3233830022	3233869768	39746	279.86	156.83	298.41	283.30	1.99	78.48	1.00	50.11	765.82	-909.38	599.58
Fixation L	1	8	3233869768	3233989145	119377	328.09	283.16	47	51	-1	13.36	13.36
Fixation R	1	8	3233869768	3233989145	119377	328.09	283.16	47	51	-1	13.14	13.14
Blink L	1	1	3233989145	3234347120	357975
Blink R	1	1	3233989145	3234347120	357975
Saccade L	1	8	3234347120	3234446488	99368	368.50	311.75	728.26	667.13	7.55	307.33	0.80	75.99	7542.23	-7136.11	3609.75
Saccade R	1	8	3234347120	3234446488	99368	368.50	311.75	728.26	667.13	7.55	307.33	0.80	75.99	7542.23	-7136.11	3609.75
Fixation L	1	9	3234446488	3234685222	238734	754.23	677.66	31	17	-1	14.37	14.37
Fixation R	1	9	3234446488	3234685222	238734	754.23	677.66	31	17	-1	14.34	14.34
Blink L	1	2	3234685222	3234864217	178995
Blink R	1	2	3234685222	3234864217	178995
Saccade L	1	9	3234864217	3234943711	79494	1094.22	917.96	1099.32	908.48	5.55	411.28	1.00	69.81	39201.31	-507.27	8361.56
Saccade R	1	9	3234864217	3234943711	79494	1094.22	917.96	1099.32	908.48	5.55	411.28	1.00	69.81	39201.31	-507.27	8361.56
Blink L	1	3	3234943711	3235182481	238770
Blink R	1	3	3234943711	3235182481	238770
Saccade L	1	10	3235182481	3235281947	99466	1102.17	802.55	1112.39	660.68	3.85	127.89	1.00	38.67	3067.37	-3043.78	1173.80
Saccade R	1	10	3235182481	3235281947	99466	1102.17	802.55	1112.39	660.68	3.85	127.89	1.00	38.67	3067.37	-3043.78	1173.80
Fixation L	1	10	3235281947	3235401327	119380	1126.59	700.86	22	50	-1	15.03	15.03
Fixation R	1	10	3235281947	3235401327	119380	1126.59	700.86	22	50	-1	14.40	14.40
Saccade L	1	11	3235401327	3235441073	39746	1134.89	710.68	893.21	452.06	3.08	255.90	0.50	77.38	6343.52	-6147.34	4508.99
Saccade R	1	11	3235401327	3235441073	39746	1134.89	710.68	893.21	452.06	3.08	255.90	0.50	77.38	6343.52	-6147.34	4508.99
Fixation L	1	11	3235441073	3235759306	318233	884.24	439.91	11	33	-1	14.21	14.21
Fixation R	1	11	3235441073	3235759306	318233	884.24	439.91	11	33	-1	13.62	13.62
Saccade L	1	12	3235759306	3235858785	99479	883.90	425.25	948.10	519.75	4.28	166.48	1.00	43.01	29167.74	-2818.17	5805.68
Saccade R	1	12	3235759306	3235858785	99479	883.90	425.25	948.10	519.75	4.28	166.48	1.00	43.01	29167.74	-2818.17	5805.68
Blink L	1	4	3235858785	3236037784	178999
Blink R	1	4	3235858785	3236037784	178999
Saccade L	1	13	3236037784	3236077527	39743	951.12	541.28	949.47	551.36	1.96	127.75	1.00	49.31	605.37	-2546.32	1050.56
Saccade R	1	13	3236037784	3236077527	39743	951.12	541.28	949.47	551.36	1.96	127.75	1.00	49.31	605.37	-2546.32	1050.56
