[BeGaze]
Converted from:	C:\Documents and Settings\iViewX\Desktop\EXPERIMENTATIONS\Experiments\results\finaleart\S9H29221-finaleart-1.idf
Date:	27.03.2019 16:03:13
Version:	BeGaze 2.5.77
Sample Rate:	50
Subject:	S9H29221
Description:	steven

Table Header for Fixations:
Event Type	Trial	Number	Start	End	Duration	Location X	Location Y	Dispersion X	Dispersion Y	Plane	Avg. Pupil Size X	Avg. Pupil Size Y

Table Header for Saccades:
Event Type	Trial	Number	Start	End	Duration	Start Loc.X	Start Loc.Y	End Loc.X	End Loc.Y	Amplitude	Peak Speed	Peak Speed At	Average Speed	Peak Accel.	Peak Decel.	Average Accel.

Table Header for Blinks:
Event Type	Trial	Number	Start	End	Duration

Table Header for User Events:
Event Type	Trial	Number	Start	Description

UserEvent	1	1	6321439164	# Message: void.jpg
Fixation L	1	1	6321448105	6321938663	490558	1566.18	647.08	15	14	-1	12.93	12.93
Fixation R	1	1	6321448105	6321938663	490558	1566.18	647.08	15	14	-1	12.09	12.09
Saccade L	1	1	6321938663	6321950808	12145	1557.66	652.84	1500.82	719.41	0.36	88.55	1.00	29.27	2098.27	-2068.44	1390.70
Saccade R	1	1	6321938663	6321950808	12145	1557.66	652.84	1500.82	719.41	0.36	88.55	1.00	29.27	2098.27	-2068.44	1390.70
Fixation L	1	2	6321950808	6322203931	253123	1486.60	712.55	28	17	-1	12.43	12.43
Fixation R	1	2	6321950808	6322203931	253123	1486.60	712.55	28	17	-1	11.35	11.35
Blink L	1	1	6322203931	6322422680	218749
Blink R	1	1	6322203931	6322422680	218749
Fixation L	1	3	6322422680	6322542030	119350	871.14	391.54	42	50	-1	11.13	11.13
Fixation R	1	3	6322422680	6322542030	119350	871.14	391.54	42	50	-1	10.89	10.89
Saccade L	1	2	6322542030	6322561911	19881	884.54	360.25	884.50	335.19	0.39	25.36	1.00	19.49	42.51	-382.55	247.68
Saccade R	1	2	6322542030	6322561911	19881	884.54	360.25	884.50	335.19	0.39	25.36	1.00	19.49	42.51	-382.55	247.68
Fixation L	1	4	6322561911	6322979641	417730	889.58	329.04	86	12	-1	11.39	11.39
Fixation R	1	4	6322561911	6322979641	417730	889.58	329.04	86	12	-1	10.98	10.98
Saccade L	1	3	6322979641	6322999510	19869	959.52	330.13	967.34	330.52	0.39	38.47	0.00	19.50	3.21	-785.16	401.38
Saccade R	1	3	6322979641	6322999510	19869	959.52	330.13	967.34	330.52	0.39	38.47	0.00	19.50	3.21	-785.16	401.38
Fixation L	1	5	6322999510	6323218252	218742	1002.82	331.38	84	6	-1	11.56	11.56
Fixation R	1	5	6322999510	6323218252	218742	1002.82	331.38	84	6	-1	11.20	11.20
Saccade L	1	4	6323218252	6323238135	19883	1052.07	331.13	1061.19	329.01	0.26	23.63	1.00	13.22	77.85	-354.01	204.50
Saccade R	1	4	6323218252	6323238135	19883	1052.07	331.13	1061.19	329.01	0.26	23.63	1.00	13.22	77.85	-354.01	204.50
Fixation L	1	6	6323238135	6323476869	238734	1097.27	333.06	62	31	-1	11.93	11.93
Fixation R	1	6	6323238135	6323476869	238734	1097.27	333.06	62	31	-1	11.66	11.66
