[BeGaze]
Converted from:	C:\Documents and Settings\iViewX\Desktop\EXPERIMENTATIONS\Experiments\results\finaleart\S6124332-finaleart-1.idf
Date:	27.03.2019 15:35:55
Version:	BeGaze 2.5.77
Sample Rate:	50
Subject:	S6124332
Description:	Romain Ferrand

Table Header for Fixations:
Event Type	Trial	Number	Start	End	Duration	Location X	Location Y	Dispersion X	Dispersion Y	Plane	Avg. Pupil Size X	Avg. Pupil Size Y

Table Header for Saccades:
Event Type	Trial	Number	Start	End	Duration	Start Loc.X	Start Loc.Y	End Loc.X	End Loc.Y	Amplitude	Peak Speed	Peak Speed At	Average Speed	Peak Accel.	Peak Decel.	Average Accel.

Table Header for Blinks:
Event Type	Trial	Number	Start	End	Duration

Table Header for User Events:
Event Type	Trial	Number	Start	Description

UserEvent	1	1	11977549938	# Message: nature_morte_aux_oranges_Vlaminck_1909.jpg
Fixation L	1	1	11977557537	11978034877	477340	849.86	811.00	12	45	-1	17.52	17.52
Fixation R	1	1	11977557537	11978034877	477340	849.86	811.00	12	45	-1	16.80	16.80
Saccade L	1	1	11978034877	11978054768	19891	856.84	775.60	867.73	673.58	0.76	103.78	1.00	38.43	2528.30	-2036.92	1585.72
Saccade R	1	1	11978034877	11978054768	19891	856.84	775.60	867.73	673.58	0.76	103.78	1.00	38.43	2528.30	-2036.92	1585.72
Fixation L	1	2	11978054768	11978193985	139217	899.75	650.45	42	39	-1	17.25	17.25
Fixation R	1	2	11978054768	11978193985	139217	899.75	650.45	42	39	-1	16.57	16.57
Saccade L	1	2	11978193985	11978253612	59627	907.56	633.66	913.95	434.95	2.20	124.57	0.67	36.88	3014.33	-2973.38	1503.81
Saccade R	1	2	11978193985	11978253612	59627	907.56	633.66	913.95	434.95	2.20	124.57	0.67	36.88	3014.33	-2973.38	1503.81
Fixation L	1	3	11978253612	11978392863	139251	907.29	435.49	71	15	-1	15.59	15.59
Fixation R	1	3	11978253612	11978392863	139251	907.29	435.49	71	15	-1	15.10	15.10
Saccade L	1	3	11978392863	11978432611	39748	912.84	437.63	862.63	298.47	2.28	111.25	1.00	57.39	2462.59	-1828.83	1719.47
Saccade R	1	3	11978392863	11978432611	39748	912.84	437.63	862.63	298.47	2.28	111.25	1.00	57.39	2462.59	-1828.83	1719.47
Fixation L	1	4	11978432611	11978711093	278482	864.21	267.57	10	64	-1	14.78	14.78
Fixation R	1	4	11978432611	11978711093	278482	864.21	267.57	10	64	-1	14.90	14.90
Saccade L	1	4	11978711093	11978730958	19865	865.35	272.17	804.88	273.80	0.61	61.19	1.00	30.46	1522.80	-1465.10	1475.48
Saccade R	1	4	11978711093	11978730958	19865	865.35	272.17	804.88	273.80	0.61	61.19	1.00	30.46	1522.80	-1465.10	1475.48
Fixation L	1	5	11978730958	11978989594	258636	743.99	279.43	70	10	-1	15.61	15.61
Fixation R	1	5	11978730958	11978989594	258636	743.99	279.43	70	10	-1	15.52	15.52
Saccade L	1	5	11978989594	11979108937	119343	734.06	282.12	539.80	839.10	9.97	262.56	0.33	83.55	6515.38	-6144.97	3180.20
Saccade R	1	5	11978989594	11979108937	119343	734.06	282.12	539.80	839.10	9.97	262.56	0.33	83.55	6515.38	-6144.97	3180.20
Fixation L	1	6	11979108937	11979208330	99393	541.39	852.00	4	22	-1	17.02	17.02
Fixation R	1	6	11979108937	11979208330	99393	541.39	852.00	4	22	-1	17.16	17.16
Saccade L	1	6	11979208330	11979248056	39726	538.88	861.47	368.72	1065.67	2.29	151.00	0.50	57.74	3701.85	-3506.31	3252.43
Saccade R	1	6	11979208330	11979248056	39726	538.88	861.47	368.72	1065.67	2.29	151.00	0.50	57.74	3701.85	-3506.31	3252.43
Fixation L	1	7	11979248056	11979466923	218867	374.44	1077.20	10	20	-1	16.82	16.82
Fixation R	1	7	11979248056	11979466923	218867	374.44	1077.20	10	20	-1	17.21	17.21
Saccade L	1	7	11979466923	11979526546	59623	378.93	1086.11	547.24	794.80	4.21	162.90	1.00	70.54	3540.17	-3764.21	2947.13
Saccade R	1	7	11979466923	11979526546	59623	378.93	1086.11	547.24	794.80	4.21	162.90	1.00	70.54	3540.17	-3764.21	2947.13
Fixation L	1	8	11979526546	11979745415	218869	550.92	800.94	16	12	-1	16.85	16.85
Fixation R	1	8	11979526546	11979745415	218869	550.92	800.94	16	12	-1	17.08	17.08
Saccade L	1	8	11979745415	11979765266	19851	550.89	804.77	499.67	703.25	0.77	115.01	1.00	39.04	2825.07	-2485.40	1980.57
Saccade R	1	8	11979745415	11979765266	19851	550.89	804.77	499.67	703.25	0.77	115.01	1.00	39.04	2825.07	-2485.40	1980.57
Fixation L	1	9	11979765266	11980003890	238624	475.85	717.15	31	24	-1	16.17	16.17
Fixation R	1	9	11979765266	11980003890	238624	475.85	717.15	31	24	-1	16.46	16.46
Saccade L	1	9	11980003890	11980063633	59743	468.33	720.49	1157.26	723.61	7.09	297.09	0.67	118.61	7384.97	-7138.13	5078.27
Saccade R	1	9	11980003890	11980063633	59743	468.33	720.49	1157.26	723.61	7.09	297.09	0.67	118.61	7384.97	-7138.13	5078.27
Fixation L	1	10	11980063633	11980401735	338102	1167.53	720.98	15	16	-1	16.55	16.55
Fixation R	1	10	11980063633	11980401735	338102	1167.53	720.98	15	16	-1	16.03	16.03
Saccade L	1	10	11980401735	11980481222	79487	1163.54	729.71	359.48	1104.78	10.59	281.47	0.50	133.25	6904.07	-6569.33	4523.74
Saccade R	1	10	11980401735	11980481222	79487	1163.54	729.71	359.48	1104.78	10.59	281.47	0.50	133.25	6904.07	-6569.33	4523.74
Fixation L	1	11	11980481222	11980839334	358112	364.98	1127.67	15	44	-1	16.68	16.68
Fixation R	1	11	11980481222	11980839334	358112	364.98	1127.67	15	44	-1	16.80	16.80
Saccade L	1	11	11980839334	11981018320	178986	372.92	1149.38	1266.41	504.13	20.24	288.42	0.33	113.11	6051.12	-5717.95	3059.16
Saccade R	1	11	11980839334	11981018320	178986	372.92	1149.38	1266.41	504.13	20.24	288.42	0.33	113.11	6051.12	-5717.95	3059.16
Fixation L	1	12	11981018320	11981356431	338111	1266.98	495.26	7	13	-1	16.51	16.51
Fixation R	1	12	11981018320	11981356431	338111	1266.98	495.26	7	13	-1	16.11	16.11
Saccade L	1	12	11981356431	11981396170	39739	1269.34	497.53	1123.55	625.91	1.92	143.30	0.50	48.30	3546.56	-2664.63	1966.46
Saccade R	1	12	11981356431	11981396170	39739	1269.34	497.53	1123.55	625.91	1.92	143.30	0.50	48.30	3546.56	-2664.63	1966.46
Fixation L	1	13	11981396170	11981535419	139249	1126.22	630.85	27	42	-1	17.30	17.30
Fixation R	1	13	11981396170	11981535419	139249	1126.22	630.85	27	42	-1	15.80	15.80
