[BeGaze]
Converted from:	C:\Documents and Settings\iViewX\Desktop\EXPERIMENTATIONS\Experiments\results\finaleart\S6124332-finaleart-1.idf
Date:	27.03.2019 15:35:46
Version:	BeGaze 2.5.77
Sample Rate:	50
Subject:	S6124332
Description:	Romain Ferrand

Table Header for Fixations:
Event Type	Trial	Number	Start	End	Duration	Location X	Location Y	Dispersion X	Dispersion Y	Plane	Avg. Pupil Size X	Avg. Pupil Size Y

Table Header for Saccades:
Event Type	Trial	Number	Start	End	Duration	Start Loc.X	Start Loc.Y	End Loc.X	End Loc.Y	Amplitude	Peak Speed	Peak Speed At	Average Speed	Peak Accel.	Peak Decel.	Average Accel.

Table Header for Blinks:
Event Type	Trial	Number	Start	End	Duration

Table Header for User Events:
Event Type	Trial	Number	Start	Description

UserEvent	1	1	11705234397	# Message: REJECTED_rose_in_a_bowl_fantin_latour_1883.jpg
Fixation L	1	1	11705254329	11705831052	576723	1019.85	594.74	76	20	-1	18.16	18.16
Fixation R	1	1	11705254329	11705831052	576723	1019.85	594.74	76	20	-1	17.45	17.45
Saccade L	1	1	11705831052	11705850911	19859	954.40	585.51	950.48	582.47	0.10	9.67	0.00	5.03	104.78	-126.35	106.18
Saccade R	1	1	11705831052	11705850911	19859	954.40	585.51	950.48	582.47	0.10	9.67	0.00	5.03	104.78	-126.35	106.18
Fixation L	1	2	11705850911	11705990164	139253	944.76	579.59	45	14	-1	19.64	19.64
Fixation R	1	2	11705850911	11705990164	139253	944.76	579.59	45	14	-1	18.47	18.47
Saccade L	1	2	11705990164	11706010037	19873	905.63	579.75	792.65	587.15	0.84	114.52	1.00	42.36	2640.86	-2728.87	2147.83
Saccade R	1	2	11705990164	11706010037	19873	905.63	579.75	792.65	587.15	0.84	114.52	1.00	42.36	2640.86	-2728.87	2147.83
Fixation L	1	3	11706010037	11706209013	198976	794.39	601.55	2	29	-1	19.57	19.57
Fixation R	1	3	11706010037	11706209013	198976	794.39	601.55	2	29	-1	19.05	19.05
Saccade L	1	3	11706209013	11706228889	19876	794.42	616.35	709.23	623.23	0.53	86.46	1.00	26.74	2107.79	-2018.33	1474.95
Saccade R	1	3	11706209013	11706228889	19876	794.42	616.35	709.23	623.23	0.53	86.46	1.00	26.74	2107.79	-2018.33	1474.95
Fixation L	1	4	11706228889	11706368142	139253	690.83	631.40	25	15	-1	19.40	19.40
Fixation R	1	4	11706228889	11706368142	139253	690.83	631.40	25	15	-1	19.09	19.09
Saccade L	1	4	11706368142	11706407887	39745	683.79	638.30	1052.17	616.31	3.31	229.92	1.00	83.25	5680.87	-5354.31	4302.01
Saccade R	1	4	11706368142	11706407887	39745	683.79	638.30	1052.17	616.31	3.31	229.92	1.00	83.25	5680.87	-5354.31	4302.01
Fixation L	1	5	11706407887	11706527255	119368	1077.66	573.95	35	58	-1	18.87	18.87
Fixation R	1	5	11706407887	11706527255	119368	1077.66	573.95	35	58	-1	18.37	18.37
Saccade L	1	5	11706527255	11706547126	19871	1086.53	557.92	1090.09	550.36	0.08	8.45	1.00	4.10	114.45	-18.76	52.11
Saccade R	1	5	11706527255	11706547126	19871	1086.53	557.92	1090.09	550.36	0.08	8.45	1.00	4.10	114.45	-18.76	52.11
Fixation L	1	6	11706547126	11706646496	99370	1095.84	544.85	33	11	-1	18.53	18.53
Fixation R	1	6	11706547126	11706646496	99370	1095.84	544.85	33	11	-1	18.30	18.30
Saccade L	1	6	11706646496	11706666491	19995	1122.20	544.92	1339.55	546.64	1.39	219.77	1.00	69.33	5320.46	-5406.68	3663.55
Saccade R	1	6	11706646496	11706666491	19995	1122.20	544.92	1339.55	546.64	1.39	219.77	1.00	69.33	5320.46	-5406.68	3663.55
Fixation L	1	7	11706666491	11706905098	238607	1357.51	562.72	49	46	-1	18.77	18.77
Fixation R	1	7	11706666491	11706905098	238607	1357.51	562.72	49	46	-1	18.00	18.00
Saccade L	1	7	11706905098	11706924977	19879	1389.12	592.85	1485.70	626.83	0.87	103.56	1.00	43.92	2392.92	-2410.94	1602.61
Saccade R	1	7	11706905098	11706924977	19879	1389.12	592.85	1485.70	626.83	0.87	103.56	1.00	43.92	2392.92	-2410.94	1602.61
Fixation L	1	8	11706924977	11707462075	537098	1483.13	680.03	16	79	-1	19.47	19.47
Fixation R	1	8	11706924977	11707462075	537098	1483.13	680.03	16	79	-1	18.36	18.36
Saccade L	1	8	11707462075	11707501824	39749	1471.88	706.36	1073.83	713.70	3.48	213.25	0.50	87.42	5193.90	-4760.56	4814.99
Saccade R	1	8	11707462075	11707501824	39749	1471.88	706.36	1073.83	713.70	3.48	213.25	0.50	87.42	5193.90	-4760.56	4814.99
Fixation L	1	9	11707501824	11707740431	238607	1048.98	709.12	42	27	-1	19.88	19.88
Fixation R	1	9	11707501824	11707740431	238607	1048.98	709.12	42	27	-1	19.32	19.32
Saccade L	1	9	11707740431	11707760433	20002	1031.47	690.84	876.13	681.51	1.00	157.39	1.00	50.08	3896.34	-3856.51	2652.63
Saccade R	1	9	11707740431	11707760433	20002	1031.47	690.84	876.13	681.51	1.00	157.39	1.00	50.08	3896.34	-3856.51	2652.63
Fixation L	1	10	11707760433	11708038785	278352	846.14	668.80	60	39	-1	20.14	20.14
Fixation R	1	10	11707760433	11708038785	278352	846.14	668.80	60	39	-1	19.00	19.00
Saccade L	1	10	11708038785	11708058782	19997	817.20	692.31	805.80	698.34	0.19	16.65	1.00	9.63	28.85	-90.06	59.08
Saccade R	1	10	11708038785	11708058782	19997	817.20	692.31	805.80	698.34	0.19	16.65	1.00	9.63	28.85	-90.06	59.08
Fixation L	1	11	11708058782	11708237771	178989	807.09	706.17	79	17	-1	20.03	20.03
Fixation R	1	11	11708058782	11708237771	178989	807.09	706.17	79	17	-1	19.22	19.22
Saccade L	1	11	11708237771	11708257656	19885	873.76	697.76	954.85	695.33	0.90	82.06	1.00	45.20	1897.56	-1988.85	1868.31
Saccade R	1	11	11708237771	11708257656	19885	873.76	697.76	954.85	695.33	0.90	82.06	1.00	45.20	1897.56	-1988.85	1868.31
Fixation L	1	12	11708257656	11708536123	278467	950.22	669.39	38	48	-1	19.58	19.58
Fixation R	1	12	11708257656	11708536123	278467	950.22	669.39	38	48	-1	18.31	18.31
Saccade L	1	12	11708536123	11708556117	19994	982.42	646.68	1014.58	645.74	0.37	33.34	0.00	18.38	776.55	-698.68	718.43
Saccade R	1	12	11708536123	11708556117	19994	982.42	646.68	1014.58	645.74	0.37	33.34	0.00	18.38	776.55	-698.68	718.43
Fixation L	1	13	11708556117	11709033351	477234	1024.66	648.30	44	35	-1	19.13	19.13
Fixation R	1	13	11708556117	11709033351	477234	1024.66	648.30	44	35	-1	18.44	18.44
Saccade L	1	13	11709033351	11709053237	19886	1010.04	621.35	972.41	495.84	0.98	132.53	1.00	49.19	3191.60	-3168.82	2409.97
Saccade R	1	13	11709033351	11709053237	19886	1010.04	621.35	972.41	495.84	0.98	132.53	1.00	49.19	3191.60	-3168.82	2409.97
Fixation L	1	14	11709053237	11709232214	178977	957.55	504.81	24	15	-1	20.03	20.03
Fixation R	1	14	11709053237	11709232214	178977	957.55	504.81	24	15	-1	18.97	18.97
