[BeGaze]
Converted from:	C:\Documents and Settings\iViewX\Desktop\EXPERIMENTATIONS\Experiments\results\finaleart\S16F14542-finaleart-1.idf
Date:	27.03.2019 15:46:36
Version:	BeGaze 2.5.77
Sample Rate:	50
Subject:	S16F14542
Description:	Diane Dewez

Table Header for Fixations:
Event Type	Trial	Number	Start	End	Duration	Location X	Location Y	Dispersion X	Dispersion Y	Plane	Avg. Pupil Size X	Avg. Pupil Size Y

Table Header for Saccades:
Event Type	Trial	Number	Start	End	Duration	Start Loc.X	Start Loc.Y	End Loc.X	End Loc.Y	Amplitude	Peak Speed	Peak Speed At	Average Speed	Peak Accel.	Peak Decel.	Average Accel.

Table Header for Blinks:
Event Type	Trial	Number	Start	End	Duration

Table Header for User Events:
Event Type	Trial	Number	Start	Description

UserEvent	1	1	6584967577	# Message: Le_port_d-Anvers_Braque_1906.jpg
Fixation L	1	1	6584970619	6585706600	735981	895.54	506.83	15	24	-1	14.18	14.18
Fixation R	1	1	6584970619	6585706600	735981	895.54	506.83	15	24	-1	14.42	14.42
Saccade L	1	1	6585706600	6585746335	39735	892.43	493.89	654.97	491.52	2.03	156.98	1.00	51.00	3900.75	-3678.45	2851.12
Saccade R	1	1	6585706600	6585746335	39735	892.43	493.89	654.97	491.52	2.03	156.98	1.00	51.00	3900.75	-3678.45	2851.12
Fixation L	1	2	6585746335	6585925329	178994	632.94	487.90	33	24	-1	12.96	12.96
Fixation R	1	2	6585746335	6585925329	178994	632.94	487.90	33	24	-1	13.02	13.02
Saccade L	1	2	6585925329	6585965194	39865	645.48	504.93	861.55	735.55	2.89	211.36	0.50	72.60	5256.88	-5059.38	3768.26
Saccade R	1	2	6585925329	6585965194	39865	645.48	504.93	861.55	735.55	2.89	211.36	0.50	72.60	5256.88	-5059.38	3768.26
Fixation L	1	3	6585965194	6586303325	338131	868.57	725.68	85	12	-1	12.67	12.67
Fixation R	1	3	6585965194	6586303325	338131	868.57	725.68	85	12	-1	12.67	12.67
Saccade L	1	3	6586303325	6586323180	19855	939.68	722.57	1102.87	705.08	1.32	165.99	1.00	66.72	4117.96	-3829.30	2970.47
Saccade R	1	3	6586303325	6586323180	19855	939.68	722.57	1102.87	705.08	1.32	165.99	1.00	66.72	4117.96	-3829.30	2970.47
Fixation L	1	4	6586323180	6586601660	278480	1138.29	672.51	42	45	-1	13.33	13.33
Fixation R	1	4	6586323180	6586601660	278480	1138.29	672.51	42	45	-1	12.74	12.74
Blink L	1	1	6586601660	6586720909	119249
Blink R	1	1	6586601660	6586720909	119249
Fixation L	1	5	6586720909	6586840279	119370	1298.94	588.68	5	17	-1	13.82	13.82
Fixation R	1	5	6586720909	6586840279	119370	1298.94	588.68	5	17	-1	14.08	14.08
Saccade L	1	4	6586840279	6586880033	39754	1300.84	583.07	1389.39	336.90	2.26	139.41	1.00	56.94	3420.70	-3385.67	3194.89
Saccade R	1	4	6586840279	6586880033	39754	1300.84	583.07	1389.39	336.90	2.26	139.41	1.00	56.94	3420.70	-3385.67	3194.89
Fixation L	1	6	6586880033	6587158512	278479	1409.74	322.47	38	49	-1	14.11	14.11
Fixation R	1	6	6586880033	6587158512	278479	1409.74	322.47	38	49	-1	13.89	13.89
Saccade L	1	5	6587158512	6587198384	39872	1427.76	290.47	1103.13	395.73	3.14	187.40	0.50	78.81	4601.26	-3968.41	3983.75
Saccade R	1	5	6587158512	6587198384	39872	1427.76	290.47	1103.13	395.73	3.14	187.40	0.50	78.81	4601.26	-3968.41	3983.75
Fixation L	1	7	6587198384	6587496626	298242	1087.41	433.39	20	50	-1	13.98	13.98
Fixation R	1	7	6587198384	6587496626	298242	1087.41	433.39	20	50	-1	14.22	14.22
Blink L	1	2	6587496626	6587715492	218866
Blink R	1	2	6587496626	6587715492	218866
Fixation L	1	8	6587715492	6588371833	656341	625.10	618.53	25	57	-1	13.76	13.76
Fixation R	1	8	6587715492	6588371833	656341	625.10	618.53	25	57	-1	14.01	14.01
Saccade L	1	6	6588371833	6588411585	39752	625.89	626.73	850.50	537.50	2.09	140.65	1.00	52.52	3361.22	-3370.64	2943.64
Saccade R	1	6	6588371833	6588411585	39752	625.89	626.73	850.50	537.50	2.09	140.65	1.00	52.52	3361.22	-3370.64	2943.64
Fixation L	1	9	6588411585	6588968557	556972	869.26	528.95	25	30	-1	12.73	12.73
Fixation R	1	9	6588411585	6588968557	556972	869.26	528.95	25	30	-1	13.01	13.01
