[BeGaze]
Converted from:	C:\Documents and Settings\iViewX\Desktop\EXPERIMENTATIONS\Experiments\results\finaleart\S02123220-finaleart-1.idf
Date:	27.03.2019 15:33:30
Version:	BeGaze 2.5.77
Sample Rate:	50
Subject:	S02123220
Description:	David Xu

Table Header for Fixations:
Event Type	Trial	Number	Start	End	Duration	Location X	Location Y	Dispersion X	Dispersion Y	Plane	Avg. Pupil Size X	Avg. Pupil Size Y

Table Header for Saccades:
Event Type	Trial	Number	Start	End	Duration	Start Loc.X	Start Loc.Y	End Loc.X	End Loc.Y	Amplitude	Peak Speed	Peak Speed At	Average Speed	Peak Accel.	Peak Decel.	Average Accel.

Table Header for Blinks:
Event Type	Trial	Number	Start	End	Duration

Table Header for User Events:
Event Type	Trial	Number	Start	Description

UserEvent	1	1	489387394	# Message: Nature_morte_au_panier_Derain_1927.jpg
Fixation L	1	1	489394642	489772614	377972	911.90	524.26	6	31	-1	17.05	17.05
Fixation R	1	1	489394642	489772614	377972	911.90	524.26	6	31	-1	15.90	15.90
Saccade L	1	1	489772614	489792490	19876	914.27	539.62	1110.38	547.81	1.34	198.49	1.00	67.24	4900.32	-4489.65	3596.29
Saccade R	1	1	489772614	489792490	19876	914.27	539.62	1110.38	547.81	1.34	198.49	1.00	67.24	4900.32	-4489.65	3596.29
Fixation L	1	2	489792490	489891975	99485	1157.30	567.03	60	33	-1	17.15	17.15
Fixation R	1	2	489792490	489891975	99485	1157.30	567.03	60	33	-1	15.32	15.32
Saccade L	1	2	489891975	489911844	19869	1165.03	581.24	1162.39	586.98	0.14	12.50	1.00	6.81	112.44	-152.75	102.62
Saccade R	1	2	489891975	489911844	19869	1165.03	581.24	1162.39	586.98	0.14	12.50	1.00	6.81	112.44	-152.75	102.62
Fixation L	1	3	489911844	490011227	99383	1164.60	603.73	12	78	-1	15.60	15.60
Fixation R	1	3	489911844	490011227	99383	1164.60	603.73	12	78	-1	13.88	13.88
Saccade L	1	3	490011227	490031097	19870	1156.00	665.47	1143.56	707.24	0.63	73.78	0.00	31.61	1063.99	-1668.87	1232.74
Saccade R	1	3	490011227	490031097	19870	1156.00	665.47	1143.56	707.24	0.63	73.78	0.00	31.61	1063.99	-1668.87	1232.74
Fixation L	1	4	490031097	490249965	218868	1137.68	706.23	16	13	-1	13.60	13.60
Fixation R	1	4	490031097	490249965	218868	1137.68	706.23	16	13	-1	12.42	12.42
Saccade L	1	4	490249965	490289710	39745	1128.36	696.79	692.70	569.86	4.41	248.39	1.00	111.05	5947.91	-5683.60	5305.38
Saccade R	1	4	490249965	490289710	39745	1128.36	696.79	692.70	569.86	4.41	248.39	1.00	111.05	5947.91	-5683.60	5305.38
Fixation L	1	5	490289710	490389204	99494	655.45	556.92	61	21	-1	12.50	12.50
Fixation R	1	5	490289710	490389204	99494	655.45	556.92	61	21	-1	12.14	12.14
Saccade L	1	5	490389204	490409080	19876	652.51	560.74	653.64	614.19	0.58	54.09	1.00	29.38	1186.24	-917.60	1096.15
Saccade R	1	5	490389204	490409080	19876	652.51	560.74	653.64	614.19	0.58	54.09	1.00	29.38	1186.24	-917.60	1096.15
Fixation L	1	6	490409080	490528443	119363	654.49	584.12	6	52	-1	12.44	12.44
Fixation R	1	6	490409080	490528443	119363	654.49	584.12	6	52	-1	12.13	12.13
Saccade L	1	6	490528443	490548318	19875	656.73	615.03	720.62	856.63	1.67	252.65	1.00	84.05	6030.96	-5667.29	4040.44
Saccade R	1	6	490528443	490548318	19875	656.73	615.03	720.62	856.63	1.67	252.65	1.00	84.05	6030.96	-5667.29	4040.44
Fixation L	1	7	490548318	490767054	218736	739.24	889.32	28	59	-1	12.62	12.62
Fixation R	1	7	490548318	490767054	218736	739.24	889.32	28	59	-1	11.99	11.99
Saccade L	1	7	490767054	490826796	59742	748.09	912.02	1101.57	944.95	3.95	263.51	1.00	66.16	6190.34	-6357.69	3282.78
Saccade R	1	7	490767054	490826796	59742	748.09	912.02	1101.57	944.95	3.95	263.51	1.00	66.16	6190.34	-6357.69	3282.78
Fixation L	1	8	490826796	491025663	198867	1132.54	976.96	44	46	-1	14.15	14.15
Fixation R	1	8	490826796	491025663	198867	1132.54	976.96	44	46	-1	11.48	11.48
Saccade L	1	8	491025663	491065433	39770	1142.78	991.89	1275.60	742.08	2.70	176.44	0.50	67.95	4313.56	-3468.01	3358.04
Saccade R	1	8	491025663	491065433	39770	1142.78	991.89	1275.60	742.08	2.70	176.44	0.50	67.95	4313.56	-3468.01	3358.04
Fixation L	1	9	491065433	491304149	238716	1276.77	712.79	42	40	-1	13.71	13.71
Fixation R	1	9	491065433	491304149	238716	1276.77	712.79	42	40	-1	12.04	12.04
Saccade L	1	9	491304149	491324023	19874	1245.04	710.35	1227.47	700.24	0.29	20.51	1.00	14.83	95.73	-372.04	242.02
Saccade R	1	9	491304149	491324023	19874	1245.04	710.35	1227.47	700.24	0.29	20.51	1.00	14.83	95.73	-372.04	242.02
Fixation L	1	10	491324023	491542765	218742	1218.46	693.65	19	21	-1	13.64	13.64
Fixation R	1	10	491324023	491542765	218742	1218.46	693.65	19	21	-1	12.03	12.03
Saccade L	1	10	491542765	491562632	19867	1207.61	701.45	1124.34	848.23	1.13	170.66	1.00	56.72	4232.34	-4074.72	2922.06
Saccade R	1	10	491542765	491562632	19867	1207.61	701.45	1124.34	848.23	1.13	170.66	1.00	56.72	4232.34	-4074.72	2922.06
Fixation L	1	11	491562632	491721735	159103	1137.59	881.39	18	44	-1	14.51	14.51
Fixation R	1	11	491562632	491721735	159103	1137.59	881.39	18	44	-1	12.62	12.62
Saccade L	1	11	491721735	491761631	39896	1142.63	890.05	1222.82	1001.60	1.28	104.81	1.00	32.14	2562.96	-2558.85	1590.45
Saccade R	1	11	491721735	491761631	39896	1142.63	890.05	1222.82	1001.60	1.28	104.81	1.00	32.14	2562.96	-2558.85	1590.45
Fixation L	1	12	491761631	491940607	178976	1228.45	1007.58	9	41	-1	15.43	15.43
Fixation R	1	12	491761631	491940607	178976	1228.45	1007.58	9	41	-1	12.38	12.38
Saccade L	1	12	491940607	491980367	39760	1230.22	991.39	1428.19	761.71	2.77	195.77	1.00	69.56	4658.49	-4174.52	3549.35
Saccade R	1	12	491940607	491980367	39760	1230.22	991.39	1428.19	761.71	2.77	195.77	1.00	69.56	4658.49	-4174.52	3549.35
Fixation L	1	13	491980367	492398077	417710	1440.62	752.47	24	57	-1	15.46	15.46
Fixation R	1	13	491980367	492398077	417710	1440.62	752.47	24	57	-1	12.10	12.10
Saccade L	1	13	492398077	492457700	59623	1453.16	752.27	1462.02	1082.61	5.06	203.04	0.33	84.79	4890.24	-2904.02	2867.20
Saccade R	1	13	492398077	492457700	59623	1453.16	752.27	1462.02	1082.61	5.06	203.04	0.33	84.79	4890.24	-2904.02	2867.20
Fixation L	1	14	492457700	492577068	119368	1474.32	1096.67	65	27	-1	15.60	15.60
Fixation R	1	14	492457700	492577068	119368	1474.32	1096.67	65	27	-1	8.44	8.44
Saccade L	1	14	492577068	492935038	357970	1474.52	1110.58	1522.01	1196.67	30.87	289.74	0.44	86.23	4811.83	-3996.90	2208.47
Saccade R	1	14	492577068	492935038	357970	1474.52	1110.58	1522.01	1196.67	30.87	289.74	0.44	86.23	4811.83	-3996.90	2208.47
Fixation L	1	15	492935038	493133906	198868	1480.48	1192.88	64	16	-1	14.63	14.63
Fixation R	1	15	492935038	493133906	198868	1480.48	1192.88	64	16	-1	12.48	12.48
Saccade L	1	15	493133906	493193672	59766	1457.67	1184.82	1276.09	450.00	9.56	405.89	0.33	159.88	9596.85	-7754.10	7096.45
Saccade R	1	15	493133906	493193672	59766	1457.67	1184.82	1276.09	450.00	9.56	405.89	0.33	159.88	9596.85	-7754.10	7096.45
Fixation L	1	16	493193672	493372648	178976	1291.62	433.11	22	26	-1	14.40	14.40
Fixation R	1	16	493193672	493372648	178976	1291.62	433.11	22	26	-1	14.32	14.32
