[BeGaze]
Converted from:	C:\Documents and Settings\iViewX\Desktop\EXPERIMENTATIONS\Experiments\results\finaleart\S16F14542-finaleart-1.idf
Date:	27.03.2019 15:47:24
Version:	BeGaze 2.5.77
Sample Rate:	50
Subject:	S16F14542
Description:	Diane Dewez

Table Header for Fixations:
Event Type	Trial	Number	Start	End	Duration	Location X	Location Y	Dispersion X	Dispersion Y	Plane	Avg. Pupil Size X	Avg. Pupil Size Y

Table Header for Saccades:
Event Type	Trial	Number	Start	End	Duration	Start Loc.X	Start Loc.Y	End Loc.X	End Loc.Y	Amplitude	Peak Speed	Peak Speed At	Average Speed	Peak Accel.	Peak Decel.	Average Accel.

Table Header for Blinks:
Event Type	Trial	Number	Start	End	Duration

Table Header for User Events:
Event Type	Trial	Number	Start	Description

UserEvent	1	1	7189068773	# Message: parrot-tulips-(II)_matisse_1905.jpg
Fixation L	1	1	7189086015	7189185393	99378	661.81	441.63	15	28	-1	14.62	14.62
Fixation R	1	1	7189086015	7189185393	99378	661.81	441.63	15	28	-1	13.07	13.07
Saccade L	1	1	7189185393	7189205387	19994	672.36	454.81	790.80	551.70	1.23	154.76	1.00	61.46	3261.42	-3559.38	2315.47
Saccade R	1	1	7189185393	7189205387	19994	672.36	454.81	790.80	551.70	1.23	154.76	1.00	61.46	3261.42	-3559.38	2315.47
Fixation L	1	2	7189205387	7189622987	417600	790.08	525.86	12	39	-1	14.73	14.73
Fixation R	1	2	7189205387	7189622987	417600	790.08	525.86	12	39	-1	13.25	13.25
Saccade L	1	2	7189622987	7189642861	19874	798.20	516.51	905.90	524.69	0.90	109.26	1.00	45.51	2294.40	-2373.44	1796.08
Saccade R	1	2	7189622987	7189642861	19874	798.20	516.51	905.90	524.69	0.90	109.26	1.00	45.51	2294.40	-2373.44	1796.08
Fixation L	1	3	7189642861	7189941218	298357	945.64	508.11	47	24	-1	12.76	12.76
Fixation R	1	3	7189642861	7189941218	298357	945.64	508.11	47	24	-1	11.03	11.03
Saccade L	1	3	7189941218	7189981099	39881	949.79	505.11	1113.21	510.11	1.41	125.81	1.00	35.36	3072.00	-2964.33	1954.14
Saccade R	1	3	7189941218	7189981099	39881	949.79	505.11	1113.21	510.11	1.41	125.81	1.00	35.36	3072.00	-2964.33	1954.14
Fixation L	1	4	7189981099	7190557819	576720	1130.51	501.67	23	39	-1	11.06	11.06
Fixation R	1	4	7189981099	7190438449	457350	1129.98	503.88	23	39	-1	8.82	8.82
Fixation R	1	5	7190458450	7190557819	99369	1132.60	492.84	4	7	-1	11.34	11.34
Saccade L	1	4	7190557819	7190577689	19870	1129.48	490.90	918.42	446.92	1.29	217.99	1.00	65.09	5307.22	-4742.32	3596.09
Saccade R	1	4	7190557819	7190577689	19870	1129.48	490.90	918.42	446.92	1.29	217.99	1.00	65.09	5307.22	-4742.32	3596.09
Fixation L	1	5	7190577689	7190895929	318240	883.45	436.98	44	35	-1	11.31	11.31
Fixation R	1	6	7190577689	7190895929	318240	883.45	436.98	44	35	-1	11.95	11.95
Saccade L	1	5	7190895929	7190915926	19997	897.55	449.86	1018.71	474.14	0.96	124.99	1.00	48.14	2869.23	-2607.50	1887.94
Saccade R	1	5	7190895929	7190915926	19997	897.55	449.86	1018.71	474.14	0.96	124.99	1.00	48.14	2869.23	-2607.50	1887.94
Fixation L	1	6	7190915926	7191771141	855215	1000.80	516.07	29	59	-1	12.74	12.74
Fixation R	1	7	7190915926	7191771141	855215	1000.80	516.07	29	59	-1	13.06	13.06
Saccade L	1	6	7191771141	7191791013	19872	997.06	526.41	948.85	506.88	0.48	52.62	1.00	24.08	1283.59	-959.60	1018.85
Saccade R	1	6	7191771141	7191791013	19872	997.06	526.41	948.85	506.88	0.48	52.62	1.00	24.08	1283.59	-959.60	1018.85
Fixation L	1	7	7191791013	7192507117	716104	907.16	488.32	48	28	-1	13.88	13.88
Fixation R	1	8	7191791013	7192507117	716104	907.16	488.32	48	28	-1	14.21	14.21
Saccade L	1	7	7192507117	7192526974	19857	910.67	481.56	1057.85	486.65	0.94	148.95	1.00	47.21	3618.55	-3540.10	2658.44
Saccade R	1	7	7192507117	7192526974	19857	910.67	481.56	1057.85	486.65	0.94	148.95	1.00	47.21	3618.55	-3540.10	2658.44
Fixation L	1	8	7192526974	7192785590	258616	1096.27	517.57	47	51	-1	15.37	15.37
Fixation R	1	9	7192526974	7192785590	258616	1096.27	517.57	47	51	-1	15.83	15.83
Saccade L	1	8	7192785590	7192805456	19866	1104.85	538.58	1104.65	540.40	0.05	3.57	1.00	2.64	71.45	1.14	26.14
Saccade R	1	8	7192785590	7192805456	19866	1104.85	538.58	1104.65	540.40	0.05	3.57	1.00	2.64	71.45	1.14	26.14
Fixation L	1	9	7192805456	7193063942	258486	1102.59	530.21	4	26	-1	15.24	15.24
Fixation R	1	10	7192805456	7193063942	258486	1102.59	530.21	4	26	-1	15.41	15.41
