[BeGaze]
Converted from:	C:\Documents and Settings\iViewX\Desktop\EXPERIMENTATIONS\Experiments\results\finaleart\S16F14542-finaleart-1.idf
Date:	27.03.2019 15:47:23
Version:	BeGaze 2.5.77
Sample Rate:	50
Subject:	S16F14542
Description:	Diane Dewez

Table Header for Fixations:
Event Type	Trial	Number	Start	End	Duration	Location X	Location Y	Dispersion X	Dispersion Y	Plane	Avg. Pupil Size X	Avg. Pupil Size Y

Table Header for Saccades:
Event Type	Trial	Number	Start	End	Duration	Start Loc.X	Start Loc.Y	End Loc.X	End Loc.Y	Amplitude	Peak Speed	Peak Speed At	Average Speed	Peak Accel.	Peak Decel.	Average Accel.

Table Header for Blinks:
Event Type	Trial	Number	Start	End	Duration

Table Header for User Events:
Event Type	Trial	Number	Start	Description

UserEvent	1	1	7187013957	# Message: void.jpg
Saccade L	1	1	7187017377	7187077107	59730	971.44	541.60	622.31	479.16	4.73	189.19	0.67	79.17	4729.76	-4005.65	3305.45
Saccade R	1	1	7187017377	7187077107	59730	971.44	541.60	622.31	479.16	4.73	189.19	0.67	79.17	4729.76	-4005.65	3305.45
Fixation L	1	1	7187077107	7187256095	178988	605.13	433.26	28	68	-1	13.78	13.78
Fixation R	1	1	7187077107	7187256095	178988	605.13	433.26	28	68	-1	12.06	12.06
Saccade L	1	2	7187256095	7187315716	59621	593.58	417.86	535.59	401.46	1.30	47.16	1.00	21.81	829.39	-747.31	557.28
Saccade R	1	2	7187256095	7187315716	59621	593.58	417.86	535.59	401.46	1.30	47.16	1.00	21.81	829.39	-747.31	557.28
Fixation L	1	2	7187315716	7187454968	139252	480.12	400.06	75	22	-1	13.08	13.08
Fixation R	1	2	7187315716	7187454968	139252	480.12	400.06	75	22	-1	11.54	11.54
Saccade L	1	3	7187454968	7187474842	19874	461.96	388.81	458.02	387.12	0.10	5.81	1.00	5.05	391.24	-25.47	148.37
Saccade R	1	3	7187454968	7187474842	19874	461.96	388.81	458.02	387.12	0.10	5.81	1.00	5.05	391.24	-25.47	148.37
Fixation L	1	3	7187474842	7187574333	99491	457.86	379.47	7	25	-1	13.17	13.17
Fixation R	1	3	7187474842	7187574333	99491	457.86	379.47	7	25	-1	11.50	11.50
Saccade L	1	4	7187574333	7187614074	39741	458.27	386.37	444.14	375.63	1.75	103.55	0.50	44.08	2160.11	-2492.84	2197.54
Saccade R	1	4	7187574333	7187614074	39741	458.27	386.37	444.14	375.63	1.75	103.55	0.50	44.08	2160.11	-2492.84	2197.54
Fixation L	1	4	7187614074	7187872706	258632	446.94	377.47	28	26	-1	13.21	13.21
Fixation R	1	4	7187614074	7187872706	258632	446.94	377.47	28	26	-1	11.37	11.37
Saccade L	1	5	7187872706	7187892573	19867	449.62	381.45	436.47	318.43	0.77	65.12	1.00	38.57	1190.31	-1421.73	1190.83
Saccade R	1	5	7187872706	7187892573	19867	449.62	381.45	436.47	318.43	0.77	65.12	1.00	38.57	1190.31	-1421.73	1190.83
Fixation L	1	5	7187892573	7188051689	159116	436.56	340.00	13	75	-1	13.48	13.48
Fixation R	1	5	7187892573	7188051689	159116	436.56	340.00	13	75	-1	12.08	12.08
Saccade L	1	6	7188051689	7188151184	99495	433.35	350.06	613.22	350.82	3.98	109.42	0.80	40.00	2192.85	-2096.49	1131.35
Saccade R	1	6	7188051689	7188151184	99495	433.35	350.06	613.22	350.82	3.98	109.42	0.80	40.00	2192.85	-2096.49	1131.35
Fixation L	1	6	7188151184	7188250556	99372	628.46	381.93	23	52	-1	14.19	14.19
Fixation R	1	6	7188151184	7188250556	99372	628.46	381.93	23	52	-1	12.50	12.50
Saccade L	1	7	7188250556	7188270551	19995	636.20	402.64	646.10	430.09	0.30	29.52	1.00	14.88	288.58	-582.83	372.54
Saccade R	1	7	7188250556	7188270551	19995	636.20	402.64	646.10	430.09	0.30	29.52	1.00	14.88	288.58	-582.83	372.54
Fixation L	1	7	7188270551	7189006392	735841	655.00	427.61	19	41	-1	14.12	14.12
Fixation R	1	7	7188270551	7189006392	735841	655.00	427.61	19	41	-1	12.59	12.59
