[BeGaze]
Converted from:	C:\Documents and Settings\iViewX\Desktop\EXPERIMENTATIONS\Experiments\results\finaleart\S4120113-finaleart-1.idf
Date:	27.03.2019 15:34:47
Version:	BeGaze 2.5.77
Sample Rate:	50
Subject:	S4120113
Description:	Vidal Attias

Table Header for Fixations:
Event Type	Trial	Number	Start	End	Duration	Location X	Location Y	Dispersion X	Dispersion Y	Plane	Avg. Pupil Size X	Avg. Pupil Size Y

Table Header for Saccades:
Event Type	Trial	Number	Start	End	Duration	Start Loc.X	Start Loc.Y	End Loc.X	End Loc.Y	Amplitude	Peak Speed	Peak Speed At	Average Speed	Peak Accel.	Peak Decel.	Average Accel.

Table Header for Blinks:
Event Type	Trial	Number	Start	End	Duration

Table Header for User Events:
Event Type	Trial	Number	Start	Description

UserEvent	1	1	7975799750	# Message: void.jpg
Fixation L	1	1	7975804570	7976063045	258475	855.01	658.44	16	78	-1	13.33	13.33
Fixation R	1	1	7975804570	7976063045	258475	855.01	658.44	16	78	-1	12.48	12.48
Saccade L	1	1	7976063045	7976082924	19879	860.97	608.42	866.98	618.38	0.62	70.69	1.00	31.41	714.83	-1473.23	806.25
Saccade R	1	1	7976063045	7976082924	19879	860.97	608.42	866.98	618.38	0.62	70.69	1.00	31.41	714.83	-1473.23	806.25
Fixation L	1	2	7976082924	7976202290	119366	869.36	631.98	7	35	-1	12.36	12.36
Fixation R	1	2	7976082924	7976202290	119366	869.36	631.98	7	35	-1	11.46	11.46
Blink L	1	1	7976202290	7976421180	218890
Blink R	1	1	7976202290	7976421180	218890
Fixation L	1	3	7976421180	7976759259	338079	1027.13	237.42	22	74	-1	11.82	11.82
Fixation R	1	3	7976421180	7976759259	338079	1027.13	237.42	22	74	-1	11.68	11.68
Saccade L	1	2	7976759259	7976779126	19867	1036.16	259.72	1034.64	266.27	0.13	8.38	1.00	6.62	-3.74	-52.19	31.74
Saccade R	1	2	7976759259	7976779126	19867	1036.16	259.72	1034.64	266.27	0.13	8.38	1.00	6.62	-3.74	-52.19	31.74
Fixation L	1	4	7976779126	7977216726	437600	1029.79	285.81	12	46	-1	12.79	12.79
Fixation R	1	4	7976779126	7977216726	437600	1029.79	285.81	12	46	-1	12.57	12.57
Saccade L	1	3	7977216726	7977256467	39741	1027.79	295.96	1015.25	535.61	2.42	143.18	1.00	60.97	3292.85	-3225.16	2577.93
Saccade R	1	3	7977216726	7977256467	39741	1027.79	295.96	1015.25	535.61	2.42	143.18	1.00	60.97	3292.85	-3225.16	2577.93
Fixation L	1	5	7977256467	7977435470	179003	979.33	525.65	48	34	-1	13.29	13.29
Fixation R	1	5	7977256467	7977435470	179003	979.33	525.65	48	34	-1	12.97	12.97
Saccade L	1	4	7977435470	7977455335	19865	968.12	510.47	971.59	464.77	0.49	46.36	1.00	24.42	887.13	-181.99	543.30
Saccade R	1	4	7977435470	7977455335	19865	968.12	510.47	971.59	464.77	0.49	46.36	1.00	24.42	887.13	-181.99	543.30
Fixation L	1	6	7977455335	7977793432	338097	967.50	483.89	9	43	-1	13.46	13.46
Fixation R	1	6	7977455335	7977793432	338097	967.50	483.89	9	43	-1	12.90	12.90
