[BeGaze]
Converted from:	C:\Documents and Settings\iViewX\Desktop\EXPERIMENTATIONS\Experiments\results\finaleart\S02123220-finaleart-1.idf
Date:	27.03.2019 15:33:33
Version:	BeGaze 2.5.77
Sample Rate:	50
Subject:	S02123220
Description:	David Xu

Table Header for Fixations:
Event Type	Trial	Number	Start	End	Duration	Location X	Location Y	Dispersion X	Dispersion Y	Plane	Avg. Pupil Size X	Avg. Pupil Size Y

Table Header for Saccades:
Event Type	Trial	Number	Start	End	Duration	Start Loc.X	Start Loc.Y	End Loc.X	End Loc.Y	Amplitude	Peak Speed	Peak Speed At	Average Speed	Peak Accel.	Peak Decel.	Average Accel.

Table Header for Blinks:
Event Type	Trial	Number	Start	End	Duration

Table Header for User Events:
Event Type	Trial	Number	Start	Description

UserEvent	1	1	786164006	# Message: lair_of_the_sea_serpent_vedder_1899.jpg
Saccade L	1	1	786164904	786204669	39765	893.23	469.35	893.85	478.80	5.10	258.35	1.00	128.32	6458.65	-6383.93	4727.29
Saccade R	1	1	786164904	786204669	39765	893.23	469.35	893.85	478.80	5.10	258.35	1.00	128.32	6458.65	-6383.93	4727.29
Fixation L	1	1	786204669	786463298	258629	890.05	467.85	10	24	-1	17.12	17.12
Fixation R	1	1	786204669	786463298	258629	890.05	467.85	10	24	-1	16.47	16.47
Saccade L	1	2	786463298	787795929	1332631	884.92	454.17	1591.49	620.04	200.85	669.51	0.27	150.72	13975.47	-15431.94	3833.00
Saccade R	1	2	786463298	787795929	1332631	884.92	454.17	1591.49	620.04	200.85	669.51	0.27	150.72	13975.47	-15431.94	3833.00
Fixation L	1	2	787795929	787895296	99367	1588.85	625.44	7	39	-1	12.81	12.81
Fixation R	1	2	787795929	787895296	99367	1588.85	625.44	7	39	-1	9.97	9.97
Saccade L	1	3	787895296	788253413	358117	1591.06	620.79	867.32	224.84	55.22	395.09	0.56	154.20	5326.12	-6856.40	3342.83
Saccade R	1	3	787895296	788253413	358117	1591.06	620.79	867.32	224.84	55.22	395.09	0.56	154.20	5326.12	-6856.40	3342.83
Fixation L	1	3	788253413	788472143	218730	882.29	224.52	56	38	-1	13.07	13.07
Fixation R	1	3	788253413	788472143	218730	882.29	224.52	56	38	-1	11.77	11.77
Saccade L	1	4	788472143	789168224	696081	920.63	249.91	1578.60	648.41	67.76	386.69	0.17	97.34	8933.61	-8042.46	2094.06
Saccade R	1	4	788472143	789168224	696081	920.63	249.91	1578.60	648.41	67.76	386.69	0.17	97.34	8933.61	-8042.46	2094.06
Fixation L	1	4	789168224	789267715	99491	1588.04	587.89	18	78	-1	13.49	13.49
Fixation R	1	4	789168224	789267715	99491	1588.04	587.89	18	78	-1	9.60	9.60
Saccade L	1	5	789267715	789963943	696228	1595.06	570.25	810.09	656.10	116.96	387.16	0.51	167.99	8664.09	-8868.55	4320.13
Saccade R	1	5	789267715	789963943	696228	1595.06	570.25	810.09	656.10	116.96	387.16	0.51	167.99	8664.09	-8868.55	4320.13
Fixation L	1	5	789963943	790063296	99353	804.70	648.38	11	11	-1	13.03	13.03
Fixation R	1	5	789963943	790063296	99353	804.70	648.38	11	11	-1	12.48	12.48
Saccade L	1	6	790063296	790162777	99481	805.97	651.44	482.31	681.49	12.05	356.25	0.40	121.09	8724.45	-7109.59	4936.98
Saccade R	1	6	790063296	790162777	99481	805.97	651.44	482.31	681.49	12.05	356.25	0.40	121.09	8724.45	-7109.59	4936.98
