[BeGaze]
Converted from:	C:\Documents and Settings\iViewX\Desktop\EXPERIMENTATIONS\Experiments\results\finaleart\S6124332-finaleart-1.idf
Date:	27.03.2019 15:35:41
Version:	BeGaze 2.5.77
Sample Rate:	50
Subject:	S6124332
Description:	Romain Ferrand

Table Header for Fixations:
Event Type	Trial	Number	Start	End	Duration	Location X	Location Y	Dispersion X	Dispersion Y	Plane	Avg. Pupil Size X	Avg. Pupil Size Y

Table Header for Saccades:
Event Type	Trial	Number	Start	End	Duration	Start Loc.X	Start Loc.Y	End Loc.X	End Loc.Y	Amplitude	Peak Speed	Peak Speed At	Average Speed	Peak Accel.	Peak Decel.	Average Accel.

Table Header for Blinks:
Event Type	Trial	Number	Start	End	Duration

Table Header for User Events:
Event Type	Trial	Number	Start	Description

UserEvent	1	1	11498415052	# Message: void.jpg
Saccade L	1	1	11498431065	11498510696	79631	627.88	956.72	312.82	1091.78	4.80	182.44	0.75	60.32	4511.03	-4480.56	2868.89
Saccade R	1	1	11498431065	11498510696	79631	627.88	956.72	312.82	1091.78	4.80	182.44	0.75	60.32	4511.03	-4480.56	2868.89
Fixation L	1	1	11498510696	11499007902	497206	320.36	1117.82	37	35	-1	15.59	15.59
Fixation R	1	1	11498510696	11499007902	497206	320.36	1117.82	37	35	-1	16.29	16.29
Saccade L	1	2	11499007902	11499027766	19864	345.31	1127.22	271.69	1126.87	0.46	74.48	1.00	23.38	1724.28	-1651.99	1212.20
Saccade R	1	2	11499007902	11499027766	19864	345.31	1127.22	271.69	1126.87	0.46	74.48	1.00	23.38	1724.28	-1651.99	1212.20
Fixation L	1	2	11499027766	11499425631	397865	268.19	1154.07	53	35	-1	16.31	16.31
Fixation R	1	2	11499027766	11499425631	397865	268.19	1154.07	53	35	-1	17.17	17.17
Saccade L	1	3	11499425631	11499445499	19868	310.56	1162.14	322.83	1160.72	0.34	50.82	1.00	17.16	46.13	-958.14	346.14
Saccade R	1	3	11499425631	11499445499	19868	310.56	1162.14	322.83	1160.72	0.34	50.82	1.00	17.16	46.13	-958.14	346.14
Fixation L	1	3	11499445499	11499664232	218733	314.15	1149.21	15	22	-1	16.81	16.81
Fixation R	1	3	11499445499	11499664232	218733	314.15	1149.21	15	22	-1	17.46	17.46
Saccade L	1	4	11499664232	11499723975	59743	310.10	1138.33	807.71	998.24	5.55	235.92	0.67	92.85	5844.09	-5344.51	3770.54
Saccade R	1	4	11499664232	11499723975	59743	310.10	1138.33	807.71	998.24	5.55	235.92	0.67	92.85	5844.09	-5344.51	3770.54
Fixation L	1	4	11499723975	11500121716	397741	802.73	964.87	19	57	-1	17.54	17.54
Fixation R	1	4	11499723975	11500121716	397741	802.73	964.87	19	57	-1	17.51	17.51
Saccade L	1	5	11500121716	11500161451	39735	817.36	940.77	919.75	608.78	3.32	189.85	0.50	83.56	4644.08	-4034.06	4007.04
Saccade R	1	5	11500121716	11500161451	39735	817.36	940.77	919.75	608.78	3.32	189.85	0.50	83.56	4644.08	-4034.06	4007.04
Fixation L	1	5	11500161451	11500400192	238741	929.27	578.44	14	41	-1	17.67	17.67
Fixation R	1	5	11500161451	11500400192	238741	929.27	578.44	14	41	-1	17.48	17.48
