[BeGaze]
Converted from:	C:\Documents and Settings\iViewX\Desktop\EXPERIMENTATIONS\Experiments\results\finaleart\S22H22551-finaleart-1.idf
Date:	27.03.2019 15:58:19
Version:	BeGaze 2.5.77
Sample Rate:	50
Subject:	S22H22551
Description:	Mathieu Chambre

Table Header for Fixations:
Event Type	Trial	Number	Start	End	Duration	Location X	Location Y	Dispersion X	Dispersion Y	Plane	Avg. Pupil Size X	Avg. Pupil Size Y

Table Header for Saccades:
Event Type	Trial	Number	Start	End	Duration	Start Loc.X	Start Loc.Y	End Loc.X	End Loc.Y	Amplitude	Peak Speed	Peak Speed At	Average Speed	Peak Accel.	Peak Decel.	Average Accel.

Table Header for Blinks:
Event Type	Trial	Number	Start	End	Duration

Table Header for User Events:
Event Type	Trial	Number	Start	Description

UserEvent	1	1	5432771632	# Message: the_three_skulls_gericault_1814.jpg
Fixation L	1	1	5432780001	5433297099	517098	996.32	445.47	50	44	-1	16.89	16.89
Fixation R	1	1	5432780001	5433297099	517098	996.32	445.47	50	44	-1	16.80	16.80
Saccade L	1	1	5433297099	5433336958	39859	1006.30	447.90	1046.34	500.45	0.77	45.72	1.00	19.31	1034.27	-773.36	611.67
Saccade R	1	1	5433297099	5433336958	39859	1006.30	447.90	1046.34	500.45	0.77	45.72	1.00	19.31	1034.27	-773.36	611.67
Fixation L	1	2	5433336958	5433555713	218755	1066.66	521.25	29	38	-1	17.67	17.67
Fixation R	1	2	5433336958	5433555713	218755	1066.66	521.25	29	38	-1	17.45	17.45
Saccade L	1	2	5433555713	5433575579	19866	1075.57	538.89	1140.53	538.91	0.42	65.70	1.00	21.15	1598.70	-1536.46	1047.61
Saccade R	1	2	5433555713	5433575579	19866	1075.57	538.89	1140.53	538.91	0.42	65.70	1.00	21.15	1598.70	-1536.46	1047.61
Fixation L	1	3	5433575579	5433714822	139243	1137.79	541.70	10	11	-1	18.41	18.41
Fixation R	1	3	5433575579	5433714822	139243	1137.79	541.70	10	11	-1	18.26	18.26
Saccade L	1	3	5433714822	5433754560	39738	1140.02	548.14	1411.30	533.02	2.35	178.94	0.50	59.09	4294.62	-4262.85	3305.74
Saccade R	1	3	5433714822	5433754560	39738	1140.02	548.14	1411.30	533.02	2.35	178.94	0.50	59.09	4294.62	-4262.85	3305.74
Fixation L	1	4	5433754560	5434013182	258622	1405.93	523.79	9	25	-1	18.82	18.82
Fixation R	1	4	5433754560	5434013182	258622	1405.93	523.79	9	25	-1	18.73	18.73
Saccade L	1	4	5434013182	5434033050	19868	1401.70	520.37	1401.25	639.93	0.65	120.93	1.00	32.94	2892.61	-2976.26	1964.04
Saccade R	1	4	5434013182	5434033050	19868	1401.70	520.37	1401.25	639.93	0.65	120.93	1.00	32.94	2892.61	-2976.26	1964.04
Fixation L	1	5	5434033050	5434152424	119374	1400.25	638.66	3	4	-1	19.06	19.06
Fixation R	1	5	5434033050	5434152424	119374	1400.25	638.66	3	4	-1	19.39	19.39
Saccade L	1	5	5434152424	5434231916	79492	1400.13	636.07	399.86	462.87	12.13	375.06	0.50	152.61	9297.78	-6555.70	5378.01
Saccade R	1	5	5434152424	5434231916	79492	1400.13	636.07	399.86	462.87	12.13	375.06	0.50	152.61	9297.78	-6555.70	5378.01
Fixation L	1	6	5434231916	5434669524	437608	441.95	481.96	55	31	-1	19.04	19.04
Fixation R	1	6	5434231916	5434669524	437608	441.95	481.96	55	31	-1	19.02	19.02
Saccade L	1	6	5434669524	5434709271	39747	451.58	489.74	453.68	689.75	1.76	106.43	0.50	44.22	2436.87	-2538.70	2378.81
Saccade R	1	6	5434669524	5434709271	39747	451.58	489.74	453.68	689.75	1.76	106.43	0.50	44.22	2436.87	-2538.70	2378.81
Fixation L	1	7	5434709271	5434928133	218862	453.58	682.67	20	46	-1	18.76	18.76
Fixation R	1	7	5434709271	5434928133	218862	453.58	682.67	20	46	-1	19.31	19.31
Saccade L	1	7	5434928133	5434948003	19870	438.20	717.55	281.72	929.87	1.60	266.63	1.00	80.54	6608.85	-6147.09	4537.07
Saccade R	1	7	5434928133	5434948003	19870	438.20	717.55	281.72	929.87	1.60	266.63	1.00	80.54	6608.85	-6147.09	4537.07
Fixation L	1	8	5434948003	5435246377	298374	301.23	961.99	24	45	-1	19.70	19.70
Fixation R	1	8	5434948003	5435246377	298374	301.23	961.99	24	45	-1	20.55	20.55
Saccade L	1	8	5435246377	5435306001	59624	304.44	975.02	897.43	938.14	6.10	269.28	0.67	102.30	6695.86	-6513.16	4748.58
Saccade R	1	8	5435246377	5435306001	59624	304.44	975.02	897.43	938.14	6.10	269.28	0.67	102.30	6695.86	-6513.16	4748.58
Fixation L	1	9	5435306001	5435465101	159100	905.08	917.41	55	32	-1	19.65	19.65
Fixation R	1	9	5435306001	5435465101	159100	905.08	917.41	55	32	-1	20.10	20.10
Saccade L	1	9	5435465101	5435504972	39871	949.84	905.84	1468.41	898.99	4.67	330.73	0.50	117.24	8235.17	-7979.28	6117.02
Saccade R	1	9	5435465101	5435504972	39871	949.84	905.84	1468.41	898.99	4.67	330.73	0.50	117.24	8235.17	-7979.28	6117.02
Fixation L	1	10	5435504972	5435703841	198869	1458.33	898.06	70	10	-1	19.61	19.61
Fixation R	1	10	5435504972	5435703841	198869	1458.33	898.06	70	10	-1	19.86	19.86
Saccade L	1	10	5435703841	5435743585	39744	1518.78	904.25	1772.75	972.27	3.27	279.53	0.50	82.16	6840.15	-6377.72	3666.23
Saccade R	1	10	5435703841	5435743585	39744	1518.78	904.25	1772.75	972.27	3.27	279.53	0.50	82.16	6840.15	-6377.72	3666.23
Fixation L	1	11	5435743585	5435942452	198867	1755.24	1007.53	27	52	-1	19.44	19.44
Fixation R	1	11	5435743585	5435942452	198867	1755.24	1007.53	27	52	-1	19.08	19.08
Saccade L	1	11	5435942452	5435982322	39870	1745.47	1024.96	1440.52	965.94	2.69	226.94	0.50	67.49	5483.65	-5565.20	3707.56
Saccade R	1	11	5435942452	5435982322	39870	1745.47	1024.96	1440.52	965.94	2.69	226.94	0.50	67.49	5483.65	-5565.20	3707.56
Fixation L	1	12	5435982322	5436141442	159120	1436.46	942.40	10	41	-1	19.17	19.17
Fixation R	1	12	5435982322	5436141442	159120	1436.46	942.40	10	41	-1	18.31	18.31
Saccade L	1	12	5436141442	5436181195	39753	1430.23	924.59	1803.03	943.06	3.21	219.16	1.00	80.73	5383.00	-5009.58	4439.66
Saccade R	1	12	5436141442	5436181195	39753	1430.23	924.59	1803.03	943.06	3.21	219.16	1.00	80.73	5383.00	-5009.58	4439.66
Fixation L	1	13	5436181195	5436519296	338101	1791.82	993.77	21	77	-1	18.95	18.95
Fixation R	1	13	5436181195	5436519296	338101	1791.82	993.77	21	77	-1	18.23	18.23
Saccade L	1	13	5436519296	5436758046	238750	1803.74	1020.19	1745.36	252.11	72.87	2012.48	0.33	305.20	50250.37	-50312.12	15515.39
Saccade R	1	13	5436519296	5436758046	238750	1803.74	1020.19	1745.36	252.11	72.87	2012.48	0.33	305.20	50250.37	-50312.12	15515.39
