[BeGaze]
Converted from:	C:\Documents and Settings\iViewX\Desktop\EXPERIMENTATIONS\Experiments\results\finaleart\S02123220-finaleart-1.idf
Date:	27.03.2019 15:33:46
Version:	BeGaze 2.5.77
Sample Rate:	50
Subject:	S02123220
Description:	David Xu

Table Header for Fixations:
Event Type	Trial	Number	Start	End	Duration	Location X	Location Y	Dispersion X	Dispersion Y	Plane	Avg. Pupil Size X	Avg. Pupil Size Y

Table Header for Saccades:
Event Type	Trial	Number	Start	End	Duration	Start Loc.X	Start Loc.Y	End Loc.X	End Loc.Y	Amplitude	Peak Speed	Peak Speed At	Average Speed	Peak Accel.	Peak Decel.	Average Accel.

Table Header for Blinks:
Event Type	Trial	Number	Start	End	Duration

Table Header for User Events:
Event Type	Trial	Number	Start	Description

UserEvent	1	1	2227369239	# Message: the_kiss_gericault_1816.jpg
Fixation L	1	1	2227371664	2227849125	477461	1048.86	495.06	20	33	-1	12.87	12.87
Fixation R	1	1	2227371664	2227849125	477461	1048.86	495.06	20	33	-1	11.98	11.98
Saccade L	1	1	2227849125	2227888908	39783	1038.86	506.01	1138.80	341.14	2.08	162.60	0.50	52.22	3868.75	-3217.89	2180.48
Saccade R	1	1	2227849125	2227888908	39783	1038.86	506.01	1138.80	341.14	2.08	162.60	0.50	52.22	3868.75	-3217.89	2180.48
Fixation L	1	2	2227888908	2227988244	99336	1144.24	294.71	19	68	-1	13.04	13.04
Fixation R	1	2	2227888908	2227988244	99336	1144.24	294.71	19	68	-1	12.13	12.13
Saccade L	1	2	2227988244	2228008240	19996	1158.46	272.51	1164.53	251.79	0.33	21.84	1.00	16.61	254.58	-17.09	136.99
Saccade R	1	2	2227988244	2228008240	19996	1158.46	272.51	1164.53	251.79	0.33	21.84	1.00	16.61	254.58	-17.09	136.99
Fixation L	1	3	2228008240	2228187233	178993	1161.79	244.15	39	60	-1	12.42	12.42
Fixation R	1	3	2228008240	2228187233	178993	1161.79	244.15	39	60	-1	11.30	11.30
Saccade L	1	3	2228187233	2228425844	238611	1134.88	214.85	1174.42	357.81	18.52	166.70	1.00	77.63	2703.62	-4068.19	1593.11
Saccade R	1	3	2228187233	2228425844	238611	1134.88	214.85	1174.42	357.81	18.52	166.70	1.00	77.63	2703.62	-4068.19	1593.11
Fixation L	1	4	2228425844	2228545208	119364	1169.70	414.42	11	88	-1	12.64	12.64
Fixation R	1	4	2228425844	2228545208	119364	1169.70	414.42	11	88	-1	11.34	11.34
Saccade L	1	4	2228545208	2228644709	99501	1163.41	446.53	1095.45	488.49	2.00	58.09	1.00	20.11	1152.75	-937.18	467.65
Saccade R	1	4	2228545208	2228644709	99501	1163.41	446.53	1095.45	488.49	2.00	58.09	1.00	20.11	1152.75	-937.18	467.65
Fixation L	1	5	2228644709	2228823693	178984	1069.89	534.56	31	66	-1	13.40	13.40
Fixation R	1	5	2228644709	2228823693	178984	1069.89	534.56	31	66	-1	11.90	11.90
Saccade L	1	5	2228823693	2228863439	39746	1065.49	554.89	763.13	564.27	2.62	159.01	1.00	65.95	3930.07	-3493.64	3564.70
Saccade R	1	5	2228823693	2228863439	39746	1065.49	554.89	763.13	564.27	2.62	159.01	1.00	65.95	3930.07	-3493.64	3564.70
Fixation L	1	6	2228863439	2229181671	318232	750.34	599.88	17	52	-1	13.41	13.41
Fixation R	1	6	2228863439	2229181671	318232	750.34	599.88	17	52	-1	12.17	12.17
Saccade L	1	6	2229181671	2229201541	19870	747.39	607.63	639.82	587.29	0.74	110.74	1.00	37.46	2695.63	-2512.08	1945.25
Saccade R	1	6	2229181671	2229201541	19870	747.39	607.63	639.82	587.29	0.74	110.74	1.00	37.46	2695.63	-2512.08	1945.25
Fixation L	1	7	2229201541	2229460150	258609	642.28	569.63	15	30	-1	13.27	13.27
Fixation R	1	7	2229201541	2229460150	258609	642.28	569.63	15	30	-1	12.56	12.56
Saccade L	1	7	2229460150	2229519764	59614	647.36	569.97	1143.17	398.43	5.64	251.00	0.67	94.65	6192.67	-5903.63	4433.68
Saccade R	1	7	2229460150	2229519764	59614	647.36	569.97	1143.17	398.43	5.64	251.00	0.67	94.65	6192.67	-5903.63	4433.68
Fixation L	1	8	2229519764	2229897757	377993	1155.11	339.06	17	75	-1	13.68	13.68
Fixation R	1	8	2229519764	2229897757	377993	1155.11	339.06	17	75	-1	12.76	12.76
Saccade L	1	8	2229897757	2229917644	19887	1154.54	323.15	1154.02	314.62	0.08	8.64	1.00	4.11	150.54	-130.07	107.16
Saccade R	1	8	2229897757	2229917644	19887	1154.54	323.15	1154.02	314.62	0.08	8.64	1.00	4.11	150.54	-130.07	107.16
Fixation L	1	9	2229917644	2230056864	139220	1154.99	318.81	3	31	-1	13.82	13.82
Fixation R	1	9	2229917644	2230056864	139220	1154.99	318.81	3	31	-1	12.84	12.84
Saccade L	1	9	2230056864	2230076746	19882	1156.66	343.03	1155.47	469.38	0.82	127.81	1.00	41.03	3130.14	-3139.13	2249.74
Saccade R	1	9	2230056864	2230076746	19882	1156.66	343.03	1155.47	469.38	0.82	127.81	1.00	41.03	3130.14	-3139.13	2249.74
Fixation L	1	10	2230076746	2230434723	357977	1156.57	473.21	20	76	-1	14.37	14.37
Fixation R	1	10	2230076746	2230434723	357977	1156.57	473.21	20	76	-1	12.87	12.87
Saccade L	1	10	2230434723	2230454601	19878	1165.99	423.32	1167.03	418.32	0.07	5.16	1.00	3.65	45.84	-57.62	34.98
Saccade R	1	10	2230434723	2230454601	19878	1165.99	423.32	1167.03	418.32	0.07	5.16	1.00	3.65	45.84	-57.62	34.98
Fixation L	1	11	2230454601	2230613705	159104	1176.07	416.27	14	5	-1	14.42	14.42
Fixation R	1	11	2230454601	2230613705	159104	1176.07	416.27	14	5	-1	13.11	13.11
Saccade L	1	11	2230613705	2230633590	19885	1181.06	415.35	1147.01	513.81	0.69	105.38	1.00	34.94	2581.82	-2275.95	1844.44
Saccade R	1	11	2230613705	2230633590	19885	1181.06	415.35	1147.01	513.81	0.69	105.38	1.00	34.94	2581.82	-2275.95	1844.44
Fixation L	1	12	2230633590	2230912067	278477	1105.07	512.52	50	9	-1	14.72	14.72
Fixation R	1	12	2230633590	2230912067	278477	1105.07	512.52	50	9	-1	12.91	12.91
Saccade L	1	12	2230912067	2230951833	39766	1100.96	509.76	1229.03	540.64	1.36	110.51	0.50	34.24	2742.00	-2152.54	1490.43
Saccade R	1	12	2230912067	2230951833	39766	1100.96	509.76	1229.03	540.64	1.36	110.51	0.50	34.24	2742.00	-2152.54	1490.43
Fixation L	1	13	2230951833	2231230305	278472	1240.99	584.87	15	57	-1	14.94	14.94
Fixation R	1	13	2230951833	2231230305	278472	1240.99	584.87	15	57	-1	13.12	13.12
Saccade L	1	13	2231230305	2231270050	39745	1237.16	591.42	1177.62	505.89	1.50	82.61	1.00	37.62	1994.73	-1963.89	1857.95
Saccade R	1	13	2231230305	2231270050	39745	1237.16	591.42	1177.62	505.89	1.50	82.61	1.00	37.62	1994.73	-1963.89	1857.95
Fixation L	1	14	2231270050	2231369545	99495	1165.54	487.19	18	29	-1	14.69	14.69
Fixation R	1	14	2231270050	2231369545	99495	1165.54	487.19	18	29	-1	13.15	13.15
