[BeGaze]
Converted from:	C:\Documents and Settings\iViewX\Desktop\EXPERIMENTATIONS\Experiments\results\finaleart\S16F14542-finaleart-1.idf
Date:	27.03.2019 15:47:33
Version:	BeGaze 2.5.77
Sample Rate:	50
Subject:	S16F14542
Description:	Diane Dewez

Table Header for Fixations:
Event Type	Trial	Number	Start	End	Duration	Location X	Location Y	Dispersion X	Dispersion Y	Plane	Avg. Pupil Size X	Avg. Pupil Size Y

Table Header for Saccades:
Event Type	Trial	Number	Start	End	Duration	Start Loc.X	Start Loc.Y	End Loc.X	End Loc.Y	Amplitude	Peak Speed	Peak Speed At	Average Speed	Peak Accel.	Peak Decel.	Average Accel.

Table Header for Blinks:
Event Type	Trial	Number	Start	End	Duration

Table Header for User Events:
Event Type	Trial	Number	Start	Description

UserEvent	1	1	7268403490	# Message: oysters_manet_1862.jpg
Fixation L	1	1	7268406100	7268863585	457485	771.39	488.16	14	24	-1	10.09	10.09
Fixation R	1	1	7268406100	7268863585	457485	771.39	488.16	14	24	-1	10.73	10.73
Saccade L	1	1	7268863585	7268883585	20000	766.59	488.06	616.13	489.78	0.97	152.19	1.00	48.55	3745.47	-3230.40	2607.47
Saccade R	1	1	7268863585	7268883585	20000	766.59	488.06	616.13	489.78	0.97	152.19	1.00	48.55	3745.47	-3230.40	2607.47
Fixation L	1	2	7268883585	7269022702	139117	565.18	475.08	67	30	-1	10.45	10.45
Fixation R	1	2	7268883585	7269022702	139117	565.18	475.08	67	30	-1	10.92	10.92
Saccade L	1	2	7269022702	7269122198	99496	548.25	459.37	985.59	563.88	6.24	255.75	0.80	62.70	6202.53	-6195.46	3234.99
Saccade R	1	2	7269022702	7269122198	99496	548.25	459.37	985.59	563.88	6.24	255.75	0.80	62.70	6202.53	-6195.46	3234.99
Fixation L	1	3	7269122198	7269380806	258608	984.31	594.72	26	51	-1	11.64	11.64
Fixation R	1	3	7269122198	7269380806	258608	984.31	594.72	26	51	-1	12.31	12.31
Saccade L	1	3	7269380806	7269400673	19867	1005.07	615.53	1229.02	620.77	1.65	226.50	1.00	83.21	5449.45	-5481.63	4100.59
Saccade R	1	3	7269380806	7269400673	19867	1005.07	615.53	1229.02	620.77	1.65	226.50	1.00	83.21	5449.45	-5481.63	4100.59
Fixation L	1	4	7269400673	7269639294	238621	1301.38	620.96	83	13	-1	12.52	12.52
Fixation R	1	4	7269400673	7269639294	238621	1301.38	620.96	83	13	-1	12.75	12.75
Saccade L	1	4	7269639294	7269659167	19873	1306.11	627.30	1306.24	631.32	0.08	4.70	1.00	4.09	27.45	2.82	19.07
Saccade R	1	4	7269639294	7269659167	19873	1306.11	627.30	1306.24	631.32	0.08	4.70	1.00	4.09	27.45	2.82	19.07
Fixation L	1	5	7269659167	7269977533	318366	1302.18	645.61	13	20	-1	12.87	12.87
Fixation R	1	5	7269659167	7269977533	318366	1302.18	645.61	13	20	-1	12.83	12.83
Saccade L	1	5	7269977533	7270017273	39740	1294.47	650.10	1041.39	616.45	2.21	182.88	0.50	55.51	4474.54	-4393.93	2994.03
Saccade R	1	5	7269977533	7270017273	39740	1294.47	650.10	1041.39	616.45	2.21	182.88	0.50	55.51	4474.54	-4393.93	2994.03
Fixation L	1	6	7270017273	7270335509	318236	1040.47	589.42	7	43	-1	13.05	13.05
Fixation R	1	6	7270017273	7270335509	318236	1040.47	589.42	7	43	-1	12.98	12.98
Saccade L	1	6	7270335509	7270355386	19877	1038.69	591.95	1163.69	744.17	1.14	199.18	1.00	57.39	4861.09	-4471.02	3286.42
Saccade R	1	6	7270335509	7270355386	19877	1038.69	591.95	1163.69	744.17	1.14	199.18	1.00	57.39	4861.09	-4471.02	3286.42
Fixation L	1	7	7270355386	7270753231	397845	1188.67	792.40	33	61	-1	12.89	12.89
Fixation R	1	7	7270355386	7270753231	397845	1188.67	792.40	33	61	-1	13.17	13.17
Blink L	1	1	7270753231	7271031603	278372
Blink R	1	1	7270753231	7271031603	278372
Fixation L	1	8	7271031603	7271688071	656468	969.69	590.88	26	26	-1	14.46	14.46
Fixation R	1	8	7271031603	7271688071	656468	969.69	590.88	26	26	-1	14.25	14.25
Saccade L	1	7	7271688071	7271707945	19874	961.26	580.10	909.37	574.31	0.35	52.82	1.00	17.61	1303.78	-1070.12	852.65
Saccade R	1	7	7271688071	7271707945	19874	961.26	580.10	909.37	574.31	0.35	52.82	1.00	17.61	1303.78	-1070.12	852.65
Fixation L	1	9	7271707945	7272404034	696089	891.73	560.86	27	28	-1	12.75	12.75
Fixation R	1	9	7271707945	7272404034	696089	891.73	560.86	27	28	-1	12.69	12.69
