[BeGaze]
Converted from:	C:\Documents and Settings\iViewX\Desktop\EXPERIMENTATIONS\Experiments\results\finaleart\S01A22542-finaleart-1.idf
Date:	27.03.2019 15:33:18
Version:	BeGaze 2.5.77
Sample Rate:	50
Subject:	S01A22542
Description:	Thibault Seve Minnaert

Table Header for Fixations:
Event Type	Trial	Number	Start	End	Duration	Location X	Location Y	Dispersion X	Dispersion Y	Plane	Avg. Pupil Size X	Avg. Pupil Size Y

Table Header for Saccades:
Event Type	Trial	Number	Start	End	Duration	Start Loc.X	Start Loc.Y	End Loc.X	End Loc.Y	Amplitude	Peak Speed	Peak Speed At	Average Speed	Peak Accel.	Peak Decel.	Average Accel.

Table Header for Blinks:
Event Type	Trial	Number	Start	End	Duration

Table Header for User Events:
Event Type	Trial	Number	Start	Description

UserEvent	1	1	8984799327	# Message: void.jpg
Fixation L	1	1	8984805709	8984945065	139356	586.21	518.31	6	3	-1	13.44	13.44
Fixation R	1	1	8984805709	8984945065	139356	586.21	518.31	6	3	-1	13.89	13.89
Saccade L	1	1	8984945065	8984965118	20053	583.18	515.87	527.60	403.18	0.84	127.09	1.00	41.86	3097.72	-2629.59	2188.47
Saccade R	1	1	8984945065	8984965118	20053	583.18	515.87	527.60	403.18	0.84	127.09	1.00	41.86	3097.72	-2629.59	2188.47
Fixation L	1	2	8984965118	8985084437	119319	502.19	377.81	37	36	-1	13.64	13.64
Fixation R	1	2	8984965118	8985084437	119319	502.19	377.81	37	36	-1	14.24	14.24
Saccade L	1	2	8985084437	8985124168	39731	519.52	373.71	1023.79	377.48	4.33	275.35	0.50	108.95	6751.36	-6751.98	6125.48
Saccade R	1	2	8985084437	8985124168	39731	519.52	373.71	1023.79	377.48	4.33	275.35	0.50	108.95	6751.36	-6751.98	6125.48
Fixation L	1	3	8985124168	8985542309	418141	1018.10	384.59	11	26	-1	14.48	14.48
Fixation R	1	3	8985124168	8985542309	418141	1018.10	384.59	11	26	-1	15.16	15.16
Blink L	1	1	8985542309	8985741416	199107
Blink R	1	1	8985542309	8985741416	199107
Fixation L	1	4	8985741416	8986597601	856185	1125.63	506.66	11	47	-1	14.98	14.98
Fixation R	1	4	8985741416	8986597601	856185	1125.63	506.66	11	47	-1	15.25	15.25
Saccade L	1	3	8986597601	8986617479	19878	1118.39	493.25	1015.26	525.57	0.80	109.32	1.00	40.41	2464.99	-2504.08	1798.99
Saccade R	1	3	8986597601	8986617479	19878	1118.39	493.25	1015.26	525.57	0.80	109.32	1.00	40.41	2464.99	-2504.08	1798.99
Fixation L	1	5	8986617479	8986796717	179238	1027.25	560.90	19	52	-1	14.58	14.58
Fixation R	1	5	8986617479	8986796717	179238	1027.25	560.90	19	52	-1	14.50	14.50
