[BeGaze]
Converted from:	C:\Documents and Settings\iViewX\Desktop\EXPERIMENTATIONS\Experiments\results\finaleart\S3121421-finaleart-1.idf
Date:	27.03.2019 15:34:11
Version:	BeGaze 2.5.77
Sample Rate:	50
Subject:	S3121421
Description:	Jean Jouve

Table Header for Fixations:
Event Type	Trial	Number	Start	End	Duration	Location X	Location Y	Dispersion X	Dispersion Y	Plane	Avg. Pupil Size X	Avg. Pupil Size Y

Table Header for Saccades:
Event Type	Trial	Number	Start	End	Duration	Start Loc.X	Start Loc.Y	End Loc.X	End Loc.Y	Amplitude	Peak Speed	Peak Speed At	Average Speed	Peak Accel.	Peak Decel.	Average Accel.

Table Header for Blinks:
Event Type	Trial	Number	Start	End	Duration

Table Header for User Events:
Event Type	Trial	Number	Start	Description

UserEvent	1	1	5355844786	# Message: Hayet-Nature-morte-1888.jpg
Blink L	1	1	5355849221	5355968714	119493
Blink R	1	1	5355849221	5355968714	119493
Fixation L	1	1	5355968714	5357302376	1333662	844.17	574.52	29	66	-1	10.90	10.90
Fixation R	1	1	5355968714	5357302376	1333662	844.17	574.52	29	66	-1	12.10	12.10
Saccade L	1	1	5357302376	5357322259	19883	829.98	611.39	830.90	625.87	0.28	23.97	0.00	14.08	286.02	-238.28	241.54
Saccade R	1	1	5357302376	5357322259	19883	829.98	611.39	830.90	625.87	0.28	23.97	0.00	14.08	286.02	-238.28	241.54
Fixation L	1	2	5357322259	5357919465	597206	816.05	646.91	23	40	-1	10.52	10.52
Fixation R	1	2	5357322259	5357919465	597206	816.05	646.91	23	40	-1	11.85	11.85
Saccade L	1	2	5357919465	5357959336	39871	817.93	652.67	1176.38	454.64	3.81	266.03	0.50	95.59	6345.96	-6138.25	5293.20
Saccade R	1	2	5357919465	5357959336	39871	817.93	652.67	1176.38	454.64	3.81	266.03	0.50	95.59	6345.96	-6138.25	5293.20
Fixation L	1	3	5357959336	5358218078	258742	1185.97	470.96	65	25	-1	10.29	10.29
Fixation R	1	3	5357959336	5358218078	258742	1185.97	470.96	65	25	-1	11.26	11.26
Saccade L	1	3	5358218078	5358257825	39747	1237.95	468.86	1747.66	274.00	5.33	301.35	0.50	134.09	7432.94	-6345.21	6376.59
Saccade R	1	3	5358218078	5358257825	39747	1237.95	468.86	1747.66	274.00	5.33	301.35	0.50	134.09	7432.94	-6345.21	6376.59
Fixation L	1	4	5358257825	5358377319	119494	1764.15	316.96	24	70	-1	10.19	10.19
Fixation R	1	4	5358257825	5358377319	119494	1764.15	316.96	24	70	-1	10.33	10.33
Saccade L	1	4	5358377319	5358397180	19861	1762.07	344.68	1749.85	372.76	0.52	37.45	1.00	26.06	556.22	-295.04	370.07
Saccade R	1	4	5358377319	5358397180	19861	1762.07	344.68	1749.85	372.76	0.52	37.45	1.00	26.06	556.22	-295.04	370.07
Fixation L	1	5	5358397180	5358556433	159253	1745.62	373.77	38	58	-1	9.90	9.90
Fixation R	1	5	5358397180	5358556433	159253	1745.62	373.77	38	58	-1	10.11	10.11
Saccade L	1	5	5358556433	5358616190	59757	1724.52	396.54	1266.22	442.75	5.07	341.04	0.67	84.85	8224.84	-8041.06	4192.89
Saccade R	1	5	5358556433	5358616190	59757	1724.52	396.54	1266.22	442.75	5.07	341.04	0.67	84.85	8224.84	-8041.06	4192.89
Fixation L	1	6	5358616190	5358954647	338457	1263.75	428.89	10	20	-1	9.96	9.96
Fixation R	1	6	5358616190	5358954647	338457	1263.75	428.89	10	20	-1	10.26	10.26
Saccade L	1	6	5358954647	5359014275	59628	1256.95	422.75	715.06	242.74	6.22	284.87	0.33	104.24	7038.90	-4634.42	4595.48
Saccade R	1	6	5358954647	5359014275	59628	1256.95	422.75	715.06	242.74	6.22	284.87	0.33	104.24	7038.90	-4634.42	4595.48
Fixation L	1	7	5359014275	5359392504	378229	728.47	256.93	24	29	-1	9.52	9.52
Fixation R	1	7	5359014275	5359392504	378229	728.47	256.93	24	29	-1	10.21	10.21
Saccade L	1	7	5359392504	5359452255	59751	735.60	270.17	574.20	521.70	4.39	225.06	0.67	73.55	5300.17	-4979.80	3031.33
Saccade R	1	7	5359392504	5359452255	59751	735.60	270.17	574.20	521.70	4.39	225.06	0.67	73.55	5300.17	-4979.80	3031.33
Fixation L	1	8	5359452255	5359710987	258732	566.36	526.95	14	22	-1	9.81	9.81
Fixation R	1	8	5359452255	5359710987	258732	566.36	526.95	14	22	-1	10.96	10.96
Saccade L	1	8	5359710987	5359830478	119491	568.09	525.96	320.46	479.27	5.75	145.03	0.17	48.10	3581.90	-2609.20	1697.40
Saccade R	1	8	5359710987	5359830478	119491	568.09	525.96	320.46	479.27	5.75	145.03	0.17	48.10	3581.90	-2609.20	1697.40
