[BeGaze]
Converted from:	C:\Documents and Settings\iViewX\Desktop\EXPERIMENTATIONS\Experiments\results\finaleart\S1022551-finaleart-1.idf
Date:	27.03.2019 15:38:09
Version:	BeGaze 2.5.77
Sample Rate:	50
Subject:	S1022551
Description:	Alexis Nebout

Table Header for Fixations:
Event Type	Trial	Number	Start	End	Duration	Location X	Location Y	Dispersion X	Dispersion Y	Plane	Avg. Pupil Size X	Avg. Pupil Size Y

Table Header for Saccades:
Event Type	Trial	Number	Start	End	Duration	Start Loc.X	Start Loc.Y	End Loc.X	End Loc.Y	Amplitude	Peak Speed	Peak Speed At	Average Speed	Peak Accel.	Peak Decel.	Average Accel.

Table Header for Blinks:
Event Type	Trial	Number	Start	End	Duration

Table Header for User Events:
Event Type	Trial	Number	Start	Description

UserEvent	1	1	8514263490	# Message: void.jpg
Saccade L	1	1	8514273832	8514353339	79507	1401.06	288.99	1501.22	568.43	4.12	161.02	0.75	51.82	3948.65	-3949.13	2490.90
Saccade R	1	1	8514273832	8514353339	79507	1401.06	288.99	1501.22	568.43	4.12	161.02	0.75	51.82	3948.65	-3949.13	2490.90
Fixation L	1	1	8514353339	8514603888	250549	1498.29	569.31	7	7	-1	11.30	11.30
Fixation R	1	1	8514353339	8514603888	250549	1498.29	569.31	7	7	-1	9.71	9.71
Saccade L	1	2	8514603888	8514631832	27944	1494.14	573.49	1250.74	591.92	1.98	246.78	1.00	70.88	6088.81	-5869.70	4213.18
Saccade R	1	2	8514603888	8514631832	27944	1494.14	573.49	1250.74	591.92	1.98	246.78	1.00	70.88	6088.81	-5869.70	4213.18
Fixation L	1	2	8514631832	8515248406	616574	1258.07	630.77	18	53	-1	12.12	12.12
Fixation R	1	2	8514631832	8515248406	616574	1258.07	630.77	18	53	-1	10.22	10.22
Saccade L	1	3	8515248406	8515288147	39741	1244.13	638.85	1137.13	629.38	1.25	92.08	0.50	31.57	31172.59	-1431.26	8775.98
Saccade R	1	3	8515248406	8515288147	39741	1244.13	638.85	1137.13	629.38	1.25	92.08	0.50	31.57	31172.59	-1431.26	8775.98
Blink L	1	1	8515288147	8515507655	219508
Blink R	1	1	8515288147	8515507655	219508
Fixation L	1	3	8515507655	8516242853	735198	999.53	496.33	18	41	-1	12.44	12.44
Fixation R	1	3	8515507655	8516242853	735198	999.53	496.33	18	41	-1	10.81	10.81
Saccade L	1	4	8516242853	8516262730	19877	987.62	487.58	877.72	485.76	0.76	111.18	1.00	38.02	2718.28	0.00	1359.14
Saccade R	1	4	8516242853	8516262730	19877	987.62	487.58	877.72	485.76	0.76	111.18	1.00	38.02	2718.28	0.00	1359.14
