[BeGaze]
Converted from:	C:\Documents and Settings\iViewX\Desktop\EXPERIMENTATIONS\Experiments\results\finaleart\S13H22431-finaleart-1.idf
Date:	27.03.2019 15:42:17
Version:	BeGaze 2.5.77
Sample Rate:	50
Subject:	S13H22431
Description:	Jimmy Petit

Table Header for Fixations:
Event Type	Trial	Number	Start	End	Duration	Location X	Location Y	Dispersion X	Dispersion Y	Plane	Avg. Pupil Size X	Avg. Pupil Size Y

Table Header for Saccades:
Event Type	Trial	Number	Start	End	Duration	Start Loc.X	Start Loc.Y	End Loc.X	End Loc.Y	Amplitude	Peak Speed	Peak Speed At	Average Speed	Peak Accel.	Peak Decel.	Average Accel.

Table Header for Blinks:
Event Type	Trial	Number	Start	End	Duration

Table Header for User Events:
Event Type	Trial	Number	Start	Description

UserEvent	1	1	28197687883	# Message: flowers-and-fruit-a-melon_fantin-latour_1865.jpg
Fixation L	1	1	28197689550	28198047532	357982	759.41	541.41	38	41	-1	15.37	15.37
Fixation R	1	1	28197689550	28198047532	357982	759.41	541.41	38	41	-1	15.50	15.50
Saccade L	1	1	28198047532	28198107173	59641	760.43	543.35	939.31	451.55	5.97	304.97	1.00	100.11	4880.05	-7388.58	4519.13
Blink R	1	1	28198047532	28198127032	79500
Fixation L	1	2	28198107173	28198326020	218847	933.20	438.14	12	25	-1	16.11	16.11
Fixation R	1	2	28198127032	28198326020	198988	932.64	436.92	9	25	-1	16.81	16.81
Saccade L	1	2	28198326020	28198485135	159115	926.87	428.42	964.25	789.90	8.50	269.18	0.88	53.42	6632.05	-6496.57	2607.69
Saccade R	1	1	28198326020	28198485135	159115	926.87	428.42	964.25	789.90	8.50	269.18	0.88	53.42	6632.05	-6496.57	2607.69
Fixation L	1	3	28198485135	28198703875	218740	960.82	775.85	6	21	-1	15.79	15.79
Fixation R	1	3	28198485135	28198703875	218740	960.82	775.85	6	21	-1	16.16	16.16
Saccade L	1	3	28198703875	28198723757	19882	958.30	769.38	903.03	819.48	0.53	75.45	1.00	26.62	1836.18	-1619.78	1365.88
Saccade R	1	2	28198703875	28198723757	19882	958.30	769.38	903.03	819.48	0.53	75.45	1.00	26.62	1836.18	-1619.78	1365.88
Fixation L	1	4	28198723757	28198962498	238741	910.50	840.44	25	27	-1	15.46	15.46
Fixation R	1	4	28198723757	28198962498	238741	910.50	840.44	25	27	-1	16.14	16.14
Saccade L	1	4	28198962498	28199022112	59614	905.60	844.66	521.41	629.09	4.68	175.39	0.67	78.47	4330.15	-4274.84	3423.61
Saccade R	1	3	28198962498	28199022112	59614	905.60	844.66	521.41	629.09	4.68	175.39	0.67	78.47	4330.15	-4274.84	3423.61
Fixation L	1	5	28199022112	28199419976	397864	514.62	638.22	65	32	-1	14.54	14.54
Fixation R	1	5	28199022112	28199419976	397864	514.62	638.22	65	32	-1	15.77	15.77
Saccade L	1	5	28199419976	28199439855	19879	461.73	635.67	498.46	623.42	0.60	68.52	0.00	30.19	885.93	-1480.08	916.17
Saccade R	1	4	28199419976	28199439855	19879	461.73	635.67	498.46	623.42	0.60	68.52	0.00	30.19	885.93	-1480.08	916.17
Fixation L	1	6	28199439855	28199598976	159121	479.03	628.01	29	34	-1	14.46	14.46
Fixation R	1	6	28199439855	28199598976	159121	479.03	628.01	29	34	-1	15.38	15.38
Saccade L	1	6	28199598976	28199618842	19866	476.94	628.08	505.23	773.77	0.86	150.11	1.00	43.21	3604.62	-3577.89	2436.31
Saccade R	1	5	28199598976	28199618842	19866	476.94	628.08	505.23	773.77	0.86	150.11	1.00	43.21	3604.62	-3577.89	2436.31
Fixation L	1	7	28199618842	28200036576	417734	528.13	787.46	31	26	-1	14.50	14.50
Fixation R	1	7	28199618842	28200036576	417734	528.13	787.46	31	26	-1	15.57	15.57
Saccade L	1	7	28200036576	28200135943	99367	533.12	797.22	1362.10	811.64	10.64	241.34	0.60	107.11	5858.14	-3907.82	3314.34
Saccade R	1	6	28200036576	28200135943	99367	533.12	797.22	1362.10	811.64	10.64	241.34	0.60	107.11	5858.14	-3907.82	3314.34
Fixation L	1	8	28200135943	28200394558	258615	1364.10	835.90	9	45	-1	14.83	14.83
Fixation R	1	8	28200135943	28200394558	258615	1364.10	835.90	9	45	-1	15.29	15.29
Saccade L	1	8	28200394558	28200414433	19875	1365.21	856.80	1476.30	871.38	0.71	113.34	1.00	35.86	2645.19	-2431.67	1863.08
Saccade R	1	7	28200394558	28200414433	19875	1365.21	856.80	1476.30	871.38	0.71	113.34	1.00	35.86	2645.19	-2431.67	1863.08
Fixation L	1	9	28200414433	28200553684	139251	1449.63	884.83	38	22	-1	14.74	14.74
Fixation R	1	9	28200414433	28200553684	139251	1449.63	884.83	38	22	-1	14.65	14.65
Saccade L	1	9	28200553684	28200613295	59611	1437.82	890.49	566.68	653.67	9.48	411.28	0.33	159.06	10177.45	-7255.93	7021.83
Saccade R	1	8	28200553684	28200613295	59611	1437.82	890.49	566.68	653.67	9.48	411.28	0.33	159.06	10177.45	-7255.93	7021.83
Fixation L	1	10	28200613295	28200911666	298371	545.16	608.95	32	57	-1	14.99	14.99
Fixation R	1	10	28200613295	28200911666	298371	545.16	608.95	32	57	-1	15.44	15.44
Saccade L	1	10	28200911666	28200931532	19866	540.75	605.80	501.72	603.36	0.29	39.56	1.00	14.56	895.59	-706.45	552.17
Saccade R	1	9	28200911666	28200931532	19866	540.75	605.80	501.72	603.36	0.29	39.56	1.00	14.56	895.59	-706.45	552.17
Fixation L	1	11	28200931532	28201150404	218872	500.18	601.91	17	8	-1	14.88	14.88
Fixation R	1	11	28200931532	28201150404	218872	500.18	601.91	17	8	-1	15.68	15.68
Saccade L	1	11	28201150404	28201170271	19867	496.47	597.56	526.81	523.21	0.59	81.23	1.00	29.48	1909.50	-1678.43	1386.45
Saccade R	1	10	28201150404	28201170271	19867	496.47	597.56	526.81	523.21	0.59	81.23	1.00	29.48	1909.50	-1678.43	1386.45
Fixation L	1	12	28201170271	28201329392	159121	564.43	495.08	52	38	-1	14.84	14.84
Fixation R	1	12	28201170271	28201329392	159121	564.43	495.08	52	38	-1	15.66	15.66
Blink L	1	1	28201329392	28201488505	159113
Blink R	1	2	28201329392	28201488505	159113
Fixation L	1	13	28201488505	28201687378	198873	578.41	485.53	13	13	-1	15.48	15.48
Fixation R	1	13	28201488505	28201687378	198873	578.41	485.53	13	13	-1	16.58	16.58
