[BeGaze]
Converted from:	C:\Documents and Settings\iViewX\Desktop\EXPERIMENTATIONS\Experiments\results\finaleart\S7121223-finaleart-1.idf
Date:	27.03.2019 15:36:57
Version:	BeGaze 2.5.77
Sample Rate:	50
Subject:	S7121223
Description:	Gregoire pacreau

Table Header for Fixations:
Event Type	Trial	Number	Start	End	Duration	Location X	Location Y	Dispersion X	Dispersion Y	Plane	Avg. Pupil Size X	Avg. Pupil Size Y

Table Header for Saccades:
Event Type	Trial	Number	Start	End	Duration	Start Loc.X	Start Loc.Y	End Loc.X	End Loc.Y	Amplitude	Peak Speed	Peak Speed At	Average Speed	Peak Accel.	Peak Decel.	Average Accel.

Table Header for Blinks:
Event Type	Trial	Number	Start	End	Duration

Table Header for User Events:
Event Type	Trial	Number	Start	Description

UserEvent	1	1	4413580723	# Message: void.jpg
Fixation L	1	1	4413591667	4413810404	218737	1544.68	772.20	7	23	-1	14.74	14.74
Fixation R	1	1	4413591667	4413810404	218737	1544.68	772.20	7	23	-1	14.12	14.12
Saccade L	1	1	4413810404	4413870022	59618	1541.92	777.92	1160.25	550.67	4.84	211.14	0.67	81.13	5248.85	-4983.11	3914.41
Saccade R	1	1	4413810404	4413870022	59618	1541.92	777.92	1160.25	550.67	4.84	211.14	0.67	81.13	5248.85	-4983.11	3914.41
Fixation L	1	2	4413870022	4414108751	238729	1144.18	553.49	69	9	-1	15.17	15.17
Fixation R	1	2	4413870022	4414108751	238729	1144.18	553.49	69	9	-1	14.82	14.82
Saccade L	1	2	4414108751	4414128645	19894	1091.13	555.41	1036.46	540.78	0.66	57.25	1.00	33.35	1258.79	-1046.54	1037.98
Saccade R	1	2	4414108751	4414128645	19894	1091.13	555.41	1036.46	540.78	0.66	57.25	1.00	33.35	1258.79	-1046.54	1037.98
Fixation L	1	3	4414128645	4414228149	99504	1001.57	536.95	65	19	-1	14.12	14.12
Fixation R	1	3	4414128645	4414228149	99504	1001.57	536.95	65	19	-1	14.25	14.25
Saccade L	1	3	4414228149	4414267879	39730	970.65	527.07	871.36	532.71	1.50	81.98	1.00	37.70	1945.59	-1829.49	1049.54
Saccade R	1	3	4414228149	4414267879	39730	970.65	527.07	871.36	532.71	1.50	81.98	1.00	37.70	1945.59	-1829.49	1049.54
Fixation L	1	4	4414267879	4414546360	278481	912.69	551.59	50	49	-1	13.52	13.52
Fixation R	1	4	4414267879	4414546360	278481	912.69	551.59	50	49	-1	13.49	13.49
Saccade L	1	4	4414546360	4414566238	19878	921.20	573.06	923.45	574.04	0.05	3.88	0.00	2.76	5.10	-36.38	18.06
Saccade R	1	4	4414546360	4414566238	19878	921.20	573.06	923.45	574.04	0.05	3.88	0.00	2.76	5.10	-36.38	18.06
Fixation L	1	5	4414566238	4415560682	994444	931.18	595.12	15	40	-1	13.87	13.87
Fixation R	1	5	4414566238	4415560682	994444	931.18	595.12	15	40	-1	14.31	14.31
