[BeGaze]
Converted from:	C:\Documents and Settings\iViewX\Desktop\EXPERIMENTATIONS\Experiments\results\finaleart\S15H25531-finaleart-1.idf
Date:	27.03.2019 15:45:22
Version:	BeGaze 2.5.77
Sample Rate:	50
Subject:	S15H25531
Description:	Mikail Demirdelen

Table Header for Fixations:
Event Type	Trial	Number	Start	End	Duration	Location X	Location Y	Dispersion X	Dispersion Y	Plane	Avg. Pupil Size X	Avg. Pupil Size Y

Table Header for Saccades:
Event Type	Trial	Number	Start	End	Duration	Start Loc.X	Start Loc.Y	End Loc.X	End Loc.Y	Amplitude	Peak Speed	Peak Speed At	Average Speed	Peak Accel.	Peak Decel.	Average Accel.

Table Header for Blinks:
Event Type	Trial	Number	Start	End	Duration

Table Header for User Events:
Event Type	Trial	Number	Start	Description

UserEvent	1	1	4288594328	# Message: sargent-male-model-resting.jpg
Saccade L	1	1	4288606652	4288706052	99400	1044.93	407.89	924.05	417.71	2.48	119.75	1.00	24.96	2850.90	-2555.34	896.38
Saccade R	1	1	4288606652	4288706052	99400	1044.93	407.89	924.05	417.71	2.48	119.75	1.00	24.96	2850.90	-2555.34	896.38
Fixation L	1	1	4288706052	4289024254	318202	932.46	397.75	31	53	-1	11.47	11.47
Fixation R	1	1	4288706052	4289024254	318202	932.46	397.75	31	53	-1	12.02	12.02
Saccade L	1	2	4289024254	4289064120	39866	926.98	369.89	1303.29	381.17	3.22	260.86	1.00	80.83	6435.42	-6000.30	4489.13
Saccade R	1	2	4289024254	4289064120	39866	926.98	369.89	1303.29	381.17	3.22	260.86	1.00	80.83	6435.42	-6000.30	4489.13
Fixation L	1	2	4289064120	4289223241	159121	1333.34	392.87	39	30	-1	11.21	11.21
Fixation R	1	2	4289064120	4289223241	159121	1333.34	392.87	39	30	-1	11.70	11.70
Saccade L	1	3	4289223241	4289243113	19872	1340.52	410.86	1397.17	417.91	0.35	57.75	1.00	17.57	1378.47	-806.51	777.01
Saccade R	1	3	4289223241	4289243113	19872	1340.52	410.86	1397.17	417.91	0.35	57.75	1.00	17.57	1378.47	-806.51	777.01
Fixation L	1	3	4289243113	4289919324	676211	1414.19	451.68	27	72	-1	12.13	12.13
Fixation R	1	3	4289243113	4289919324	676211	1414.19	451.68	27	72	-1	12.79	12.79
Blink L	1	1	4289919324	4290058570	139246
Saccade R	1	4	4289919324	4290038698	119374	1399.89	489.76	760.86	642.93	20.92	399.51	1.00	175.24	8449.10	-9869.39	7430.98
Fixation R	1	4	4290038698	4290197814	159116	766.56	647.45	14	20	-1	14.33	14.33
Fixation L	1	4	4290058570	4290197814	139244	767.27	648.02	14	20	-1	14.05	14.05
Saccade L	1	4	4290197814	4290217694	19880	760.54	650.58	669.94	653.77	0.84	91.70	1.00	42.06	1914.14	-1478.04	1594.55
Saccade R	1	5	4290197814	4290217694	19880	760.54	650.58	669.94	653.77	0.84	91.70	1.00	42.06	1914.14	-1478.04	1594.55
Fixation L	1	5	4290217694	4290516047	298353	692.09	655.68	57	14	-1	14.43	14.43
Fixation R	1	5	4290217694	4290516047	298353	692.09	655.68	57	14	-1	14.19	14.19
Saccade L	1	5	4290516047	4290555800	39753	687.84	648.29	1061.70	669.74	3.11	235.07	0.50	78.30	5838.76	-5651.22	4592.21
Saccade R	1	6	4290516047	4290555800	39753	687.84	648.29	1061.70	669.74	3.11	235.07	0.50	78.30	5838.76	-5651.22	4592.21
Fixation L	1	6	4290555800	4290774541	218741	1056.54	673.08	9	20	-1	14.03	14.03
Fixation R	1	6	4290555800	4290774541	218741	1056.54	673.08	9	20	-1	14.39	14.39
Saccade L	1	6	4290774541	4290814410	39869	1052.55	682.24	1355.11	693.28	2.51	167.37	0.50	62.99	4142.13	-4091.81	3702.16
Saccade R	1	7	4290774541	4290814410	39869	1052.55	682.24	1355.11	693.28	2.51	167.37	0.50	62.99	4142.13	-4091.81	3702.16
Fixation L	1	7	4290814410	4291112667	298257	1357.79	708.14	9	21	-1	14.06	14.06
Fixation R	1	7	4290814410	4291112667	298257	1357.79	708.14	9	21	-1	14.37	14.37
Saccade L	1	7	4291112667	4291132653	19986	1355.65	712.07	1366.62	540.69	1.06	173.67	1.00	53.03	4305.28	-4166.71	3103.47
Saccade R	1	8	4291112667	4291132653	19986	1355.65	712.07	1366.62	540.69	1.06	173.67	1.00	53.03	4305.28	-4166.71	3103.47
Fixation L	1	8	4291132653	4291888362	755709	1385.73	496.32	28	62	-1	14.65	14.65
Fixation R	1	8	4291132653	4291888362	755709	1385.73	496.32	28	62	-1	14.26	14.26
Saccade L	1	8	4291888362	4291928568	40206	1393.72	484.80	924.48	491.14	3.99	290.62	1.00	99.13	7169.83	-6305.68	5559.95
Saccade R	1	9	4291888362	4291928568	40206	1393.72	484.80	924.48	491.14	3.99	290.62	1.00	99.13	7169.83	-6305.68	5559.95
Fixation L	1	9	4291928568	4292584582	656014	913.65	490.28	37	47	-1	15.87	15.87
Fixation R	1	9	4291928568	4292584582	656014	913.65	490.28	37	47	-1	15.25	15.25
