[BeGaze]
Converted from:	C:\Documents and Settings\iViewX\Desktop\EXPERIMENTATIONS\Experiments\results\finaleart\S7121223-finaleart-1.idf
Date:	27.03.2019 15:37:21
Version:	BeGaze 2.5.77
Sample Rate:	50
Subject:	S7121223
Description:	Gregoire pacreau

Table Header for Fixations:
Event Type	Trial	Number	Start	End	Duration	Location X	Location Y	Dispersion X	Dispersion Y	Plane	Avg. Pupil Size X	Avg. Pupil Size Y

Table Header for Saccades:
Event Type	Trial	Number	Start	End	Duration	Start Loc.X	Start Loc.Y	End Loc.X	End Loc.Y	Amplitude	Peak Speed	Peak Speed At	Average Speed	Peak Accel.	Peak Decel.	Average Accel.

Table Header for Blinks:
Event Type	Trial	Number	Start	End	Duration

Table Header for User Events:
Event Type	Trial	Number	Start	Description

UserEvent	1	1	5467143284	# Message: void.jpg
Fixation L	1	1	5467152911	5467391673	238762	1065.65	482.07	21	10	-1	14.12	14.12
Fixation R	1	1	5467152911	5467391673	238762	1065.65	482.07	21	10	-1	13.39	13.39
Saccade L	1	1	5467391673	5467411527	19854	1083.51	478.40	1282.54	477.74	1.39	201.25	1.00	70.21	4937.84	-5000.35	3633.50
Saccade R	1	1	5467391673	5467411527	19854	1083.51	478.40	1282.54	477.74	1.39	201.25	1.00	70.21	4937.84	-5000.35	3633.50
Fixation L	1	2	5467411527	5467769549	358022	1331.63	475.78	57	32	-1	14.10	14.10
Fixation R	1	2	5467411527	5467769549	358022	1331.63	475.78	57	32	-1	13.19	13.19
Saccade L	1	2	5467769549	5467789386	19837	1299.80	502.04	1273.43	526.95	0.47	37.73	0.00	23.76	784.34	-560.57	631.48
Saccade R	1	2	5467769549	5467789386	19837	1299.80	502.04	1273.43	526.95	0.47	37.73	0.00	23.76	784.34	-560.57	631.48
Fixation L	1	3	5467789386	5468028105	238719	1269.11	527.62	52	45	-1	14.34	14.34
Fixation R	1	3	5467789386	5468028105	238719	1269.11	527.62	52	45	-1	13.53	13.53
Saccade L	1	3	5468028105	5468048016	19911	1249.35	535.65	1245.78	538.62	0.06	4.70	1.00	3.06	40.05	-73.26	54.96
Saccade R	1	3	5468028105	5468048016	19911	1249.35	535.65	1245.78	538.62	0.06	4.70	1.00	3.06	40.05	-73.26	54.96
Fixation L	1	4	5468048016	5468187218	139202	1241.57	538.77	12	2	-1	14.36	14.36
Fixation R	1	4	5468048016	5468187218	139202	1241.57	538.77	12	2	-1	13.68	13.68
Blink L	1	1	5468187218	5468386083	198865
Blink R	1	1	5468187218	5468386083	198865
Fixation L	1	5	5468386083	5468803816	417733	1020.50	461.42	16	10	-1	14.75	14.75
Fixation R	1	5	5468386083	5468803816	417733	1020.50	461.42	16	10	-1	15.11	15.11
Saccade L	1	4	5468803816	5468823680	19864	1011.08	466.89	918.24	495.71	0.55	98.33	1.00	27.90	2449.45	-2350.08	1623.42
Saccade R	1	4	5468803816	5468823680	19864	1011.08	466.89	918.24	495.71	0.55	98.33	1.00	27.90	2449.45	-2350.08	1623.42
Fixation L	1	6	5468823680	5469141914	318234	908.74	494.95	16	18	-1	14.87	14.87
Fixation R	1	6	5468823680	5469141914	318234	908.74	494.95	16	18	-1	15.23	15.23
