[BeGaze]
Converted from:	C:\Documents and Settings\iViewX\Desktop\EXPERIMENTATIONS\Experiments\results\finaleart\S13H22431-finaleart-1.idf
Date:	27.03.2019 15:41:26
Version:	BeGaze 2.5.77
Sample Rate:	50
Subject:	S13H22431
Description:	Jimmy Petit

Table Header for Fixations:
Event Type	Trial	Number	Start	End	Duration	Location X	Location Y	Dispersion X	Dispersion Y	Plane	Avg. Pupil Size X	Avg. Pupil Size Y

Table Header for Saccades:
Event Type	Trial	Number	Start	End	Duration	Start Loc.X	Start Loc.Y	End Loc.X	End Loc.Y	Amplitude	Peak Speed	Peak Speed At	Average Speed	Peak Accel.	Peak Decel.	Average Accel.

Table Header for Blinks:
Event Type	Trial	Number	Start	End	Duration

Table Header for User Events:
Event Type	Trial	Number	Start	Description

UserEvent	1	1	27307572857	# Message: void.jpg
Fixation L	1	1	27307587122	27307905352	318230	513.70	192.81	37	22	-1	15.79	15.79
Fixation R	1	1	27307587122	27307885368	298246	512.13	191.78	21	13	-1	16.87	16.87
Blink R	1	1	27307885368	27308004715	119347
Saccade L	1	1	27307905352	27307984844	79492	538.67	209.19	771.93	357.13	4.39	121.21	1.00	55.21	1526.56	-2768.55	1316.85
Fixation L	1	2	27307984844	27308163835	178991	789.66	359.47	25	15	-1	18.12	18.12
Fixation R	1	2	27308004715	27308163835	159120	791.63	359.73	19	15	-1	18.92	18.92
Saccade L	1	2	27308163835	27308223583	59748	794.76	358.84	1209.79	276.71	4.39	194.55	0.33	73.51	4779.22	-3760.44	3359.95
Saccade R	1	1	27308163835	27308223583	59748	794.76	358.84	1209.79	276.71	4.39	194.55	0.33	73.51	4779.22	-3760.44	3359.95
Fixation L	1	3	27308223583	27308342834	119251	1216.90	270.18	63	20	-1	17.12	17.12
Fixation R	1	3	27308223583	27308342834	119251	1216.90	270.18	63	20	-1	18.18	18.18
Saccade L	1	3	27308342834	27308402581	59747	1267.99	260.54	1532.70	202.74	5.24	206.98	0.33	87.66	4794.18	-3207.09	2878.26
Saccade R	1	2	27308342834	27308402581	59747	1267.99	260.54	1532.70	202.74	5.24	206.98	0.33	87.66	4794.18	-3207.09	2878.26
Fixation L	1	4	27308402581	27308601446	198865	1527.72	233.27	52	42	-1	16.82	16.82
Fixation R	1	4	27308402581	27308601446	198865	1527.72	233.27	52	42	-1	17.78	17.78
Saccade L	1	4	27308601446	27308621315	19869	1561.37	241.43	1569.29	241.99	0.28	34.77	1.00	14.03	127.40	-668.53	301.45
Saccade R	1	3	27308601446	27308621315	19869	1561.37	241.43	1569.29	241.99	0.28	34.77	1.00	14.03	127.40	-668.53	301.45
Fixation L	1	5	27308621315	27308740691	119376	1576.15	249.43	19	18	-1	16.77	16.77
Fixation R	1	5	27308621315	27308740691	119376	1576.15	249.43	19	18	-1	17.60	17.60
Saccade L	1	5	27308740691	27308780430	39739	1576.98	260.38	1096.05	465.75	4.49	335.63	0.50	113.08	8150.97	-8188.53	6349.52
Saccade R	1	4	27308740691	27308780430	39739	1576.98	260.38	1096.05	465.75	4.49	335.63	0.50	113.08	8150.97	-8188.53	6349.52
Fixation L	1	6	27308780430	27308899807	119377	1093.28	446.25	38	40	-1	17.05	17.05
Fixation R	1	6	27308780430	27308899807	119377	1093.28	446.25	38	40	-1	17.71	17.71
Saccade L	1	6	27308899807	27308919686	19879	1061.93	447.14	936.04	558.37	1.17	169.89	1.00	58.81	4040.28	-3638.87	2791.93
Saccade R	1	5	27308899807	27308919686	19879	1061.93	447.14	936.04	558.37	1.17	169.89	1.00	58.81	4040.28	-3638.87	2791.93
Fixation L	1	7	27308919686	27309078804	159118	934.99	529.91	5	44	-1	17.00	17.00
Fixation R	1	7	27308919686	27309078804	159118	934.99	529.91	5	44	-1	17.30	17.30
Saccade L	1	7	27309078804	27309118545	39741	934.12	525.42	701.71	543.22	1.98	152.96	1.00	49.80	3741.60	-3585.17	2805.14
Saccade R	1	6	27309078804	27309118545	39741	934.12	525.42	701.71	543.22	1.98	152.96	1.00	49.80	3741.60	-3585.17	2805.14
Fixation L	1	8	27309118545	27309237943	119398	693.78	564.22	14	43	-1	16.42	16.42
Fixation R	1	8	27309118545	27309237943	119398	693.78	564.22	14	43	-1	16.96	16.96
Saccade L	1	8	27309237943	27309377163	139220	688.16	586.51	671.98	431.99	14.71	217.54	0.43	105.64	4145.11	-3210.12	2021.16
Blink R	1	2	27309237943	27309416910	178967
Fixation L	1	9	27309377163	27309556151	178988	662.39	479.88	14	59	-1	16.36	16.36
Fixation R	1	9	27309416910	27309556151	139241	660.73	485.24	6	13	-1	16.38	16.38
