[BeGaze]
Converted from:	C:\Documents and Settings\iViewX\Desktop\EXPERIMENTATIONS\Experiments\results\finaleart\S3121421-finaleart-1.idf
Date:	27.03.2019 15:34:10
Version:	BeGaze 2.5.77
Sample Rate:	50
Subject:	S3121421
Description:	Jean Jouve

Table Header for Fixations:
Event Type	Trial	Number	Start	End	Duration	Location X	Location Y	Dispersion X	Dispersion Y	Plane	Avg. Pupil Size X	Avg. Pupil Size Y

Table Header for Saccades:
Event Type	Trial	Number	Start	End	Duration	Start Loc.X	Start Loc.Y	End Loc.X	End Loc.Y	Amplitude	Peak Speed	Peak Speed At	Average Speed	Peak Accel.	Peak Decel.	Average Accel.

Table Header for Blinks:
Event Type	Trial	Number	Start	End	Duration

Table Header for User Events:
Event Type	Trial	Number	Start	Description

UserEvent	1	1	5329132142	# Message: void.jpg
Saccade L	1	1	5329142713	5329202463	59750	1008.39	839.77	876.38	1034.86	3.87	192.35	0.67	64.85	4808.65	-3228.46	1932.82
Saccade R	1	1	5329142713	5329202463	59750	1008.39	839.77	876.38	1034.86	3.87	192.35	0.67	64.85	4808.65	-3228.46	1932.82
Fixation L	1	1	5329202463	5329381563	179100	882.00	1078.26	13	75	-1	12.36	12.36
Fixation R	1	1	5329202463	5329381563	179100	882.00	1078.26	13	75	-1	12.21	12.21
Saccade L	1	2	5329381563	5329421315	39752	873.65	1058.05	484.21	841.57	3.96	289.90	0.50	99.53	6844.21	-6985.14	5318.38
Saccade R	1	2	5329381563	5329421315	39752	873.65	1058.05	484.21	841.57	3.96	289.90	0.50	99.53	6844.21	-6985.14	5318.38
Fixation L	1	2	5329421315	5329560676	139361	470.43	850.78	21	51	-1	11.79	11.79
Fixation R	1	2	5329421315	5329560676	139361	470.43	850.78	21	51	-1	12.04	12.04
Blink L	1	1	5329560676	5329879170	318494
Blink R	1	1	5329560676	5329879170	318494
Fixation L	1	3	5329879170	5330556003	676833	920.67	727.96	14	70	-1	11.80	11.80
Fixation R	1	3	5329879170	5330556003	676833	920.67	727.96	14	70	-1	12.33	12.33
Saccade L	1	3	5330556003	5330615744	59741	919.06	700.41	971.88	398.39	3.36	115.41	0.67	56.16	2739.93	-2505.28	2067.17
Saccade R	1	3	5330556003	5330615744	59741	919.06	700.41	971.88	398.39	3.36	115.41	0.67	56.16	2739.93	-2505.28	2067.17
Fixation L	1	4	5330615744	5331133354	517610	989.89	378.18	28	42	-1	10.61	10.61
Fixation R	1	4	5330615744	5331133354	517610	989.89	378.18	28	42	-1	11.32	11.32
