[BeGaze]
Converted from:	C:\Documents and Settings\iViewX\Desktop\EXPERIMENTATIONS\Experiments\results\finaleart\S11H21112-finaleart-1.idf
Date:	27.03.2019 15:38:46
Version:	BeGaze 2.5.77
Sample Rate:	50
Subject:	S11H21112
Description:	Clement legrand-Duchenne

Table Header for Fixations:
Event Type	Trial	Number	Start	End	Duration	Location X	Location Y	Dispersion X	Dispersion Y	Plane	Avg. Pupil Size X	Avg. Pupil Size Y

Table Header for Saccades:
Event Type	Trial	Number	Start	End	Duration	Start Loc.X	Start Loc.Y	End Loc.X	End Loc.Y	Amplitude	Peak Speed	Peak Speed At	Average Speed	Peak Accel.	Peak Decel.	Average Accel.

Table Header for Blinks:
Event Type	Trial	Number	Start	End	Duration

Table Header for User Events:
Event Type	Trial	Number	Start	Description

UserEvent	1	1	4086607565	# Message: Georges-braque-still-life-with-jugs-and-pipe-1906.jpg
Fixation L	1	1	4086624592	4087022437	397845	1054.78	500.34	24	38	-1	16.18	16.18
Fixation R	1	1	4086624592	4087022437	397845	1054.78	500.34	24	38	-1	17.88	17.88
Saccade L	1	1	4087022437	4087042324	19887	1036.10	487.69	805.48	495.99	1.36	233.32	1.00	68.58	5767.96	-5534.80	3832.18
Saccade R	1	1	4087022437	4087042324	19887	1036.10	487.69	805.48	495.99	1.36	233.32	1.00	68.58	5767.96	-5534.80	3832.18
Fixation L	1	2	4087042324	4087380421	338097	772.93	483.68	44	31	-1	14.94	14.94
Fixation R	1	2	4087042324	4087380421	338097	772.93	483.68	44	31	-1	16.90	16.90
Saccade L	1	2	4087380421	4087400308	19887	781.64	464.93	973.52	455.25	1.17	194.28	1.00	58.77	4833.33	-4602.54	3171.23
Saccade R	1	2	4087380421	4087400308	19887	781.64	464.93	973.52	455.25	1.17	194.28	1.00	58.77	4833.33	-4602.54	3171.23
Fixation L	1	3	4087400308	4087798159	397851	982.66	417.53	41	57	-1	13.31	13.31
Fixation R	1	3	4087400308	4087798159	397851	982.66	417.53	41	57	-1	14.95	14.95
Saccade L	1	3	4087798159	4087818027	19868	1015.33	420.49	1036.93	434.36	0.48	36.97	1.00	24.41	57.23	-407.13	246.50
Saccade R	1	3	4087798159	4087818027	19868	1015.33	420.49	1036.93	434.36	0.48	36.97	1.00	24.41	57.23	-407.13	246.50
Fixation L	1	4	4087818027	4088315255	497228	1038.12	467.73	23	46	-1	13.40	13.40
Fixation R	1	4	4087818027	4088315255	497228	1038.12	467.73	23	46	-1	14.83	14.83
Saccade L	1	4	4088315255	4088335128	19873	1019.86	480.90	917.92	483.67	1.00	103.15	1.00	50.30	2508.08	-2409.94	2108.31
Saccade R	1	4	4088315255	4088335128	19873	1019.86	480.90	917.92	483.67	1.00	103.15	1.00	50.30	2508.08	-2409.94	2108.31
Fixation L	1	5	4088335128	4088553873	218745	851.72	485.64	75	6	-1	13.40	13.40
Fixation R	1	5	4088335128	4088553873	218745	851.72	485.64	75	6	-1	14.86	14.86
Saccade L	1	5	4088553873	4088593742	39869	845.02	486.33	675.90	550.81	1.66	166.87	1.00	41.70	4092.33	-3937.80	2227.35
Saccade R	1	5	4088553873	4088593742	39869	845.02	486.33	675.90	550.81	1.66	166.87	1.00	41.70	4092.33	-3937.80	2227.35
Fixation L	1	6	4088593742	4088832363	238621	677.11	546.71	24	12	-1	13.45	13.45
Fixation R	1	6	4088593742	4088832363	238621	677.11	546.71	24	12	-1	15.08	15.08
Saccade L	1	6	4088832363	4088852233	19870	694.95	540.14	936.39	430.05	1.58	268.24	1.00	79.57	6691.67	-6358.41	4498.82
Saccade R	1	6	4088832363	4088852233	19870	694.95	540.14	936.39	430.05	1.58	268.24	1.00	79.57	6691.67	-6358.41	4498.82
Fixation L	1	7	4088852233	4089071100	218867	940.11	419.74	10	68	-1	13.36	13.36
Fixation R	1	7	4088852233	4089071100	218867	940.11	419.74	10	68	-1	14.97	14.97
Saccade L	1	7	4089071100	4089110846	39746	944.53	400.42	1112.59	404.58	1.51	145.88	1.00	37.89	3511.08	-3540.30	2075.53
Saccade R	1	7	4089071100	4089110846	39746	944.53	400.42	1112.59	404.58	1.51	145.88	1.00	37.89	3511.08	-3540.30	2075.53
Fixation L	1	8	4089110846	4089548453	437607	1103.38	443.93	23	63	-1	12.96	12.96
Fixation R	1	8	4089110846	4089548453	437607	1103.38	443.93	23	63	-1	14.53	14.53
Saccade L	1	8	4089548453	4089568325	19872	1093.62	467.82	1143.56	572.20	0.75	117.05	1.00	37.63	2906.53	-2712.95	2139.41
Saccade R	1	8	4089548453	4089568325	19872	1093.62	467.82	1143.56	572.20	0.75	117.05	1.00	37.63	2906.53	-2712.95	2139.41
Fixation L	1	9	4089568325	4089707574	139249	1154.24	613.38	18	70	-1	13.23	13.23
Fixation R	1	9	4089568325	4089707574	139249	1154.24	613.38	18	70	-1	14.76	14.76
Saccade L	1	9	4089707574	4089747344	39770	1160.21	620.59	1254.09	957.10	3.38	205.16	1.00	84.92	4571.93	-4815.14	3997.37
Saccade R	1	9	4089707574	4089747344	39770	1160.21	620.59	1254.09	957.10	3.38	205.16	1.00	84.92	4571.93	-4815.14	3997.37
Fixation L	1	10	4089747344	4090304295	556951	1271.06	1010.44	37	62	-1	13.36	13.36
Fixation R	1	10	4089747344	4090304295	556951	1271.06	1010.44	37	62	-1	15.01	15.01
Saccade L	1	10	4090304295	4090344049	39754	1286.88	1018.25	1191.41	1025.71	0.88	88.80	1.00	22.23	2192.21	-2133.93	1160.81
Saccade R	1	10	4090304295	4090344049	39754	1286.88	1018.25	1191.41	1025.71	0.88	88.80	1.00	22.23	2192.21	-2133.93	1160.81
Fixation L	1	11	4090344049	4090602659	258610	1175.72	1036.33	28	22	-1	13.67	13.67
Fixation R	1	11	4090344049	4090602659	258610	1175.72	1036.33	28	22	-1	15.11	15.11
