[BeGaze]
Converted from:	C:\Documents and Settings\iViewX\Desktop\EXPERIMENTATIONS\Experiments\results\finaleart\S6124332-finaleart-1.idf
Date:	27.03.2019 15:35:56
Version:	BeGaze 2.5.77
Sample Rate:	50
Subject:	S6124332
Description:	Romain Ferrand

Table Header for Fixations:
Event Type	Trial	Number	Start	End	Duration	Location X	Location Y	Dispersion X	Dispersion Y	Plane	Avg. Pupil Size X	Avg. Pupil Size Y

Table Header for Saccades:
Event Type	Trial	Number	Start	End	Duration	Start Loc.X	Start Loc.Y	End Loc.X	End Loc.Y	Amplitude	Peak Speed	Peak Speed At	Average Speed	Peak Accel.	Peak Decel.	Average Accel.

Table Header for Blinks:
Event Type	Trial	Number	Start	End	Duration

Table Header for User Events:
Event Type	Trial	Number	Start	Description

UserEvent	1	1	11987839083	# Message: void.jpg
Fixation L	1	1	11987840553	11987939911	99358	1092.08	729.61	7	18	-1	16.23	16.23
Fixation R	1	1	11987840553	11987939911	99358	1092.08	729.61	7	18	-1	14.97	14.97
Saccade L	1	1	11987939911	11987979785	39874	1088.34	738.60	1108.33	1026.75	2.69	188.69	0.50	67.43	4666.85	-4168.56	3378.77
Saccade R	1	1	11987939911	11987979785	39874	1088.34	738.60	1108.33	1026.75	2.69	188.69	0.50	67.43	4666.85	-4168.56	3378.77
Fixation L	1	2	11987979785	11988337759	357974	1135.85	1004.45	36	51	-1	15.51	15.51
Fixation R	1	2	11987979785	11988337759	357974	1135.85	1004.45	36	51	-1	14.67	14.67
Saccade L	1	2	11988337759	11988417258	79499	1135.07	975.03	1039.44	839.05	2.68	93.07	0.25	33.72	2264.82	-2144.18	1060.41
Saccade R	1	2	11988337759	11988417258	79499	1135.07	975.03	1039.44	839.05	2.68	93.07	0.25	33.72	2264.82	-2144.18	1060.41
Fixation L	1	3	11988417258	11988516746	99488	1052.97	798.86	33	58	-1	16.85	16.85
Fixation R	1	3	11988417258	11988516746	99488	1052.97	798.86	33	58	-1	15.87	15.87
Saccade L	1	3	11988516746	11988536628	19882	1061.92	787.41	1052.31	857.57	0.43	71.63	1.00	21.83	1639.14	-1728.76	1152.29
Saccade R	1	3	11988516746	11988536628	19882	1061.92	787.41	1052.31	857.57	0.43	71.63	1.00	21.83	1639.14	-1728.76	1152.29
Fixation L	1	4	11988536628	11988815104	278476	1048.87	849.97	10	13	-1	17.22	17.22
Fixation R	1	4	11988536628	11988815104	278476	1048.87	849.97	10	13	-1	16.70	16.70
Saccade L	1	4	11988815104	11988834973	19869	1050.91	843.72	1033.85	736.22	0.78	110.09	1.00	39.17	2603.47	-2421.56	1987.29
Saccade R	1	4	11988815104	11988834973	19869	1050.91	843.72	1033.85	736.22	0.78	110.09	1.00	39.17	2603.47	-2421.56	1987.29
Fixation L	1	5	11988834973	11989133336	298363	989.78	745.87	53	43	-1	17.77	17.77
Fixation R	1	5	11988834973	11989133336	298363	989.78	745.87	53	43	-1	17.59	17.59
Saccade L	1	5	11989133336	11989153200	19864	979.88	758.62	979.12	760.25	0.04	4.46	1.00	1.96	-12.56	-66.13	33.55
Saccade R	1	5	11989133336	11989153200	19864	979.88	758.62	979.12	760.25	0.04	4.46	1.00	1.96	-12.56	-66.13	33.55
Fixation L	1	6	11989153200	11989829418	676218	982.62	761.77	14	12	-1	17.69	17.69
Fixation R	1	6	11989153200	11989829418	676218	982.62	761.77	14	12	-1	17.38	17.38
