[BeGaze]
Converted from:	C:\Documents and Settings\iViewX\Desktop\EXPERIMENTATIONS\Experiments\results\finaleart\S3121421-finaleart-1.idf
Date:	27.03.2019 15:34:06
Version:	BeGaze 2.5.77
Sample Rate:	50
Subject:	S3121421
Description:	Jean Jouve

Table Header for Fixations:
Event Type	Trial	Number	Start	End	Duration	Location X	Location Y	Dispersion X	Dispersion Y	Plane	Avg. Pupil Size X	Avg. Pupil Size Y

Table Header for Saccades:
Event Type	Trial	Number	Start	End	Duration	Start Loc.X	Start Loc.Y	End Loc.X	End Loc.Y	Amplitude	Peak Speed	Peak Speed At	Average Speed	Peak Accel.	Peak Decel.	Average Accel.

Table Header for Blinks:
Event Type	Trial	Number	Start	End	Duration

Table Header for User Events:
Event Type	Trial	Number	Start	Description

UserEvent	1	1	4971522451	# Message: landschaft_mit_dem_ondregenbogen_caspar_david_friedrich_1810.jpg
Fixation L	1	1	4971537434	4972094266	556832	1085.51	607.77	15	58	-1	10.79	10.79
Fixation R	1	1	4971537434	4972094266	556832	1085.51	607.77	15	58	-1	11.26	11.26
Saccade L	1	1	4972094266	4972134138	39872	1074.50	573.86	1057.12	417.85	1.86	98.80	1.00	46.69	1444.73	-2394.52	1501.61
Saccade R	1	1	4972094266	4972134138	39872	1074.50	573.86	1057.12	417.85	1.86	98.80	1.00	46.69	1444.73	-2394.52	1501.61
Fixation L	1	2	4972134138	4972452373	318235	1021.57	424.78	55	12	-1	10.72	10.72
Fixation R	1	2	4972134138	4972452373	318235	1021.57	424.78	55	12	-1	11.51	11.51
Saccade L	1	2	4972452373	4972472242	19869	1001.57	423.07	830.57	404.79	0.97	173.91	1.00	48.59	4290.10	-4039.26	2825.55
Saccade R	1	2	4972452373	4972472242	19869	1001.57	423.07	830.57	404.79	0.97	173.91	1.00	48.59	4290.10	-4039.26	2825.55
Fixation L	1	3	4972472242	4972690978	218736	818.67	388.63	17	41	-1	10.33	10.33
Fixation R	1	3	4972472242	4972690978	218736	818.67	388.63	17	41	-1	11.09	11.09
Saccade L	1	3	4972690978	4972750592	59614	817.33	383.23	348.87	427.73	5.21	248.12	0.67	87.34	5971.49	-5304.06	3895.62
Saccade R	1	3	4972690978	4972750592	59614	817.33	383.23	348.87	427.73	5.21	248.12	0.67	87.34	5971.49	-5304.06	3895.62
Fixation L	1	4	4972750592	4972929721	179129	342.65	429.22	9	68	-1	9.31	9.31
Fixation R	1	4	4972750592	4972929721	179129	342.65	429.22	9	68	-1	10.41	10.41
Blink L	1	1	4972929721	4973208068	278347
Blink R	1	1	4972929721	4973068822	139101
Blink R	1	2	4973068822	4973247822	179000
Blink L	1	2	4973247822	4973347318	99496
Blink R	1	3	4973247822	4973347318	99496
Blink L	1	3	4973347318	4973466704	119386
Blink R	1	4	4973347318	4973466704	119386
Saccade L	1	4	4973466704	4973586051	119347	959.89	1276.70	1354.68	529.93	33.26	1583.13	1.00	278.67	8426.12	-39398.43	9020.33
Saccade R	1	4	4973466704	4973586051	119347	959.89	1276.70	1354.68	529.93	33.26	1583.13	1.00	278.67	8426.12	-39398.43	9020.33
Fixation L	1	5	4973586051	4973765036	178985	1350.03	520.64	16	28	-1	10.16	10.16
Fixation R	1	5	4973586051	4973765036	178985	1350.03	520.64	16	28	-1	11.33	11.33
Saccade L	1	5	4973765036	4973804783	39747	1353.92	530.48	1720.30	529.87	3.33	214.13	1.00	83.78	4833.05	-5053.09	4253.91
Saccade R	1	5	4973765036	4973804783	39747	1353.92	530.48	1720.30	529.87	3.33	214.13	1.00	83.78	4833.05	-5053.09	4253.91
Fixation L	1	6	4973804783	4974003672	198889	1697.45	567.29	38	59	-1	10.07	10.07
Fixation R	1	6	4973804783	4974003672	198889	1697.45	567.29	38	59	-1	10.88	10.88
Saccade L	1	6	4974003672	4974103142	99470	1685.99	576.18	968.40	477.60	10.10	336.95	0.80	101.56	8256.71	-7932.96	4337.33
Saccade R	1	6	4974003672	4974103142	99470	1685.99	576.18	968.40	477.60	10.10	336.95	0.80	101.56	8256.71	-7932.96	4337.33
Fixation L	1	7	4974103142	4974361623	258481	947.26	445.71	31	52	-1	9.97	9.97
Fixation R	1	7	4974103142	4974361623	258481	947.26	445.71	31	52	-1	11.38	11.38
Saccade L	1	7	4974361623	4974381500	19877	937.02	426.00	878.46	388.69	0.59	70.24	1.00	29.61	1709.76	-1400.30	1418.15
Saccade R	1	7	4974361623	4974381500	19877	937.02	426.00	878.46	388.69	0.59	70.24	1.00	29.61	1709.76	-1400.30	1418.15
Fixation L	1	8	4974381500	4974480989	99489	829.73	379.89	69	29	-1	9.64	9.64
Fixation R	1	8	4974381500	4974480989	99489	829.73	379.89	69	29	-1	11.33	11.33
Saccade L	1	8	4974480989	4974500875	19886	809.45	366.57	809.94	358.14	0.27	17.68	1.00	13.47	74.56	-228.60	120.78
Saccade R	1	8	4974480989	4974500875	19886	809.45	366.57	809.94	358.14	0.27	17.68	1.00	13.47	74.56	-228.60	120.78
Fixation L	1	9	4974500875	4974779355	278480	808.72	361.90	29	13	-1	9.56	9.56
Fixation R	1	9	4974500875	4974779355	278480	808.72	361.90	29	13	-1	11.09	11.09
Saccade L	1	9	4974779355	4974819122	39767	784.70	367.89	350.96	448.74	3.89	250.30	0.50	97.86	6203.80	-6089.97	5405.60
Saccade R	1	9	4974779355	4974819122	39767	784.70	367.89	350.96	448.74	3.89	250.30	0.50	97.86	6203.80	-6089.97	5405.60
Fixation L	1	10	4974819122	4975117461	298339	337.67	457.01	22	62	-1	8.58	8.58
Fixation R	1	10	4974819122	4975117461	298339	337.67	457.01	22	62	-1	10.96	10.96
Saccade L	1	10	4975117461	4975137341	19880	334.22	475.81	336.47	505.37	0.26	29.99	1.00	13.10	546.51	-694.96	496.58
Saccade R	1	10	4975117461	4975137341	19880	334.22	475.81	336.47	505.37	0.26	29.99	1.00	13.10	546.51	-694.96	496.58
Fixation L	1	11	4975137341	4975256704	119363	339.33	504.33	8	60	-1	8.28	8.28
Fixation R	1	11	4975137341	4975256704	119363	339.33	504.33	8	60	-1	10.72	10.72
Saccade L	1	11	4975256704	4975415817	159113	344.91	517.71	968.34	1118.16	14.38	166.75	0.88	90.35	2769.50	-3946.70	1695.53
Saccade R	1	11	4975256704	4975415817	159113	344.91	517.71	968.34	1118.16	14.38	166.75	0.88	90.35	2769.50	-3946.70	1695.53
Fixation L	1	12	4975415817	4975515185	99368	975.38	1116.97	14	24	-1	8.81	8.81
Fixation R	1	12	4975415817	4975515185	99368	975.38	1116.97	14	24	-1	10.42	10.42
