[BeGaze]
Converted from:	C:\Documents and Settings\iViewX\Desktop\EXPERIMENTATIONS\Experiments\results\finaleart\S19F21442-finaleart-1.idf
Date:	27.03.2019 15:51:54
Version:	BeGaze 2.5.77
Sample Rate:	50
Subject:	S19F21442
Description:	Juliette Veuillez

Table Header for Fixations:
Event Type	Trial	Number	Start	End	Duration	Location X	Location Y	Dispersion X	Dispersion Y	Plane	Avg. Pupil Size X	Avg. Pupil Size Y

Table Header for Saccades:
Event Type	Trial	Number	Start	End	Duration	Start Loc.X	Start Loc.Y	End Loc.X	End Loc.Y	Amplitude	Peak Speed	Peak Speed At	Average Speed	Peak Accel.	Peak Decel.	Average Accel.

Table Header for Blinks:
Event Type	Trial	Number	Start	End	Duration

Table Header for User Events:
Event Type	Trial	Number	Start	Description

UserEvent	1	1	8286599814	# Message: void.jpg
Fixation L	1	1	8286605424	8286804283	198859	1383.74	526.26	7	9	-1	11.13	11.13
Fixation R	1	1	8286605424	8286804283	198859	1383.74	526.26	7	9	-1	10.71	10.71
Saccade L	1	1	8286804283	8286844184	39901	1387.72	521.91	1665.29	412.21	2.65	198.71	0.50	66.33	4876.76	-4374.94	3557.69
Saccade R	1	1	8286804283	8286844184	39901	1387.72	521.91	1665.29	412.21	2.65	198.71	0.50	66.33	4876.76	-4374.94	3557.69
Fixation L	1	2	8286844184	8286963405	119221	1629.11	421.82	63	30	-1	11.06	11.06
Fixation R	1	2	8286844184	8286963405	119221	1629.11	421.82	63	30	-1	10.38	10.38
Saccade L	1	2	8286963405	8286983394	19989	1610.59	436.33	1611.41	448.73	0.21	12.57	1.00	10.56	42.12	-3.92	21.96
Saccade R	1	2	8286963405	8286983394	19989	1610.59	436.33	1611.41	448.73	0.21	12.57	1.00	10.56	42.12	-3.92	21.96
Fixation L	1	3	8286983394	8287500514	517120	1623.67	445.59	35	18	-1	11.10	11.10
Fixation R	1	3	8286983394	8287500514	517120	1623.67	445.59	35	18	-1	10.71	10.71
Saccade L	1	3	8287500514	8287560127	59613	1603.49	454.32	1051.54	505.98	6.19	272.44	0.33	103.84	6747.02	-4717.38	4335.17
Saccade R	1	3	8287500514	8287560127	59613	1603.49	454.32	1051.54	505.98	6.19	272.44	0.33	103.84	6747.02	-4717.38	4335.17
Fixation L	1	4	8287560127	8288097226	537099	1039.87	534.59	23	68	-1	12.13	12.13
Fixation R	1	4	8287560127	8288097226	537099	1039.87	534.59	23	68	-1	12.49	12.49
Saccade L	1	4	8288097226	8288136977	39751	1031.34	541.97	813.61	527.99	2.22	125.37	1.00	55.73	2985.39	-2769.87	2307.35
Saccade R	1	4	8288097226	8288136977	39751	1031.34	541.97	813.61	527.99	2.22	125.37	1.00	55.73	2985.39	-2769.87	2307.35
Fixation L	1	5	8288136977	8288594458	457481	764.50	516.36	66	30	-1	12.61	12.61
Fixation R	1	5	8288136977	8288594458	457481	764.50	516.36	66	30	-1	13.57	13.57
