[BeGaze]
Converted from:	C:\Documents and Settings\iViewX\Desktop\EXPERIMENTATIONS\Experiments\results\finaleart\S15H25531-finaleart-1.idf
Date:	27.03.2019 15:46:02
Version:	BeGaze 2.5.77
Sample Rate:	50
Subject:	S15H25531
Description:	Mikail Demirdelen

Table Header for Fixations:
Event Type	Trial	Number	Start	End	Duration	Location X	Location Y	Dispersion X	Dispersion Y	Plane	Avg. Pupil Size X	Avg. Pupil Size Y

Table Header for Saccades:
Event Type	Trial	Number	Start	End	Duration	Start Loc.X	Start Loc.Y	End Loc.X	End Loc.Y	Amplitude	Peak Speed	Peak Speed At	Average Speed	Peak Accel.	Peak Decel.	Average Accel.

Table Header for Blinks:
Event Type	Trial	Number	Start	End	Duration

Table Header for User Events:
Event Type	Trial	Number	Start	Description

UserEvent	1	1	4796354016	# Message: void.jpg
Fixation L	1	1	4796358133	4796497522	139389	1264.68	714.52	14	47	-1	11.94	11.94
Fixation R	1	1	4796358133	4796497522	139389	1264.68	714.52	14	47	-1	13.23	13.23
Saccade L	1	1	4796497522	4796517478	19956	1275.58	755.10	1374.81	887.70	1.23	167.49	1.00	61.42	4109.70	-4029.45	2853.08
Saccade R	1	1	4796497522	4796517478	19956	1275.58	755.10	1374.81	887.70	1.23	167.49	1.00	61.42	4109.70	-4029.45	2853.08
Fixation L	1	2	4796517478	4796855354	337876	1386.08	914.67	19	34	-1	12.10	12.10
Fixation R	1	2	4796517478	4796855354	337876	1386.08	914.67	19	34	-1	13.25	13.25
Saccade L	1	2	4796855354	4796895114	39760	1393.84	906.80	1288.62	897.89	1.52	107.61	0.50	38.19	2602.20	-1538.53	1297.06
Saccade R	1	2	4796855354	4796914975	59621	1393.84	906.80	1245.15	884.34	2.35	107.61	0.33	39.40	2602.20	-1538.53	1044.92
Blink L	1	1	4796895114	4797233226	338112
Blink R	1	1	4796914975	4797233226	318251
Fixation L	1	3	4797233226	4797392463	159237	907.18	1136.34	22	43	-1	12.64	12.64
Fixation R	1	3	4797233226	4797392463	159237	907.18	1136.34	22	43	-1	13.15	13.15
Saccade L	1	3	4797392463	4797432211	39748	909.09	1133.98	609.65	1196.41	2.88	234.21	1.00	72.44	5705.16	-5022.26	3328.04
Saccade R	1	3	4797392463	4797432211	39748	909.09	1133.98	609.65	1196.41	2.88	234.21	1.00	72.44	5705.16	-5022.26	3328.04
Fixation L	1	4	4797432211	4797670817	238606	560.98	1224.30	62	37	-1	12.49	12.49
Fixation R	1	4	4797432211	4797670817	238606	560.98	1224.30	62	37	-1	13.29	13.29
Saccade L	1	4	4797670817	4797710694	39877	555.35	1231.92	607.00	1071.88	1.86	171.80	1.00	46.63	4245.52	-3696.98	2317.45
Saccade R	1	4	4797670817	4797710694	39877	555.35	1231.92	607.00	1071.88	1.86	171.80	1.00	46.63	4245.52	-3696.98	2317.45
Fixation L	1	5	4797710694	4797869810	159116	609.58	1030.64	33	54	-1	12.33	12.33
Fixation R	1	5	4797710694	4797869810	159116	609.58	1030.64	33	54	-1	13.47	13.47
Saccade L	1	5	4797869810	4797889683	19873	622.84	1017.29	626.48	1008.02	0.20	14.92	0.00	9.84	140.02	-142.09	136.02
Saccade R	1	5	4797869810	4797889683	19873	622.84	1017.29	626.48	1008.02	0.20	14.92	0.00	9.84	140.02	-142.09	136.02
Fixation L	1	6	4797889683	4798207916	318233	647.65	989.36	30	52	-1	12.28	12.28
Fixation R	1	6	4797889683	4798207916	318233	647.65	989.36	30	52	-1	13.72	13.72
Saccade L	1	6	4798207916	4798247667	39751	650.19	1030.54	645.03	1014.91	1.97	92.93	1.00	49.63	1783.15	-2055.30	1557.84
Saccade R	1	6	4798207916	4798247667	39751	650.19	1030.54	645.03	1014.91	1.97	92.93	1.00	49.63	1783.15	-2055.30	1557.84
Fixation L	1	7	4798247667	4798347164	99497	652.45	995.14	13	28	-1	13.42	13.42
Fixation R	1	7	4798247667	4798347164	99497	652.45	995.14	13	28	-1	13.80	13.80
