[BeGaze]
Converted from:	C:\Documents and Settings\iViewX\Desktop\EXPERIMENTATIONS\Experiments\results\finaleart\S01A22542-finaleart-1.idf
Date:	27.03.2019 15:33:20
Version:	BeGaze 2.5.77
Sample Rate:	50
Subject:	S01A22542
Description:	Thibault Seve Minnaert

Table Header for Fixations:
Event Type	Trial	Number	Start	End	Duration	Location X	Location Y	Dispersion X	Dispersion Y	Plane	Avg. Pupil Size X	Avg. Pupil Size Y

Table Header for Saccades:
Event Type	Trial	Number	Start	End	Duration	Start Loc.X	Start Loc.Y	End Loc.X	End Loc.Y	Amplitude	Peak Speed	Peak Speed At	Average Speed	Peak Accel.	Peak Decel.	Average Accel.

Table Header for Blinks:
Event Type	Trial	Number	Start	End	Duration

Table Header for User Events:
Event Type	Trial	Number	Start	Description

UserEvent	1	1	9212090989	# Message: void.jpg
Fixation L	1	1	9212108700	9212367187	258487	1513.52	629.56	54	22	-1	13.23	13.23
Fixation R	1	1	9212108700	9212367187	258487	1513.52	629.56	54	22	-1	13.00	13.00
Saccade L	1	1	9212367187	9212387057	19870	1470.86	616.66	1288.95	619.18	1.36	183.98	1.00	68.53	4495.41	-4077.10	3068.77
Saccade R	1	1	9212367187	9212387057	19870	1470.86	616.66	1288.95	619.18	1.36	183.98	1.00	68.53	4495.41	-4077.10	3068.77
Fixation L	1	2	9212387057	9212665410	278353	1237.53	641.03	61	38	-1	13.45	13.45
Fixation R	1	2	9212387057	9212665410	278353	1237.53	641.03	61	38	-1	13.03	13.03
Saccade L	1	2	9212665410	9212685411	20001	1229.34	657.22	1220.97	650.00	1.12	209.05	1.00	56.13	29170.60	215.99	11523.14
Saccade R	1	2	9212665410	9212685411	20001	1229.34	657.22	1220.97	650.00	1.12	209.05	1.00	56.13	29170.60	215.99	11523.14
Blink L	1	1	9212685411	9212824535	139124
Blink R	1	1	9212685411	9212824535	139124
Fixation L	1	3	9212824535	9213083142	258607	839.91	464.54	44	14	-1	14.09	14.09
Fixation R	1	3	9212824535	9213083142	258607	839.91	464.54	44	14	-1	13.76	13.76
Saccade L	1	3	9213083142	9213103014	19872	877.52	472.37	1051.31	468.49	1.13	175.80	1.00	56.92	4319.01	-4278.13	3140.69
Saccade R	1	3	9213083142	9213103014	19872	877.52	472.37	1051.31	468.49	1.13	175.80	1.00	56.92	4319.01	-4278.13	3140.69
Fixation L	1	4	9213103014	9213321757	218743	1068.83	452.46	25	27	-1	14.77	14.77
Fixation R	1	4	9213103014	9213321757	218743	1068.83	452.46	25	27	-1	14.35	14.35
Saccade L	1	4	9213321757	9213341628	19871	1076.87	440.94	942.37	439.27	0.98	136.04	1.00	49.55	3366.66	-3148.45	2646.77
Saccade R	1	4	9213321757	9213341628	19871	1076.87	440.94	942.37	439.27	0.98	136.04	1.00	49.55	3366.66	-3148.45	2646.77
Fixation L	1	5	9213341628	9213580247	238619	895.86	460.09	58	40	-1	14.89	14.89
Fixation R	1	5	9213341628	9213580247	238619	895.86	460.09	58	40	-1	14.66	14.66
Saccade L	1	5	9213580247	9213600114	19867	893.61	480.11	1023.89	475.69	0.76	131.85	1.00	38.13	3186.38	-3076.08	2108.94
Saccade R	1	5	9213580247	9213600114	19867	893.61	480.11	1023.89	475.69	0.76	131.85	1.00	38.13	3186.38	-3076.08	2108.94
Fixation L	1	6	9213600114	9213779112	178998	1022.05	470.46	11	11	-1	15.14	15.14
Fixation R	1	6	9213600114	9213779112	178998	1022.05	470.46	11	11	-1	14.92	14.92
Saccade L	1	6	9213779112	9213798981	19869	1021.84	466.01	905.68	466.86	0.64	117.50	1.00	32.33	2820.08	-2499.71	1786.10
Saccade R	1	6	9213779112	9213798981	19869	1021.84	466.01	905.68	466.86	0.64	117.50	1.00	32.33	2820.08	-2499.71	1786.10
Fixation L	1	7	9213798981	9214057608	258627	890.52	468.23	42	23	-1	15.25	15.25
Fixation R	1	7	9213798981	9214057608	258627	890.52	468.23	42	23	-1	15.11	15.11
Saccade L	1	7	9214057608	9214077463	19855	923.80	466.81	968.74	464.07	0.73	46.64	0.00	36.55	702.57	0.00	351.28
Saccade R	1	7	9214057608	9214077463	19855	923.80	466.81	968.74	464.07	0.73	46.64	0.00	36.55	702.57	0.00	351.28
