[BeGaze]
Converted from:	C:\Documents and Settings\iViewX\Desktop\EXPERIMENTATIONS\Experiments\results\finaleart\S20H24222-finaleart-1.idf
Date:	27.03.2019 15:53:48
Version:	BeGaze 2.5.77
Sample Rate:	50
Subject:	S20H24222
Description:	Hugo Brument

Table Header for Fixations:
Event Type	Trial	Number	Start	End	Duration	Location X	Location Y	Dispersion X	Dispersion Y	Plane	Avg. Pupil Size X	Avg. Pupil Size Y

Table Header for Saccades:
Event Type	Trial	Number	Start	End	Duration	Start Loc.X	Start Loc.Y	End Loc.X	End Loc.Y	Amplitude	Peak Speed	Peak Speed At	Average Speed	Peak Accel.	Peak Decel.	Average Accel.

Table Header for Blinks:
Event Type	Trial	Number	Start	End	Duration

Table Header for User Events:
Event Type	Trial	Number	Start	Description

UserEvent	1	1	12179765427	# Message: void.jpg
Saccade L	1	1	12179782256	12179901489	119233	812.27	282.73	574.18	279.58	3.98	150.55	0.83	33.39	3673.53	-3590.02	1490.32
Saccade R	1	1	12179782256	12179901489	119233	812.27	282.73	574.18	279.58	3.98	150.55	0.83	33.39	3673.53	-3590.02	1490.32
Fixation L	1	1	12179901489	12180080601	179112	586.22	299.95	32	37	-1	10.31	10.31
Fixation R	1	1	12179901489	12180080601	179112	586.22	299.95	32	37	-1	11.59	11.59
Saccade L	1	2	12180080601	12180100484	19883	606.29	307.99	901.20	310.98	1.61	298.08	1.00	81.14	7387.46	-7367.35	5029.53
Saccade R	1	2	12180080601	12180100484	19883	606.29	307.99	901.20	310.98	1.61	298.08	1.00	81.14	7387.46	-7367.35	5029.53
Fixation L	1	2	12180100484	12180319221	218737	902.42	304.30	20	31	-1	10.31	10.31
Fixation R	1	2	12180100484	12180319221	218737	902.42	304.30	20	31	-1	11.61	11.61
Blink L	1	1	12180319221	12180418705	99484
Blink R	1	1	12180319221	12180538085	218864
Blink L	1	2	12180438598	12180538085	99487
Fixation L	1	3	12180538085	12180677204	139119	1132.53	546.20	3	6	-1	11.50	11.50
Fixation R	1	3	12180538085	12180677204	139119	1132.53	546.20	3	6	-1	11.40	11.40
Saccade L	1	3	12180677204	12180736957	59753	1133.26	542.14	1775.63	646.50	6.99	260.06	0.33	116.99	6468.10	-5278.96	4774.35
Saccade R	1	3	12180677204	12180736957	59753	1133.26	542.14	1775.63	646.50	6.99	260.06	0.33	116.99	6468.10	-5278.96	4774.35
Fixation L	1	4	12180736957	12181114834	377877	1740.73	653.87	51	18	-1	11.95	11.95
Fixation R	1	4	12180736957	12181114834	377877	1740.73	653.87	51	18	-1	11.20	11.20
Saccade L	1	4	12181114834	12181174561	59727	1724.41	650.00	1041.30	600.44	7.14	296.77	0.67	119.62	7359.27	-6998.79	5048.74
Saccade R	1	4	12181114834	12181174561	59727	1724.41	650.00	1041.30	600.44	7.14	296.77	0.67	119.62	7359.27	-6998.79	5048.74
Fixation L	1	5	12181174561	12181711535	536974	1013.79	552.28	34	65	-1	11.90	11.90
Fixation R	1	5	12181174561	12181711535	536974	1013.79	552.28	34	65	-1	11.73	11.73
Saccade L	1	5	12181711535	12181751283	39748	1013.20	541.17	894.59	549.08	1.29	74.98	1.00	32.33	1811.65	0.00	927.72
Saccade R	1	5	12181711535	12181751283	39748	1013.20	541.17	894.59	549.08	1.29	74.98	1.00	32.33	1811.65	0.00	927.72
