[BeGaze]
Converted from:	C:\Documents and Settings\iViewX\Desktop\EXPERIMENTATIONS\Experiments\results\finaleart\S16F14542-finaleart-1.idf
Date:	27.03.2019 15:47:17
Version:	BeGaze 2.5.77
Sample Rate:	50
Subject:	S16F14542
Description:	Diane Dewez

Table Header for Fixations:
Event Type	Trial	Number	Start	End	Duration	Location X	Location Y	Dispersion X	Dispersion Y	Plane	Avg. Pupil Size X	Avg. Pupil Size Y

Table Header for Saccades:
Event Type	Trial	Number	Start	End	Duration	Start Loc.X	Start Loc.Y	End Loc.X	End Loc.Y	Amplitude	Peak Speed	Peak Speed At	Average Speed	Peak Accel.	Peak Decel.	Average Accel.

Table Header for Blinks:
Event Type	Trial	Number	Start	End	Duration

Table Header for User Events:
Event Type	Trial	Number	Start	Description

UserEvent	1	1	7076254464	# Message: still-life-with-bottle-of-wind_cross_1904.jpg
Fixation L	1	1	7076263286	7076700880	437594	740.25	383.24	6	18	-1	13.97	13.97
Fixation R	1	1	7076263286	7076700880	437594	740.25	383.24	6	18	-1	14.03	14.03
Saccade L	1	1	7076700880	7076740639	39759	742.55	373.64	1001.69	557.70	2.83	163.77	0.50	71.16	3820.36	-3947.41	3791.32
Saccade R	1	1	7076700880	7076740639	39759	742.55	373.64	1001.69	557.70	2.83	163.77	0.50	71.16	3820.36	-3947.41	3791.32
Fixation L	1	2	7076740639	7077138480	397841	1006.22	579.86	13	35	-1	13.59	13.59
Fixation R	1	2	7076740639	7077138480	397841	1006.22	579.86	13	35	-1	13.10	13.10
Saccade L	1	2	7077138480	7077158367	19887	1014.07	580.91	1173.54	615.26	0.95	164.98	1.00	47.92	4109.54	-3976.80	2781.09
Saccade R	1	2	7077138480	7077158367	19887	1014.07	580.91	1173.54	615.26	0.95	164.98	1.00	47.92	4109.54	-3976.80	2781.09
Fixation L	1	3	7077158367	7077436848	278481	1177.65	638.99	11	48	-1	12.49	12.49
Fixation R	1	3	7077158367	7077436848	278481	1177.65	638.99	11	48	-1	11.37	11.37
Saccade L	1	3	7077436848	7077496461	59613	1183.43	602.86	1219.16	256.05	4.44	161.00	0.33	74.51	3967.03	-2699.32	2569.12
Saccade R	1	3	7077436848	7077496461	59613	1183.43	602.86	1219.16	256.05	4.44	161.00	0.33	74.51	3967.03	-2699.32	2569.12
Fixation L	1	4	7077496461	7077755084	258623	1234.67	206.55	34	64	-1	12.01	12.01
Fixation R	1	4	7077496461	7077755084	258623	1234.67	206.55	34	64	-1	10.99	10.99
Saccade L	1	4	7077755084	7077854447	99363	1247.47	191.71	914.31	483.25	6.36	316.72	0.80	64.05	7805.61	-7585.45	3041.35
Saccade R	1	4	7077755084	7077854447	99363	1247.47	191.71	914.31	483.25	6.36	316.72	0.80	64.05	7805.61	-7585.45	3041.35
Fixation L	1	5	7077854447	7078093192	238745	919.21	516.92	12	49	-1	12.68	12.68
Fixation R	1	5	7077854447	7078093192	238745	919.21	516.92	12	49	-1	12.36	12.36
Saccade L	1	5	7078093192	7078152812	59620	915.63	532.56	1364.24	933.20	6.29	275.00	0.67	105.49	6845.27	-6396.04	4679.92
Saccade R	1	5	7078093192	7078152812	59620	915.63	532.56	1364.24	933.20	6.29	275.00	0.67	105.49	6845.27	-6396.04	4679.92
Fixation L	1	6	7078152812	7078391554	238742	1385.86	933.07	28	12	-1	14.15	14.15
Fixation R	1	6	7078152812	7078391554	238742	1385.86	933.07	28	12	-1	13.22	13.22
Saccade L	1	6	7078391554	7078411432	19878	1386.15	940.34	1474.92	1059.32	1.00	150.13	1.00	50.10	3681.17	-3360.20	2681.58
Saccade R	1	6	7078391554	7078411432	19878	1386.15	940.34	1474.92	1059.32	1.00	150.13	1.00	50.10	3681.17	-3360.20	2681.58
Fixation L	1	7	7078411432	7078550673	139241	1521.81	1080.57	58	26	-1	14.15	14.15
Fixation R	1	7	7078411432	7078550673	139241	1521.81	1080.57	58	26	-1	12.35	12.35
Saccade L	1	7	7078550673	7078570546	19873	1533.36	1085.65	1533.70	1103.62	0.13	18.18	1.00	6.69	430.89	-308.66	285.29
Saccade R	1	7	7078550673	7078570546	19873	1533.36	1085.65	1533.70	1103.62	0.13	18.18	1.00	6.69	430.89	-308.66	285.29
Fixation L	1	8	7078570546	7079087637	517091	1543.64	1130.51	23	38	-1	13.25	13.25
Fixation R	1	8	7078570546	7079087637	517091	1543.64	1130.51	23	38	-1	11.58	11.58
Saccade L	1	8	7079087637	7079167267	79630	1555.66	1142.35	1017.49	691.61	8.64	258.76	0.50	108.49	6418.13	-3984.20	3718.78
Saccade R	1	8	7079087637	7079167267	79630	1555.66	1142.35	1017.49	691.61	8.64	258.76	0.50	108.49	6418.13	-3984.20	3718.78
Fixation L	1	9	7079167267	7079326380	159113	1000.85	698.10	28	47	-1	12.53	12.53
Fixation R	1	9	7079167267	7079326380	159113	1000.85	698.10	28	47	-1	11.43	11.43
Saccade L	1	9	7079326380	7079346256	19876	989.18	660.93	880.49	560.41	1.08	149.74	1.00	54.11	3606.67	-3662.76	2643.59
Saccade R	1	9	7079326380	7079346256	19876	989.18	660.93	880.49	560.41	1.08	149.74	1.00	54.11	3606.67	-3662.76	2643.59
Fixation L	1	10	7079346256	7079823602	477346	865.98	554.24	18	19	-1	11.68	11.68
Fixation R	1	10	7079346256	7079823602	477346	865.98	554.24	18	19	-1	11.12	11.12
Saccade L	1	10	7079823602	7079843486	19884	868.02	563.66	795.83	551.05	0.58	74.13	1.00	29.13	1774.82	-1472.73	1289.15
Saccade R	1	10	7079823602	7079843486	19884	868.02	563.66	795.83	551.05	0.58	74.13	1.00	29.13	1774.82	-1472.73	1289.15
Fixation L	1	11	7079843486	7079942976	99490	764.66	522.87	43	54	-1	11.10	11.10
Fixation R	1	11	7079843486	7079942976	99490	764.66	522.87	43	54	-1	10.68	10.68
Saccade L	1	11	7079942976	7079962856	19880	753.20	496.99	748.63	483.53	0.20	14.38	1.00	10.25	156.86	-312.80	183.35
Saccade R	1	11	7079942976	7079962856	19880	753.20	496.99	748.63	483.53	0.20	14.38	1.00	10.25	156.86	-312.80	183.35
Fixation L	1	12	7079962856	7080201465	238609	751.25	482.82	34	28	-1	10.86	10.86
Fixation R	1	12	7079962856	7080201465	238609	751.25	482.82	34	28	-1	10.68	10.68
Saccade L	1	12	7080201465	7080241340	39875	781.99	465.27	843.57	455.70	0.98	49.41	0.50	24.60	1206.77	-513.98	573.58
Saccade R	1	12	7080201465	7080241340	39875	781.99	465.27	843.57	455.70	0.98	49.41	0.50	24.60	1206.77	-513.98	573.58
