[BeGaze]
Converted from:	C:\Documents and Settings\iViewX\Desktop\EXPERIMENTATIONS\Experiments\results\finaleart\S6124332-finaleart-1.idf
Date:	27.03.2019 15:35:48
Version:	BeGaze 2.5.77
Sample Rate:	50
Subject:	S6124332
Description:	Romain Ferrand

Table Header for Fixations:
Event Type	Trial	Number	Start	End	Duration	Location X	Location Y	Dispersion X	Dispersion Y	Plane	Avg. Pupil Size X	Avg. Pupil Size Y

Table Header for Saccades:
Event Type	Trial	Number	Start	End	Duration	Start Loc.X	Start Loc.Y	End Loc.X	End Loc.Y	Amplitude	Peak Speed	Peak Speed At	Average Speed	Peak Accel.	Peak Decel.	Average Accel.

Table Header for Blinks:
Event Type	Trial	Number	Start	End	Duration

Table Header for User Events:
Event Type	Trial	Number	Start	Description

UserEvent	1	1	11742298630	# Message: landschaft_mit_dem_ondregenbogen_caspar_david_friedrich_1810.jpg
Saccade L	1	1	11742308982	11742348719	39737	1039.89	528.30	995.48	635.15	1.42	109.21	1.00	35.74	2730.19	-2646.11	1450.29
Saccade R	1	1	11742308982	11742348719	39737	1039.89	528.30	995.48	635.15	1.42	109.21	1.00	35.74	2730.19	-2646.11	1450.29
Fixation L	1	1	11742348719	11742826091	477372	972.03	642.73	29	21	-1	17.66	17.66
Fixation R	1	1	11742348719	11742826091	477372	972.03	642.73	29	21	-1	17.40	17.40
Saccade L	1	2	11742826091	11742865811	39720	974.96	636.50	971.94	479.64	1.48	86.74	1.00	37.39	2073.05	-1812.91	1718.54
Saccade R	1	2	11742826091	11742865811	39720	974.96	636.50	971.94	479.64	1.48	86.74	1.00	37.39	2073.05	-1812.91	1718.54
Fixation L	1	2	11742865811	11743124419	258608	955.83	454.91	27	34	-1	18.30	18.30
Fixation R	1	2	11742865811	11743124419	258608	955.83	454.91	27	34	-1	17.94	17.94
Saccade L	1	3	11743124419	11743144291	19872	944.33	452.10	876.42	446.92	0.41	68.90	1.00	20.84	1609.28	-1521.28	1049.89
Saccade R	1	3	11743124419	11743144291	19872	944.33	452.10	876.42	446.92	0.41	68.90	1.00	20.84	1609.28	-1521.28	1049.89
Fixation L	1	3	11743144291	11743323289	178998	860.62	439.14	42	17	-1	18.85	18.85
Fixation R	1	3	11743144291	11743323289	178998	860.62	439.14	42	17	-1	18.45	18.45
Saccade L	1	4	11743323289	11743363037	39748	833.73	437.67	473.10	510.59	3.27	241.93	0.50	82.17	5945.39	-5852.75	4355.15
Saccade R	1	4	11743323289	11743363037	39748	833.73	437.67	473.10	510.59	3.27	241.93	0.50	82.17	5945.39	-5852.75	4355.15
Fixation L	1	4	11743363037	11743562008	198971	471.62	523.25	4	24	-1	18.06	18.06
Fixation R	1	4	11743363037	11743562008	198971	471.62	523.25	4	24	-1	18.34	18.34
Saccade L	1	5	11743562008	11743641506	79498	471.01	532.32	1005.83	1024.06	8.53	329.26	0.50	107.28	8191.89	-6404.23	4572.27
Saccade R	1	5	11743562008	11743641506	79498	471.01	532.32	1005.83	1024.06	8.53	329.26	0.50	107.28	8191.89	-6404.23	4572.27
Fixation L	1	5	11743641506	11744357595	716089	1022.70	1020.10	36	19	-1	17.88	17.88
Fixation R	1	5	11743641506	11744357595	716089	1022.70	1020.10	36	19	-1	17.28	17.28
Saccade L	1	6	11744357595	11744397340	39745	1025.47	1021.42	1031.81	798.33	2.18	113.50	0.50	54.75	2798.46	-2420.69	2425.73
Saccade R	1	6	11744357595	11744397340	39745	1025.47	1021.42	1031.81	798.33	2.18	113.50	0.50	54.75	2798.46	-2420.69	2425.73
Fixation L	1	6	11744397340	11744655959	258619	1038.56	740.19	13	74	-1	18.21	18.21
Fixation R	1	6	11744397340	11744655959	258619	1038.56	740.19	13	74	-1	17.10	17.10
Saccade L	1	7	11744655959	11744675827	19868	1036.39	724.02	1032.40	638.35	0.57	86.75	1.00	28.89	2111.69	-1783.84	1322.77
Saccade R	1	7	11744655959	11744675827	19868	1036.39	724.02	1032.40	638.35	0.57	86.75	1.00	28.89	2111.69	-1783.84	1322.77
Fixation L	1	7	11744675827	11745013931	338104	1004.04	647.60	46	28	-1	18.79	18.79
Fixation R	1	7	11744675827	11745013931	338104	1004.04	647.60	46	28	-1	17.86	17.86
Saccade L	1	8	11745013931	11745033805	19874	986.08	629.59	982.83	604.64	0.26	25.45	1.00	12.83	273.76	-285.63	216.42
Saccade R	1	8	11745013931	11745033805	19874	986.08	629.59	982.83	604.64	0.26	25.45	1.00	12.83	273.76	-285.63	216.42
Fixation L	1	8	11745033805	11745471401	437596	958.65	601.02	52	28	-1	19.68	19.68
Fixation R	1	8	11745033805	11745471401	437596	958.65	601.02	52	28	-1	19.12	19.12
Saccade L	1	9	11745471401	11745511157	39756	929.92	585.52	864.50	420.63	1.70	90.66	1.00	42.78	2186.21	-2076.42	2006.91
Saccade R	1	9	11745471401	11745511157	39756	929.92	585.52	864.50	420.63	1.70	90.66	1.00	42.78	2186.21	-2076.42	2006.91
Fixation L	1	9	11745511157	11745869244	358087	847.32	431.24	23	48	-1	19.78	19.78
Fixation R	1	9	11745511157	11745869244	358087	847.32	431.24	23	48	-1	19.39	19.39
Saccade L	1	10	11745869244	11745889144	19900	864.58	397.77	887.98	383.20	0.37	27.88	1.00	18.63	286.98	-410.97	260.46
Saccade R	1	10	11745869244	11745889144	19900	864.58	397.77	887.98	383.20	0.37	27.88	1.00	18.63	286.98	-410.97	260.46
Fixation L	1	10	11745889144	11746048233	159089	899.25	376.04	15	22	-1	18.56	18.56
Fixation R	1	10	11745889144	11746048233	159089	899.25	376.04	15	22	-1	18.35	18.35
Saccade L	1	11	11746048233	11746107873	59640	903.68	370.04	1448.87	494.40	5.87	200.68	0.33	98.35	4890.52	-4553.93	3720.65
Saccade R	1	11	11746048233	11746107873	59640	903.68	370.04	1448.87	494.40	5.87	200.68	0.33	98.35	4890.52	-4553.93	3720.65
Fixation L	1	11	11746107873	11746266986	159113	1448.56	517.07	16	42	-1	18.18	18.18
Fixation R	1	11	11746107873	11746266986	159113	1448.56	517.07	16	42	-1	17.76	17.76
Saccade L	1	12	11746266986	11746286857	19871	1437.72	537.24	1572.94	589.87	1.12	146.76	1.00	56.23	3519.04	0.00	1759.52
Saccade R	1	12	11746266986	11746286857	19871	1437.72	537.24	1572.94	589.87	1.12	146.76	1.00	56.23	3519.04	0.00	1759.52
