[BeGaze]
Converted from:	C:\Documents and Settings\iViewX\Desktop\EXPERIMENTATIONS\Experiments\results\finaleart\S02123220-finaleart-1.idf
Date:	27.03.2019 15:33:43
Version:	BeGaze 2.5.77
Sample Rate:	50
Subject:	S02123220
Description:	David Xu

Table Header for Fixations:
Event Type	Trial	Number	Start	End	Duration	Location X	Location Y	Dispersion X	Dispersion Y	Plane	Avg. Pupil Size X	Avg. Pupil Size Y

Table Header for Saccades:
Event Type	Trial	Number	Start	End	Duration	Start Loc.X	Start Loc.Y	End Loc.X	End Loc.Y	Amplitude	Peak Speed	Peak Speed At	Average Speed	Peak Accel.	Peak Decel.	Average Accel.

Table Header for Blinks:
Event Type	Trial	Number	Start	End	Duration

Table Header for User Events:
Event Type	Trial	Number	Start	Description

UserEvent	1	1	1787451165	# Message: void.jpg
Saccade L	1	1	1787463666	1787543289	79623	948.35	519.45	1655.28	354.77	12.81	442.91	0.25	160.94	6942.20	-8468.14	3789.40
Blink R	1	1	1787463666	1787583026	119360
Fixation L	1	1	1787543289	1787642648	99359	1620.66	386.74	52	45	-1	11.28	11.28
Fixation R	1	1	1787583026	1787861528	278502	1600.35	414.18	39	56	-1	10.36	10.36
Saccade L	1	2	1787642648	1787662646	19998	1616.04	399.97	1606.46	414.00	0.19	17.19	1.00	9.68	224.68	-305.29	212.33
Fixation L	1	2	1787662646	1788000755	338109	1588.48	431.02	33	45	-1	11.27	11.27
Saccade R	1	1	1787861528	1787881381	19853	1585.55	438.05	1579.34	441.35	0.10	7.95	1.00	5.19	50.02	-20.92	29.38
Fixation R	1	2	1787881381	1788000755	119374	1579.00	444.58	8	15	-1	10.32	10.32
Blink L	1	1	1788000755	1788358753	357998
Blink R	1	2	1788000755	1788358753	357998
Fixation L	1	3	1788358753	1788796327	437574	1239.04	445.41	28	62	-1	12.36	12.36
Fixation R	1	3	1788358753	1788796327	437574	1239.04	445.41	28	62	-1	11.88	11.88
Saccade L	1	3	1788796327	1788855947	59620	1232.25	479.51	874.15	514.45	4.16	143.31	0.67	69.80	3412.87	-2556.61	2279.68
Saccade R	1	2	1788796327	1788855947	59620	1232.25	479.51	874.15	514.45	4.16	143.31	0.67	69.80	3412.87	-2556.61	2279.68
Fixation L	1	4	1788855947	1789214050	358103	843.29	530.33	44	53	-1	12.49	12.49
Fixation R	1	4	1788855947	1789214050	358103	843.29	530.33	44	53	-1	12.25	12.25
Saccade L	1	4	1789214050	1789233924	19874	874.62	547.23	933.93	541.49	0.76	60.28	1.00	38.22	1307.05	-735.10	914.63
Saccade R	1	3	1789214050	1789233924	19874	874.62	547.23	933.93	541.49	0.76	60.28	1.00	38.22	1307.05	-735.10	914.63
Fixation L	1	5	1789233924	1789353189	119265	991.93	546.26	79	17	-1	12.42	12.42
Fixation R	1	5	1789233924	1789353189	119265	991.93	546.26	79	17	-1	11.87	11.87
Saccade L	1	5	1789353189	1789452672	99483	999.35	552.00	989.51	572.07	0.76	15.30	0.60	7.69	177.84	-242.36	112.99
Saccade R	1	4	1789353189	1789452672	99483	999.35	552.00	989.51	572.07	0.76	15.30	0.60	7.69	177.84	-242.36	112.99
