[BeGaze]
Converted from:	C:\Documents and Settings\iViewX\Desktop\EXPERIMENTATIONS\Experiments\results\finaleart\S5121332-finaleart-1.idf
Date:	27.03.2019 15:34:53
Version:	BeGaze 2.5.77
Sample Rate:	50
Subject:	S5121332
Description:	Dylan Marinho

Table Header for Fixations:
Event Type	Trial	Number	Start	End	Duration	Location X	Location Y	Dispersion X	Dispersion Y	Plane	Avg. Pupil Size X	Avg. Pupil Size Y

Table Header for Saccades:
Event Type	Trial	Number	Start	End	Duration	Start Loc.X	Start Loc.Y	End Loc.X	End Loc.Y	Amplitude	Peak Speed	Peak Speed At	Average Speed	Peak Accel.	Peak Decel.	Average Accel.

Table Header for Blinks:
Event Type	Trial	Number	Start	End	Duration

Table Header for User Events:
Event Type	Trial	Number	Start	Description

UserEvent	1	1	8956079483	# Message: REJECTED_after-the-bath_degas_1885.jpg
Fixation L	1	1	8956088548	8956466529	377981	894.03	586.99	45	30	-1	14.53	14.53
Fixation R	1	1	8956088548	8956466529	377981	894.03	586.99	45	30	-1	14.27	14.27
Blink L	1	1	8956466529	8956625639	159110
Blink R	1	1	8956466529	8956625639	159110
Saccade L	1	1	8956625639	8956745014	119375	856.19	509.67	393.75	455.83	7.32	259.07	0.83	61.32	6379.24	-6378.06	2569.81
Saccade R	1	1	8956625639	8956745014	119375	856.19	509.67	393.75	455.83	7.32	259.07	0.83	61.32	6379.24	-6378.06	2569.81
Fixation L	1	2	8956745014	8957142750	397736	400.06	461.46	35	35	-1	15.62	15.62
Fixation R	1	2	8956745014	8957142750	397736	400.06	461.46	35	35	-1	15.41	15.41
Saccade L	1	2	8957142750	8957162608	19858	405.85	472.87	328.72	472.86	0.48	78.03	1.00	24.38	1936.30	-1815.26	1269.26
Saccade R	1	2	8957142750	8957162608	19858	405.85	472.87	328.72	472.86	0.48	78.03	1.00	24.38	1936.30	-1815.26	1269.26
Fixation L	1	3	8957162608	8957321720	159112	324.49	477.25	69	8	-1	15.83	15.83
Fixation R	1	3	8957162608	8957321720	159112	324.49	477.25	69	8	-1	15.83	15.83
Saccade L	1	3	8957321720	8957361466	39746	382.76	473.98	751.12	476.53	3.59	292.09	0.50	90.29	7232.45	-7134.30	4097.75
Saccade R	1	3	8957321720	8957361466	39746	382.76	473.98	751.12	476.53	3.59	292.09	0.50	90.29	7232.45	-7134.30	4097.75
Fixation L	1	4	8957361466	8957620083	258617	758.09	464.15	10	19	-1	16.15	16.15
Fixation R	1	4	8957361466	8957620083	258617	758.09	464.15	10	19	-1	16.21	16.21
Saccade L	1	4	8957620083	8957659822	39739	755.67	462.25	1003.58	546.78	2.36	146.13	0.50	59.37	3572.18	-3180.26	3202.73
Saccade R	1	4	8957620083	8957659822	39739	755.67	462.25	1003.58	546.78	2.36	146.13	0.50	59.37	3572.18	-3180.26	3202.73
Fixation L	1	5	8957659822	8957779196	119374	1018.01	538.61	20	21	-1	16.45	16.45
Fixation R	1	5	8957659822	8957779196	119374	1018.01	538.61	20	21	-1	16.37	16.37
Blink L	1	2	8957779196	8957878693	99497
Blink R	1	2	8957779196	8957878693	99497
Fixation L	1	6	8957878693	8958316164	437471	1097.85	557.06	34	24	-1	16.62	16.62
Fixation R	1	6	8957878693	8958316164	437471	1097.85	557.06	34	24	-1	16.56	16.56
Saccade L	1	5	8958316164	8958336161	19997	1071.19	547.60	979.83	467.79	0.81	122.70	1.00	40.43	3051.66	-2944.78	2117.20
Saccade R	1	5	8958316164	8958336161	19997	1071.19	547.60	979.83	467.79	0.81	122.70	1.00	40.43	3051.66	-2944.78	2117.20
Fixation L	1	7	8958336161	8958733876	397715	981.00	462.33	12	21	-1	16.83	16.83
Fixation R	1	7	8958336161	8958733876	397715	981.00	462.33	12	21	-1	16.90	16.90
Saccade L	1	6	8958733876	8958753766	19890	975.46	477.74	863.08	572.14	0.87	148.44	1.00	43.56	3696.37	-3542.44	2477.24
Saccade R	1	6	8958733876	8958753766	19890	975.46	477.74	863.08	572.14	0.87	148.44	1.00	43.56	3696.37	-3542.44	2477.24
Fixation L	1	8	8958753766	8959071990	318224	851.99	590.21	18	37	-1	16.63	16.63
Fixation R	1	8	8958753766	8959071990	318224	851.99	590.21	18	37	-1	16.77	16.77
Saccade L	1	7	8959071990	8959091872	19882	844.44	609.34	827.41	771.37	0.98	164.78	1.00	49.48	4082.45	-3944.96	2755.13
Saccade R	1	7	8959071990	8959091872	19882	844.44	609.34	827.41	771.37	0.98	164.78	1.00	49.48	4082.45	-3944.96	2755.13
Fixation L	1	9	8959091872	8959449971	358099	805.77	780.01	28	15	-1	16.63	16.63
Fixation R	1	9	8959091872	8959449971	358099	805.77	780.01	28	15	-1	16.86	16.86
Blink L	1	3	8959449971	8959569211	119240
Blink R	1	3	8959449971	8959569211	119240
Fixation L	1	10	8959569211	8959847695	278484	838.26	526.63	15	18	-1	16.54	16.54
Fixation R	1	10	8959569211	8959847695	278484	838.26	526.63	15	18	-1	16.83	16.83
