[BeGaze]
Converted from:	C:\Documents and Settings\iViewX\Desktop\EXPERIMENTATIONS\Experiments\results\finaleart\S14F27123-finaleart-1.idf
Date:	27.03.2019 15:43:24
Version:	BeGaze 2.5.77
Sample Rate:	50
Subject:	S14F27123
Description:	Anne-flore Perrin

Table Header for Fixations:
Event Type	Trial	Number	Start	End	Duration	Location X	Location Y	Dispersion X	Dispersion Y	Plane	Avg. Pupil Size X	Avg. Pupil Size Y

Table Header for Saccades:
Event Type	Trial	Number	Start	End	Duration	Start Loc.X	Start Loc.Y	End Loc.X	End Loc.Y	Amplitude	Peak Speed	Peak Speed At	Average Speed	Peak Accel.	Peak Decel.	Average Accel.

Table Header for Blinks:
Event Type	Trial	Number	Start	End	Duration

Table Header for User Events:
Event Type	Trial	Number	Start	Description

UserEvent	1	1	30935222676	# Message: les-deux-amies_marevna_0.jpg
Fixation L	1	1	30935228762	30935666383	437621	857.45	765.99	15	28	-1	12.51	12.51
Fixation R	1	1	30935228762	30935666383	437621	857.45	765.99	15	28	-1	12.58	12.58
Saccade L	1	1	30935666383	30935706113	39730	860.86	755.69	1012.69	556.37	2.36	148.58	1.00	59.32	3645.69	-3505.53	3402.67
Saccade R	1	1	30935666383	30935706113	39730	860.86	755.69	1012.69	556.37	2.36	148.58	1.00	59.32	3645.69	-3505.53	3402.67
Fixation L	1	2	30935706113	30935904975	198862	1017.45	522.29	10	83	-1	11.36	11.36
Fixation R	1	2	30935706113	30935904975	198862	1017.45	522.29	10	83	-1	11.40	11.40
Saccade L	1	2	30935904975	30935964725	59750	1018.45	509.59	1216.60	355.49	3.29	170.12	0.67	55.08	4206.37	-3467.41	2293.44
Saccade R	1	2	30935904975	30935964725	59750	1018.45	509.59	1216.60	355.49	3.29	170.12	0.67	55.08	4206.37	-3467.41	2293.44
Fixation L	1	3	30935964725	30936123845	159120	1218.55	325.02	10	37	-1	9.45	9.45
Fixation R	1	3	30935964725	30936123845	159120	1218.55	325.02	10	37	-1	9.82	9.82
Saccade L	1	3	30936123845	30936163592	39747	1224.11	318.25	1476.49	235.35	2.52	136.37	0.50	63.44	3290.74	-3033.80	2992.05
Saccade R	1	3	30936123845	30936163592	39747	1224.11	318.25	1476.49	235.35	2.52	136.37	0.50	63.44	3290.74	-3033.80	2992.05
Fixation L	1	4	30936163592	30936402333	238741	1459.53	261.60	24	48	-1	9.64	9.64
Fixation R	1	4	30936163592	30936402333	238741	1459.53	261.60	24	48	-1	9.96	9.96
Saccade L	1	4	30936402333	30936442081	39748	1453.91	268.37	1574.49	454.91	2.74	187.77	1.00	69.00	4611.73	-4377.27	3761.19
Saccade R	1	4	30936402333	30936442081	39748	1453.91	268.37	1574.49	454.91	2.74	187.77	1.00	69.00	4611.73	-4377.27	3761.19
Fixation L	1	5	30936442081	30936760317	318236	1560.71	467.09	25	18	-1	10.61	10.61
Fixation R	1	5	30936442081	30936760317	318236	1560.71	467.09	25	18	-1	10.52	10.52
Saccade L	1	5	30936760317	30936800069	39752	1558.25	462.94	1161.70	761.49	4.39	374.64	0.50	110.50	9144.91	-8622.49	5814.58
Saccade R	1	5	30936760317	30936800069	39752	1558.25	462.94	1161.70	761.49	4.39	374.64	0.50	110.50	9144.91	-8622.49	5814.58
Fixation L	1	6	30936800069	30937058688	258619	1163.34	735.99	37	50	-1	11.32	11.32
Fixation R	1	6	30936800069	30937058688	258619	1163.34	735.99	37	50	-1	11.37	11.37
Saccade L	1	6	30937058688	30937078551	19863	1134.32	738.46	948.71	760.56	1.23	189.03	1.00	61.88	4690.13	-4511.90	3218.94
Saccade R	1	6	30937058688	30937078551	19863	1134.32	738.46	948.71	760.56	1.23	189.03	1.00	61.88	4690.13	-4511.90	3218.94
Fixation L	1	7	30937078551	30937357046	278495	940.03	775.80	13	68	-1	11.41	11.41
Fixation R	1	7	30937078551	30937357046	278495	940.03	775.80	13	68	-1	11.49	11.49
Saccade L	1	7	30937357046	30937396795	39749	935.19	809.56	574.19	970.07	3.97	300.55	1.00	99.88	7367.58	-6792.39	4380.98
Saccade R	1	7	30937357046	30937396795	39749	935.19	809.56	574.19	970.07	3.97	300.55	1.00	99.88	7367.58	-6792.39	4380.98
Fixation L	1	8	30937396795	30937496289	99494	625.53	950.67	71	27	-1	15.97	15.97
Fixation R	1	8	30937396795	30937496289	99494	625.53	950.67	71	27	-1	11.66	11.66
Saccade L	1	8	30937496289	30937635397	139108	643.59	944.66	355.49	945.56	5.38	184.84	1.00	38.65	4501.43	-4010.41	1646.99
Saccade R	1	8	30937496289	30937635397	139108	643.59	944.66	355.49	945.56	5.38	184.84	1.00	38.65	4501.43	-4010.41	1646.99
Fixation L	1	9	30937635397	30937754772	119375	346.29	967.18	28	45	-1	16.56	16.56
Fixation R	1	9	30937635397	30937754772	119375	346.29	967.18	28	45	-1	12.13	12.13
Saccade L	1	9	30937754772	30937814528	59756	340.02	955.31	430.65	344.81	7.02	368.01	0.67	117.47	8918.86	-8209.03	5150.43
Saccade R	1	9	30937754772	30937814528	59756	340.02	955.31	430.65	344.81	7.02	368.01	0.67	117.47	8918.86	-8209.03	5150.43
Fixation L	1	10	30937814528	30937913894	99366	452.08	327.79	33	46	-1	12.14	12.14
Fixation R	1	10	30937814528	30937913894	99366	452.08	327.79	33	46	-1	11.94	11.94
Saccade L	1	10	30937913894	30937933787	19893	463.82	351.74	472.95	175.39	1.17	178.58	1.00	58.82	3779.25	-4089.48	2623.62
Saccade R	1	10	30937913894	30937933787	19893	463.82	351.74	472.95	175.39	1.17	178.58	1.00	58.82	3779.25	-4089.48	2623.62
Fixation L	1	11	30937933787	30938172502	238715	470.70	173.61	22	28	-1	12.00	12.00
Fixation R	1	11	30937933787	30938172502	238715	470.70	173.61	22	28	-1	12.05	12.05
Saccade L	1	11	30938172502	30938212252	39750	485.70	178.11	1141.49	159.31	5.63	435.86	0.50	141.63	10449.55	-10645.60	8032.05
Saccade R	1	11	30938172502	30938212252	39750	485.70	178.11	1141.49	159.31	5.63	435.86	0.50	141.63	10449.55	-10645.60	8032.05
Fixation L	1	12	30938212252	30938411125	198873	1142.02	168.80	18	27	-1	12.92	12.92
Fixation R	1	12	30938212252	30938411125	198873	1142.02	168.80	18	27	-1	12.69	12.69
Saccade L	1	12	30938411125	30938470881	59756	1149.71	174.88	407.71	122.85	8.19	415.97	0.67	137.09	10357.73	-9204.97	6425.82
Saccade R	1	12	30938411125	30938470881	59756	1149.71	174.88	407.71	122.85	8.19	415.97	0.67	137.09	10357.73	-9204.97	6425.82
Fixation L	1	13	30938470881	30938828847	357966	389.24	128.38	33	56	-1	12.67	12.67
Fixation R	1	13	30938470881	30938828847	357966	389.24	128.38	33	56	-1	12.09	12.09
Saccade L	1	13	30938828847	30938848731	19884	403.67	111.24	414.37	173.69	0.57	64.09	1.00	28.49	1486.03	-929.25	1150.45
Saccade R	1	13	30938828847	30938848731	19884	403.67	111.24	414.37	173.69	0.57	64.09	1.00	28.49	1486.03	-929.25	1150.45
Fixation L	1	14	30938848731	30939186834	338103	421.32	134.31	16	67	-1	13.11	13.11
Fixation R	1	14	30938848731	30939186834	338103	421.32	134.31	16	67	-1	12.61	12.61
Saccade L	1	14	30939186834	30939206835	20001	415.63	109.53	663.04	197.74	1.87	265.53	1.00	93.29	6427.85	0.00	3213.92
Saccade R	1	14	30939186834	30939206835	20001	415.63	109.53	663.04	197.74	1.87	265.53	1.00	93.29	6427.85	0.00	3213.92
