[BeGaze]
Converted from:	C:\Documents and Settings\iViewX\Desktop\EXPERIMENTATIONS\Experiments\results\finaleart\S9H29221-finaleart-1.idf
Date:	27.03.2019 16:02:16
Version:	BeGaze 2.5.77
Sample Rate:	50
Subject:	S9H29221
Description:	steven

Table Header for Fixations:
Event Type	Trial	Number	Start	End	Duration	Location X	Location Y	Dispersion X	Dispersion Y	Plane	Avg. Pupil Size X	Avg. Pupil Size Y

Table Header for Saccades:
Event Type	Trial	Number	Start	End	Duration	Start Loc.X	Start Loc.Y	End Loc.X	End Loc.Y	Amplitude	Peak Speed	Peak Speed At	Average Speed	Peak Accel.	Peak Decel.	Average Accel.

Table Header for Blinks:
Event Type	Trial	Number	Start	End	Duration

Table Header for User Events:
Event Type	Trial	Number	Start	Description

UserEvent	1	1	5733840502	# Message: Naked_man_reversed_on_the_ground_Gericault_1817.jpg
Fixation L	1	1	5733849980	5734009099	159119	1133.56	511.16	45	6	-1	15.47	15.47
Fixation R	1	1	5733849980	5734009099	159119	1133.56	511.16	45	6	-1	15.03	15.03
Saccade L	1	1	5734009099	5734028970	19871	1094.63	515.32	1056.67	532.18	0.45	45.44	0.00	22.60	1016.32	-1095.85	1021.43
Saccade R	1	1	5734009099	5734028970	19871	1094.63	515.32	1056.67	532.18	0.45	45.44	0.00	22.60	1016.32	-1095.85	1021.43
Fixation L	1	2	5734028970	5734725173	696203	1041.75	527.80	72	26	-1	15.18	15.18
Fixation R	1	2	5734028970	5734725173	696203	1041.75	527.80	72	26	-1	15.25	15.25
Saccade L	1	2	5734725173	5734765886	40713	985.31	510.53	976.94	506.50	0.35	16.40	1.00	8.58	-119.49	-175.06	147.17
Saccade R	1	2	5734725173	5734765886	40713	985.31	510.53	976.94	506.50	0.35	16.40	1.00	8.58	-119.49	-175.06	147.17
Fixation L	1	3	5734765886	5735063285	297399	981.41	485.73	42	50	-1	13.46	13.46
Fixation R	1	3	5734765886	5735063285	297399	981.41	485.73	42	50	-1	13.63	13.63
Saccade L	1	3	5735063285	5735083176	19891	1016.39	457.60	1020.85	454.71	0.24	28.17	1.00	11.99	633.52	-569.62	426.36
Saccade R	1	3	5735063285	5735083176	19891	1016.39	457.60	1020.85	454.71	0.24	28.17	1.00	11.99	633.52	-569.62	426.36
Fixation L	1	4	5735083176	5735500887	417711	981.53	432.26	53	33	-1	12.54	12.54
Fixation R	1	4	5735083176	5735500887	417711	981.53	432.26	53	33	-1	12.83	12.83
Saccade L	1	4	5735500887	5735540635	39748	976.67	425.77	778.98	605.57	2.38	179.13	1.00	59.95	4472.83	-4208.06	3457.67
Saccade R	1	4	5735500887	5735540635	39748	976.67	425.77	778.98	605.57	2.38	179.13	1.00	59.95	4472.83	-4208.06	3457.67
Fixation L	1	5	5735540635	5735799273	258638	793.18	612.73	69	26	-1	12.68	12.68
Fixation R	1	5	5735540635	5735799273	258638	793.18	612.73	69	26	-1	12.98	12.98
Saccade L	1	5	5735799273	5735819121	19848	847.89	599.40	853.38	596.26	0.27	36.62	1.00	13.56	-18.30	-755.54	321.80
Saccade R	1	5	5735799273	5735819121	19848	847.89	599.40	853.38	596.26	0.27	36.62	1.00	13.56	-18.30	-755.54	321.80
Fixation L	1	6	5735819121	5735938371	119250	852.34	594.22	1	8	-1	12.76	12.76
Fixation R	1	6	5735819121	5735938371	119250	852.34	594.22	1	8	-1	13.23	13.23
Saccade L	1	6	5735938371	5735998132	59761	852.64	588.98	631.28	285.64	4.45	170.88	0.67	74.49	4052.74	-3694.33	2809.95
Saccade R	1	6	5735938371	5735998132	59761	852.64	588.98	631.28	285.64	4.45	170.88	0.67	74.49	4052.74	-3694.33	2809.95
Fixation L	1	7	5735998132	5736177104	178972	627.48	306.25	38	27	-1	12.29	12.29
Fixation R	1	7	5735998132	5736177104	178972	627.48	306.25	38	27	-1	12.66	12.66
Saccade L	1	7	5736177104	5736196977	19873	596.95	297.56	519.23	241.26	0.80	97.07	1.00	40.30	2361.72	-2349.62	1738.70
Saccade R	1	7	5736177104	5736196977	19873	596.95	297.56	519.23	241.26	0.80	97.07	1.00	40.30	2361.72	-2349.62	1738.70
Fixation L	1	8	5736196977	5736435725	238748	511.37	233.76	29	46	-1	11.85	11.85
Fixation R	1	8	5736196977	5736435725	238748	511.37	233.76	29	46	-1	12.58	12.58
Saccade L	1	8	5736435725	5736475467	39742	532.50	271.35	760.95	585.63	3.86	304.67	0.50	97.08	7567.67	-6680.55	4390.25
Saccade R	1	8	5736435725	5736475467	39742	532.50	271.35	760.95	585.63	3.86	304.67	0.50	97.08	7567.67	-6680.55	4390.25
Fixation L	1	9	5736475467	5736873196	397729	731.33	566.07	42	30	-1	11.94	11.94
Fixation R	1	9	5736475467	5736873196	397729	731.33	566.07	42	30	-1	12.90	12.90
Saccade L	1	9	5736873196	5736913072	39876	735.50	563.22	1053.41	534.73	2.82	242.16	0.50	70.68	6005.88	-5764.70	3806.13
Saccade R	1	9	5736873196	5736913072	39876	735.50	563.22	1053.41	534.73	2.82	242.16	0.50	70.68	6005.88	-5764.70	3806.13
Fixation L	1	10	5736913072	5737370552	457480	1030.54	531.97	52	42	-1	11.87	11.87
Fixation R	1	10	5736913072	5737370552	457480	1030.54	531.97	52	42	-1	12.42	12.42
Saccade L	1	10	5737370552	5737390424	19872	1000.45	500.74	992.40	500.85	0.24	23.03	1.00	11.98	-114.67	-371.95	211.79
Saccade R	1	10	5737370552	5737390424	19872	1000.45	500.74	992.40	500.85	0.24	23.03	1.00	11.98	-114.67	-371.95	211.79
Fixation L	1	11	5737390424	5737668921	278497	978.07	496.85	21	13	-1	11.99	11.99
Fixation R	1	11	5737390424	5737668921	278497	978.07	496.85	21	13	-1	12.18	12.18
Saccade L	1	11	5737668921	5737887663	218742	977.06	488.67	538.90	408.86	33.22	777.21	0.27	151.86	14670.89	-19430.23	5988.22
Saccade R	1	11	5737668921	5737887663	218742	977.06	488.67	538.90	408.86	33.22	777.21	0.27	151.86	14670.89	-19430.23	5988.22
