[BeGaze]
Converted from:	C:\Documents and Settings\iViewX\Desktop\EXPERIMENTATIONS\Experiments\results\finaleart\S7121223-finaleart-1.idf
Date:	27.03.2019 15:36:52
Version:	BeGaze 2.5.77
Sample Rate:	50
Subject:	S7121223
Description:	Gregoire pacreau

Table Header for Fixations:
Event Type	Trial	Number	Start	End	Duration	Location X	Location Y	Dispersion X	Dispersion Y	Plane	Avg. Pupil Size X	Avg. Pupil Size Y

Table Header for Saccades:
Event Type	Trial	Number	Start	End	Duration	Start Loc.X	Start Loc.Y	End Loc.X	End Loc.Y	Amplitude	Peak Speed	Peak Speed At	Average Speed	Peak Accel.	Peak Decel.	Average Accel.

Table Header for Blinks:
Event Type	Trial	Number	Start	End	Duration

Table Header for User Events:
Event Type	Trial	Number	Start	Description

UserEvent	1	1	4330147755	# Message: garlic-cloves-and-knife-on-the-corner-of-a-table_caillebotte_1871.jpg
Fixation L	1	1	4330154881	4330572624	417743	859.87	561.26	13	14	-1	13.75	13.75
Fixation R	1	1	4330154881	4330572624	417743	859.87	561.26	13	14	-1	15.26	15.26
Saccade L	1	1	4330572624	4330592481	19857	869.52	569.25	879.24	670.60	0.69	102.98	1.00	34.84	2371.29	-2299.27	1590.37
Saccade R	1	1	4330572624	4330592481	19857	869.52	569.25	879.24	670.60	0.69	102.98	1.00	34.84	2371.29	-2299.27	1590.37
Fixation L	1	2	4330592481	4330791346	198865	880.55	662.67	53	44	-1	14.29	14.29
Fixation R	1	2	4330592481	4330791346	198865	880.55	662.67	53	44	-1	15.78	15.78
Saccade L	1	2	4330791346	4330811209	19863	843.86	677.49	837.58	669.30	0.35	24.83	1.00	17.54	29.97	-38.02	29.50
Saccade R	1	2	4330791346	4330811209	19863	843.86	677.49	837.58	669.30	0.35	24.83	1.00	17.54	29.97	-38.02	29.50
Fixation L	1	3	4330811209	4330910709	99500	855.77	672.56	24	22	-1	14.83	14.83
Fixation R	1	3	4330811209	4330910709	99500	855.77	672.56	24	22	-1	16.27	16.27
Saccade L	1	3	4330910709	4330950457	39748	860.85	671.74	1041.21	670.26	1.80	126.38	1.00	45.24	2734.37	-2913.51	1945.92
Saccade R	1	3	4330910709	4330950457	39748	860.85	671.74	1041.21	670.26	1.80	126.38	1.00	45.24	2734.37	-2913.51	1945.92
Fixation L	1	4	4330950457	4331129446	178989	1044.44	672.13	21	17	-1	15.05	15.05
Fixation R	1	4	4330950457	4331129446	178989	1044.44	672.13	21	17	-1	16.27	16.27
Saccade L	1	4	4331129446	4331149330	19884	1057.16	678.89	1129.05	668.30	0.50	73.50	1.00	24.96	1705.87	-1793.63	1176.70
Saccade R	1	4	4331129446	4331149330	19884	1057.16	678.89	1129.05	668.30	0.50	73.50	1.00	24.96	1705.87	-1793.63	1176.70
Fixation L	1	5	4331149330	4331368187	218857	1137.18	659.48	14	17	-1	14.66	14.66
Fixation R	1	5	4331149330	4331368187	218857	1137.18	659.48	14	17	-1	15.66	15.66
Saccade L	1	5	4331368187	4331388058	19871	1143.53	652.89	1267.11	646.96	0.70	125.13	1.00	35.36	3110.17	-2942.74	2043.26
Saccade R	1	5	4331368187	4331388058	19871	1143.53	652.89	1267.11	646.96	0.70	125.13	1.00	35.36	3110.17	-2942.74	2043.26
Fixation L	1	6	4331388058	4331686431	298373	1277.32	630.34	16	25	-1	13.19	13.19
Fixation R	1	6	4331388058	4331686431	298373	1277.32	630.34	16	25	-1	14.17	14.17
Saccade L	1	6	4331686431	4331706286	19855	1282.00	626.19	1406.74	627.38	0.72	126.18	1.00	36.15	3088.14	-3088.74	2112.70
Saccade R	1	6	4331686431	4331706286	19855	1282.00	626.19	1406.74	627.38	0.72	126.18	1.00	36.15	3088.14	-3088.74	2112.70
Fixation L	1	7	4331706286	4331925032	218746	1414.80	651.87	11	39	-1	12.73	12.73
Fixation R	1	7	4331706286	4331925032	218746	1414.80	651.87	11	39	-1	13.23	13.23
Saccade L	1	7	4331925032	4331964777	39745	1417.11	658.78	1241.13	765.21	1.76	140.29	0.50	44.32	3479.66	-3364.22	2595.52
Saccade R	1	7	4331925032	4331964777	39745	1417.11	658.78	1241.13	765.21	1.76	140.29	0.50	44.32	3479.66	-3364.22	2595.52
Fixation L	1	8	4331964777	4332163769	198992	1231.65	773.66	12	15	-1	13.14	13.14
Fixation R	1	8	4331964777	4332163769	198992	1231.65	773.66	12	15	-1	13.72	13.72
Blink L	1	1	4332163769	4332342751	178982
Blink R	1	1	4332163769	4332342751	178982
Saccade L	1	8	4332342751	4332382505	39754	883.20	764.91	872.14	738.11	2.94	128.30	1.00	74.05	2241.71	-2609.85	1890.13
Saccade R	1	8	4332342751	4332382505	39754	883.20	764.91	872.14	738.11	2.94	128.30	1.00	74.05	2241.71	-2609.85	1890.13
Fixation L	1	9	4332382505	4332521740	139235	867.60	746.94	6	28	-1	16.86	16.86
Fixation R	1	9	4332382505	4332521740	139235	867.60	746.94	6	28	-1	14.53	14.53
Saccade L	1	9	4332521740	4332561498	39758	867.72	766.44	601.41	717.69	2.59	177.62	0.50	65.13	4030.32	-4243.76	3049.55
Saccade R	1	9	4332521740	4332561498	39758	867.72	766.44	601.41	717.69	2.59	177.62	0.50	65.13	4030.32	-4243.76	3049.55
Fixation L	1	10	4332561498	4332939351	377853	609.21	689.02	39	56	-1	16.64	16.64
Fixation R	1	10	4332561498	4332939351	377853	609.21	689.02	39	56	-1	15.10	15.10
Saccade L	1	10	4332939351	4332959232	19881	634.32	711.29	638.52	729.53	0.22	18.94	1.00	10.99	190.15	-350.26	181.58
Saccade R	1	10	4332939351	4332959232	19881	634.32	711.29	638.52	729.53	0.22	18.94	1.00	10.99	190.15	-350.26	181.58
Fixation L	1	11	4332959232	4333118335	159103	650.71	743.84	62	22	-1	17.40	17.40
Fixation R	1	11	4332959232	4333118335	159103	650.71	743.84	62	22	-1	15.82	15.82
Saccade L	1	11	4333118335	4333158215	39880	701.40	752.26	1052.38	789.33	3.44	243.58	0.50	86.20	5965.67	-5723.37	3828.66
Saccade R	1	11	4333118335	4333158215	39880	701.40	752.26	1052.38	789.33	3.44	243.58	0.50	86.20	5965.67	-5723.37	3828.66
Fixation L	1	12	4333158215	4333376949	218734	1047.30	795.29	11	28	-1	17.99	17.99
Fixation R	1	12	4333158215	4333376949	218734	1047.30	795.29	11	28	-1	16.26	16.26
Saccade L	1	12	4333376949	4333416714	39765	1043.10	799.76	1393.91	783.63	3.16	204.76	0.50	79.53	4972.60	-4893.51	4598.23
Saccade R	1	12	4333376949	4333416714	39765	1043.10	799.76	1393.91	783.63	3.16	204.76	0.50	79.53	4972.60	-4893.51	4598.23
Fixation L	1	13	4333416714	4333655437	238723	1396.25	781.32	5	24	-1	18.30	18.30
Fixation R	1	13	4333416714	4333655437	238723	1396.25	781.32	5	24	-1	15.40	15.40
Saccade L	1	13	4333655437	4333675312	19875	1398.14	775.13	1406.03	658.98	0.66	117.76	1.00	33.25	2917.25	-2665.26	1961.42
Saccade R	1	13	4333655437	4333675312	19875	1398.14	775.13	1406.03	658.98	0.66	117.76	1.00	33.25	2917.25	-2665.26	1961.42
Fixation L	1	14	4333675312	4333953821	278509	1414.20	641.72	27	62	-1	18.04	18.04
Fixation R	1	14	4333675312	4333953821	278509	1414.20	641.72	27	62	-1	15.07	15.07
Saccade L	1	14	4333953821	4333973666	19845	1401.34	644.05	1386.38	650.26	0.33	27.50	1.00	16.78	171.47	-311.33	253.51
Saccade R	1	14	4333953821	4333973666	19845	1401.34	644.05	1386.38	650.26	0.33	27.50	1.00	16.78	171.47	-311.33	253.51
Fixation L	1	15	4333973666	4334132793	159127	1368.05	635.54	52	32	-1	17.36	17.36
Fixation R	1	15	4333973666	4334132793	159127	1368.05	635.54	52	32	-1	14.81	14.81
