[BeGaze]
Converted from:	C:\Documents and Settings\iViewX\Desktop\EXPERIMENTATIONS\Experiments\results\finaleart\S4120113-finaleart-1.idf
Date:	27.03.2019 15:34:43
Version:	BeGaze 2.5.77
Sample Rate:	50
Subject:	S4120113
Description:	Vidal Attias

Table Header for Fixations:
Event Type	Trial	Number	Start	End	Duration	Location X	Location Y	Dispersion X	Dispersion Y	Plane	Avg. Pupil Size X	Avg. Pupil Size Y

Table Header for Saccades:
Event Type	Trial	Number	Start	End	Duration	Start Loc.X	Start Loc.Y	End Loc.X	End Loc.Y	Amplitude	Peak Speed	Peak Speed At	Average Speed	Peak Accel.	Peak Decel.	Average Accel.

Table Header for Blinks:
Event Type	Trial	Number	Start	End	Duration

Table Header for User Events:
Event Type	Trial	Number	Start	Description

UserEvent	1	1	7716068607	# Message: reclining-nude_bazille_1860.jpg
Fixation L	1	1	7716070994	7716468755	397761	1004.84	494.75	8	37	-1	15.08	15.08
Fixation R	1	1	7716070994	7716468755	397761	1004.84	494.75	8	37	-1	15.36	15.36
Saccade L	1	1	7716468755	7716508472	39717	1002.59	494.07	900.36	692.92	2.07	148.31	0.50	52.12	3557.98	-3323.96	2680.47
Saccade R	1	1	7716468755	7716508472	39717	1002.59	494.07	900.36	692.92	2.07	148.31	0.50	52.12	3557.98	-3323.96	2680.47
Fixation L	1	2	7716508472	7716806814	298342	879.89	685.06	67	32	-1	15.58	15.58
Fixation R	1	2	7716508472	7716806814	298342	879.89	685.06	67	32	-1	15.85	15.85
Saccade L	1	2	7716806814	7716826692	19878	833.18	680.53	617.40	686.59	1.69	218.28	1.00	85.21	5389.79	-5350.57	3861.27
Saccade R	1	2	7716806814	7716826692	19878	833.18	680.53	617.40	686.59	1.69	218.28	1.00	85.21	5389.79	-5350.57	3861.27
Fixation L	1	3	7716826692	7717025680	198988	550.78	676.59	75	14	-1	14.42	14.42
Fixation R	1	3	7716826692	7717025680	198988	550.78	676.59	75	14	-1	14.59	14.59
Saccade L	1	3	7717025680	7717045553	19873	543.78	673.20	543.69	659.40	0.10	13.96	1.00	4.95	269.95	-254.97	191.05
Saccade R	1	3	7717025680	7717045553	19873	543.78	673.20	543.69	659.40	0.10	13.96	1.00	4.95	269.95	-254.97	191.05
Fixation L	1	4	7717045553	7717980375	934822	544.15	669.87	48	40	-1	13.66	13.66
Fixation R	1	4	7717045553	7717980375	934822	544.15	669.87	48	40	-1	14.80	14.80
Saccade L	1	4	7717980375	7718039987	59612	581.29	684.20	1333.84	744.53	7.95	326.53	0.33	133.33	8133.49	-6953.17	5891.02
Saccade R	1	4	7717980375	7718039987	59612	581.29	684.20	1333.84	744.53	7.95	326.53	0.33	133.33	8133.49	-6953.17	5891.02
Fixation L	1	5	7718039987	7718278731	238744	1329.93	755.49	12	16	-1	15.48	15.48
Fixation R	1	5	7718039987	7718278731	238744	1329.93	755.49	12	16	-1	15.35	15.35
Saccade L	1	5	7718278731	7718298609	19878	1328.26	760.92	1573.93	767.73	1.48	248.47	1.00	74.30	6035.26	-5137.06	3966.98
Saccade R	1	5	7718278731	7718298609	19878	1328.26	760.92	1573.93	767.73	1.48	248.47	1.00	74.30	6035.26	-5137.06	3966.98
Fixation L	1	6	7718298609	7718497478	198869	1608.19	791.19	50	43	-1	14.73	14.73
Fixation R	1	6	7718298609	7718497478	198869	1608.19	791.19	50	43	-1	13.78	13.78
Saccade L	1	6	7718497478	7718517343	19865	1622.70	811.00	1626.65	815.15	0.25	18.93	0.00	12.71	-69.02	-285.42	201.76
Saccade R	1	6	7718497478	7718517343	19865	1622.70	811.00	1626.65	815.15	0.25	18.93	0.00	12.71	-69.02	-285.42	201.76
Fixation L	1	7	7718517343	7719014562	497219	1613.37	814.23	31	21	-1	14.91	14.91
Fixation R	1	7	7718517343	7719014562	497219	1613.37	814.23	31	21	-1	13.94	13.94
Blink L	1	1	7719014562	7719213540	198978
Blink R	1	1	7719014562	7719213540	198978
Fixation L	1	8	7719213540	7719611273	397733	718.00	762.23	30	63	-1	14.47	14.47
Fixation R	1	8	7719213540	7719611273	397733	718.00	762.23	30	63	-1	15.16	15.16
Saccade L	1	7	7719611273	7719631156	19883	711.71	733.48	512.51	640.88	1.30	222.12	1.00	65.36	5401.69	-5345.49	3670.78
Saccade R	1	7	7719611273	7719631156	19883	711.71	733.48	512.51	640.88	1.30	222.12	1.00	65.36	5401.69	-5345.49	3670.78
Fixation L	1	9	7719631156	7720068743	437587	488.39	653.84	32	27	-1	12.38	12.38
Fixation R	1	9	7719631156	7720068743	437587	488.39	653.84	32	27	-1	13.59	13.59
