[BeGaze]
Converted from:	C:\Documents and Settings\iViewX\Desktop\EXPERIMENTATIONS\Experiments\results\finaleart\S19F21442-finaleart-1.idf
Date:	27.03.2019 15:51:15
Version:	BeGaze 2.5.77
Sample Rate:	50
Subject:	S19F21442
Description:	Juliette Veuillez

Table Header for Fixations:
Event Type	Trial	Number	Start	End	Duration	Location X	Location Y	Dispersion X	Dispersion Y	Plane	Avg. Pupil Size X	Avg. Pupil Size Y

Table Header for Saccades:
Event Type	Trial	Number	Start	End	Duration	Start Loc.X	Start Loc.Y	End Loc.X	End Loc.Y	Amplitude	Peak Speed	Peak Speed At	Average Speed	Peak Accel.	Peak Decel.	Average Accel.

Table Header for Blinks:
Event Type	Trial	Number	Start	End	Duration

Table Header for User Events:
Event Type	Trial	Number	Start	Description

UserEvent	1	1	7185618526	# Message: goya-Bodegones-con-pargos-dorados-1812.jpg
Fixation L	1	1	7185627812	7186085270	457458	983.44	585.13	14	58	-1	12.33	12.33
Fixation R	1	1	7185627812	7186085270	457458	983.44	585.13	14	58	-1	13.31	13.31
Saccade L	1	1	7186085270	7186125031	39761	976.46	633.01	1251.78	665.51	2.65	167.36	0.50	66.73	4144.53	-4090.47	3148.55
Saccade R	1	1	7186085270	7186125031	39761	976.46	633.01	1251.78	665.51	2.65	167.36	0.50	66.73	4144.53	-4090.47	3148.55
Fixation L	1	2	7186125031	7186304132	179101	1265.01	666.97	45	28	-1	12.38	12.38
Fixation R	1	2	7186125031	7186304132	179101	1265.01	666.97	45	28	-1	13.49	13.49
Saccade L	1	2	7186304132	7186343882	39750	1236.12	647.87	870.76	544.97	3.59	267.73	0.50	90.42	6612.95	-6336.76	4330.03
Saccade R	1	2	7186304132	7186343882	39750	1236.12	647.87	870.76	544.97	3.59	267.73	0.50	90.42	6612.95	-6336.76	4330.03
Fixation L	1	3	7186343882	7186582502	238620	874.57	547.40	7	25	-1	12.12	12.12
Fixation R	1	3	7186343882	7186582502	238620	874.57	547.40	7	25	-1	13.24	13.24
Saccade L	1	3	7186582502	7186622369	39867	876.71	561.61	1180.13	804.55	3.50	213.44	0.50	87.76	5293.33	-4737.39	4811.70
Saccade R	1	3	7186582502	7186622369	39867	876.71	561.61	1180.13	804.55	3.50	213.44	0.50	87.76	5293.33	-4737.39	4811.70
Fixation L	1	4	7186622369	7186801361	178992	1193.65	801.01	20	16	-1	12.66	12.66
Fixation R	1	4	7186622369	7186801361	178992	1193.65	801.01	20	16	-1	13.22	13.22
Saccade L	1	4	7186801361	7186821239	19878	1190.44	804.44	1300.10	806.02	0.93	110.93	1.00	46.56	2671.67	-2680.55	2359.76
Saccade R	1	4	7186801361	7186821239	19878	1190.44	804.44	1300.10	806.02	0.93	110.93	1.00	46.56	2671.67	-2680.55	2359.76
Fixation L	1	5	7186821239	7186920620	99381	1355.57	824.83	70	29	-1	12.78	12.78
Fixation R	1	5	7186821239	7186920620	99381	1355.57	824.83	70	29	-1	13.67	13.67
Saccade L	1	5	7186920620	7186940609	19989	1361.44	835.20	1358.74	843.50	0.12	9.55	1.00	5.84	-18.00	-124.72	66.97
Saccade R	1	5	7186920620	7186940609	19989	1361.44	835.20	1358.74	843.50	0.12	9.55	1.00	5.84	-18.00	-124.72	66.97
Fixation L	1	6	7186940609	7187079858	139249	1359.69	849.88	13	12	-1	12.76	12.76
Fixation R	1	6	7186940609	7187079858	139249	1359.69	849.88	13	12	-1	13.58	13.58
Saccade L	1	6	7187079858	7187139482	59624	1367.38	854.56	699.65	708.66	7.03	321.27	0.67	117.93	7940.42	-7881.62	5487.07
Saccade R	1	6	7187079858	7187139482	59624	1367.38	854.56	699.65	708.66	7.03	321.27	0.67	117.93	7940.42	-7881.62	5487.07
Fixation L	1	7	7187139482	7187318468	178986	690.62	707.13	16	10	-1	12.40	12.40
Fixation R	1	7	7187139482	7187318468	178986	690.62	707.13	16	10	-1	14.09	14.09
Saccade L	1	7	7187318468	7187338346	19878	683.16	704.54	597.10	699.63	0.61	87.20	1.00	30.51	2055.60	-1948.01	1502.28
Saccade R	1	7	7187318468	7187338346	19878	683.16	704.54	597.10	699.63	0.61	87.20	1.00	30.51	2055.60	-1948.01	1502.28
Fixation L	1	8	7187338346	7187557209	218863	568.66	696.14	43	16	-1	12.17	12.17
Fixation R	1	8	7187338346	7187557209	218863	568.66	696.14	43	16	-1	14.01	14.01
Saccade L	1	8	7187557209	7187596952	39743	553.26	685.46	589.12	811.53	1.57	95.21	0.50	39.56	2298.70	-1151.38	1242.93
Saccade R	1	8	7187557209	7187596952	39743	553.26	685.46	589.12	811.53	1.57	95.21	0.50	39.56	2298.70	-1151.38	1242.93
Fixation L	1	9	7187596952	7187775944	178992	609.43	850.04	26	49	-1	11.67	11.67
Fixation R	1	9	7187596952	7187775944	178992	609.43	850.04	26	49	-1	13.82	13.82
Saccade L	1	9	7187775944	7187815691	39747	613.45	856.05	1060.58	857.41	3.71	313.76	0.50	93.27	7797.42	-7657.69	5543.73
Saccade R	1	9	7187775944	7187815691	39747	613.45	856.05	1060.58	857.41	3.71	313.76	0.50	93.27	7797.42	-7657.69	5543.73
Fixation L	1	10	7187815691	7188074309	258618	1069.97	868.88	12	21	-1	12.52	12.52
Fixation R	1	10	7187815691	7188074309	258618	1069.97	868.88	12	21	-1	13.83	13.83
Saccade L	1	10	7188074309	7188133927	59618	1073.42	877.91	1599.79	1029.94	5.69	269.61	0.67	95.42	6726.08	-6537.72	4441.50
Saccade R	1	10	7188074309	7188133927	59618	1073.42	877.91	1599.79	1029.94	5.69	269.61	0.67	95.42	6726.08	-6537.72	4441.50
Fixation L	1	11	7188133927	7188511907	377980	1589.95	1016.42	35	40	-1	11.83	11.83
Fixation R	1	11	7188133927	7188511907	377980	1589.95	1016.42	35	40	-1	12.51	12.51
Saccade L	1	11	7188511907	7188551663	39756	1575.97	999.28	1214.69	470.57	5.96	382.49	0.50	149.95	9186.74	-8574.54	7509.83
Saccade R	1	11	7188511907	7188551663	39756	1575.97	999.28	1214.69	470.57	5.96	382.49	0.50	149.95	9186.74	-8574.54	7509.83
Fixation L	1	12	7188551663	7188790404	238741	1172.31	460.68	55	27	-1	12.00	12.00
Fixation R	1	12	7188551663	7188790404	238741	1172.31	460.68	55	27	-1	13.03	13.03
Saccade L	1	12	7188790404	7188830153	39749	1159.55	470.84	840.77	506.31	2.76	225.47	0.50	69.36	5563.74	-5356.85	3907.55
Saccade R	1	12	7188790404	7188830153	39749	1159.55	470.84	840.77	506.31	2.76	225.47	0.50	69.36	5563.74	-5356.85	3907.55
Fixation L	1	13	7188830153	7189168261	338108	839.81	530.58	12	39	-1	12.53	12.53
Fixation R	1	13	7188830153	7189168261	338108	839.81	530.58	12	39	-1	14.09	14.09
Saccade L	1	13	7189168261	7189208009	39748	843.48	538.79	585.76	370.33	2.60	225.69	0.50	65.41	5554.02	-5533.45	3819.01
Saccade R	1	13	7189168261	7189208009	39748	843.48	538.79	585.76	370.33	2.60	225.69	0.50	65.41	5554.02	-5533.45	3819.01
Fixation L	1	14	7189208009	7189605857	397848	588.44	355.87	7	31	-1	12.51	12.51
Fixation R	1	14	7189208009	7189605857	397848	588.44	355.87	7	31	-1	14.60	14.60
