[BeGaze]
Converted from:	C:\Documents and Settings\iViewX\Desktop\EXPERIMENTATIONS\Experiments\results\finaleart\S3121421-finaleart-1.idf
Date:	27.03.2019 15:34:03
Version:	BeGaze 2.5.77
Sample Rate:	50
Subject:	S3121421
Description:	Jean Jouve

Table Header for Fixations:
Event Type	Trial	Number	Start	End	Duration	Location X	Location Y	Dispersion X	Dispersion Y	Plane	Avg. Pupil Size X	Avg. Pupil Size Y

Table Header for Saccades:
Event Type	Trial	Number	Start	End	Duration	Start Loc.X	Start Loc.Y	End Loc.X	End Loc.Y	Amplitude	Peak Speed	Peak Speed At	Average Speed	Peak Accel.	Peak Decel.	Average Accel.

Table Header for Blinks:
Event Type	Trial	Number	Start	End	Duration

Table Header for User Events:
Event Type	Trial	Number	Start	Description

UserEvent	1	1	4903922556	# Message: Fleurs_et_fruits_camoin_1942.jpg
Fixation L	1	1	4903934145	4904809327	875182	1057.16	518.91	13	78	-1	12.77	12.77
Fixation R	1	1	4903934145	4904809327	875182	1057.16	518.91	13	78	-1	13.83	13.83
Saccade L	1	1	4904809327	4904829201	19874	1054.76	462.80	1038.29	324.06	0.88	141.31	1.00	44.49	3334.90	-2927.86	2166.30
Saccade R	1	1	4904809327	4904829201	19874	1054.76	462.80	1038.29	324.06	0.88	141.31	1.00	44.49	3334.90	-2927.86	2166.30
Fixation L	1	2	4904829201	4905028072	198871	1005.45	311.41	44	18	-1	11.79	11.79
Fixation R	1	2	4904829201	4905028072	198871	1005.45	311.41	44	18	-1	12.54	12.54
Saccade L	1	2	4905028072	4905067817	39745	993.36	307.38	849.22	619.49	3.01	196.91	0.50	75.70	4878.06	-4471.30	4215.59
Saccade R	1	2	4905028072	4905067817	39745	993.36	307.38	849.22	619.49	3.01	196.91	0.50	75.70	4878.06	-4471.30	4215.59
Fixation L	1	3	4905067817	4905306548	238731	846.11	640.39	7	34	-1	11.62	11.62
Fixation R	1	3	4905067817	4905306548	238731	846.11	640.39	7	34	-1	12.28	12.28
Saccade L	1	3	4905306548	4905366162	59614	849.51	637.62	1234.24	418.49	4.76	243.65	0.67	79.79	5954.42	-6018.41	3353.97
Saccade R	1	3	4905306548	4905366162	59614	849.51	637.62	1234.24	418.49	4.76	243.65	0.67	79.79	5954.42	-6018.41	3353.97
Fixation L	1	4	4905366162	4905604786	238624	1244.68	409.73	25	34	-1	11.33	11.33
Fixation R	1	4	4905366162	4905604786	238624	1244.68	409.73	25	34	-1	11.71	11.71
Saccade L	1	4	4905604786	4905644655	39869	1257.62	403.39	979.24	299.27	2.69	180.17	0.50	67.37	4386.26	-3898.57	3427.32
Saccade R	1	4	4905604786	4905644655	39869	1257.62	403.39	979.24	299.27	2.69	180.17	0.50	67.37	4386.26	-3898.57	3427.32
Fixation L	1	5	4905644655	4905982761	338106	957.59	267.03	30	44	-1	11.11	11.11
Fixation R	1	5	4905644655	4905982761	338106	957.59	267.03	30	44	-1	11.76	11.76
Saccade L	1	5	4905982761	4906002627	19866	954.21	267.63	920.57	251.25	0.24	37.85	1.00	12.04	907.01	-768.94	595.95
Saccade R	1	5	4905982761	4906002627	19866	954.21	267.63	920.57	251.25	0.24	37.85	1.00	12.04	907.01	-768.94	595.95
Fixation L	1	6	4906002627	4906161746	159119	909.71	247.35	22	7	-1	10.92	10.92
Fixation R	1	6	4906002627	4906161746	159119	909.71	247.35	22	7	-1	11.51	11.51
Saccade L	1	6	4906161746	4906201493	39747	914.77	245.89	1284.56	240.53	3.16	200.89	0.50	79.46	4973.91	-4917.55	4502.25
Saccade R	1	6	4906161746	4906201493	39747	914.77	245.89	1284.56	240.53	3.16	200.89	0.50	79.46	4973.91	-4917.55	4502.25
Fixation L	1	7	4906201493	4906380480	178987	1284.20	239.73	8	5	-1	11.10	11.10
Fixation R	1	7	4906201493	4906380480	178987	1284.20	239.73	8	5	-1	11.49	11.49
Saccade L	1	7	4906380480	4906420227	39747	1280.31	240.34	920.00	257.77	2.99	237.73	0.50	75.18	5888.03	-5816.27	4453.18
Saccade R	1	7	4906380480	4906420227	39747	1280.31	240.34	920.00	257.77	2.99	237.73	0.50	75.18	5888.03	-5816.27	4453.18
Fixation L	1	8	4906420227	4906698718	278491	928.90	276.33	11	32	-1	10.90	10.90
Fixation R	1	8	4906420227	4906698718	278491	928.90	276.33	11	32	-1	11.54	11.54
Saccade L	1	8	4906698718	4906758466	59748	931.63	290.07	859.10	662.48	4.39	201.03	0.33	73.54	5008.79	-2869.37	2981.59
Saccade R	1	8	4906698718	4906758466	59748	931.63	290.07	859.10	662.48	4.39	201.03	0.33	73.54	5008.79	-2869.37	2981.59
Fixation L	1	9	4906758466	4907116442	357976	851.85	628.27	21	60	-1	10.99	10.99
Fixation R	1	9	4906758466	4907116442	357976	851.85	628.27	21	60	-1	11.71	11.71
Saccade L	1	9	4907116442	4907136323	19881	858.35	601.49	877.58	455.04	1.01	149.40	1.00	50.72	3396.46	-3231.98	2510.67
Saccade R	1	9	4907116442	4907136323	19881	858.35	601.49	877.58	455.04	1.01	149.40	1.00	50.72	3396.46	-3231.98	2510.67
Fixation L	1	10	4907136323	4907613663	477340	895.54	458.53	31	22	-1	10.58	10.58
Fixation R	1	10	4907136323	4907613663	477340	895.54	458.53	31	22	-1	11.57	11.57
Saccade L	1	10	4907613663	4907653406	39743	908.90	472.24	647.82	446.09	2.24	161.30	0.50	56.24	4006.68	-3856.01	3250.45
Saccade R	1	10	4907613663	4907653406	39743	908.90	472.24	647.82	446.09	2.24	161.30	0.50	56.24	4006.68	-3856.01	3250.45
Fixation L	1	11	4907653406	4907912016	258610	655.14	433.77	13	32	-1	10.20	10.20
Fixation R	1	11	4907653406	4907912016	258610	655.14	433.77	13	32	-1	11.42	11.42
