[BeGaze]
Converted from:	C:\Documents and Settings\iViewX\Desktop\EXPERIMENTATIONS\Experiments\results\finaleart\S20H24222-finaleart-1.idf
Date:	27.03.2019 15:52:08
Version:	BeGaze 2.5.77
Sample Rate:	50
Subject:	S20H24222
Description:	Hugo Brument

Table Header for Fixations:
Event Type	Trial	Number	Start	End	Duration	Location X	Location Y	Dispersion X	Dispersion Y	Plane	Avg. Pupil Size X	Avg. Pupil Size Y

Table Header for Saccades:
Event Type	Trial	Number	Start	End	Duration	Start Loc.X	Start Loc.Y	End Loc.X	End Loc.Y	Amplitude	Peak Speed	Peak Speed At	Average Speed	Peak Accel.	Peak Decel.	Average Accel.

Table Header for Blinks:
Event Type	Trial	Number	Start	End	Duration

Table Header for User Events:
Event Type	Trial	Number	Start	Description

UserEvent	1	1	11069019554	# Message: marquet-fruit-knife-and-napkin-1898.jpg
Fixation L	1	1	11069035775	11069672245	636470	863.18	624.29	70	28	-1	14.35	14.35
Fixation R	1	1	11069035775	11069672245	636470	863.18	624.29	70	28	-1	15.42	15.42
Saccade L	1	1	11069672245	11069692138	19893	891.07	606.49	891.97	597.40	0.09	9.24	1.00	4.58	111.13	-138.90	83.72
Saccade R	1	1	11069672245	11069692138	19893	891.07	606.49	891.97	597.40	0.09	9.24	1.00	4.58	111.13	-138.90	83.72
Fixation L	1	2	11069692138	11069791620	99482	886.26	595.84	26	6	-1	12.48	12.48
Fixation R	1	2	11069692138	11069791620	99482	886.26	595.84	26	6	-1	13.82	13.82
Saccade L	1	2	11069791620	11069831371	39751	865.48	591.61	535.88	679.35	3.04	233.07	0.50	76.55	5674.45	-5629.35	4006.00
Saccade R	1	2	11069791620	11069831371	39751	865.48	591.61	535.88	679.35	3.04	233.07	0.50	76.55	5674.45	-5629.35	4006.00
Fixation L	1	3	11069831371	11070149604	318233	531.70	685.01	48	48	-1	11.51	11.51
Fixation R	1	3	11069831371	11070149604	318233	531.70	685.01	48	48	-1	12.67	12.67
Saccade L	1	3	11070149604	11070169477	19873	499.66	701.35	493.41	683.05	0.41	38.81	1.00	20.78	-345.42	-481.18	420.86
Saccade R	1	3	11070149604	11070169477	19873	499.66	701.35	493.41	683.05	0.41	38.81	1.00	20.78	-345.42	-481.18	420.86
Fixation L	1	4	11070169477	11070308718	139241	485.84	700.82	13	40	-1	10.88	10.88
Fixation R	1	4	11070169477	11070308718	139241	485.84	700.82	13	40	-1	12.22	12.22
Saccade L	1	4	11070308718	11070348588	39870	488.81	723.20	710.79	601.77	2.63	186.22	0.50	65.96	4203.91	-4354.75	3089.19
Saccade R	1	4	11070308718	11070348588	39870	488.81	723.20	710.79	601.77	2.63	186.22	0.50	65.96	4203.91	-4354.75	3089.19
Fixation L	1	5	11070348588	11070607097	258509	722.38	604.31	21	26	-1	11.06	11.06
Fixation R	1	5	11070348588	11070607097	258509	722.38	604.31	21	26	-1	12.63	12.63
Saccade L	1	5	11070607097	11070646828	39731	730.85	601.93	975.22	644.54	2.37	153.04	0.50	59.68	3623.45	-3115.06	2784.14
Saccade R	1	5	11070607097	11070646828	39731	730.85	601.93	975.22	644.54	2.37	153.04	0.50	59.68	3623.45	-3115.06	2784.14
Fixation L	1	6	11070646828	11071024814	377986	974.43	694.14	13	63	-1	11.58	11.58
Fixation R	1	6	11070646828	11071024814	377986	974.43	694.14	13	63	-1	12.72	12.72
Saccade L	1	6	11071024814	11071084443	59629	969.45	701.92	373.51	1147.22	7.88	405.61	0.67	132.18	9993.97	-9585.45	7054.68
Saccade R	1	6	11071024814	11071084443	59629	969.45	701.92	373.51	1147.22	7.88	405.61	0.67	132.18	9993.97	-9585.45	7054.68
Fixation L	1	7	11071084443	11071899901	815458	399.48	1123.80	50	47	-1	12.02	12.02
Fixation R	1	7	11071084443	11071899901	815458	399.48	1123.80	50	47	-1	13.73	13.73
Saccade L	1	7	11071899901	11071919906	20005	421.60	1099.69	420.30	1095.09	0.14	14.19	1.00	6.81	-43.01	-233.97	111.25
Saccade R	1	7	11071899901	11071919906	20005	421.60	1099.69	420.30	1095.09	0.14	14.19	1.00	6.81	-43.01	-233.97	111.25
Fixation L	1	8	11071919906	11072019270	99364	418.25	1089.16	4	11	-1	12.32	12.32
Fixation R	1	8	11071919906	11072019270	99364	418.25	1089.16	4	11	-1	14.37	14.37
Saccade L	1	8	11072019270	11072098884	79614	416.22	1083.87	1430.60	147.01	16.17	546.15	0.50	203.14	13547.34	-9307.42	7569.07
Saccade R	1	8	11072019270	11072098884	79614	416.22	1083.87	1430.60	147.01	16.17	546.15	0.50	203.14	13547.34	-9307.42	7569.07
Fixation L	1	9	11072098884	11072277889	179005	1411.68	190.82	30	68	-1	12.30	12.30
Fixation R	1	9	11072098884	11072277889	179005	1411.68	190.82	30	68	-1	13.78	13.78
Saccade L	1	9	11072277889	11072297763	19874	1405.41	215.78	1402.24	219.58	0.16	12.65	1.00	7.85	145.31	-47.21	67.86
Saccade R	1	9	11072277889	11072297763	19874	1405.41	215.78	1402.24	219.58	0.16	12.65	1.00	7.85	145.31	-47.21	67.86
Fixation L	1	10	11072297763	11072417132	119369	1400.04	209.02	14	22	-1	12.23	12.23
Fixation R	1	10	11072297763	11072417132	119369	1400.04	209.02	14	22	-1	13.32	13.32
Saccade L	1	10	11072417132	11072437021	19889	1410.02	197.52	1479.47	118.50	0.78	106.42	1.00	38.98	2494.34	-2075.61	1641.26
Saccade R	1	10	11072417132	11072437021	19889	1410.02	197.52	1479.47	118.50	0.78	106.42	1.00	38.98	2494.34	-2075.61	1641.26
Fixation L	1	11	11072437021	11072914361	477340	1483.73	108.17	42	55	-1	11.34	11.34
Fixation R	1	11	11072437021	11072914361	477340	1483.73	108.17	42	55	-1	11.91	11.91
Saccade L	1	11	11072914361	11073013850	99489	1472.57	125.03	402.79	1055.21	21.18	493.54	0.60	212.87	11843.92	-10003.69	5599.67
Saccade R	1	11	11072914361	11073013850	99489	1472.57	125.03	402.79	1055.21	21.18	493.54	0.60	212.87	11843.92	-10003.69	5599.67
