[BeGaze]
Converted from:	C:\Documents and Settings\iViewX\Desktop\EXPERIMENTATIONS\Experiments\results\finaleart\S6124332-finaleart-1.idf
Date:	27.03.2019 15:35:57
Version:	BeGaze 2.5.77
Sample Rate:	50
Subject:	S6124332
Description:	Romain Ferrand

Table Header for Fixations:
Event Type	Trial	Number	Start	End	Duration	Location X	Location Y	Dispersion X	Dispersion Y	Plane	Avg. Pupil Size X	Avg. Pupil Size Y

Table Header for Saccades:
Event Type	Trial	Number	Start	End	Duration	Start Loc.X	Start Loc.Y	End Loc.X	End Loc.Y	Amplitude	Peak Speed	Peak Speed At	Average Speed	Peak Accel.	Peak Decel.	Average Accel.

Table Header for Blinks:
Event Type	Trial	Number	Start	End	Duration

Table Header for User Events:
Event Type	Trial	Number	Start	Description

UserEvent	1	1	12012448359	# Message: void.jpg
Fixation L	1	1	12012464061	12012961272	497211	751.77	1191.52	37	55	-1	20.20	20.20
Fixation R	1	1	12012464061	12012961272	497211	751.77	1191.52	37	55	-1	19.75	19.75
Saccade L	1	1	12012961272	12013001015	39743	767.19	1212.99	799.74	1029.81	1.81	113.97	0.50	45.58	2762.46	-2183.31	2017.37
Saccade R	1	1	12012961272	12013001015	39743	767.19	1212.99	799.74	1029.81	1.81	113.97	0.50	45.58	2762.46	-2183.31	2017.37
Fixation L	1	2	12013001015	12013557994	556979	832.90	993.70	45	45	-1	19.07	19.07
Fixation R	1	2	12013001015	12013557994	556979	832.90	993.70	45	45	-1	18.76	18.76
Saccade L	1	2	12013557994	12013617613	59619	844.63	997.09	387.03	1245.94	5.50	214.44	0.67	92.33	5338.91	-5271.44	3994.81
Saccade R	1	2	12013557994	12013617613	59619	844.63	997.09	387.03	1245.94	5.50	214.44	0.67	92.33	5338.91	-5271.44	3994.81
Fixation L	1	3	12013617613	12014075074	457461	409.58	1254.81	76	17	-1	18.74	18.74
Fixation R	1	3	12013617613	12014075074	457461	409.58	1254.81	76	17	-1	18.21	18.21
Saccade L	1	3	12014075074	12014094954	19880	457.09	1256.70	439.33	1227.73	0.35	34.37	1.00	17.83	810.17	-565.88	695.98
Saccade R	1	3	12014075074	12014094954	19880	457.09	1256.70	439.33	1227.73	0.35	34.37	1.00	17.83	810.17	-565.88	695.98
Fixation L	1	4	12014094954	12014413179	318225	424.06	1191.26	23	44	-1	19.03	19.03
Fixation R	1	4	12014094954	12014413179	318225	424.06	1191.26	23	44	-1	18.74	18.74
Saccade L	1	4	12014413179	12014453063	39884	438.06	1184.80	492.75	1172.20	0.82	51.78	0.50	20.51	1215.05	-326.50	513.85
Saccade R	1	4	12014413179	12014453063	39884	438.06	1184.80	492.75	1172.20	0.82	51.78	0.50	20.51	1215.05	-326.50	513.85
