[BeGaze]
Converted from:	C:\Documents and Settings\iViewX\Desktop\EXPERIMENTATIONS\Experiments\results\finaleart\S6124332-finaleart-1.idf
Date:	27.03.2019 15:36:03
Version:	BeGaze 2.5.77
Sample Rate:	50
Subject:	S6124332
Description:	Romain Ferrand

Table Header for Fixations:
Event Type	Trial	Number	Start	End	Duration	Location X	Location Y	Dispersion X	Dispersion Y	Plane	Avg. Pupil Size X	Avg. Pupil Size Y

Table Header for Saccades:
Event Type	Trial	Number	Start	End	Duration	Start Loc.X	Start Loc.Y	End Loc.X	End Loc.Y	Amplitude	Peak Speed	Peak Speed At	Average Speed	Peak Accel.	Peak Decel.	Average Accel.

Table Header for Blinks:
Event Type	Trial	Number	Start	End	Duration

Table Header for User Events:
Event Type	Trial	Number	Start	Description

UserEvent	1	1	12122885012	# Message: void.jpg
Fixation L	1	1	12122892033	12123090879	198846	892.61	201.06	28	42	-1	16.52	16.52
Fixation R	1	1	12122892033	12123090879	198846	892.61	201.06	28	42	-1	16.72	16.72
Saccade L	1	1	12123090879	12123150623	59744	905.06	192.84	946.11	638.16	5.51	264.31	0.67	92.19	6481.90	-6014.67	4256.50
Saccade R	1	1	12123090879	12123150623	59744	905.06	192.84	946.11	638.16	5.51	264.31	0.67	92.19	6481.90	-6014.67	4256.50
Fixation L	1	2	12123150623	12123548360	397737	956.19	692.38	18	81	-1	17.64	17.64
Fixation R	1	2	12123150623	12123548360	397737	956.19	692.38	18	81	-1	17.81	17.81
Saccade L	1	2	12123548360	12123568227	19867	949.30	719.79	948.82	720.68	0.03	2.38	0.00	1.74	2.48	-18.37	11.77
Saccade R	1	2	12123548360	12123568227	19867	949.30	719.79	948.82	720.68	0.03	2.38	0.00	1.74	2.48	-18.37	11.77
Fixation L	1	3	12123568227	12124483172	914945	961.49	724.60	20	29	-1	18.03	18.03
Fixation R	1	3	12123568227	12124483172	914945	961.49	724.60	20	29	-1	17.88	17.88
Saccade L	1	3	12124483172	12124503055	19883	962.41	710.01	961.70	657.95	0.33	52.67	1.00	16.62	1251.55	25.60	478.02
Saccade R	1	3	12124483172	12124503055	19883	962.41	710.01	961.70	657.95	0.33	52.67	1.00	16.62	1251.55	25.60	478.02
Fixation L	1	4	12124503055	12124682040	178985	959.72	682.79	21	75	-1	18.12	18.12
Fixation R	1	4	12124503055	12124682040	178985	959.72	682.79	21	75	-1	18.06	18.06
Saccade L	1	4	12124682040	12124702038	19998	941.69	708.17	932.13	706.97	0.36	33.23	1.00	18.18	320.83	-94.95	142.10
Saccade R	1	4	12124682040	12124702038	19998	941.69	708.17	932.13	706.97	0.36	33.23	1.00	18.18	320.83	-94.95	142.10
Fixation L	1	5	12124702038	12124900905	198867	903.65	733.09	35	39	-1	18.12	18.12
Fixation R	1	5	12124702038	12124900905	198867	903.65	733.09	35	39	-1	18.08	18.08
