[BeGaze]
Converted from:	C:\Documents and Settings\iViewX\Desktop\EXPERIMENTATIONS\Experiments\results\finaleart\S16F14542-finaleart-1.idf
Date:	27.03.2019 15:47:31
Version:	BeGaze 2.5.77
Sample Rate:	50
Subject:	S16F14542
Description:	Diane Dewez

Table Header for Fixations:
Event Type	Trial	Number	Start	End	Duration	Location X	Location Y	Dispersion X	Dispersion Y	Plane	Avg. Pupil Size X	Avg. Pupil Size Y

Table Header for Saccades:
Event Type	Trial	Number	Start	End	Duration	Start Loc.X	Start Loc.Y	End Loc.X	End Loc.Y	Amplitude	Peak Speed	Peak Speed At	Average Speed	Peak Accel.	Peak Decel.	Average Accel.

Table Header for Blinks:
Event Type	Trial	Number	Start	End	Duration

Table Header for User Events:
Event Type	Trial	Number	Start	Description

UserEvent	1	1	7250089558	# Message: basket-of-fruits-Manet-1864.jpg
Fixation L	1	1	7250108605	7250267904	159299	765.60	378.53	8	30	-1	14.10	14.10
Fixation R	1	1	7250108605	7250267904	159299	765.60	378.53	8	30	-1	14.00	14.00
Saccade L	1	1	7250267904	7250287596	19692	761.51	363.74	814.85	422.21	0.50	80.06	1.00	25.54	1968.83	-1214.83	1206.74
Saccade R	1	1	7250267904	7250287596	19692	761.51	363.74	814.85	422.21	0.50	80.06	1.00	25.54	1968.83	-1214.83	1206.74
Fixation L	1	2	7250287596	7250387077	99481	824.62	450.14	40	56	-1	13.98	13.98
Fixation R	1	2	7250287596	7250387077	99481	824.62	450.14	40	56	-1	13.80	13.80
Saccade L	1	2	7250387077	7250406961	19884	839.62	478.55	843.87	485.96	0.24	16.96	1.00	12.22	4.69	-207.81	115.24
Saccade R	1	2	7250387077	7250406961	19884	839.62	478.55	843.87	485.96	0.24	16.96	1.00	12.22	4.69	-207.81	115.24
Fixation L	1	3	7250406961	7250725190	318229	851.75	481.56	53	40	-1	14.62	14.62
Fixation R	1	3	7250406961	7250725190	318229	851.75	481.56	53	40	-1	14.16	14.16
Saccade L	1	3	7250725190	7250745072	19882	897.40	510.94	959.68	525.76	0.68	64.76	1.00	34.14	1464.15	-1060.94	1136.37
Saccade R	1	3	7250725190	7250745072	19882	897.40	510.94	959.68	525.76	0.68	64.76	1.00	34.14	1464.15	-1060.94	1136.37
Fixation L	1	4	7250745072	7250943938	198866	959.38	547.97	19	39	-1	15.35	15.35
Fixation R	1	4	7250745072	7250943938	198866	959.38	547.97	19	39	-1	15.14	15.14
Saccade L	1	4	7250943938	7250983811	39873	964.82	562.65	976.81	829.35	2.28	148.37	0.50	57.21	3633.71	-3449.79	3232.41
Saccade R	1	4	7250943938	7250983811	39873	964.82	562.65	976.81	829.35	2.28	148.37	0.50	57.21	3633.71	-3449.79	3232.41
Fixation L	1	5	7250983811	7251162798	178987	984.27	818.10	12	15	-1	15.57	15.57
Fixation R	1	5	7250983811	7251162798	178987	984.27	818.10	12	15	-1	15.06	15.06
Saccade L	1	5	7251162798	7251182675	19877	989.39	818.42	995.82	914.37	0.58	97.27	1.00	29.06	2401.07	-2382.68	1717.14
Saccade R	1	5	7251162798	7251182675	19877	989.39	818.42	995.82	914.37	0.58	97.27	1.00	29.06	2401.07	-2382.68	1717.14
Fixation L	1	6	7251182675	7251500911	318236	999.12	913.24	7	20	-1	15.67	15.67
Fixation R	1	6	7251182675	7251500911	318236	999.12	913.24	7	20	-1	15.21	15.21
Blink L	1	1	7251500911	7251739648	238737
Blink R	1	1	7251500911	7251739648	238737
Fixation L	1	7	7251739648	7252057882	318234	910.47	507.27	6	18	-1	15.52	15.52
Fixation R	1	7	7251739648	7252057882	318234	910.47	507.27	6	18	-1	15.18	15.18
Saccade L	1	6	7252057882	7252097631	39749	910.69	512.96	1301.28	702.20	3.65	249.35	0.50	91.71	6204.34	-5929.70	5364.57
Saccade R	1	6	7252057882	7252097631	39749	910.69	512.96	1301.28	702.20	3.65	249.35	0.50	91.71	6204.34	-5929.70	5364.57
Fixation L	1	8	7252097631	7252634607	536976	1321.21	718.84	27	27	-1	15.44	15.44
Fixation R	1	8	7252097631	7252634607	536976	1321.21	718.84	27	27	-1	14.92	14.92
Saccade L	1	7	7252634607	7252694352	59745	1312.56	729.47	900.55	557.76	5.25	214.20	0.33	87.93	5320.98	-4442.12	3970.51
Blink R	1	2	7252634607	7252734093	99486
Fixation L	1	9	7252694352	7252913089	218737	899.09	521.07	19	62	-1	15.13	15.13
Fixation R	1	9	7252734093	7252913089	178996	898.04	515.97	17	37	-1	15.28	15.28
Blink L	1	2	7252913089	7253092076	178987
Blink R	1	3	7252913089	7253092076	178987
Fixation L	1	10	7253092076	7253450065	357989	806.08	481.83	25	73	-1	15.70	15.70
Fixation R	1	10	7253092076	7253450065	357989	806.08	481.83	25	73	-1	16.05	16.05
Saccade L	1	8	7253450065	7253549571	99506	811.06	466.94	813.15	479.15	0.64	30.82	1.00	6.39	718.20	-80.59	219.53
Saccade R	1	7	7253450065	7253549571	99506	811.06	466.94	813.15	479.15	0.64	30.82	1.00	6.39	718.20	-80.59	219.53
Blink L	1	3	7253549571	7253808174	258603
Blink R	1	4	7253549571	7253808174	258603
Fixation L	1	11	7253808174	7254026920	218746	1058.40	600.41	4	14	-1	16.48	16.48
Fixation R	1	11	7253808174	7254026920	218746	1058.40	600.41	4	14	-1	16.51	16.51
Saccade L	1	9	7254026920	7254086663	59743	1057.16	598.10	1354.56	751.86	4.07	239.77	0.67	68.08	5965.65	-2018.51	2553.30
Saccade R	1	8	7254026920	7254086663	59743	1057.16	598.10	1354.56	751.86	4.07	239.77	0.67	68.08	5965.65	-2018.51	2553.30
