[BeGaze]
Converted from:	C:\Documents and Settings\iViewX\Desktop\EXPERIMENTATIONS\Experiments\results\finaleart\S02123220-finaleart-1.idf
Date:	27.03.2019 15:33:30
Version:	BeGaze 2.5.77
Sample Rate:	50
Subject:	S02123220
Description:	David Xu

Table Header for Fixations:
Event Type	Trial	Number	Start	End	Duration	Location X	Location Y	Dispersion X	Dispersion Y	Plane	Avg. Pupil Size X	Avg. Pupil Size Y

Table Header for Saccades:
Event Type	Trial	Number	Start	End	Duration	Start Loc.X	Start Loc.Y	End Loc.X	End Loc.Y	Amplitude	Peak Speed	Peak Speed At	Average Speed	Peak Accel.	Peak Decel.	Average Accel.

Table Header for Blinks:
Event Type	Trial	Number	Start	End	Duration

Table Header for User Events:
Event Type	Trial	Number	Start	Description

UserEvent	1	1	675887885	# Message: REJECTED_cezanne-still-life-with-green-pot-and-pewter-1870.jpg
Fixation L	1	1	675896002	676015648	119646	1004.75	356.58	11	82	-1	12.27	12.27
Fixation R	1	1	675896002	676015648	119646	1004.75	356.58	11	82	-1	13.20	13.20
Saccade L	1	1	676015648	676035308	19660	998.93	321.75	913.05	411.52	0.89	125.66	1.00	45.06	3015.00	-2800.19	1984.37
Saccade R	1	1	676015648	676035308	19660	998.93	321.75	913.05	411.52	0.89	125.66	1.00	45.06	3015.00	-2800.19	1984.37
Fixation L	1	2	676035308	676174480	139172	883.39	432.04	39	60	-1	12.73	12.73
Fixation R	1	2	676035308	676174480	139172	883.39	432.04	39	60	-1	13.92	13.92
Saccade L	1	2	676174480	676472845	298365	873.94	466.99	1001.65	686.60	26.89	258.77	0.40	90.12	6342.30	-6190.53	2755.22
Saccade R	1	2	676174480	676472845	298365	873.94	466.99	1001.65	686.60	26.89	258.77	0.40	90.12	6342.30	-6190.53	2755.22
Fixation L	1	3	676472845	676631961	159116	976.37	722.14	41	42	-1	13.91	13.91
Fixation R	1	3	676472845	676631961	159116	976.37	722.14	41	42	-1	14.70	14.70
Saccade L	1	3	676631961	676810942	178981	959.80	729.13	733.41	640.66	12.37	208.51	0.11	69.13	5172.89	-4651.62	2166.48
Saccade R	1	3	676631961	676810942	178981	959.80	729.13	733.41	640.66	12.37	208.51	0.11	69.13	5172.89	-4651.62	2166.48
Fixation L	1	4	676810942	676930317	119375	746.00	647.32	20	14	-1	14.54	14.54
Fixation R	1	4	676810942	676930317	119375	746.00	647.32	20	14	-1	15.54	15.54
Saccade L	1	4	676930317	677009800	79483	753.54	648.36	1040.56	699.02	3.84	156.92	0.25	48.29	3619.30	-3852.99	2631.32
Saccade R	1	4	676930317	677009800	79483	753.54	648.36	1040.56	699.02	3.84	156.92	0.25	48.29	3619.30	-3852.99	2631.32
Fixation L	1	5	677009800	677188793	178993	1032.57	738.67	16	82	-1	15.46	15.46
Fixation R	1	5	677009800	677188793	178993	1032.57	738.67	16	82	-1	15.15	15.15
Saccade L	1	5	677188793	677208664	19871	1038.07	746.11	1005.54	750.06	0.42	38.16	1.00	21.35	738.16	-387.69	606.10
Saccade R	1	5	677188793	677208664	19871	1038.07	746.11	1005.54	750.06	0.42	38.16	1.00	21.35	738.16	-387.69	606.10
Fixation L	1	6	677208664	677347908	139244	960.17	751.76	57	17	-1	15.70	15.70
Fixation R	1	6	677208664	677347908	139244	960.17	751.76	57	17	-1	15.51	15.51
Saccade L	1	6	677347908	677566762	218854	955.98	742.86	1215.91	551.02	27.64	300.77	0.82	126.31	7139.36	-7176.12	4503.11
Saccade R	1	6	677347908	677566762	218854	955.98	742.86	1215.91	551.02	27.64	300.77	0.82	126.31	7139.36	-7176.12	4503.11
Fixation L	1	7	677566762	677865128	298366	1218.83	553.98	9	73	-1	16.30	16.30
Fixation R	1	7	677566762	677865128	298366	1218.83	553.98	9	73	-1	14.89	14.89
Saccade L	1	7	677865128	678083872	218744	1219.44	534.90	1013.25	774.76	19.69	435.09	1.00	90.03	10747.03	-10494.18	3271.41
Saccade R	1	7	677865128	678083872	218744	1219.44	534.90	1013.25	774.76	19.69	435.09	1.00	90.03	10747.03	-10494.18	3271.41
Fixation L	1	8	678083872	678461717	377845	1012.37	783.18	24	44	-1	16.79	16.79
Fixation R	1	8	678083872	678461717	377845	1012.37	783.18	24	44	-1	16.88	16.88
Saccade L	1	8	678461717	678481716	19999	1026.31	764.59	1058.22	761.90	0.24	32.40	1.00	11.94	731.68	-421.93	396.62
Saccade R	1	8	678461717	678481716	19999	1026.31	764.59	1058.22	761.90	0.24	32.40	1.00	11.94	731.68	-421.93	396.62
Fixation L	1	9	678481716	678978920	497204	1087.88	746.40	47	28	-1	16.88	16.88
Fixation R	1	9	678481716	678978920	497204	1087.88	746.40	47	28	-1	16.62	16.62
Saccade L	1	9	678978920	678998811	19891	1056.73	753.69	1023.96	765.73	0.63	46.36	0.00	31.80	733.52	-169.88	318.34
Saccade R	1	9	678978920	678998811	19891	1056.73	753.69	1023.96	765.73	0.63	46.36	0.00	31.80	733.52	-169.88	318.34
Fixation L	1	10	678998811	679297166	298355	1028.94	807.00	25	72	-1	17.25	17.25
Fixation R	1	10	678998811	679297166	298355	1028.94	807.00	25	72	-1	16.92	16.92
Saccade L	1	10	679297166	679317044	19878	1043.48	772.19	1052.50	766.26	0.24	13.42	1.00	12.05	58.43	-62.76	49.96
Saccade R	1	10	679297166	679317044	19878	1043.48	772.19	1052.50	766.26	0.24	13.42	1.00	12.05	58.43	-62.76	49.96
Fixation L	1	11	679317044	679436409	119365	1050.82	763.16	29	70	-1	17.34	17.34
Fixation R	1	11	679317044	679436409	119365	1050.82	763.16	29	70	-1	17.19	17.19
Saccade L	1	11	679436409	679456278	19869	1030.31	814.60	1027.71	783.72	0.75	55.09	0.00	37.88	293.13	-372.09	302.11
Saccade R	1	11	679436409	679456278	19869	1030.31	814.60	1027.71	783.72	0.75	55.09	0.00	37.88	293.13	-372.09	302.11
Fixation L	1	12	679456278	679595516	139238	1019.33	832.19	13	64	-1	17.57	17.57
Fixation R	1	12	679456278	679595516	139238	1019.33	832.19	13	64	-1	17.41	17.41
Saccade L	1	12	679595516	679655146	59630	1014.30	838.44	533.90	730.29	5.29	279.88	0.67	88.73	6907.78	-6502.14	3991.18
Saccade R	1	12	679595516	679655146	59630	1014.30	838.44	533.90	730.29	5.29	279.88	0.67	88.73	6907.78	-6502.14	3991.18
Fixation L	1	13	679655146	679873999	218853	516.70	725.81	22	12	-1	17.27	17.27
Fixation R	1	13	679655146	679873999	218853	516.70	725.81	22	12	-1	18.60	18.60
