[BeGaze]
Converted from:	C:\Documents and Settings\iViewX\Desktop\EXPERIMENTATIONS\Experiments\results\finaleart\S01A22542-finaleart-1.idf
Date:	27.03.2019 15:33:20
Version:	BeGaze 2.5.77
Sample Rate:	50
Subject:	S01A22542
Description:	Thibault Seve Minnaert

Table Header for Fixations:
Event Type	Trial	Number	Start	End	Duration	Location X	Location Y	Dispersion X	Dispersion Y	Plane	Avg. Pupil Size X	Avg. Pupil Size Y

Table Header for Saccades:
Event Type	Trial	Number	Start	End	Duration	Start Loc.X	Start Loc.Y	End Loc.X	End Loc.Y	Amplitude	Peak Speed	Peak Speed At	Average Speed	Peak Accel.	Peak Decel.	Average Accel.

Table Header for Blinks:
Event Type	Trial	Number	Start	End	Duration

Table Header for User Events:
Event Type	Trial	Number	Start	Description

UserEvent	1	1	9238562398	# Message: woman-at-her-toilette_degas_1877.jpg
Fixation L	1	1	9238571176	9238690707	119531	825.45	506.52	8	10	-1	16.08	16.08
Fixation R	1	1	9238571176	9238690707	119531	825.45	506.52	8	10	-1	15.96	15.96
Saccade L	1	1	9238690707	9238750415	59708	821.41	506.74	609.14	512.63	8.52	633.11	1.00	142.70	33979.83	-2195.88	10825.16
Saccade R	1	1	9238690707	9238750415	59708	821.41	506.74	609.14	512.63	8.52	633.11	1.00	142.70	33979.83	-2195.88	10825.16
Blink L	1	1	9238750415	9238949399	198984
Blink R	1	1	9238750415	9238949399	198984
Saccade L	1	2	9238949399	9239068896	119497	764.96	550.42	995.60	393.16	4.80	186.33	1.00	40.15	4374.19	-4625.99	1896.84
Saccade R	1	2	9238949399	9239068896	119497	764.96	550.42	995.60	393.16	4.80	186.33	1.00	40.15	4374.19	-4625.99	1896.84
Fixation L	1	2	9239068896	9239188401	119505	1008.55	385.67	77	21	-1	15.13	15.13
Fixation R	1	2	9239068896	9239188401	119505	1008.55	385.67	77	21	-1	15.17	15.17
Saccade L	1	3	9239188401	9239208277	19876	1073.31	371.53	1051.48	362.48	0.59	78.40	0.00	29.75	565.54	-1574.97	876.87
Saccade R	1	3	9239188401	9239208277	19876	1073.31	371.53	1051.48	362.48	0.59	78.40	0.00	29.75	565.54	-1574.97	876.87
Fixation L	1	3	9239208277	9239367513	159236	1072.59	348.70	48	36	-1	14.28	14.28
Fixation R	1	3	9239208277	9239367513	159236	1072.59	348.70	48	36	-1	14.50	14.50
Saccade L	1	4	9239367513	9239387499	19986	1100.43	329.87	1113.15	320.97	0.25	21.54	0.00	12.73	254.15	-334.83	271.67
Saccade R	1	4	9239367513	9239387499	19986	1100.43	329.87	1113.15	320.97	0.25	21.54	0.00	12.73	254.15	-334.83	271.67
Fixation L	1	4	9239387499	9239666241	278742	1127.76	307.75	31	18	-1	13.28	13.28
Fixation R	1	4	9239387499	9239666241	278742	1127.76	307.75	31	18	-1	13.60	13.60
Saccade L	1	5	9239666241	9239686109	19868	1137.60	303.76	1139.54	461.94	0.90	159.99	1.00	45.53	3958.60	-3939.92	2766.38
Saccade R	1	5	9239666241	9239686109	19868	1137.60	303.76	1139.54	461.94	0.90	159.99	1.00	45.53	3958.60	-3939.92	2766.38
Fixation L	1	5	9239686109	9239845351	159242	1133.60	472.82	8	17	-1	13.26	13.26
Fixation R	1	5	9239686109	9239845351	159242	1133.60	472.82	8	17	-1	13.15	13.15
Saccade L	1	6	9239845351	9239885233	39882	1131.19	470.31	1513.84	282.54	3.49	247.22	0.50	87.48	6142.59	-6087.07	5299.70
Saccade R	1	6	9239845351	9239885233	39882	1131.19	470.31	1513.84	282.54	3.49	247.22	0.50	87.48	6142.59	-6087.07	5299.70
Fixation L	1	6	9239885233	9240124106	238873	1508.02	311.65	44	50	-1	12.96	12.96
Fixation R	1	6	9239885233	9240124106	238873	1508.02	311.65	44	50	-1	13.14	13.14
Saccade L	1	7	9240124106	9240163968	39862	1474.53	333.31	1075.80	334.99	3.69	288.38	0.50	92.62	6960.97	-6704.07	4638.74
Saccade R	1	7	9240124106	9240163968	39862	1474.53	333.31	1075.80	334.99	3.69	288.38	0.50	92.62	6960.97	-6704.07	4638.74
Fixation L	1	7	9240163968	9240382975	219007	1060.98	337.02	19	11	-1	13.37	13.37
Fixation R	1	7	9240163968	9240382975	219007	1060.98	337.02	19	11	-1	13.06	13.06
Saccade L	1	8	9240382975	9240422831	39856	1058.40	343.79	1040.29	758.40	3.59	232.70	0.50	89.99	5616.83	-5513.11	4998.19
Saccade R	1	8	9240382975	9240422831	39856	1058.40	343.79	1040.29	758.40	3.59	232.70	0.50	89.99	5616.83	-5513.11	4998.19
Fixation L	1	8	9240422831	9240641823	218992	1018.97	764.66	51	44	-1	13.42	13.42
Fixation R	1	8	9240422831	9240641823	218992	1018.97	764.66	51	44	-1	13.16	13.16
Saccade L	1	9	9240641823	9240661688	19865	1057.57	732.62	1037.91	691.10	0.69	68.42	0.00	34.89	1098.73	-1157.59	909.62
Saccade R	1	9	9240641823	9240661688	19865	1057.57	732.62	1037.91	691.10	0.69	68.42	0.00	34.89	1098.73	-1157.59	909.62
Fixation L	1	9	9240661688	9240840955	179267	1060.51	689.99	48	28	-1	13.27	13.27
Fixation R	1	9	9240661688	9240840955	179267	1060.51	689.99	48	28	-1	13.15	13.15
Saccade L	1	10	9240840955	9240880676	39721	1086.82	676.68	1275.50	464.81	2.68	199.52	0.50	67.55	4933.83	-4682.22	3367.32
Saccade R	1	10	9240840955	9240880676	39721	1086.82	676.68	1275.50	464.81	2.68	199.52	0.50	67.55	4933.83	-4682.22	3367.32
Fixation L	1	10	9240880676	9241179420	298744	1289.87	452.08	17	20	-1	12.83	12.83
Fixation R	1	10	9240880676	9241179420	298744	1289.87	452.08	17	20	-1	12.88	12.88
Saccade L	1	11	9241179420	9241219167	39747	1288.30	463.78	1194.50	646.98	1.91	131.38	1.00	47.93	3118.15	-2993.24	2437.13
Saccade R	1	11	9241179420	9241219167	39747	1288.30	463.78	1194.50	646.98	1.91	131.38	1.00	47.93	3118.15	-2993.24	2437.13
Fixation L	1	11	9241219167	9241478041	258874	1180.15	642.64	21	30	-1	12.87	12.87
Fixation R	1	11	9241219167	9241478041	258874	1180.15	642.64	21	30	-1	12.67	12.67
Saccade L	1	12	9241478041	9241497911	19870	1173.05	656.21	1017.78	720.49	0.99	169.95	1.00	49.94	4203.31	-4138.02	2882.30
Saccade R	1	12	9241478041	9241497911	19870	1173.05	656.21	1017.78	720.49	0.99	169.95	1.00	49.94	4203.31	-4138.02	2882.30
Fixation L	1	12	9241497911	9241697019	199108	1019.37	746.16	3	32	-1	13.60	13.60
Fixation R	1	12	9241497911	9241697019	199108	1019.37	746.16	3	32	-1	13.40	13.40
Saccade L	1	13	9241697019	9241736896	39877	1020.02	751.79	463.63	798.12	4.90	290.08	0.50	122.89	7185.51	-6666.53	6701.75
Saccade R	1	13	9241697019	9241736896	39877	1020.02	751.79	463.63	798.12	4.90	290.08	0.50	122.89	7185.51	-6666.53	6701.75
Fixation L	1	13	9241736896	9241916024	179128	430.27	812.09	45	26	-1	13.53	13.53
Fixation R	1	13	9241736896	9241916024	179128	430.27	812.09	45	26	-1	14.12	14.12
Saccade L	1	14	9241916024	9241936008	19984	424.10	818.51	458.35	687.40	0.76	137.06	1.00	38.07	3349.06	-2697.20	2049.50
Saccade R	1	14	9241916024	9241936008	19984	424.10	818.51	458.35	687.40	0.76	137.06	1.00	38.07	3349.06	-2697.20	2049.50
Fixation L	1	14	9241936008	9242095245	159237	475.91	680.81	36	16	-1	13.20	13.20
Fixation R	1	14	9241936008	9242095245	159237	475.91	680.81	36	16	-1	13.83	13.83
Saccade L	1	15	9242095245	9242135133	39888	488.87	672.52	765.58	635.35	2.50	176.68	1.00	62.73	4365.24	-3982.39	3226.67
Saccade R	1	15	9242095245	9242135133	39888	488.87	672.52	765.58	635.35	2.50	176.68	1.00	62.73	4365.24	-3982.39	3226.67
Fixation L	1	15	9242135133	9242314236	179103	779.22	595.44	23	59	-1	12.83	12.83
Fixation R	1	15	9242135133	9242314236	179103	779.22	595.44	23	59	-1	13.77	13.77
Saccade L	1	16	9242314236	9242354127	39891	789.28	576.02	882.52	356.40	2.17	185.35	0.50	54.40	4514.66	-4379.14	2866.79
Saccade R	1	16	9242314236	9242354127	39891	789.28	576.02	882.52	356.40	2.17	185.35	0.50	54.40	4514.66	-4379.14	2866.79
Fixation L	1	16	9242354127	9242533239	179112	885.71	353.83	60	11	-1	12.71	12.71
Fixation R	1	16	9242354127	9242533239	179112	885.71	353.83	60	11	-1	13.48	13.48
Saccade L	1	17	9242533239	9242553234	19995	837.84	358.88	656.84	354.76	1.63	183.09	1.00	81.51	4565.85	0.00	2282.92
Saccade R	1	17	9242533239	9242553234	19995	837.84	358.88	656.84	354.76	1.63	183.09	1.00	81.51	4565.85	0.00	2282.92
