[BeGaze]
Converted from:	C:\Documents and Settings\iViewX\Desktop\EXPERIMENTATIONS\Experiments\results\finaleart\S1022551-finaleart-1.idf
Date:	27.03.2019 15:37:56
Version:	BeGaze 2.5.77
Sample Rate:	50
Subject:	S1022551
Description:	Alexis Nebout

Table Header for Fixations:
Event Type	Trial	Number	Start	End	Duration	Location X	Location Y	Dispersion X	Dispersion Y	Plane	Avg. Pupil Size X	Avg. Pupil Size Y

Table Header for Saccades:
Event Type	Trial	Number	Start	End	Duration	Start Loc.X	Start Loc.Y	End Loc.X	End Loc.Y	Amplitude	Peak Speed	Peak Speed At	Average Speed	Peak Accel.	Peak Decel.	Average Accel.

Table Header for Blinks:
Event Type	Trial	Number	Start	End	Duration

Table Header for User Events:
Event Type	Trial	Number	Start	Description

UserEvent	1	1	8214344019	# Message: landschaft_mit_dem_ondregenbogen_caspar_david_friedrich_1810.jpg
Fixation L	1	1	8214345972	8215220999	875027	934.10	567.02	12	57	-1	14.22	14.22
Fixation R	1	1	8214345972	8215220999	875027	934.10	567.02	12	57	-1	12.56	12.56
Saccade L	1	1	8215220999	8215280745	59746	939.45	577.06	946.38	590.67	5.62	262.46	0.33	94.07	6378.51	-4556.95	2960.19
Saccade R	1	1	8215220999	8215280745	59746	939.45	577.06	946.38	590.67	5.62	262.46	0.33	94.07	6378.51	-4556.95	2960.19
Fixation L	1	2	8215280745	8215474333	193588	952.36	577.95	14	33	-1	14.49	14.49
Fixation R	1	2	8215280745	8215474333	193588	952.36	577.95	14	33	-1	12.87	12.87
Saccade L	1	2	8215474333	8215499499	25166	961.27	558.50	877.36	407.67	1.29	174.55	1.00	51.16	4188.78	-4335.47	2847.69
Saccade R	1	2	8215474333	8215499499	25166	961.27	558.50	877.36	407.67	1.29	174.55	1.00	51.16	4188.78	-4335.47	2847.69
Fixation L	1	3	8215499499	8215797857	298358	878.17	417.67	10	20	-1	14.15	14.15
Fixation R	1	3	8215499499	8215797857	298358	878.17	417.67	10	20	-1	12.87	12.87
Saccade L	1	3	8215797857	8215837600	39743	879.60	408.97	507.74	423.89	3.42	298.82	1.00	86.10	7335.86	-7356.64	4334.98
Saccade R	1	3	8215797857	8215837600	39743	879.60	408.97	507.74	423.89	3.42	298.82	1.00	86.10	7335.86	-7356.64	4334.98
Fixation L	1	4	8215837600	8216036597	198997	474.54	457.82	41	54	-1	12.72	12.72
Fixation R	1	4	8215837600	8216036597	198997	474.54	457.82	41	54	-1	11.56	11.56
Saccade L	1	4	8216036597	8216076339	39742	478.98	478.36	1082.12	795.26	5.82	439.85	0.50	146.45	10959.31	-10309.46	8348.38
Saccade R	1	4	8216036597	8216076339	39742	478.98	478.36	1082.12	795.26	5.82	439.85	0.50	146.45	10959.31	-10309.46	8348.38
Fixation L	1	5	8216076339	8216354823	278484	1106.38	830.33	34	52	-1	11.44	11.44
Fixation R	1	5	8216076339	8216354823	278484	1106.38	830.33	34	52	-1	10.53	10.53
Saccade L	1	5	8216354823	8216374693	19870	1116.55	847.69	1122.45	864.20	0.24	24.27	1.00	12.28	503.72	-158.62	343.45
Saccade R	1	5	8216354823	8216374693	19870	1116.55	847.69	1122.45	864.20	0.24	24.27	1.00	12.28	503.72	-158.62	343.45
Fixation L	1	6	8216374693	8216493939	119246	1129.48	902.86	14	56	-1	11.05	11.05
Fixation R	1	6	8216374693	8216493939	119246	1129.48	902.86	14	56	-1	10.42	10.42
Saccade L	1	6	8216493939	8216513953	20014	1137.13	918.95	1121.16	962.24	0.36	46.68	1.00	17.79	1057.91	-933.77	792.66
Saccade R	1	6	8216493939	8216513953	20014	1137.13	918.95	1121.16	962.24	0.36	46.68	1.00	17.79	1057.91	-933.77	792.66
Fixation L	1	7	8216513953	8216673076	159123	1114.27	962.41	24	28	-1	11.67	11.67
Fixation R	1	7	8216513953	8216673076	159123	1114.27	962.41	24	28	-1	11.00	11.00
Saccade L	1	7	8216673076	8216692935	19859	1103.53	971.52	1061.82	987.49	0.34	45.18	1.00	16.93	988.49	-973.48	733.84
Saccade R	1	7	8216673076	8216692935	19859	1103.53	971.52	1061.82	987.49	0.34	45.18	1.00	16.93	988.49	-973.48	733.84
Fixation L	1	8	8216692935	8218025498	1332563	1044.10	1007.83	39	55	-1	14.28	14.28
Fixation R	1	8	8216692935	8218025498	1332563	1044.10	1007.83	39	55	-1	12.81	12.81
Saccade L	1	8	8218025498	8218085243	59745	1049.37	1019.31	1419.00	591.62	6.29	230.84	0.33	105.33	5760.38	-3784.47	4036.90
Saccade R	1	8	8218025498	8218085243	59745	1049.37	1019.31	1419.00	591.62	6.29	230.84	0.33	105.33	5760.38	-3784.47	4036.90
Fixation L	1	9	8218085243	8218383597	298354	1412.45	620.89	18	53	-1	14.86	14.86
Fixation R	1	9	8218085243	8218383597	298354	1412.45	620.89	18	53	-1	13.17	13.17
