[BeGaze]
Converted from:	C:\Documents and Settings\iViewX\Desktop\EXPERIMENTATIONS\Experiments\results\finaleart\S18F56223-finaleart-1.idf
Date:	27.03.2019 15:49:20
Version:	BeGaze 2.5.77
Sample Rate:	50
Subject:	S18F56223
Description:	Pascale Sebillot

Table Header for Fixations:
Event Type	Trial	Number	Start	End	Duration	Location X	Location Y	Dispersion X	Dispersion Y	Plane	Avg. Pupil Size X	Avg. Pupil Size Y

Table Header for Saccades:
Event Type	Trial	Number	Start	End	Duration	Start Loc.X	Start Loc.Y	End Loc.X	End Loc.Y	Amplitude	Peak Speed	Peak Speed At	Average Speed	Peak Accel.	Peak Decel.	Average Accel.

Table Header for Blinks:
Event Type	Trial	Number	Start	End	Duration

Table Header for User Events:
Event Type	Trial	Number	Start	Description

UserEvent	1	1	2899204417	# Message: bacchante_sorolla_1886.jpg
Fixation L	1	1	2899206578	2899465151	258573	765.69	583.25	28	15	-1	15.33	15.33
Fixation R	1	1	2899206578	2899465151	258573	765.69	583.25	28	15	-1	13.80	13.80
Saccade L	1	1	2899465151	2899485026	19875	787.88	580.39	934.31	563.94	1.09	149.02	1.00	54.77	3465.92	-3594.03	2411.08
Saccade R	1	1	2899465151	2899485026	19875	787.88	580.39	934.31	563.94	1.09	149.02	1.00	54.77	3465.92	-3594.03	2411.08
Fixation L	1	2	2899485026	2899763521	278495	930.40	531.37	19	42	-1	15.59	15.59
Fixation R	1	2	2899485026	2899763521	278495	930.40	531.37	19	42	-1	13.66	13.66
Saccade L	1	2	2899763521	2899783391	19870	936.65	521.85	1128.47	530.94	1.16	194.20	1.00	58.46	4834.11	-4609.75	3290.96
Saccade R	1	2	2899763521	2899783391	19870	936.65	521.85	1128.47	530.94	1.16	194.20	1.00	58.46	4834.11	-4609.75	3290.96
Fixation L	1	3	2899783391	2899942507	159116	1103.73	545.54	31	32	-1	14.03	14.03
Fixation R	1	3	2899783391	2899942507	159116	1103.73	545.54	31	32	-1	12.10	12.10
Saccade L	1	3	2899942507	2899982291	39784	1096.99	540.31	1309.71	425.68	2.57	154.25	1.00	64.53	3364.48	-3395.53	2792.43
Saccade R	1	3	2899942507	2899982291	39784	1096.99	540.31	1309.71	425.68	2.57	154.25	1.00	64.53	3364.48	-3395.53	2792.43
Fixation L	1	4	2899982291	2900181250	198959	1292.38	453.61	29	50	-1	12.51	12.51
Fixation R	1	4	2899982291	2900181250	198959	1292.38	453.61	29	50	-1	10.88	10.88
Saccade L	1	4	2900181250	2900220996	39746	1291.37	450.74	1487.41	337.50	2.01	133.49	1.00	50.55	3258.57	-3144.56	2836.10
Saccade R	1	4	2900181250	2900220996	39746	1291.37	450.74	1487.41	337.50	2.01	133.49	1.00	50.55	3258.57	-3144.56	2836.10
Fixation L	1	5	2900220996	2900380112	159116	1492.77	326.72	13	17	-1	12.12	12.12
Fixation R	1	5	2900220996	2900380112	159116	1492.77	326.72	13	17	-1	10.64	10.64
Saccade L	1	5	2900380112	2900439732	59620	1487.52	332.47	1684.66	72.35	4.73	230.14	0.33	79.34	5604.65	-4360.32	3748.07
Saccade R	1	5	2900380112	2900439732	59620	1487.52	332.47	1684.66	72.35	4.73	230.14	0.33	79.34	5604.65	-4360.32	3748.07
Fixation L	1	6	2900439732	2900638730	198998	1674.38	104.45	35	60	-1	11.80	11.80
Fixation R	1	6	2900439732	2900638730	198998	1674.38	104.45	35	60	-1	10.29	10.29
Saccade L	1	6	2900638730	2900718225	79495	1656.70	132.91	1211.25	599.10	8.34	293.66	0.75	104.89	6729.24	-6005.35	3691.37
Saccade R	1	6	2900638730	2900718225	79495	1656.70	132.91	1211.25	599.10	8.34	293.66	0.75	104.89	6729.24	-6005.35	3691.37
Fixation L	1	7	2900718225	2900817719	99494	1225.95	559.65	33	64	-1	11.85	11.85
Fixation R	1	7	2900718225	2900817719	99494	1225.95	559.65	33	64	-1	9.94	9.94
Saccade L	1	7	2900817719	2900956961	139242	1243.32	560.21	794.86	519.04	8.31	226.60	0.86	59.66	5165.67	-5090.98	2190.79
Saccade R	1	7	2900817719	2900956961	139242	1243.32	560.21	794.86	519.04	8.31	226.60	0.86	59.66	5165.67	-5090.98	2190.79
Fixation L	1	8	2900956961	2901215463	258502	777.92	469.87	22	70	-1	12.11	12.11
Fixation R	1	8	2900956961	2901215463	258502	777.92	469.87	22	70	-1	10.34	10.34
Saccade L	1	8	2901215463	2901295071	79608	773.93	462.26	255.67	554.60	6.92	306.75	0.50	86.88	7544.03	-6615.25	3510.19
Saccade R	1	8	2901215463	2901295071	79608	773.93	462.26	255.67	554.60	6.92	306.75	0.50	86.88	7544.03	-6615.25	3510.19
Fixation L	1	9	2901295071	2901414442	119371	267.87	576.08	44	54	-1	11.15	11.15
Fixation R	1	9	2901295071	2901414442	119371	267.87	576.08	44	54	-1	10.32	10.32
Saccade L	1	9	2901414442	2901513811	99369	271.14	586.93	359.05	212.20	6.93	239.31	0.80	69.73	5074.23	-5929.40	2836.23
Saccade R	1	9	2901414442	2901513811	99369	271.14	586.93	359.05	212.20	6.93	239.31	0.80	69.73	5074.23	-5929.40	2836.23
Fixation L	1	10	2901513811	2901672941	159130	370.73	205.10	27	12	-1	11.19	11.19
Fixation R	1	10	2901513811	2901672941	159130	370.73	205.10	27	12	-1	10.84	10.84
Saccade L	1	10	2901672941	2901712681	39740	380.81	201.61	950.72	215.95	4.75	366.24	0.50	119.52	8932.81	-8992.08	6946.07
Saccade R	1	10	2901672941	2901712681	39740	380.81	201.61	950.72	215.95	4.75	366.24	0.50	119.52	8932.81	-8992.08	6946.07
Fixation L	1	11	2901712681	2902031049	318368	961.15	217.52	30	14	-1	11.80	11.80
Fixation R	1	11	2901712681	2902031049	318368	961.15	217.52	30	14	-1	10.86	10.86
Saccade L	1	11	2902031049	2902070819	39770	976.08	213.25	1480.84	205.79	4.69	263.90	0.50	117.95	6411.76	-6070.80	5953.81
Saccade R	1	11	2902031049	2902070819	39770	976.08	213.25	1480.84	205.79	4.69	263.90	0.50	117.95	6411.76	-6070.80	5953.81
Fixation L	1	12	2902070819	2902170164	99345	1521.81	185.26	52	31	-1	12.38	12.38
Fixation R	1	12	2902070819	2902170164	99345	1521.81	185.26	52	31	-1	10.83	10.83
Saccade L	1	12	2902170164	2902190159	19995	1533.74	176.80	1649.49	98.71	0.88	141.23	1.00	43.82	3070.78	-2960.01	2094.34
Saccade R	1	12	2902170164	2902190159	19995	1533.74	176.80	1649.49	98.71	0.88	141.23	1.00	43.82	3070.78	-2960.01	2094.34
Fixation L	1	13	2902190159	2902548143	357984	1650.55	99.29	37	29	-1	12.19	12.19
Fixation R	1	13	2902190159	2902548143	357984	1650.55	99.29	37	29	-1	10.65	10.65
Saccade L	1	13	2902548143	2902607764	59621	1632.27	87.90	1504.62	768.34	7.67	331.90	0.67	128.70	7801.04	-7751.33	5163.94
Saccade R	1	13	2902548143	2902607764	59621	1632.27	87.90	1504.62	768.34	7.67	331.90	0.67	128.70	7801.04	-7751.33	5163.94
Fixation L	1	14	2902607764	2902747006	139242	1507.51	763.74	28	41	-1	12.52	12.52
Fixation R	1	14	2902607764	2902747006	139242	1507.51	763.74	28	41	-1	10.53	10.53
Saccade L	1	14	2902747006	2902766879	19873	1518.75	778.74	1474.94	732.74	0.66	64.26	1.00	33.07	963.67	-1415.95	871.22
Saccade R	1	14	2902747006	2902766879	19873	1518.75	778.74	1474.94	732.74	0.66	64.26	1.00	33.07	963.67	-1415.95	871.22
Fixation L	1	15	2902766879	2902965872	198993	1457.54	737.47	45	43	-1	13.11	13.11
Fixation R	1	15	2902766879	2902965872	198993	1457.54	737.47	45	43	-1	11.04	11.04
Saccade L	1	15	2902965872	2902985751	19879	1452.38	722.34	1434.89	530.79	1.45	194.50	1.00	73.18	3456.39	-4194.19	2866.84
Saccade R	1	15	2902965872	2902985751	19879	1452.38	722.34	1434.89	530.79	1.45	194.50	1.00	73.18	3456.39	-4194.19	2866.84
Fixation L	1	16	2902985751	2903204482	218731	1440.30	511.76	14	31	-1	12.38	12.38
Fixation R	1	16	2902985751	2903204482	218731	1440.30	511.76	14	31	-1	10.76	10.76
