[BeGaze]
Converted from:	C:\Documents and Settings\iViewX\Desktop\EXPERIMENTATIONS\Experiments\results\finaleart\S6124332-finaleart-1.idf
Date:	27.03.2019 15:35:55
Version:	BeGaze 2.5.77
Sample Rate:	50
Subject:	S6124332
Description:	Romain Ferrand

Table Header for Fixations:
Event Type	Trial	Number	Start	End	Duration	Location X	Location Y	Dispersion X	Dispersion Y	Plane	Avg. Pupil Size X	Avg. Pupil Size Y

Table Header for Saccades:
Event Type	Trial	Number	Start	End	Duration	Start Loc.X	Start Loc.Y	End Loc.X	End Loc.Y	Amplitude	Peak Speed	Peak Speed At	Average Speed	Peak Accel.	Peak Decel.	Average Accel.

Table Header for Blinks:
Event Type	Trial	Number	Start	End	Duration

Table Header for User Events:
Event Type	Trial	Number	Start	Description

UserEvent	1	1	11971386789	# Message: REJECTED_rose_in_a_bowl_fantin_latour_1883.jpg
Fixation L	1	1	11971391651	11972107736	716085	906.29	581.60	77	18	-1	18.55	18.55
Fixation R	1	1	11971391651	11972107736	716085	906.29	581.60	77	18	-1	17.90	17.90
Saccade L	1	1	11972107736	11972127607	19871	834.76	584.80	686.69	640.22	1.30	159.90	1.00	65.61	3824.78	-3657.28	2817.40
Saccade R	1	1	11972107736	11972127607	19871	834.76	584.80	686.69	640.22	1.30	159.90	1.00	65.61	3824.78	-3657.28	2817.40
Fixation L	1	2	11972127607	11972266843	139236	657.82	655.14	37	31	-1	18.64	18.64
Fixation R	1	2	11972127607	11972266843	139236	657.82	655.14	37	31	-1	17.75	17.75
Saccade L	1	2	11972266843	11972306604	39761	649.18	672.10	1000.72	688.50	3.24	211.43	1.00	81.49	5182.78	-5182.10	4100.99
Saccade R	1	2	11972266843	11972306604	39761	649.18	672.10	1000.72	688.50	3.24	211.43	1.00	81.49	5182.78	-5182.10	4100.99
Fixation L	1	3	11972306604	11972425970	119366	1030.20	697.51	42	15	-1	18.70	18.70
Fixation R	1	3	11972306604	11972425970	119366	1030.20	697.51	42	15	-1	17.84	17.84
Saccade L	1	3	11972425970	11972445847	19877	1016.21	703.88	824.60	685.65	1.13	194.63	1.00	56.98	4827.51	-4736.12	3359.70
Saccade R	1	3	11972425970	11972445847	19877	1016.21	703.88	824.60	685.65	1.13	194.63	1.00	56.98	4827.51	-4736.12	3359.70
Fixation L	1	4	11972445847	11972704327	258480	827.36	687.22	7	23	-1	19.03	19.03
Fixation R	1	4	11972445847	11972704327	258480	827.36	687.22	7	23	-1	18.47	18.47
Saccade L	1	4	11972704327	11972724313	19986	823.28	693.66	719.47	667.25	0.73	108.35	1.00	36.32	2666.90	-2547.78	1929.09
Saccade R	1	4	11972704327	11972724313	19986	823.28	693.66	719.47	667.25	0.73	108.35	1.00	36.32	2666.90	-2547.78	1929.09
Fixation L	1	5	11972724313	11972962938	238625	725.31	689.65	14	28	-1	19.21	19.21
Fixation R	1	5	11972724313	11972962938	238625	725.31	689.65	14	28	-1	19.01	19.01
Saccade L	1	5	11972962938	11973042551	79613	721.82	687.52	1377.57	689.48	7.86	239.57	0.75	98.78	4780.17	-5368.96	3442.79
Saccade R	1	5	11972962938	11973042551	79613	721.82	687.52	1377.57	689.48	7.86	239.57	0.75	98.78	4780.17	-5368.96	3442.79
Fixation L	1	6	11973042551	11973241419	198868	1387.13	685.13	20	12	-1	18.69	18.69
Fixation R	1	6	11973042551	11973241419	198868	1387.13	685.13	20	12	-1	18.63	18.63
Saccade L	1	6	11973241419	11973281158	39739	1381.08	687.65	1198.43	624.49	1.95	151.65	0.50	49.18	3643.68	-3008.75	2257.39
Saccade R	1	6	11973241419	11973281158	39739	1381.08	687.65	1198.43	624.49	1.95	151.65	0.50	49.18	3643.68	-3008.75	2257.39
Fixation L	1	7	11973281158	11973778383	497225	1187.88	606.97	65	32	-1	18.55	18.55
Fixation R	1	7	11973281158	11973778383	497225	1187.88	606.97	65	32	-1	17.50	17.50
Saccade L	1	7	11973778383	11973798247	19864	1245.07	610.59	1248.25	607.40	0.27	45.62	1.00	13.84	15.52	-1026.39	356.86
Saccade R	1	7	11973778383	11973798247	19864	1245.07	610.59	1248.25	607.40	0.27	45.62	1.00	13.84	15.52	-1026.39	356.86
Fixation L	1	8	11973798247	11973957371	159124	1250.10	605.93	35	12	-1	18.39	18.39
Fixation R	1	8	11973798247	11973957371	159124	1250.10	605.93	35	12	-1	18.16	18.16
Saccade L	1	8	11973957371	11973997244	39873	1221.33	604.91	1035.02	553.01	2.43	108.90	0.50	60.91	2515.77	-2063.68	1791.75
Saccade R	1	8	11973957371	11973997244	39873	1221.33	604.91	1035.02	553.01	2.43	108.90	0.50	60.91	2515.77	-2063.68	1791.75
Fixation L	1	9	11973997244	11974335352	338108	1048.17	496.40	25	70	-1	19.58	19.58
Fixation R	1	9	11973997244	11974335352	338108	1048.17	496.40	25	70	-1	18.53	18.53
Saccade L	1	9	11974335352	11974355229	19877	1037.06	482.43	1047.46	464.06	0.24	21.35	1.00	12.27	274.06	-307.29	199.94
Saccade R	1	9	11974335352	11974355229	19877	1037.06	482.43	1047.46	464.06	0.24	21.35	1.00	12.27	274.06	-307.29	199.94
Fixation L	1	10	11974355229	11974534220	178991	1032.44	448.07	23	35	-1	18.36	18.36
Fixation R	1	10	11974355229	11974534220	178991	1032.44	448.07	23	35	-1	17.54	17.54
Saccade L	1	10	11974534220	11974573981	39761	1023.98	443.13	683.30	600.21	3.53	210.45	0.50	88.81	5198.04	-4025.44	4229.60
Saccade R	1	10	11974534220	11974573981	39761	1023.98	443.13	683.30	600.21	3.53	210.45	0.50	88.81	5198.04	-4025.44	4229.60
Fixation L	1	11	11974573981	11974892194	318213	628.85	606.75	60	21	-1	17.65	17.65
Fixation R	1	11	11974573981	11974892194	318213	628.85	606.75	60	21	-1	17.60	17.60
Saccade L	1	11	11974892194	11975091173	198979	624.77	608.20	337.10	1064.90	12.87	184.41	0.20	64.67	4531.36	-3347.30	2232.20
Saccade R	1	11	11974892194	11975091173	198979	624.77	608.20	337.10	1064.90	12.87	184.41	0.20	64.67	4531.36	-3347.30	2232.20
Fixation L	1	12	11975091173	11975389538	298365	305.93	1103.16	41	46	-1	17.23	17.23
Fixation R	1	12	11975091173	11975389538	298365	305.93	1103.16	41	46	-1	17.83	17.83
