[BeGaze]
Converted from:	C:\Documents and Settings\iViewX\Desktop\EXPERIMENTATIONS\Experiments\results\finaleart\S1022551-finaleart-1.idf
Date:	27.03.2019 15:37:46
Version:	BeGaze 2.5.77
Sample Rate:	50
Subject:	S1022551
Description:	Alexis Nebout

Table Header for Fixations:
Event Type	Trial	Number	Start	End	Duration	Location X	Location Y	Dispersion X	Dispersion Y	Plane	Avg. Pupil Size X	Avg. Pupil Size Y

Table Header for Saccades:
Event Type	Trial	Number	Start	End	Duration	Start Loc.X	Start Loc.Y	End Loc.X	End Loc.Y	Amplitude	Peak Speed	Peak Speed At	Average Speed	Peak Accel.	Peak Decel.	Average Accel.

Table Header for Blinks:
Event Type	Trial	Number	Start	End	Duration

Table Header for User Events:
Event Type	Trial	Number	Start	Description

UserEvent	1	1	7924187249	# Message: void.jpg
Fixation L	1	1	7924189815	7924408707	218892	1009.65	898.56	12	6	-1	12.35	12.35
Fixation R	1	1	7924189815	7924408707	218892	1009.65	898.56	12	6	-1	9.76	9.76
Saccade L	1	1	7924408707	7924448437	39730	1003.28	901.72	715.38	902.03	3.20	291.00	1.00	80.58	7160.11	-7176.86	4898.77
Saccade R	1	1	7924408707	7924448437	39730	1003.28	901.72	715.38	902.03	3.20	291.00	1.00	80.58	7160.11	-7176.86	4898.77
Fixation L	1	2	7924448437	7924704144	255707	692.01	904.60	36	7	-1	11.56	11.56
Fixation R	1	2	7924448437	7924704144	255707	692.01	904.60	36	7	-1	10.37	10.37
Saccade L	1	2	7924704144	7924726914	22770	678.53	905.23	492.06	951.35	1.28	194.25	1.00	56.43	4779.25	-4523.36	3215.62
Saccade R	1	2	7924704144	7924726914	22770	678.53	905.23	492.06	951.35	1.28	194.25	1.00	56.43	4779.25	-4523.36	3215.62
Fixation L	1	3	7924726914	7924945662	218748	503.90	959.21	16	43	-1	11.15	11.15
Fixation R	1	3	7924726914	7924945662	218748	503.90	959.21	16	43	-1	10.02	10.02
Saccade L	1	3	7924945662	7924985422	39760	507.63	970.01	706.94	726.88	2.93	228.75	0.50	73.74	5439.57	-5218.23	3984.38
Saccade R	1	3	7924945662	7924985422	39760	507.63	970.01	706.94	726.88	2.93	228.75	0.50	73.74	5439.57	-5218.23	3984.38
Fixation L	1	4	7924985422	7925084898	99476	723.08	733.88	20	17	-1	11.25	11.25
Fixation R	1	4	7924985422	7925084898	99476	723.08	733.88	20	17	-1	10.49	10.49
Saccade L	1	4	7925084898	7925104775	19877	726.09	743.50	724.90	577.36	1.00	168.03	1.00	50.10	4107.83	-3736.36	2791.83
Saccade R	1	4	7925084898	7925104775	19877	726.09	743.50	724.90	577.36	1.00	168.03	1.00	50.10	4107.83	-3736.36	2791.83
Fixation L	1	5	7925104775	7925303624	198849	732.02	543.14	27	43	-1	11.74	11.74
Fixation R	1	5	7925104775	7925303624	198849	732.02	543.14	27	43	-1	10.58	10.58
Saccade L	1	5	7925303624	7925323634	20010	750.86	539.12	821.38	533.70	0.49	71.55	1.00	24.46	1697.61	-1542.87	1182.26
Saccade R	1	5	7925303624	7925323634	20010	750.86	539.12	821.38	533.70	0.49	71.55	1.00	24.46	1697.61	-1542.87	1182.26
Fixation L	1	6	7925323634	7925701497	377863	835.10	514.03	24	33	-1	12.37	12.37
Fixation R	1	6	7925323634	7925701497	377863	835.10	514.03	24	33	-1	10.89	10.89
Saccade L	1	6	7925701497	7925721371	19874	840.13	502.65	893.88	500.41	0.31	54.42	1.00	15.65	1345.26	-1074.97	848.42
Saccade R	1	6	7925701497	7925721371	19874	840.13	502.65	893.88	500.41	0.31	54.42	1.00	15.65	1345.26	-1074.97	848.42
Fixation L	1	7	7925721371	7926198724	477353	906.58	487.81	23	18	-1	12.78	12.78
Fixation R	1	7	7925721371	7926198724	477353	906.58	487.81	23	18	-1	10.77	10.77
