[BeGaze]
Converted from:	C:\Documents and Settings\iViewX\Desktop\EXPERIMENTATIONS\Experiments\results\finaleart\S12H22222-finaleart-1.idf
Date:	27.03.2019 15:39:59
Version:	BeGaze 2.5.77
Sample Rate:	50
Subject:	S12H22222
Description:	aurele barriere

Table Header for Fixations:
Event Type	Trial	Number	Start	End	Duration	Location X	Location Y	Dispersion X	Dispersion Y	Plane	Avg. Pupil Size X	Avg. Pupil Size Y

Table Header for Saccades:
Event Type	Trial	Number	Start	End	Duration	Start Loc.X	Start Loc.Y	End Loc.X	End Loc.Y	Amplitude	Peak Speed	Peak Speed At	Average Speed	Peak Accel.	Peak Decel.	Average Accel.

Table Header for Blinks:
Event Type	Trial	Number	Start	End	Duration

Table Header for User Events:
Event Type	Trial	Number	Start	Description

UserEvent	1	1	22953137397	# Message: delacroix-Reclining-Odalisque-or-Woman-with-a-Parakeet-1827.jpg
Fixation L	1	1	22953153557	22953591174	437617	932.45	429.10	21	16	-1	19.47	19.47
Fixation R	1	1	22953153557	22953591174	437617	932.45	429.10	21	16	-1	18.08	18.08
Saccade L	1	1	22953591174	22953650806	59632	924.42	426.34	1404.85	316.98	6.47	311.74	0.33	108.42	7662.60	-6707.86	5242.33
Saccade R	1	1	22953591174	22953650806	59632	924.42	426.34	1404.85	316.98	6.47	311.74	0.33	108.42	7662.60	-6707.86	5242.33
Fixation L	1	2	22953650806	22953849642	198836	1399.44	330.59	17	56	-1	17.85	17.85
Fixation R	1	2	22953650806	22953849642	198836	1399.44	330.59	17	56	-1	16.65	16.65
Saccade L	1	2	22953849642	22953869640	19998	1405.41	302.62	1402.66	272.36	0.29	30.73	1.00	14.64	622.58	-356.44	390.34
Saccade R	1	2	22953849642	22953869640	19998	1405.41	302.62	1402.66	272.36	0.29	30.73	1.00	14.64	622.58	-356.44	390.34
Fixation L	1	3	22953869640	22954903854	1034214	1421.38	250.50	49	50	-1	16.69	16.69
Fixation R	1	3	22953869640	22954903854	1034214	1421.38	250.50	49	50	-1	15.65	15.65
Saccade L	1	3	22954903854	22954983472	79618	1397.65	284.40	1270.56	316.07	1.89	94.99	1.00	23.69	2229.50	-2061.64	896.30
Saccade R	1	3	22954903854	22954983472	79618	1397.65	284.40	1270.56	316.07	1.89	94.99	1.00	23.69	2229.50	-2061.64	896.30
Fixation L	1	4	22954983472	22955261830	278358	1271.42	347.78	25	54	-1	18.31	18.31
Fixation R	1	4	22954983472	22955261830	278358	1271.42	347.78	25	54	-1	16.90	16.90
Saccade L	1	4	22955261830	22955281845	20015	1258.12	370.24	1240.90	475.60	0.77	107.99	1.00	38.63	2641.39	-2465.11	1712.06
Saccade R	1	4	22955261830	22955281845	20015	1258.12	370.24	1240.90	475.60	0.77	107.99	1.00	38.63	2641.39	-2465.11	1712.06
Fixation L	1	5	22955281845	22955480703	198858	1212.13	464.61	40	20	-1	18.61	18.61
Fixation R	1	5	22955281845	22955480703	198858	1212.13	464.61	40	20	-1	17.06	17.06
Saccade L	1	5	22955480703	22955500575	19872	1206.09	463.25	1287.09	467.34	0.51	82.05	1.00	25.69	1938.78	-2018.75	1348.90
Saccade R	1	5	22955480703	22955500575	19872	1206.09	463.25	1287.09	467.34	0.51	82.05	1.00	25.69	1938.78	-2018.75	1348.90
Fixation L	1	6	22955500575	22956117175	616600	1282.43	479.61	28	36	-1	18.84	18.84
Fixation R	1	6	22955500575	22956117175	616600	1282.43	479.61	28	36	-1	17.18	17.18
Saccade L	1	6	22956117175	22956137048	19873	1279.90	466.75	1387.73	336.72	1.19	170.83	1.00	59.88	4260.63	-3864.42	3270.65
Saccade R	1	6	22956117175	22956137048	19873	1279.90	466.75	1387.73	336.72	1.19	170.83	1.00	59.88	4260.63	-3864.42	3270.65
Fixation L	1	7	22956137048	22956495033	357985	1411.06	283.44	30	67	-1	18.27	18.27
Fixation R	1	7	22956137048	22956495033	357985	1411.06	283.44	30	67	-1	16.64	16.64
Saccade L	1	7	22956495033	22956514902	19869	1417.46	269.25	1420.85	262.00	0.11	8.09	1.00	5.29	135.55	-126.95	100.91
Saccade R	1	7	22956495033	22956514902	19869	1417.46	269.25	1420.85	262.00	0.11	8.09	1.00	5.29	135.55	-126.95	100.91
Fixation L	1	8	22956514902	22956793403	278501	1425.35	278.60	8	36	-1	18.75	18.75
Fixation R	1	8	22956514902	22956793403	278501	1425.35	278.60	8	36	-1	17.09	17.09
Saccade L	1	8	22956793403	22956892901	99498	1424.32	298.32	1174.43	631.92	5.60	222.08	1.00	56.33	5253.59	-5472.19	2313.21
Saccade R	1	8	22956793403	22956892901	99498	1424.32	298.32	1174.43	631.92	5.60	222.08	1.00	56.33	5253.59	-5472.19	2313.21
Fixation L	1	9	22956892901	22957131506	238605	1159.01	620.87	19	15	-1	19.76	19.76
Fixation R	1	9	22956892901	22957131506	238605	1159.01	620.87	19	15	-1	17.96	17.96
