[BeGaze]
Converted from:	C:\Documents and Settings\iViewX\Desktop\EXPERIMENTATIONS\Experiments\results\finaleart\S13H22431-finaleart-1.idf
Date:	27.03.2019 15:42:15
Version:	BeGaze 2.5.77
Sample Rate:	50
Subject:	S13H22431
Description:	Jimmy Petit

Table Header for Fixations:
Event Type	Trial	Number	Start	End	Duration	Location X	Location Y	Dispersion X	Dispersion Y	Plane	Avg. Pupil Size X	Avg. Pupil Size Y

Table Header for Saccades:
Event Type	Trial	Number	Start	End	Duration	Start Loc.X	Start Loc.Y	End Loc.X	End Loc.Y	Amplitude	Peak Speed	Peak Speed At	Average Speed	Peak Accel.	Peak Decel.	Average Accel.

Table Header for Blinks:
Event Type	Trial	Number	Start	End	Duration

Table Header for User Events:
Event Type	Trial	Number	Start	Description

UserEvent	1	1	28177311458	# Message: void.jpg
Fixation L	1	1	28177322080	28177878906	556826	846.75	241.08	13	51	-1	17.57	17.57
Fixation R	1	1	28177322080	28177878906	556826	846.75	241.08	13	51	-1	18.26	18.26
Saccade L	1	1	28177878906	28177978410	99504	843.76	262.54	1623.51	150.96	10.55	194.26	0.80	106.00	3912.33	-4349.26	2395.71
Saccade R	1	1	28177878906	28177978410	99504	843.76	262.54	1623.51	150.96	10.55	194.26	0.80	106.00	3912.33	-4349.26	2395.71
Fixation L	1	2	28177978410	28178217020	238610	1633.80	191.07	24	68	-1	15.16	15.16
Fixation R	1	2	28177978410	28178217020	238610	1633.80	191.07	24	68	-1	15.91	15.91
Saccade L	1	2	28178217020	28178236897	19877	1634.63	219.01	1629.78	231.11	0.18	13.18	1.00	8.98	242.05	-59.31	127.48
Saccade R	1	2	28178217020	28178236897	19877	1634.63	219.01	1629.78	231.11	0.18	13.18	1.00	8.98	242.05	-59.31	127.48
Fixation L	1	3	28178236897	28178396033	159136	1605.96	231.79	50	20	-1	15.11	15.11
Fixation R	1	3	28178236897	28178396033	159136	1605.96	231.79	50	20	-1	16.04	16.04
Blink L	1	1	28178396033	28178535253	139220
Blink R	1	1	28178396033	28178535253	139220
Saccade L	1	3	28178535253	28178674499	139246	1314.00	342.02	1754.14	233.22	8.64	166.17	0.57	62.01	4013.83	-2931.32	1338.57
Saccade R	1	3	28178535253	28178674499	139246	1314.00	342.02	1754.14	233.22	8.64	166.17	0.57	62.01	4013.83	-2931.32	1338.57
Fixation L	1	4	28178674499	28178952986	278487	1766.87	241.78	50	28	-1	17.05	17.05
Fixation R	1	4	28178674499	28178952986	278487	1766.87	241.78	50	28	-1	16.95	16.95
Saccade L	1	4	28178952986	28179032478	79492	1759.35	236.07	831.25	373.84	11.04	327.51	0.50	138.85	8010.76	-5697.13	4604.50
Saccade R	1	4	28178952986	28179032478	79492	1759.35	236.07	831.25	373.84	11.04	327.51	0.50	138.85	8010.76	-5697.13	4604.50
Fixation L	1	5	28179032478	28179310978	278500	824.09	381.71	15	28	-1	17.14	17.14
Fixation R	1	5	28179032478	28179310978	278500	824.09	381.71	15	28	-1	17.37	17.37
