[BeGaze]
Converted from:	C:\Documents and Settings\iViewX\Desktop\EXPERIMENTATIONS\Experiments\results\finaleart\S8119532-finaleart-1.idf
Date:	27.03.2019 16:01:28
Version:	BeGaze 2.5.77
Sample Rate:	50
Subject:	S8119532
Description:	Alexandre Drewery

Table Header for Fixations:
Event Type	Trial	Number	Start	End	Duration	Location X	Location Y	Dispersion X	Dispersion Y	Plane	Avg. Pupil Size X	Avg. Pupil Size Y

Table Header for Saccades:
Event Type	Trial	Number	Start	End	Duration	Start Loc.X	Start Loc.Y	End Loc.X	End Loc.Y	Amplitude	Peak Speed	Peak Speed At	Average Speed	Peak Accel.	Peak Decel.	Average Accel.

Table Header for Blinks:
Event Type	Trial	Number	Start	End	Duration

Table Header for User Events:
Event Type	Trial	Number	Start	Description

UserEvent	1	1	3716938346	# Message: void.jpg
Saccade L	1	1	3716955690	3717194427	238737	1026.52	343.20	1225.83	741.24	14.00	241.10	0.17	58.63	6027.46	-4613.15	2016.79
Saccade R	1	1	3716955690	3717194427	238737	1026.52	343.20	1225.83	741.24	14.00	241.10	0.17	58.63	6027.46	-4613.15	2016.79
Fixation L	1	1	3717194427	3717393290	198863	1234.08	757.76	41	37	-1	13.88	13.88
Fixation R	1	1	3717194427	3717393290	198863	1234.08	757.76	41	37	-1	13.91	13.91
Saccade L	1	2	3717393290	3717413192	19902	1265.01	771.40	1298.77	746.81	0.56	42.25	1.00	28.36	399.46	-609.49	416.68
Saccade R	1	2	3717393290	3717413192	19902	1265.01	771.40	1298.77	746.81	0.56	42.25	1.00	28.36	399.46	-609.49	416.68
Fixation L	1	2	3717413192	3717572282	159090	1302.77	761.87	26	31	-1	13.62	13.62
Fixation R	1	2	3717413192	3717572282	159090	1302.77	761.87	26	31	-1	13.62	13.62
Blink L	1	1	3717572282	3717890518	318236
Blink R	1	1	3717572282	3717890518	318236
Saccade L	1	3	3717890518	3718231353	340835	738.01	743.14	733.19	715.90	21.81	214.03	0.47	64.00	4194.17	-4739.88	1776.25
Saccade R	1	3	3717890518	3718231353	340835	738.01	743.14	733.19	715.90	21.81	214.03	0.47	64.00	4194.17	-4739.88	1776.25
Fixation L	1	3	3718231353	3718467364	236011	746.27	758.36	19	51	-1	13.72	13.72
Fixation R	1	3	3718231353	3718467364	236011	746.27	758.36	19	51	-1	14.87	14.87
Saccade L	1	4	3718467364	3718527129	59765	752.46	761.10	919.99	739.15	3.52	166.85	0.66	58.84	4099.12	-3130.61	2228.13
Saccade R	1	4	3718467364	3718527129	59765	752.46	761.10	919.99	739.15	3.52	166.85	0.66	58.84	4099.12	-3130.61	2228.13
Fixation L	1	4	3718527129	3718686229	159100	933.80	696.68	20	67	-1	13.57	13.57
Fixation R	1	4	3718527129	3718686229	159100	933.80	696.68	20	67	-1	14.51	14.51
Saccade L	1	5	3718686229	3718706104	19875	937.49	671.77	931.83	417.98	1.62	256.64	1.00	81.55	5488.04	-6264.20	3958.89
Saccade R	1	5	3718686229	3718706104	19875	937.49	671.77	931.83	417.98	1.62	256.64	1.00	81.55	5488.04	-6264.20	3958.89
Fixation L	1	5	3718706104	3718944715	238611	906.85	440.88	41	43	-1	12.69	12.69
Fixation R	1	5	3718706104	3718944715	238611	906.85	440.88	41	43	-1	13.96	13.96
