[BeGaze]
Converted from:	C:\Documents and Settings\iViewX\Desktop\EXPERIMENTATIONS\Experiments\results\finaleart\S21F22332-finaleart-1.idf
Date:	27.03.2019 15:55:39
Version:	BeGaze 2.5.77
Sample Rate:	50
Subject:	S21F22332
Description:	Cyrielle Mailart

Table Header for Fixations:
Event Type	Trial	Number	Start	End	Duration	Location X	Location Y	Dispersion X	Dispersion Y	Plane	Avg. Pupil Size X	Avg. Pupil Size Y

Table Header for Saccades:
Event Type	Trial	Number	Start	End	Duration	Start Loc.X	Start Loc.Y	End Loc.X	End Loc.Y	Amplitude	Peak Speed	Peak Speed At	Average Speed	Peak Accel.	Peak Decel.	Average Accel.

Table Header for Blinks:
Event Type	Trial	Number	Start	End	Duration

Table Header for User Events:
Event Type	Trial	Number	Start	Description

UserEvent	1	1	2753851917	# Message: void.jpg
Fixation L	1	1	2753864023	2754062871	198848	499.75	270.56	5	38	-1	15.10	15.10
Fixation R	1	1	2753864023	2754062871	198848	499.75	270.56	5	38	-1	14.29	14.29
Saccade L	1	1	2754062871	2754082754	19883	501.10	279.31	728.96	309.43	1.34	232.39	1.00	67.61	5535.39	-5645.94	3755.12
Saccade R	1	1	2754062871	2754082754	19883	501.10	279.31	728.96	309.43	1.34	232.39	1.00	67.61	5535.39	-5645.94	3755.12
Fixation L	1	2	2754082754	2754400981	318227	764.70	290.52	48	44	-1	15.32	15.32
Fixation R	1	2	2754082754	2754400981	318227	764.70	290.52	48	44	-1	15.14	15.14
Blink L	1	1	2754400981	2754599988	199007
Blink R	1	1	2754400981	2754599988	199007
Fixation L	1	3	2754679461	2754977835	298374	829.98	210.79	12	75	-1	14.64	14.64
Fixation R	1	3	2754679461	2754977835	298374	829.98	210.79	12	75	-1	13.88	13.88
Saccade L	1	2	2754977835	2755017583	39748	827.39	205.84	781.32	271.88	1.89	113.25	0.50	47.65	2714.78	-2085.48	2269.46
Saccade R	1	2	2754977835	2755017583	39748	827.39	205.84	781.32	271.88	1.89	113.25	0.50	47.65	2714.78	-2085.48	2269.46
Fixation L	1	4	2755017583	2755455176	437593	771.63	306.86	25	47	-1	14.87	14.87
Fixation R	1	4	2755017583	2755455176	437593	771.63	306.86	25	47	-1	14.15	14.15
Saccade L	1	3	2755455176	2755475049	19873	775.51	299.56	884.97	303.34	0.84	110.78	1.00	42.38	2709.98	-2108.37	2041.50
Saccade R	1	3	2755455176	2755475049	19873	775.51	299.56	884.97	303.34	0.84	110.78	1.00	42.38	2709.98	-2108.37	2041.50
Fixation L	1	5	2755475049	2755713795	238746	864.97	335.72	47	51	-1	15.01	15.01
Fixation R	1	5	2755475049	2755713795	238746	864.97	335.72	47	51	-1	14.40	14.40
Saccade L	1	4	2755713795	2755733666	19871	868.36	354.43	868.32	358.65	0.11	6.14	1.00	5.29	167.68	-10.00	59.86
Saccade R	1	4	2755713795	2755733666	19871	868.36	354.43	868.32	358.65	0.11	6.14	1.00	5.29	167.68	-10.00	59.86
Fixation L	1	6	2755733666	2755853030	119364	868.61	376.23	10	29	-1	15.15	15.15
Fixation R	1	6	2755733666	2755853030	119364	868.61	376.23	10	29	-1	14.43	14.43
