[BeGaze]
Converted from:	C:\Documents and Settings\iViewX\Desktop\EXPERIMENTATIONS\Experiments\results\finaleart\S19F21442-finaleart-1.idf
Date:	27.03.2019 15:50:44
Version:	BeGaze 2.5.77
Sample Rate:	50
Subject:	S19F21442
Description:	Juliette Veuillez

Table Header for Fixations:
Event Type	Trial	Number	Start	End	Duration	Location X	Location Y	Dispersion X	Dispersion Y	Plane	Avg. Pupil Size X	Avg. Pupil Size Y

Table Header for Saccades:
Event Type	Trial	Number	Start	End	Duration	Start Loc.X	Start Loc.Y	End Loc.X	End Loc.Y	Amplitude	Peak Speed	Peak Speed At	Average Speed	Peak Accel.	Peak Decel.	Average Accel.

Table Header for Blinks:
Event Type	Trial	Number	Start	End	Duration

Table Header for User Events:
Event Type	Trial	Number	Start	Description

UserEvent	1	1	6641656119	# Message: chestnut_avenue_in_la_celle_saint_cloud_sisley_1865.jpg
Fixation L	1	1	6641674777	6642052784	378007	534.98	418.90	40	20	-1	12.63	12.63
Fixation R	1	1	6641674777	6642052784	378007	534.98	418.90	40	20	-1	15.42	15.42
Saccade L	1	1	6642052784	6642092509	39725	559.08	433.15	1031.95	570.05	4.24	281.06	0.50	106.71	6931.13	-6817.20	5949.98
Saccade R	1	1	6642052784	6642092509	39725	559.08	433.15	1031.95	570.05	4.24	281.06	0.50	106.71	6931.13	-6817.20	5949.98
Fixation L	1	2	6642092509	6642490242	397733	1040.51	587.77	19	45	-1	11.26	11.26
Fixation R	1	2	6642092509	6642490242	397733	1040.51	587.77	19	45	-1	13.09	13.09
Saccade L	1	2	6642490242	6642510240	19998	1044.20	567.77	977.79	421.44	1.04	162.52	1.00	51.89	4000.06	-3740.85	2775.64
Saccade R	1	2	6642490242	6642510240	19998	1044.20	567.77	977.79	421.44	1.04	162.52	1.00	51.89	4000.06	-3740.85	2775.64
Fixation L	1	3	6642510240	6642709105	198865	980.00	429.85	17	14	-1	11.16	11.16
Fixation R	1	3	6642510240	6642709105	198865	980.00	429.85	17	14	-1	12.50	12.50
Saccade L	1	3	6642709105	6642728981	19876	979.34	424.44	998.85	207.83	1.29	219.90	1.00	64.93	5388.19	-5226.44	3654.44
Saccade R	1	3	6642709105	6642728981	19876	979.34	424.44	998.85	207.83	1.29	219.90	1.00	64.93	5388.19	-5226.44	3654.44
Fixation L	1	4	6642728981	6643325707	596726	1022.55	173.93	31	45	-1	11.58	11.58
Fixation R	1	4	6642728981	6643325707	596726	1022.55	173.93	31	45	-1	13.40	13.40
Saccade L	1	4	6643325707	6643345572	19865	1030.06	166.35	1115.67	243.38	0.68	116.48	1.00	34.19	2706.70	-2514.17	1782.57
Saccade R	1	4	6643325707	6643345572	19865	1030.06	166.35	1115.67	243.38	0.68	116.48	1.00	34.19	2706.70	-2514.17	1782.57
Fixation L	1	5	6643345572	6643624067	278495	1113.73	234.66	14	33	-1	12.07	12.07
Fixation R	1	5	6643345572	6643624067	278495	1113.73	234.66	14	33	-1	14.29	14.29
Saccade L	1	5	6643624067	6643683686	59619	1110.96	234.77	1482.56	424.78	4.68	254.06	0.67	78.44	6278.90	-5692.01	3297.58
Saccade R	1	5	6643624067	6643683686	59619	1110.96	234.77	1482.56	424.78	4.68	254.06	0.67	78.44	6278.90	-5692.01	3297.58
Fixation L	1	6	6643683686	6644200790	517104	1478.07	482.17	18	73	-1	13.00	13.00
Fixation R	1	6	6643683686	6644200790	517104	1478.07	482.17	18	73	-1	14.41	14.41
Saccade L	1	6	6644200790	6644280407	79617	1476.02	497.28	728.26	668.46	9.31	313.51	0.50	116.98	7789.80	-6313.52	4698.36
Saccade R	1	6	6644200790	6644280407	79617	1476.02	497.28	728.26	668.46	9.31	313.51	0.50	116.98	7789.80	-6313.52	4698.36
Fixation L	1	7	6644280407	6644479277	198870	719.95	671.50	21	64	-1	13.21	13.21
Fixation R	1	7	6644280407	6644479277	198870	719.95	671.50	21	64	-1	15.59	15.59
Saccade L	1	7	6644479277	6644499150	19873	726.36	718.98	923.99	950.45	1.90	307.61	1.00	95.39	7499.67	-7625.05	5513.02
Saccade R	1	7	6644479277	6644499150	19873	726.36	718.98	923.99	950.45	1.90	307.61	1.00	95.39	7499.67	-7625.05	5513.02
Fixation L	1	8	6644499150	6644737891	238741	928.42	948.41	20	38	-1	11.92	11.92
Fixation R	1	8	6644499150	6644737891	238741	928.42	948.41	20	38	-1	15.13	15.13
Saccade L	1	8	6644737891	6644777631	39740	932.69	923.06	828.15	808.46	1.76	123.92	0.50	44.37	2986.29	-2908.87	1915.03
Saccade R	1	8	6644737891	6644777631	39740	932.69	923.06	828.15	808.46	1.76	123.92	0.50	44.37	2986.29	-2908.87	1915.03
Fixation L	1	9	6644777631	6645155623	377992	820.51	777.42	24	56	-1	11.31	11.31
Fixation R	1	9	6644777631	6645155623	377992	820.51	777.42	24	56	-1	14.17	14.17
Saccade L	1	9	6645155623	6645195372	39749	814.50	783.55	508.27	912.13	3.14	198.22	0.50	79.04	4773.79	-3824.30	3852.53
Saccade R	1	9	6645155623	6645195372	39749	814.50	783.55	508.27	912.13	3.14	198.22	0.50	79.04	4773.79	-3824.30	3852.53
Fixation L	1	10	6645195372	6645573224	377852	532.57	963.24	36	61	-1	11.33	11.33
Fixation R	1	10	6645195372	6645573224	377852	532.57	963.24	36	61	-1	14.67	14.67
Saccade L	1	10	6645573224	6645652858	79634	544.40	969.04	600.97	409.95	8.03	273.37	0.50	100.87	6748.06	-6266.08	4990.36
Saccade R	1	10	6645573224	6645652858	79634	544.40	969.04	600.97	409.95	8.03	273.37	0.50	100.87	6748.06	-6266.08	4990.36
