[BeGaze]
Converted from:	C:\Documents and Settings\iViewX\Desktop\EXPERIMENTATIONS\Experiments\results\finaleart\S22H22551-finaleart-1.idf
Date:	27.03.2019 15:57:04
Version:	BeGaze 2.5.77
Sample Rate:	50
Subject:	S22H22551
Description:	Mathieu Chambre

Table Header for Fixations:
Event Type	Trial	Number	Start	End	Duration	Location X	Location Y	Dispersion X	Dispersion Y	Plane	Avg. Pupil Size X	Avg. Pupil Size Y

Table Header for Saccades:
Event Type	Trial	Number	Start	End	Duration	Start Loc.X	Start Loc.Y	End Loc.X	End Loc.Y	Amplitude	Peak Speed	Peak Speed At	Average Speed	Peak Accel.	Peak Decel.	Average Accel.

Table Header for Blinks:
Event Type	Trial	Number	Start	End	Duration

Table Header for User Events:
Event Type	Trial	Number	Start	Description

UserEvent	1	1	4821914129	# Message: void.jpg
Saccade L	1	1	4821931924	4822031293	99369	212.17	851.63	60.65	430.66	7.09	323.81	1.00	71.31	7945.89	-8064.18	3160.38
Saccade R	1	1	4821931924	4822031293	99369	212.17	851.63	60.65	430.66	7.09	323.81	1.00	71.31	7945.89	-8064.18	3160.38
Fixation L	1	1	4822031293	4822150656	119363	99.29	450.47	56	42	-1	17.31	17.31
Fixation R	1	1	4822031293	4822150656	119363	99.29	450.47	56	42	-1	17.44	17.44
Saccade L	1	2	4822150656	4822170533	19877	113.02	472.75	124.57	476.89	0.13	12.41	1.00	6.73	99.53	-247.36	144.02
Saccade R	1	2	4822150656	4822170533	19877	113.02	472.75	124.57	476.89	0.13	12.41	1.00	6.73	99.53	-247.36	144.02
Fixation L	1	2	4822170533	4822369522	198989	133.08	488.66	31	22	-1	17.61	17.61
Fixation R	1	2	4822170533	4822369522	198989	133.08	488.66	31	22	-1	17.51	17.51
Blink L	1	1	4822449009	4822548510	99501
Blink R	1	1	4822468885	4822548510	79625
Saccade L	1	3	4822548510	4822568381	19871	1197.44	485.01	1191.04	462.34	6.86	1301.75	1.00	345.31	507.51	-31948.01	10827.58
Saccade R	1	3	4822548510	4822568381	19871	1197.44	485.01	1191.04	462.34	6.86	1301.75	1.00	345.31	507.51	-31948.01	10827.58
Fixation L	1	3	4822568381	4822687761	119380	1183.36	412.77	11	66	-1	18.60	18.60
Fixation R	1	3	4822568381	4822687761	119380	1183.36	412.77	11	66	-1	19.50	19.50
Blink L	1	2	4822687761	4822926361	238600
Blink R	1	2	4822687761	4822926361	238600
Fixation L	1	4	4822926361	4823363974	437613	1239.11	376.61	15	34	-1	19.06	19.06
Fixation R	1	4	4822926361	4823363974	437613	1239.11	376.61	15	34	-1	19.03	19.03
Saccade L	1	4	4823363974	4823383844	19870	1229.46	379.99	1129.94	381.31	0.59	100.68	1.00	29.87	2479.06	-2469.22	1736.08
Saccade R	1	4	4823363974	4823383844	19870	1229.46	379.99	1129.94	381.31	0.59	100.68	1.00	29.87	2479.06	-2469.22	1736.08
Fixation L	1	5	4823383844	4823900943	517099	1144.24	393.93	18	17	-1	18.00	18.00
Fixation R	1	5	4823383844	4823900943	517099	1144.24	393.93	18	17	-1	17.72	17.72
