[BeGaze]
Converted from:	C:\Documents and Settings\iViewX\Desktop\EXPERIMENTATIONS\Experiments\results\finaleart\S11H21112-finaleart-1.idf
Date:	27.03.2019 15:39:01
Version:	BeGaze 2.5.77
Sample Rate:	50
Subject:	S11H21112
Description:	Clement legrand-Duchenne

Table Header for Fixations:
Event Type	Trial	Number	Start	End	Duration	Location X	Location Y	Dispersion X	Dispersion Y	Plane	Avg. Pupil Size X	Avg. Pupil Size Y

Table Header for Saccades:
Event Type	Trial	Number	Start	End	Duration	Start Loc.X	Start Loc.Y	End Loc.X	End Loc.Y	Amplitude	Peak Speed	Peak Speed At	Average Speed	Peak Accel.	Peak Decel.	Average Accel.

Table Header for Blinks:
Event Type	Trial	Number	Start	End	Duration

Table Header for User Events:
Event Type	Trial	Number	Start	Description

UserEvent	1	1	5064180212	# Message: study_of_a_reclining_nude_Delacroix_1824.jpg
Fixation L	1	1	5064192737	5064690215	497478	951.49	490.73	47	47	-1	13.57	13.57
Fixation R	1	1	5064192737	5064690215	497478	951.49	490.73	47	47	-1	14.77	14.77
Saccade L	1	1	5064690215	5064710075	19860	984.14	508.40	997.45	516.17	0.41	53.26	1.00	20.48	-61.89	-941.88	387.32
Saccade R	1	1	5064690215	5064710075	19860	984.14	508.40	997.45	516.17	0.41	53.26	1.00	20.48	-61.89	-941.88	387.32
Fixation L	1	2	5064710075	5065406532	696457	1011.87	542.62	19	40	-1	13.63	13.63
Fixation R	1	2	5064710075	5065406532	696457	1011.87	542.62	19	40	-1	14.35	14.35
Saccade L	1	2	5065406532	5065446408	39876	1013.32	530.23	1421.00	349.58	3.75	240.84	1.00	93.99	5805.03	-5608.92	5413.63
Saccade R	1	2	5065406532	5065446408	39876	1013.32	530.23	1421.00	349.58	3.75	240.84	1.00	93.99	5805.03	-5608.92	5413.63
Fixation L	1	3	5065446408	5065904020	457612	1420.74	341.71	23	58	-1	13.53	13.53
Fixation R	1	3	5065446408	5065904020	457612	1420.74	341.71	23	58	-1	13.83	13.83
Saccade L	1	3	5065904020	5065923885	19865	1414.92	350.74	1401.59	367.69	0.27	21.81	1.00	13.41	158.71	-144.16	148.76
Saccade R	1	3	5065904020	5065923885	19865	1414.92	350.74	1401.59	367.69	0.27	21.81	1.00	13.41	158.71	-144.16	148.76
Fixation L	1	4	5065923885	5066441241	517356	1389.82	395.25	24	73	-1	14.08	14.08
Fixation R	1	4	5065923885	5066441241	517356	1389.82	395.25	24	73	-1	13.94	13.94
Saccade L	1	4	5066441241	5066520866	79625	1378.26	400.42	1246.15	556.43	3.48	182.64	1.00	43.71	3649.32	-4502.48	1782.69
Saccade R	1	4	5066441241	5066520866	79625	1378.26	400.42	1246.15	556.43	3.48	182.64	1.00	43.71	3649.32	-4502.48	1782.69
Fixation L	1	5	5066520866	5066878969	358103	1256.43	535.24	23	74	-1	15.00	15.00
Fixation R	1	5	5066520866	5066878969	358103	1256.43	535.24	23	74	-1	15.06	15.06
Saccade L	1	5	5066878969	5066898847	19878	1268.46	482.60	1263.68	475.61	0.22	24.82	1.00	11.14	-29.54	-406.30	188.02
Saccade R	1	5	5066878969	5066898847	19878	1268.46	482.60	1263.68	475.61	0.22	24.82	1.00	11.14	-29.54	-406.30	188.02
Fixation L	1	6	5066898847	5067197327	298480	1254.92	501.13	21	50	-1	15.26	15.26
Fixation R	1	6	5066898847	5067197327	298480	1254.92	501.13	21	50	-1	14.93	14.93
Saccade L	1	6	5067197327	5067237205	39878	1251.39	519.68	1254.99	520.50	2.67	162.52	0.50	66.98	3920.89	-3980.64	3910.77
Saccade R	1	6	5067197327	5067237205	39878	1251.39	519.68	1254.99	520.50	2.67	162.52	0.50	66.98	3920.89	-3980.64	3910.77
Fixation L	1	7	5067237205	5067854059	616854	1260.96	525.52	11	28	-1	15.25	15.25
Fixation R	1	7	5067237205	5067854059	616854	1260.96	525.52	11	28	-1	17.26	17.26
Saccade L	1	7	5067854059	5067913680	59621	1255.05	521.19	645.09	671.62	7.00	311.27	0.67	117.34	7670.48	-6507.55	4590.64
Saccade R	1	7	5067854059	5067913680	59621	1255.05	521.19	645.09	671.62	7.00	311.27	0.67	117.34	7670.48	-6507.55	4590.64
Fixation L	1	8	5067913680	5068172418	258738	626.03	720.50	27	62	-1	15.57	15.57
Fixation R	1	8	5067913680	5068172418	258738	626.03	720.50	27	62	-1	18.27	18.27
