[BeGaze]
Converted from:	C:\Documents and Settings\iViewX\Desktop\EXPERIMENTATIONS\Experiments\results\finaleart\S22H22551-finaleart-1.idf
Date:	27.03.2019 15:58:52
Version:	BeGaze 2.5.77
Sample Rate:	50
Subject:	S22H22551
Description:	Mathieu Chambre

Table Header for Fixations:
Event Type	Trial	Number	Start	End	Duration	Location X	Location Y	Dispersion X	Dispersion Y	Plane	Avg. Pupil Size X	Avg. Pupil Size Y

Table Header for Saccades:
Event Type	Trial	Number	Start	End	Duration	Start Loc.X	Start Loc.Y	End Loc.X	End Loc.Y	Amplitude	Peak Speed	Peak Speed At	Average Speed	Peak Accel.	Peak Decel.	Average Accel.

Table Header for Blinks:
Event Type	Trial	Number	Start	End	Duration

Table Header for User Events:
Event Type	Trial	Number	Start	Description

UserEvent	1	1	5775784015	# Message: void.jpg
Blink L	1	1	5775796408	5775876023	79615
Blink R	1	1	5775796408	5775876023	79615
Fixation L	1	1	5775876023	5776074885	198862	855.00	538.85	7	7	-1	15.19	15.19
Fixation R	1	1	5775876023	5776074885	198862	855.00	538.85	7	7	-1	14.35	14.35
Saccade L	1	1	5776074885	5776094886	20001	858.73	535.03	724.75	409.48	1.01	185.68	1.00	50.41	4590.96	-4505.65	3132.38
Saccade R	1	1	5776074885	5776094886	20001	858.73	535.03	724.75	409.48	1.01	185.68	1.00	50.41	4590.96	-4505.65	3132.38
Fixation L	1	2	5776094886	5776293747	198861	725.61	428.44	8	32	-1	14.26	14.26
Fixation R	1	2	5776094886	5776293747	198861	725.61	428.44	8	32	-1	13.13	13.13
Blink L	1	2	5776293747	5776452865	159118
Blink R	1	2	5776293747	5776452865	159118
Fixation L	1	3	5776452865	5776572236	119371	1213.82	371.07	14	85	-1	12.22	12.22
Fixation R	1	3	5776452865	5776572236	119371	1213.82	371.07	14	85	-1	14.92	14.92
Saccade L	1	2	5776572236	5776592124	19888	1209.62	391.90	1206.80	397.06	0.05	5.95	1.00	2.76	116.64	-15.92	52.82
Saccade R	1	2	5776572236	5776592124	19888	1209.62	391.90	1206.80	397.06	0.05	5.95	1.00	2.76	116.64	-15.92	52.82
Fixation L	1	4	5776592124	5776930213	338089	1182.46	405.44	67	28	-1	15.56	15.56
Fixation R	1	4	5776592124	5776930213	338089	1182.46	405.44	67	28	-1	15.94	15.94
Saccade L	1	3	5776930213	5776950092	19879	1142.73	419.76	1134.40	422.95	0.12	11.22	1.00	6.20	-53.12	-117.84	75.29
Saccade R	1	3	5776930213	5776950092	19879	1142.73	419.76	1134.40	422.95	0.12	11.22	1.00	6.20	-53.12	-117.84	75.29
Fixation L	1	5	5776950092	5777367818	417726	1113.50	424.65	57	8	-1	16.27	16.27
Fixation R	1	5	5776950092	5777367818	417726	1113.50	424.65	57	8	-1	16.23	16.23
Saccade L	1	4	5777367818	5777387693	19875	1082.57	429.90	1028.89	431.16	0.39	54.32	1.00	19.50	1295.29	-1061.77	909.72
Saccade R	1	4	5777367818	5777387693	19875	1082.57	429.90	1028.89	431.16	0.39	54.32	1.00	19.50	1295.29	-1061.77	909.72
Fixation L	1	6	5777387693	5777785419	397726	1019.51	425.95	71	13	-1	16.51	16.51
Fixation R	1	6	5777387693	5777785419	397726	1019.51	425.95	71	13	-1	16.46	16.46
