[BeGaze]
Converted from:	C:\Documents and Settings\iViewX\Desktop\EXPERIMENTATIONS\Experiments\results\finaleart\S7121223-finaleart-1.idf
Date:	27.03.2019 15:36:37
Version:	BeGaze 2.5.77
Sample Rate:	50
Subject:	S7121223
Description:	Gregoire pacreau

Table Header for Fixations:
Event Type	Trial	Number	Start	End	Duration	Location X	Location Y	Dispersion X	Dispersion Y	Plane	Avg. Pupil Size X	Avg. Pupil Size Y

Table Header for Saccades:
Event Type	Trial	Number	Start	End	Duration	Start Loc.X	Start Loc.Y	End Loc.X	End Loc.Y	Amplitude	Peak Speed	Peak Speed At	Average Speed	Peak Accel.	Peak Decel.	Average Accel.

Table Header for Blinks:
Event Type	Trial	Number	Start	End	Duration

Table Header for User Events:
Event Type	Trial	Number	Start	Description

UserEvent	1	1	3771248097	# Message: Turner-snow-storm-boat-off-a-harbours-mouth-1842.jpg
Fixation L	1	1	3771259563	3771717558	457995	769.92	573.01	72	12	-1	17.53	17.53
Fixation R	1	1	3771259563	3771717558	457995	769.92	573.01	72	12	-1	19.96	19.96
Saccade L	1	1	3771717558	3771737414	19856	834.64	569.86	1040.16	562.59	1.61	207.95	1.00	81.08	5106.29	-5101.11	3596.40
Saccade R	1	1	3771717558	3771737414	19856	834.64	569.86	1040.16	562.59	1.61	207.95	1.00	81.08	5106.29	-5101.11	3596.40
Fixation L	1	2	3771737414	3771956528	219114	1082.82	547.84	54	26	-1	15.84	15.84
Fixation R	1	2	3771737414	3771956528	219114	1082.82	547.84	54	26	-1	17.76	17.76
Saccade L	1	2	3771956528	3771976395	19867	1095.15	536.48	1146.74	537.30	0.32	52.19	1.00	16.24	1200.50	-1166.09	805.88
Saccade R	1	2	3771956528	3771976395	19867	1095.15	536.48	1146.74	537.30	0.32	52.19	1.00	16.24	1200.50	-1166.09	805.88
Fixation L	1	3	3771976395	3772175506	199111	1158.57	527.20	19	26	-1	13.14	13.14
Fixation R	1	3	3771976395	3772175506	199111	1158.57	527.20	19	26	-1	14.71	14.71
Saccade L	1	3	3772175506	3772195383	19877	1162.52	541.62	1082.69	656.54	0.96	141.52	1.00	48.48	3513.79	-3257.54	2266.37
Saccade R	1	3	3772175506	3772195383	19877	1162.52	541.62	1082.69	656.54	0.96	141.52	1.00	48.48	3513.79	-3257.54	2266.37
Fixation L	1	4	3772195383	3772613601	418218	1081.05	696.50	15	56	-1	12.95	12.95
Fixation R	1	4	3772195383	3772613601	418218	1081.05	696.50	15	56	-1	14.14	14.14
Saccade L	1	4	3772613601	3772633483	19882	1078.03	708.11	1046.93	709.75	0.25	31.50	1.00	12.69	716.62	-580.45	515.88
Saccade R	1	4	3772613601	3772633483	19882	1078.03	708.11	1046.93	709.75	0.25	31.50	1.00	12.69	716.62	-580.45	515.88
Fixation L	1	5	3772633483	3772892343	258860	1018.13	717.71	37	11	-1	13.66	13.66
Fixation R	1	5	3772633483	3772892343	258860	1018.13	717.71	37	11	-1	15.10	15.10
Saccade L	1	5	3772892343	3772912337	19994	1011.26	716.39	985.44	627.30	0.89	93.82	1.00	44.48	2238.02	-1772.40	1965.70
Blink R	1	1	3772892343	3773091460	199117
Blink L	1	1	3772912337	3773131340	219003
Fixation R	1	6	3773091460	3773449935	358475	1043.55	699.48	47	52	-1	16.03	16.03
Fixation L	1	6	3773131340	3773629175	497835	1056.99	703.88	59	37	-1	15.31	15.31
Saccade R	1	5	3773449935	3773469804	19869	1075.56	700.17	1076.98	704.99	0.17	11.69	0.00	8.32	0.99	-138.01	90.11
Fixation R	1	7	3773469804	3773788423	318619	1091.89	722.43	32	27	-1	15.35	15.35
Saccade L	1	6	3773629175	3773649054	19879	1087.74	721.60	1089.77	725.15	0.07	6.76	1.00	3.41	130.22	74.17	109.41
Fixation L	1	7	3773649054	3773788423	139369	1102.50	728.28	20	11	-1	14.75	14.75
Saccade L	1	7	3773788423	3773808288	19865	1109.79	720.73	1121.82	505.26	1.18	218.21	1.00	59.27	5365.48	-5191.06	3583.30
Saccade R	1	6	3773788423	3773808288	19865	1109.79	720.73	1121.82	505.26	1.18	218.21	1.00	59.27	5365.48	-5191.06	3583.30
Fixation L	1	8	3773808288	3774744245	935957	1155.33	494.96	61	29	-1	14.77	14.77
Fixation R	1	8	3773808288	3774744245	935957	1155.33	494.96	61	29	-1	15.24	15.24
Saccade L	1	8	3774744245	3774764124	19879	1183.30	511.43	1063.30	701.10	1.32	226.94	1.00	66.25	5563.21	-5127.52	3821.99
Saccade R	1	7	3774744245	3774764124	19879	1183.30	511.43	1063.30	701.10	1.32	226.94	1.00	66.25	5563.21	-5127.52	3821.99
Fixation L	1	9	3774764124	3775222098	457974	1021.98	729.97	56	40	-1	16.58	16.58
Fixation R	1	9	3774764124	3775222098	457974	1021.98	729.97	56	40	-1	17.33	17.33
Saccade L	1	9	3775222098	3775242095	19997	1050.49	739.57	1053.63	748.34	0.13	9.42	1.00	6.27	148.93	0.00	74.47
Saccade R	1	8	3775222098	3775242095	19997	1050.49	739.57	1053.63	748.34	0.13	9.42	1.00	6.27	148.93	0.00	74.47
