[BeGaze]
Converted from:	C:\Documents and Settings\iViewX\Desktop\EXPERIMENTATIONS\Experiments\results\finaleart\S3121421-finaleart-1.idf
Date:	27.03.2019 15:34:10
Version:	BeGaze 2.5.77
Sample Rate:	50
Subject:	S3121421
Description:	Jean Jouve

Table Header for Fixations:
Event Type	Trial	Number	Start	End	Duration	Location X	Location Y	Dispersion X	Dispersion Y	Plane	Avg. Pupil Size X	Avg. Pupil Size Y

Table Header for Saccades:
Event Type	Trial	Number	Start	End	Duration	Start Loc.X	Start Loc.Y	End Loc.X	End Loc.Y	Amplitude	Peak Speed	Peak Speed At	Average Speed	Peak Accel.	Peak Decel.	Average Accel.

Table Header for Blinks:
Event Type	Trial	Number	Start	End	Duration

Table Header for User Events:
Event Type	Trial	Number	Start	Description

UserEvent	1	1	5341390996	# Message: void.jpg
Saccade L	1	1	5341403092	5341442838	39746	874.53	457.00	525.30	463.36	4.10	256.47	0.50	103.10	2418.51	-4932.40	2411.31
Saccade R	1	1	5341403092	5341442838	39746	874.53	457.00	525.30	463.36	4.10	256.47	0.50	103.10	2418.51	-4932.40	2411.31
Fixation L	1	1	5341442838	5341900558	457720	478.00	486.25	58	36	-1	12.17	12.17
Fixation R	1	1	5341442838	5341900558	457720	478.00	486.25	58	36	-1	12.61	12.61
Saccade L	1	2	5341900558	5342139308	238750	480.90	493.93	255.02	632.50	9.09	86.89	0.92	38.07	1958.83	-1932.54	1038.70
Saccade R	1	2	5341900558	5342139308	238750	480.90	493.93	255.02	632.50	9.09	86.89	0.92	38.07	1958.83	-1932.54	1038.70
Fixation L	1	2	5342139308	5343014753	875445	286.89	654.71	47	47	-1	10.33	10.33
Fixation R	1	2	5342139308	5343014753	875445	286.89	654.71	47	47	-1	11.02	11.02
Saccade L	1	3	5343014753	5343034618	19865	277.54	623.98	270.96	602.08	0.40	29.32	1.00	19.90	403.33	-242.86	291.63
Saccade R	1	3	5343014753	5343034618	19865	277.54	623.98	270.96	602.08	0.40	29.32	1.00	19.90	403.33	-242.86	291.63
Fixation L	1	3	5343034618	5343154103	119485	273.48	627.46	6	40	-1	10.15	10.15
Fixation R	1	3	5343034618	5343154103	119485	273.48	627.46	6	40	-1	11.28	11.28
Saccade L	1	4	5343154103	5343233606	79503	276.97	642.17	1004.68	445.70	9.13	220.66	0.50	114.82	5380.53	-4252.82	3466.62
Saccade R	1	4	5343154103	5343233606	79503	276.97	642.17	1004.68	445.70	9.13	220.66	0.50	114.82	5380.53	-4252.82	3466.62
Fixation L	1	4	5343233606	5343432581	198975	1036.55	437.39	43	18	-1	10.90	10.90
Fixation R	1	4	5343233606	5343432581	198975	1036.55	437.39	43	18	-1	11.27	11.27
