[BeGaze]
Converted from:	C:\Documents and Settings\iViewX\Desktop\EXPERIMENTATIONS\Experiments\results\finaleart\S02123220-finaleart-1.idf
Date:	27.03.2019 15:33:38
Version:	BeGaze 2.5.77
Sample Rate:	50
Subject:	S02123220
Description:	David Xu

Table Header for Fixations:
Event Type	Trial	Number	Start	End	Duration	Location X	Location Y	Dispersion X	Dispersion Y	Plane	Avg. Pupil Size X	Avg. Pupil Size Y

Table Header for Saccades:
Event Type	Trial	Number	Start	End	Duration	Start Loc.X	Start Loc.Y	End Loc.X	End Loc.Y	Amplitude	Peak Speed	Peak Speed At	Average Speed	Peak Accel.	Peak Decel.	Average Accel.

Table Header for Blinks:
Event Type	Trial	Number	Start	End	Duration

Table Header for User Events:
Event Type	Trial	Number	Start	Description

UserEvent	1	1	1445299348	# Message: void.jpg
Fixation L	1	1	1445313394	1445412883	99489	469.68	173.72	1	13	-1	13.01	13.01
Fixation R	1	1	1445313394	1445412883	99489	469.68	173.72	1	13	-1	13.86	13.86
Saccade L	1	1	1445412883	1445651524	238641	470.10	170.93	1005.65	678.37	19.13	331.17	0.83	80.18	8169.89	-6558.43	2996.19
Saccade R	1	1	1445412883	1445572002	159119	470.10	170.93	471.07	153.33	7.49	145.35	0.12	47.05	8169.89	-3347.88	2483.68
Blink R	1	1	1445572002	1445671498	99496
Fixation L	1	2	1445651524	1445810610	159086	1004.47	711.52	19	52	-1	14.99	14.99
Fixation R	1	2	1445671498	1445810610	139112	1004.32	715.66	19	35	-1	12.18	12.18
Saccade L	1	2	1445810610	1445929981	119371	996.57	701.98	1146.20	661.88	5.78	123.13	0.17	48.44	2599.98	-2442.11	1433.97
Saccade R	1	2	1445810610	1445929981	119371	996.57	701.98	1146.20	661.88	5.78	123.13	0.17	48.44	2599.98	-2442.11	1433.97
Fixation L	1	3	1445929981	1446049349	119368	1141.27	688.51	17	46	-1	14.05	14.05
Fixation R	1	3	1445929981	1446049349	119368	1141.27	688.51	17	46	-1	11.06	11.06
Blink L	1	1	1446049349	1446367575	318226
Blink R	1	2	1446049349	1446367575	318226
Saccade L	1	3	1446367575	1446387447	19872	1035.13	449.08	1038.63	492.85	0.55	44.42	1.00	27.76	719.60	-714.81	606.20
Saccade R	1	3	1446367575	1446387447	19872	1035.13	449.08	1038.63	492.85	0.55	44.42	1.00	27.76	719.60	-714.81	606.20
Fixation L	1	4	1446387447	1446785326	397879	1049.67	521.36	26	66	-1	15.16	15.16
Fixation R	1	4	1446387447	1446785326	397879	1049.67	521.36	26	66	-1	11.66	11.66
Saccade L	1	4	1446785326	1446864797	79471	1064.22	481.79	916.54	472.33	2.20	88.85	1.00	27.70	2153.41	-2057.36	1104.64
Saccade R	1	4	1446785326	1446864797	79471	1064.22	481.79	916.54	472.33	2.20	88.85	1.00	27.70	2153.41	-2057.36	1104.64
Fixation L	1	5	1446864797	1447282525	417728	896.46	496.27	26	44	-1	16.07	16.07
Fixation R	1	5	1446864797	1447282525	417728	896.46	496.27	26	44	-1	12.84	12.84
