[BeGaze]
Converted from:	C:\Documents and Settings\iViewX\Desktop\EXPERIMENTATIONS\Experiments\results\finaleart\S01A22542-finaleart-1.idf
Date:	27.03.2019 15:33:24
Version:	BeGaze 2.5.77
Sample Rate:	50
Subject:	S01A22542
Description:	Thibault Seve Minnaert

Table Header for Fixations:
Event Type	Trial	Number	Start	End	Duration	Location X	Location Y	Dispersion X	Dispersion Y	Plane	Avg. Pupil Size X	Avg. Pupil Size Y

Table Header for Saccades:
Event Type	Trial	Number	Start	End	Duration	Start Loc.X	Start Loc.Y	End Loc.X	End Loc.Y	Amplitude	Peak Speed	Peak Speed At	Average Speed	Peak Accel.	Peak Decel.	Average Accel.

Table Header for Blinks:
Event Type	Trial	Number	Start	End	Duration

Table Header for User Events:
Event Type	Trial	Number	Start	Description

UserEvent	1	1	9844543193	# Message: monticelli-still-life-with-white-pitcher-1822.jpg
Fixation L	1	1	9844558957	9844678436	119479	883.92	543.57	88	10	-1	13.79	13.79
Fixation R	1	1	9844558957	9844678436	119479	883.92	543.57	88	10	-1	14.22	14.22
Saccade L	1	1	9844678436	9844698303	19867	867.01	539.76	867.49	538.98	0.06	6.41	1.00	3.24	98.26	-55.64	82.22
Saccade R	1	1	9844678436	9844698303	19867	867.01	539.76	867.49	538.98	0.06	6.41	1.00	3.24	98.26	-55.64	82.22
Fixation L	1	2	9844698303	9844996940	298637	866.70	521.68	3	28	-1	13.91	13.91
Fixation R	1	2	9844698303	9844996940	298637	866.70	521.68	3	28	-1	14.37	14.37
Saccade L	1	2	9844996940	9845036800	39860	864.71	518.61	957.59	295.18	2.16	158.84	0.50	54.17	3916.83	-3558.24	2889.11
Saccade R	1	2	9844996940	9845036800	39860	864.71	518.61	957.59	295.18	2.16	158.84	0.50	54.17	3916.83	-3558.24	2889.11
Fixation L	1	3	9845036800	9845295656	258856	978.03	302.45	27	12	-1	13.44	13.44
Fixation R	1	3	9845036800	9845295656	258856	978.03	302.45	27	12	-1	13.75	13.75
Saccade L	1	3	9845295656	9845335401	39745	980.70	302.02	1223.19	270.86	2.03	162.70	1.00	50.96	3997.11	-3678.56	2957.65
Saccade R	1	3	9845295656	9845335401	39745	980.70	302.02	1223.19	270.86	2.03	162.70	1.00	50.96	3997.11	-3678.56	2957.65
Fixation L	1	4	9845335401	9845693761	358360	1244.45	269.70	74	23	-1	12.44	12.44
Fixation R	1	4	9845335401	9845693761	358360	1244.45	269.70	74	23	-1	12.83	12.83
Saccade L	1	4	9845693761	9845713751	19990	1294.72	283.73	1299.93	276.85	0.16	9.77	1.00	7.92	154.52	-103.12	94.56
Saccade R	1	4	9845693761	9845713751	19990	1294.72	283.73	1299.93	276.85	0.16	9.77	1.00	7.92	154.52	-103.12	94.56
Fixation L	1	5	9845713751	9846271231	557480	1293.34	304.17	50	48	-1	13.13	13.13
Fixation R	1	5	9845713751	9846271231	557480	1293.34	304.17	50	48	-1	13.16	13.16
Saccade L	1	5	9846271231	9846291100	19869	1321.63	319.16	1386.12	304.84	0.62	66.83	1.00	30.96	1641.16	-1563.51	1462.34
Saccade R	1	5	9846271231	9846291100	19869	1321.63	319.16	1386.12	304.84	0.62	66.83	1.00	30.96	1641.16	-1563.51	1462.34
Fixation L	1	6	9846291100	9846848580	557480	1380.34	310.57	12	14	-1	13.16	13.16
Fixation R	1	6	9846291100	9846848580	557480	1380.34	310.57	12	14	-1	13.15	13.15
Saccade L	1	6	9846848580	9846908316	59736	1383.84	318.04	973.93	655.36	5.50	298.59	0.67	92.11	7385.79	-7258.17	4188.24
Saccade R	1	6	9846848580	9846908316	59736	1383.84	318.04	973.93	655.36	5.50	298.59	0.67	92.11	7385.79	-7258.17	4188.24
Fixation L	1	7	9846908316	9847107433	199117	967.94	645.80	51	25	-1	13.93	13.93
Fixation R	1	7	9846908316	9847107433	199117	967.94	645.80	51	25	-1	13.44	13.44
Saccade L	1	7	9847107433	9847127333	19900	922.37	635.25	831.53	569.38	0.84	113.50	1.00	41.96	2818.02	-2470.06	2177.76
Saccade R	1	7	9847107433	9847127333	19900	922.37	635.25	831.53	569.38	0.84	113.50	1.00	41.96	2818.02	-2470.06	2177.76
Fixation L	1	8	9847127333	9847346305	218972	828.95	563.60	4	27	-1	13.84	13.84
Fixation R	1	8	9847127333	9847346305	218972	828.95	563.60	4	27	-1	13.64	13.64
Blink L	1	1	9847346305	9847565425	219120
Blink R	1	1	9847346305	9847565425	219120
Fixation L	1	9	9847565425	9847724661	159236	889.84	585.21	11	5	-1	15.00	15.00
Fixation R	1	9	9847565425	9847724661	159236	889.84	585.21	11	5	-1	14.98	14.98
Saccade L	1	8	9847724661	9847744541	19880	893.01	587.03	1001.51	603.37	0.62	110.98	1.00	31.29	2735.07	-2535.40	1774.94
Saccade R	1	8	9847724661	9847744541	19880	893.01	587.03	1001.51	603.37	0.62	110.98	1.00	31.29	2735.07	-2535.40	1774.94
Fixation L	1	10	9847744541	9847903907	159366	998.13	618.02	6	26	-1	15.71	15.71
Fixation R	1	10	9847744541	9847903907	159366	998.13	618.02	6	26	-1	15.31	15.31
Saccade L	1	9	9847903907	9847943646	39739	997.26	629.95	807.28	788.11	2.21	135.92	1.00	55.74	3384.49	-3176.30	2967.06
Saccade R	1	9	9847903907	9847943646	39739	997.26	629.95	807.28	788.11	2.21	135.92	1.00	55.74	3384.49	-3176.30	2967.06
Fixation L	1	11	9847943646	9848122891	179245	784.99	802.70	28	20	-1	15.82	15.82
Fixation R	1	11	9847943646	9848122891	179245	784.99	802.70	28	20	-1	15.41	15.41
Saccade L	1	10	9848122891	9848162640	39749	780.15	808.61	1271.17	731.96	4.44	297.14	1.00	111.64	7328.00	-6146.01	5685.89
Saccade R	1	10	9848122891	9848162640	39749	780.15	808.61	1271.17	731.96	4.44	297.14	1.00	111.64	7328.00	-6146.01	5685.89
Fixation L	1	12	9848162640	9848401632	238992	1289.00	732.51	26	55	-1	15.13	15.13
Fixation R	1	12	9848162640	9848401632	238992	1289.00	732.51	26	55	-1	14.60	14.60
Saccade L	1	11	9848401632	9848441379	39747	1285.05	721.13	989.65	821.63	2.91	257.01	0.50	73.28	6398.54	-5847.10	3829.96
Saccade R	1	11	9848401632	9848441379	39747	1285.05	721.13	989.65	821.63	2.91	257.01	0.50	73.28	6398.54	-5847.10	3829.96
Fixation L	1	13	9848441379	9848540993	99614	976.71	804.78	21	25	-1	14.75	14.75
Fixation R	1	13	9848441379	9848540993	99614	976.71	804.78	21	25	-1	14.51	14.51
