[BeGaze]
Converted from:	C:\Documents and Settings\iViewX\Desktop\EXPERIMENTATIONS\Experiments\results\finaleart\S8119532-finaleart-1.idf
Date:	27.03.2019 15:59:22
Version:	BeGaze 2.5.77
Sample Rate:	50
Subject:	S8119532
Description:	Alexandre Drewery

Table Header for Fixations:
Event Type	Trial	Number	Start	End	Duration	Location X	Location Y	Dispersion X	Dispersion Y	Plane	Avg. Pupil Size X	Avg. Pupil Size Y

Table Header for Saccades:
Event Type	Trial	Number	Start	End	Duration	Start Loc.X	Start Loc.Y	End Loc.X	End Loc.Y	Amplitude	Peak Speed	Peak Speed At	Average Speed	Peak Accel.	Peak Decel.	Average Accel.

Table Header for Blinks:
Event Type	Trial	Number	Start	End	Duration

Table Header for User Events:
Event Type	Trial	Number	Start	Description

UserEvent	1	1	2503397603	# Message: void.jpg
Fixation L	1	1	2503398758	2503955596	556838	315.82	748.92	31	49	-1	14.22	14.22
Fixation R	1	1	2503398758	2503955596	556838	315.82	748.92	31	49	-1	16.27	16.27
Saccade L	1	1	2503955596	2503995362	39766	336.20	726.77	697.66	645.55	3.25	249.62	0.50	81.83	6183.20	-5859.57	4502.39
Saccade R	1	1	2503955596	2503995362	39766	336.20	726.77	697.66	645.55	3.25	249.62	0.50	81.83	6183.20	-5859.57	4502.39
Fixation L	1	2	2503995362	2504174467	179105	676.00	621.87	34	48	-1	14.43	14.43
Fixation R	1	2	2503995362	2504174467	179105	676.00	621.87	34	48	-1	15.97	15.97
Saccade L	1	2	2504174467	2504194340	19873	671.27	627.10	677.56	689.32	0.66	63.27	1.00	33.45	1487.51	-1420.29	1422.82
Saccade R	1	2	2504174467	2504194340	19873	671.27	627.10	677.56	689.32	0.66	63.27	1.00	33.45	1487.51	-1420.29	1422.82
Fixation L	1	3	2504194340	2504492705	298365	685.55	642.04	19	66	-1	14.96	14.96
Fixation R	1	3	2504194340	2504492705	298365	685.55	642.04	19	66	-1	16.63	16.63
Saccade L	1	3	2504492705	2504532452	39747	695.51	657.41	784.14	505.61	1.80	115.36	1.00	45.23	2716.31	-2378.01	1964.67
Saccade R	1	3	2504492705	2504532452	39747	695.51	657.41	784.14	505.61	1.80	115.36	1.00	45.23	2716.31	-2378.01	1964.67
Fixation L	1	4	2504532452	2505149035	616583	802.18	505.43	56	42	-1	15.84	15.84
Fixation R	1	4	2504532452	2505149035	616583	802.18	505.43	56	42	-1	17.22	17.22
Saccade L	1	4	2505149035	2505168933	19898	840.59	484.91	858.57	494.25	0.62	42.82	1.00	30.91	344.42	-270.12	210.16
Saccade R	1	4	2505149035	2505168933	19898	840.59	484.91	858.57	494.25	0.62	42.82	1.00	30.91	344.42	-270.12	210.16
Fixation L	1	5	2505168933	2505328049	159116	816.48	505.82	54	37	-1	16.49	16.49
Fixation R	1	5	2505168933	2505328049	159116	816.48	505.82	54	37	-1	18.03	18.03
Saccade L	1	5	2505328049	2505447409	119360	807.62	485.08	807.84	454.59	3.61	74.24	1.00	30.28	1488.88	-1337.95	553.25
Saccade R	1	5	2505328049	2505447409	119360	807.62	485.08	807.84	454.59	3.61	74.24	1.00	30.28	1488.88	-1337.95	553.25
