[BeGaze]
Converted from:	C:\Documents and Settings\iViewX\Desktop\EXPERIMENTATIONS\Experiments\results\finaleart\S9H29221-finaleart-1.idf
Date:	27.03.2019 16:04:07
Version:	BeGaze 2.5.77
Sample Rate:	50
Subject:	S9H29221
Description:	steven

Table Header for Fixations:
Event Type	Trial	Number	Start	End	Duration	Location X	Location Y	Dispersion X	Dispersion Y	Plane	Avg. Pupil Size X	Avg. Pupil Size Y

Table Header for Saccades:
Event Type	Trial	Number	Start	End	Duration	Start Loc.X	Start Loc.Y	End Loc.X	End Loc.Y	Amplitude	Peak Speed	Peak Speed At	Average Speed	Peak Accel.	Peak Decel.	Average Accel.

Table Header for Blinks:
Event Type	Trial	Number	Start	End	Duration

Table Header for User Events:
Event Type	Trial	Number	Start	Description

UserEvent	1	1	6849210072	# Message: void.jpg
Fixation L	1	1	6849211604	6849553243	341639	912.58	644.17	14	8	-1	12.32	12.32
Fixation R	1	1	6849211604	6849553243	341639	912.58	644.17	14	8	-1	11.43	11.43
Saccade L	1	1	6849553243	6849589588	36345	912.71	642.66	979.17	805.38	1.85	177.76	1.00	50.96	4399.22	-4269.84	3027.05
Saccade R	1	1	6849553243	6849589588	36345	912.71	642.66	979.17	805.38	1.85	177.76	1.00	50.96	4399.22	-4269.84	3027.05
Fixation L	1	2	6849589588	6850007194	417606	995.97	790.62	21	77	-1	12.90	12.90
Fixation R	1	2	6849589588	6850007194	417606	995.97	790.62	21	77	-1	11.63	11.63
Saccade L	1	2	6850007194	6850027198	20004	988.93	727.53	987.47	680.67	0.61	61.60	0.00	30.33	1113.65	-1304.63	1150.66
Saccade R	1	2	6850007194	6850027198	20004	988.93	727.53	987.47	680.67	0.61	61.60	0.00	30.33	1113.65	-1304.63	1150.66
Fixation L	1	3	6850027198	6850126555	99357	986.79	660.23	15	80	-1	13.26	13.26
Fixation R	1	3	6850027198	6850126555	99357	986.79	660.23	15	80	-1	11.92	11.92
Saccade L	1	3	6850126555	6850245932	119377	996.45	608.92	1033.43	477.48	3.21	69.21	1.00	26.89	1617.52	-1528.60	618.29
Saccade R	1	3	6850126555	6850245932	119377	996.45	608.92	1033.43	477.48	3.21	69.21	1.00	26.89	1617.52	-1528.60	618.29
Fixation L	1	4	6850245932	6850444785	198853	1069.54	444.89	52	39	-1	13.30	13.30
Fixation R	1	4	6850245932	6850444785	198853	1069.54	444.89	52	39	-1	11.87	11.87
Saccade L	1	4	6850444785	6850464660	19875	1086.40	442.74	1103.51	438.73	0.20	17.78	1.00	9.99	387.94	-119.32	288.41
Saccade R	1	4	6850444785	6850464660	19875	1086.40	442.74	1103.51	438.73	0.20	17.78	1.00	9.99	387.94	-119.32	288.41
Fixation L	1	5	6850464660	6850962011	497351	1150.69	412.87	57	41	-1	13.78	13.78
Fixation R	1	5	6850464660	6850962011	497351	1150.69	412.87	57	41	-1	12.55	12.55
Saccade L	1	5	6850962011	6850981878	19867	1158.38	416.60	1078.14	421.72	0.71	81.33	1.00	35.76	1972.26	-1717.76	1678.38
Saccade R	1	5	6850962011	6850981878	19867	1158.38	416.60	1078.14	421.72	0.71	81.33	1.00	35.76	1972.26	-1717.76	1678.38
Fixation L	1	6	6850981878	6851160880	179002	1042.24	460.59	44	51	-1	14.86	14.86
Fixation R	1	6	6850981878	6851160880	179002	1042.24	460.59	44	51	-1	13.37	13.37
Saccade L	1	6	6851160880	6851260249	99369	1037.33	471.81	1027.35	491.52	0.52	9.51	0.20	5.19	189.27	-190.44	78.39
Saccade R	1	6	6851160880	6851260249	99369	1037.33	471.81	1027.35	491.52	0.52	9.51	0.20	5.19	189.27	-190.44	78.39
