[BeGaze]
Converted from:	C:\Documents and Settings\iViewX\Desktop\EXPERIMENTATIONS\Experiments\results\finaleart\S01A22542-finaleart-1.idf
Date:	27.03.2019 15:33:19
Version:	BeGaze 2.5.77
Sample Rate:	50
Subject:	S01A22542
Description:	Thibault Seve Minnaert

Table Header for Fixations:
Event Type	Trial	Number	Start	End	Duration	Location X	Location Y	Dispersion X	Dispersion Y	Plane	Avg. Pupil Size X	Avg. Pupil Size Y

Table Header for Saccades:
Event Type	Trial	Number	Start	End	Duration	Start Loc.X	Start Loc.Y	End Loc.X	End Loc.Y	Amplitude	Peak Speed	Peak Speed At	Average Speed	Peak Accel.	Peak Decel.	Average Accel.

Table Header for Blinks:
Event Type	Trial	Number	Start	End	Duration

Table Header for User Events:
Event Type	Trial	Number	Start	Description

UserEvent	1	1	9126704228	# Message: void.jpg
Fixation L	1	1	9126708043	9126966898	258855	960.18	649.78	62	23	-1	12.08	12.08
Fixation R	1	1	9126708043	9126966898	258855	960.18	649.78	62	23	-1	11.83	11.83
Saccade L	1	1	9126966898	9126986772	19874	902.79	639.62	887.81	640.88	0.44	62.92	0.00	21.94	355.92	-1356.64	663.98
Saccade R	1	1	9126966898	9126986772	19874	902.79	639.62	887.81	640.88	0.44	62.92	0.00	21.94	355.92	-1356.64	663.98
Fixation L	1	2	9126986772	9127365041	378269	885.83	645.90	14	14	-1	11.92	11.92
Fixation R	1	2	9126986772	9127365041	378269	885.83	645.90	14	14	-1	12.28	12.28
Saccade L	1	2	9127365041	9127385016	19975	894.26	653.65	954.09	609.26	0.48	75.36	1.00	24.03	1820.77	-1150.47	1000.85
Saccade R	1	2	9127365041	9127385016	19975	894.26	653.65	954.09	609.26	0.48	75.36	1.00	24.03	1820.77	-1150.47	1000.85
Fixation L	1	3	9127385016	9127643736	258720	977.84	579.52	28	41	-1	12.60	12.60
Fixation R	1	3	9127385016	9127643736	258720	977.84	579.52	28	41	-1	12.48	12.48
Saccade L	1	3	9127643736	9127663721	19985	980.88	567.83	898.91	569.14	0.45	82.93	1.00	22.44	2046.80	-2012.96	1356.86
Saccade R	1	3	9127643736	9127663721	19985	980.88	567.83	898.91	569.14	0.45	82.93	1.00	22.44	2046.80	-2012.96	1356.86
Fixation L	1	4	9127663721	9128022077	358356	897.81	573.19	10	16	-1	13.01	13.01
Fixation R	1	4	9127663721	9128022077	358356	897.81	573.19	10	16	-1	12.96	12.96
Saccade L	1	4	9128022077	9128041964	19887	906.43	584.33	1008.24	582.79	0.60	103.00	1.00	30.34	2530.81	-2545.23	1778.80
Saccade R	1	4	9128022077	9128041964	19887	906.43	584.33	1008.24	582.79	0.60	103.00	1.00	30.34	2530.81	-2545.23	1778.80
Fixation L	1	5	9128041964	9128241100	199136	1001.06	594.08	14	29	-1	13.87	13.87
Fixation R	1	5	9128041964	9128241100	199136	1001.06	594.08	14	29	-1	13.36	13.36
Saccade L	1	5	9128241100	9128260955	19855	993.92	610.01	895.40	620.34	0.58	100.20	1.00	29.04	2390.01	-2401.73	1608.34
Saccade R	1	5	9128241100	9128260955	19855	993.92	610.01	895.40	620.34	0.58	100.20	1.00	29.04	2390.01	-2401.73	1608.34
Fixation L	1	6	9128260955	9128539683	278728	892.79	629.36	58	21	-1	13.98	13.98
Fixation R	1	6	9128260955	9128539683	278728	892.79	629.36	58	21	-1	13.85	13.85
Saccade L	1	6	9128539683	9128699061	159378	944.80	617.51	937.15	620.89	16.41	348.39	0.50	102.96	8348.75	-8262.55	3477.73
Saccade R	1	6	9128539683	9128699061	159378	944.80	617.51	937.15	620.89	16.41	348.39	0.50	102.96	8348.75	-8262.55	3477.73
