[BeGaze]
Converted from:	C:\Documents and Settings\iViewX\Desktop\EXPERIMENTATIONS\Experiments\results\finaleart\S14F27123-finaleart-1.idf
Date:	27.03.2019 15:44:06
Version:	BeGaze 2.5.77
Sample Rate:	50
Subject:	S14F27123
Description:	Anne-flore Perrin

Table Header for Fixations:
Event Type	Trial	Number	Start	End	Duration	Location X	Location Y	Dispersion X	Dispersion Y	Plane	Avg. Pupil Size X	Avg. Pupil Size Y

Table Header for Saccades:
Event Type	Trial	Number	Start	End	Duration	Start Loc.X	Start Loc.Y	End Loc.X	End Loc.Y	Amplitude	Peak Speed	Peak Speed At	Average Speed	Peak Accel.	Peak Decel.	Average Accel.

Table Header for Blinks:
Event Type	Trial	Number	Start	End	Duration

Table Header for User Events:
Event Type	Trial	Number	Start	Description

UserEvent	1	1	31729424447	# Message: Morning,_An_Overcast_Day_Rouen_Pissaro_1896.jpg
Fixation L	1	1	31729441772	31729899232	457460	834.86	646.80	10	39	-1	12.89	12.89
Fixation R	1	1	31729441772	31729899232	457460	834.86	646.80	10	39	-1	12.64	12.64
Saccade L	1	1	31729899232	31729919121	19889	827.43	637.54	640.68	625.07	1.05	189.27	1.00	52.67	4649.17	-4430.55	3075.43
Saccade R	1	1	31729899232	31729919121	19889	827.43	637.54	640.68	625.07	1.05	189.27	1.00	52.67	4649.17	-4430.55	3075.43
Fixation L	1	2	31729919121	31730177737	258616	658.40	601.66	22	45	-1	10.91	10.91
Fixation R	1	2	31729919121	31730177737	258616	658.40	601.66	22	45	-1	11.14	11.14
Saccade L	1	2	31730177737	31730197610	19873	658.17	579.83	571.74	561.68	0.57	89.34	1.00	28.61	2201.46	-2119.79	1476.87
Saccade R	1	2	31730177737	31730197610	19873	658.17	579.83	571.74	561.68	0.57	89.34	1.00	28.61	2201.46	-2119.79	1476.87
Fixation L	1	3	31730197610	31730376598	178988	561.65	538.97	18	35	-1	9.49	9.49
Fixation R	1	3	31730197610	31730376598	178988	561.65	538.97	18	35	-1	9.68	9.68
Saccade L	1	3	31730376598	31730436344	59746	553.15	526.45	1015.07	527.20	4.85	342.67	0.67	81.26	8500.85	-8179.59	3928.69
Saccade R	1	3	31730376598	31730436344	59746	553.15	526.45	1015.07	527.20	4.85	342.67	0.67	81.26	8500.85	-8179.59	3928.69
Fixation L	1	4	31730436344	31730595465	159121	1030.00	555.34	26	44	-1	9.85	9.85
Fixation R	1	4	31730436344	31730595465	159121	1030.00	555.34	26	44	-1	9.50	9.50
Saccade L	1	4	31730595465	31730615340	19875	1041.56	567.38	1263.09	571.38	1.23	224.03	1.00	61.75	5511.41	-5317.31	3680.21
Saccade R	1	4	31730595465	31730615340	19875	1041.56	567.38	1263.09	571.38	1.23	224.03	1.00	61.75	5511.41	-5317.31	3680.21
Fixation L	1	5	31730615340	31731013069	397729	1286.37	581.27	32	21	-1	9.97	9.97
Fixation R	1	5	31730615340	31731013069	397729	1286.37	581.27	32	21	-1	9.91	9.91
Saccade L	1	5	31731013069	31731033090	20021	1292.18	580.26	1339.96	634.83	0.51	73.37	1.00	25.41	1777.19	-1729.98	1234.46
Saccade R	1	5	31731013069	31731033090	20021	1292.18	580.26	1339.96	634.83	0.51	73.37	1.00	25.41	1777.19	-1729.98	1234.46
Fixation L	1	6	31731033090	31731231936	198846	1356.86	632.79	22	34	-1	10.34	10.34
Fixation R	1	6	31731033090	31731231936	198846	1356.86	632.79	22	34	-1	10.02	10.02
Saccade L	1	6	31731231936	31731271683	39747	1362.56	650.67	1037.55	650.16	2.72	209.45	0.50	68.49	5137.47	-5100.13	4002.49
Saccade R	1	6	31731231936	31731271683	39747	1362.56	650.67	1037.55	650.16	2.72	209.45	0.50	68.49	5137.47	-5100.13	4002.49
Fixation L	1	7	31731271683	31731550167	278484	1025.15	637.40	17	27	-1	11.29	11.29
Fixation R	1	7	31731271683	31731550167	278484	1025.15	637.40	17	27	-1	10.31	10.31
Saccade L	1	7	31731550167	31731589925	39758	1021.79	626.52	675.83	621.26	2.92	219.06	0.50	73.46	5285.51	-5338.15	4242.37
Saccade R	1	7	31731550167	31731589925	39758	1021.79	626.52	675.83	621.26	2.92	219.06	0.50	73.46	5285.51	-5338.15	4242.37
Fixation L	1	8	31731589925	31731828656	238731	690.33	614.05	25	22	-1	10.39	10.39
Fixation R	1	8	31731589925	31731828656	238731	690.33	614.05	25	22	-1	10.85	10.85
Saccade L	1	8	31731828656	31731868410	39754	700.66	619.74	550.36	931.27	3.42	211.59	1.00	86.14	5227.50	-5150.18	4845.91
Saccade R	1	8	31731828656	31731868410	39754	700.66	619.74	550.36	931.27	3.42	211.59	1.00	86.14	5227.50	-5150.18	4845.91
Fixation L	1	9	31731868410	31732246268	377858	545.44	907.28	23	39	-1	10.71	10.71
Fixation R	1	9	31731868410	31732246268	377858	545.44	907.28	23	39	-1	11.32	11.32
Blink L	1	1	31732246268	31732365632	119364
Blink R	1	1	31732246268	31732365632	119364
Saccade L	1	9	31732365632	31732465128	99496	609.28	1008.55	1072.29	477.99	24.11	1170.31	1.00	242.31	8937.78	-29023.99	8498.63
Saccade R	1	9	31732365632	31732465128	99496	609.28	1008.55	1072.29	477.99	24.11	1170.31	1.00	242.31	8937.78	-29023.99	8498.63
Fixation L	1	10	31732465128	31732663997	198869	1074.62	489.21	7	63	-1	11.94	11.94
Fixation R	1	10	31732465128	31732663997	198869	1074.62	489.21	7	63	-1	11.67	11.67
Saccade L	1	10	31732663997	31732703746	39749	1075.84	470.28	1337.38	265.84	3.28	228.73	0.50	82.45	5230.18	-4976.67	3608.28
Saccade R	1	10	31732663997	31732703746	39749	1075.84	470.28	1337.38	265.84	3.28	228.73	0.50	82.45	5230.18	-4976.67	3608.28
Fixation L	1	11	31732703746	31732862868	159122	1356.00	258.08	28	26	-1	10.87	10.87
Fixation R	1	11	31732703746	31732862868	159122	1356.00	258.08	28	26	-1	10.65	10.65
Saccade L	1	11	31732862868	31732882738	19870	1360.11	259.31	1406.45	117.49	0.87	150.91	1.00	43.89	3767.43	-3581.38	2549.35
Saccade R	1	11	31732862868	31732882738	19870	1360.11	259.31	1406.45	117.49	0.87	150.91	1.00	43.89	3767.43	-3581.38	2549.35
Fixation L	1	12	31732882738	31733101604	218866	1431.66	127.66	31	23	-1	10.87	10.87
Fixation R	1	12	31732882738	31733101604	218866	1431.66	127.66	31	23	-1	10.72	10.72
Saccade L	1	12	31733101604	31733181100	79496	1435.05	140.11	1502.20	1140.24	12.16	409.12	0.50	152.98	10203.13	-8116.97	5689.08
Saccade R	1	12	31733101604	31733181100	79496	1435.05	140.11	1502.20	1140.24	12.16	409.12	0.50	152.98	10203.13	-8116.97	5689.08
Fixation L	1	13	31733181100	31733419840	238740	1503.69	1115.78	39	35	-1	22.20	22.20
Fixation R	1	13	31733181100	31733419840	238740	1503.69	1115.78	39	35	-1	11.88	11.88
