[BeGaze]
Converted from:	C:\Documents and Settings\iViewX\Desktop\EXPERIMENTATIONS\Experiments\results\finaleart\S21F22332-finaleart-1.idf
Date:	27.03.2019 15:56:17
Version:	BeGaze 2.5.77
Sample Rate:	50
Subject:	S21F22332
Description:	Cyrielle Mailart

Table Header for Fixations:
Event Type	Trial	Number	Start	End	Duration	Location X	Location Y	Dispersion X	Dispersion Y	Plane	Avg. Pupil Size X	Avg. Pupil Size Y

Table Header for Saccades:
Event Type	Trial	Number	Start	End	Duration	Start Loc.X	Start Loc.Y	End Loc.X	End Loc.Y	Amplitude	Peak Speed	Peak Speed At	Average Speed	Peak Accel.	Peak Decel.	Average Accel.

Table Header for Blinks:
Event Type	Trial	Number	Start	End	Duration

Table Header for User Events:
Event Type	Trial	Number	Start	Description

UserEvent	1	1	3066983819	# Message: void.jpg
Saccade L	1	1	3066988599	3067087951	99352	1643.67	863.24	1642.73	438.31	6.85	266.63	0.80	68.98	6648.35	-6271.34	3177.32
Saccade R	1	1	3066988599	3067087951	99352	1643.67	863.24	1642.73	438.31	6.85	266.63	0.80	68.98	6648.35	-6271.34	3177.32
Fixation L	1	1	3067087951	3067187444	99493	1650.76	445.30	11	13	-1	13.74	13.74
Fixation R	1	1	3067087951	3067187444	99493	1650.76	445.30	11	13	-1	12.60	12.60
Saccade L	1	2	3067187444	3067207328	19884	1651.18	448.34	1677.74	214.78	1.24	237.66	1.00	62.30	5870.03	-5779.54	3920.46
Saccade R	1	2	3067187444	3067207328	19884	1651.18	448.34	1677.74	214.78	1.24	237.66	1.00	62.30	5870.03	-5779.54	3920.46
Fixation L	1	2	3067207328	3067406209	198881	1673.69	208.72	9	17	-1	12.71	12.71
Fixation R	1	2	3067207328	3067406209	198881	1673.69	208.72	9	17	-1	11.59	11.59
Blink L	1	1	3067406209	3067525559	119350
Blink R	1	1	3067406209	3067525559	119350
Saccade L	1	3	3067525559	3067545428	19869	4.85	0.00	3.73	0.00	6.26	1255.75	1.00	314.91	-15.67	-31365.51	10471.42
Saccade R	1	3	3067525559	3067545428	19869	4.85	0.00	3.73	0.00	6.26	1255.75	1.00	314.91	-15.67	-31365.51	10471.42
Saccade L	1	4	3067605189	3067625056	19867	2.14	0.00	1.85	0.00	0.01	0.51	1.00	0.35	26841.74	-5.35	8950.21
Saccade R	1	4	3067605189	3067644936	39747	2.14	0.00	1.62	0.00	8.55	1073.96	1.00	215.07	26841.74	-5.35	6723.43
Fixation L	1	3	3067684671	3067863671	179000	1002.28	332.21	20	54	-1	13.72	13.72
Fixation R	1	3	3067684671	3067863671	179000	1002.28	332.21	20	54	-1	12.74	12.74
Blink L	1	2	3067863671	3068082523	218852
Blink R	1	2	3067863671	3068082523	218852
Fixation L	1	4	3068082523	3068838237	755714	938.16	466.60	10	57	-1	15.11	15.11
Fixation R	1	4	3068082523	3068838237	755714	938.16	466.60	10	57	-1	13.92	13.92
Saccade L	1	5	3068838237	3068858237	20000	933.49	482.67	860.53	532.47	0.81	89.35	1.00	40.68	2181.82	-1240.12	1552.51
Saccade R	1	5	3068838237	3068858237	20000	933.49	482.67	860.53	532.47	0.81	89.35	1.00	40.68	2181.82	-1240.12	1552.51
Fixation L	1	5	3068858237	3068977480	119243	877.42	547.57	56	23	-1	15.17	15.17
Fixation R	1	5	3068858237	3068977480	119243	877.42	547.57	56	23	-1	14.22	14.22
