[BeGaze]
Converted from:	C:\Documents and Settings\iViewX\Desktop\EXPERIMENTATIONS\Experiments\results\finaleart\S5121332-finaleart-1.idf
Date:	27.03.2019 15:34:54
Version:	BeGaze 2.5.77
Sample Rate:	50
Subject:	S5121332
Description:	Dylan Marinho

Table Header for Fixations:
Event Type	Trial	Number	Start	End	Duration	Location X	Location Y	Dispersion X	Dispersion Y	Plane	Avg. Pupil Size X	Avg. Pupil Size Y

Table Header for Saccades:
Event Type	Trial	Number	Start	End	Duration	Start Loc.X	Start Loc.Y	End Loc.X	End Loc.Y	Amplitude	Peak Speed	Peak Speed At	Average Speed	Peak Accel.	Peak Decel.	Average Accel.

Table Header for Blinks:
Event Type	Trial	Number	Start	End	Duration

Table Header for User Events:
Event Type	Trial	Number	Start	Description

UserEvent	1	1	8968373983	# Message: madrazo-y-kuntz-Man-Holding-a-Dagger-1850.jpg
Fixation L	1	1	8968380434	8968520976	140542	896.44	689.66	8	4	-1	16.91	16.91
Fixation R	1	1	8968380434	8968520976	140542	896.44	689.66	8	4	-1	16.96	16.96
Blink L	1	1	8968520976	8968738534	217558
Blink R	1	1	8968520976	8968738534	217558
Fixation L	1	2	8968738534	8968877669	139135	853.29	661.56	5	12	-1	17.57	17.57
Fixation R	1	2	8968738534	8968877669	139135	853.29	661.56	5	12	-1	17.33	17.33
Saccade L	1	1	8968877669	8968917525	39856	853.79	663.64	1064.29	671.47	1.88	142.02	0.50	47.13	3469.33	-3213.82	2500.65
Saccade R	1	1	8968877669	8968917525	39856	853.79	663.64	1064.29	671.47	1.88	142.02	0.50	47.13	3469.33	-3213.82	2500.65
Fixation L	1	3	8968917525	8969076635	159110	1059.31	689.16	24	32	-1	17.20	17.20
Fixation R	1	3	8968917525	8969076635	159110	1059.31	689.16	24	32	-1	17.20	17.20
Saccade L	1	2	8969076635	8969096513	19878	1078.24	684.29	1184.03	598.62	0.95	137.69	1.00	47.97	3331.45	-3052.65	2204.17
Saccade R	1	2	8969076635	8969096513	19878	1078.24	684.29	1184.03	598.62	0.95	137.69	1.00	47.97	3331.45	-3052.65	2204.17
Fixation L	1	4	8969096513	8969215885	119372	1186.47	594.99	7	74	-1	16.40	16.40
Fixation R	1	4	8969096513	8969215885	119372	1186.47	594.99	7	74	-1	16.17	16.17
Saccade L	1	3	8969215885	8969235758	19873	1191.04	544.38	1250.28	342.69	1.47	212.55	1.00	73.94	5246.08	-4863.42	3633.38
Saccade R	1	3	8969215885	8969235758	19873	1191.04	544.38	1250.28	342.69	1.47	212.55	1.00	73.94	5246.08	-4863.42	3633.38
Fixation L	1	5	8969235758	8969693216	457458	1275.67	332.72	39	39	-1	15.33	15.33
Fixation R	1	5	8969235758	8969693216	457458	1275.67	332.72	39	39	-1	15.28	15.28
Saccade L	1	4	8969693216	8969732963	39747	1253.43	346.91	903.79	745.49	4.83	358.64	0.50	121.49	8742.87	-8528.25	6261.54
Saccade R	1	4	8969693216	8969732963	39747	1253.43	346.91	903.79	745.49	4.83	358.64	0.50	121.49	8742.87	-8528.25	6261.54
Fixation L	1	6	8969732963	8970090941	357978	913.91	757.25	17	21	-1	16.10	16.10
Fixation R	1	6	8969732963	8970090941	357978	913.91	757.25	17	21	-1	15.89	15.89
Saccade L	1	5	8970090941	8970130711	39770	912.48	751.50	530.45	884.66	3.65	235.72	1.00	91.75	5812.29	-5749.00	4913.95
Saccade R	1	5	8970090941	8970130711	39770	912.48	751.50	530.45	884.66	3.65	235.72	1.00	91.75	5812.29	-5749.00	4913.95
Fixation L	1	7	8970130711	8970309825	179114	526.09	925.07	17	52	-1	16.43	16.43
Fixation R	1	7	8970130711	8970309825	179114	526.09	925.07	17	52	-1	16.54	16.54
Saccade L	1	6	8970309825	8970329683	19858	530.01	934.72	415.32	942.03	0.91	116.25	1.00	45.66	2744.07	-2779.19	2247.22
Saccade R	1	6	8970309825	8970329683	19858	530.01	934.72	415.32	942.03	0.91	116.25	1.00	45.66	2744.07	-2779.19	2247.22
Fixation L	1	8	8970329683	8970608169	278486	382.44	960.33	54	31	-1	16.61	16.61
Fixation R	1	8	8970329683	8970608169	278486	382.44	960.33	54	31	-1	16.77	16.77
Saccade L	1	7	8970608169	8970667787	59618	388.66	973.90	869.37	858.83	5.16	265.70	0.67	86.48	6556.27	-6405.28	4163.74
Saccade R	1	7	8970608169	8970667787	59618	388.66	973.90	869.37	858.83	5.16	265.70	0.67	86.48	6556.27	-6405.28	4163.74
Fixation L	1	9	8970667787	8970886534	218747	875.96	850.21	80	12	-1	17.13	17.13
Fixation R	1	9	8970667787	8970886534	218747	875.96	850.21	80	12	-1	17.38	17.38
Saccade L	1	8	8970886534	8970906401	19867	943.60	847.65	988.30	850.85	0.69	80.81	0.00	34.79	1072.91	-1755.22	1285.55
Saccade R	1	8	8970886534	8970906401	19867	943.60	847.65	988.30	850.85	0.69	80.81	0.00	34.79	1072.91	-1755.22	1285.55
Fixation L	1	10	8970906401	8971025770	119369	996.47	858.35	14	15	-1	17.36	17.36
Fixation R	1	10	8970906401	8971025770	119369	996.47	858.35	14	15	-1	17.49	17.49
Blink L	1	2	8971025770	8971165015	139245
Blink R	1	2	8971025770	8971165015	139245
Saccade L	1	9	8971165015	8971204764	39749	829.81	603.73	821.41	632.37	2.48	105.47	1.00	62.48	2177.83	-2361.73	1715.95
Saccade R	1	9	8971165015	8971204764	39749	829.81	603.73	821.41	632.37	2.48	105.47	1.00	62.48	2177.83	-2361.73	1715.95
Fixation L	1	11	8971204764	8971940718	735954	823.70	632.38	18	80	-1	18.47	18.47
Fixation R	1	11	8971204764	8971940718	735954	823.70	632.38	18	80	-1	17.16	17.16
Saccade L	1	10	8971940718	8971960576	19858	833.16	586.54	833.11	585.01	0.05	4.81	1.00	2.62	109.41	-81.47	84.56
Saccade R	1	10	8971940718	8971960576	19858	833.16	586.54	833.11	585.01	0.05	4.81	1.00	2.62	109.41	-81.47	84.56
Fixation L	1	12	8971960576	8972318686	358110	842.58	579.47	30	11	-1	18.94	18.94
Fixation R	1	12	8971960576	8972318686	358110	842.58	579.47	30	11	-1	17.50	17.50
Saccade L	1	11	8972318686	8972358435	39749	862.48	579.61	1130.97	679.21	2.95	150.87	1.00	74.11	3684.47	0.00	2370.44
Saccade R	1	11	8972318686	8972358435	39749	862.48	579.61	1130.97	679.21	2.95	150.87	1.00	74.11	3684.47	0.00	2370.44
