[BeGaze]
Converted from:	C:\Documents and Settings\iViewX\Desktop\EXPERIMENTATIONS\Experiments\results\finaleart\S5121332-finaleart-1.idf
Date:	27.03.2019 15:35:33
Version:	BeGaze 2.5.77
Sample Rate:	50
Subject:	S5121332
Description:	Dylan Marinho

Table Header for Fixations:
Event Type	Trial	Number	Start	End	Duration	Location X	Location Y	Dispersion X	Dispersion Y	Plane	Avg. Pupil Size X	Avg. Pupil Size Y

Table Header for Saccades:
Event Type	Trial	Number	Start	End	Duration	Start Loc.X	Start Loc.Y	End Loc.X	End Loc.Y	Amplitude	Peak Speed	Peak Speed At	Average Speed	Peak Accel.	Peak Decel.	Average Accel.

Table Header for Blinks:
Event Type	Trial	Number	Start	End	Duration

Table Header for User Events:
Event Type	Trial	Number	Start	Description

UserEvent	1	1	10421426760	# Message: void.jpg
Fixation L	1	1	10421444766	10421584035	139269	1408.09	1014.22	12	12	-1	13.90	13.90
Fixation R	1	1	10421444766	10421584035	139269	1408.09	1014.22	12	12	-1	12.70	12.70
Saccade L	1	1	10421584035	10421604043	20008	1413.55	1006.77	1450.76	913.08	0.71	101.96	1.00	35.69	2448.76	-2443.52	1874.17
Saccade R	1	1	10421584035	10421604043	20008	1413.55	1006.77	1450.76	913.08	0.71	101.96	1.00	35.69	2448.76	-2443.52	1874.17
Fixation L	1	2	10421604043	10421882228	278185	1494.85	893.90	54	24	-1	13.47	13.47
Fixation R	1	2	10421604043	10421882228	278185	1494.85	893.90	54	24	-1	12.35	12.35
Blink L	1	1	10421882228	10422319835	437607
Blink R	1	1	10421882228	10422319835	437607
Saccade L	1	2	10422319835	10422399440	79605	1113.27	497.81	1134.62	503.93	15.24	1236.38	1.00	191.42	30813.46	-1508.07	5503.36
Saccade R	1	2	10422319835	10422399440	79605	1113.27	497.81	1134.62	503.93	15.24	1236.38	1.00	191.42	30813.46	-1508.07	5503.36
Blink L	1	2	10422399440	10422578440	179000
Blink R	1	2	10422399440	10422578440	179000
Fixation L	1	3	10422578440	10422777295	198855	1085.34	453.03	37	24	-1	15.12	15.12
Fixation R	1	3	10422578440	10422777295	198855	1085.34	453.03	37	24	-1	15.09	15.09
Saccade L	1	3	10422777295	10422797177	19882	1072.28	455.13	1002.83	460.24	0.44	70.44	1.00	22.25	1725.20	-1638.28	1179.40
Saccade R	1	3	10422777295	10422797177	19882	1072.28	455.13	1002.83	460.24	0.44	70.44	1.00	22.25	1725.20	-1638.28	1179.40
Fixation L	1	4	10422797177	10423413765	616588	996.57	463.92	44	36	-1	14.30	14.30
Fixation R	1	4	10422797177	10423413765	616588	996.57	463.92	44	36	-1	14.13	14.13
