[BeGaze]
Converted from:	C:\Documents and Settings\iViewX\Desktop\EXPERIMENTATIONS\Experiments\results\finaleart\S15H25531-finaleart-1.idf
Date:	27.03.2019 15:44:51
Version:	BeGaze 2.5.77
Sample Rate:	50
Subject:	S15H25531
Description:	Mikail Demirdelen

Table Header for Fixations:
Event Type	Trial	Number	Start	End	Duration	Location X	Location Y	Dispersion X	Dispersion Y	Plane	Avg. Pupil Size X	Avg. Pupil Size Y

Table Header for Saccades:
Event Type	Trial	Number	Start	End	Duration	Start Loc.X	Start Loc.Y	End Loc.X	End Loc.Y	Amplitude	Peak Speed	Peak Speed At	Average Speed	Peak Accel.	Peak Decel.	Average Accel.

Table Header for Blinks:
Event Type	Trial	Number	Start	End	Duration

Table Header for User Events:
Event Type	Trial	Number	Start	Description

UserEvent	1	1	3883001323	# Message: the-pointe-de-per-kiridec-at-roscoff_Rysselberghe_0.jpg
Blink L	1	1	3883011533	3883150775	139242
Blink R	1	1	3883011533	3883150775	139242
Fixation L	1	1	3883150775	3883488904	338129	851.63	383.17	8	7	-1	13.31	13.31
Fixation R	1	1	3883150775	3883488904	338129	851.63	383.17	8	7	-1	15.23	15.23
Saccade L	1	1	3883488904	3883528758	39854	846.71	388.00	1162.22	531.31	2.92	236.58	1.00	73.31	5829.19	-5741.93	4238.71
Saccade R	1	1	3883488904	3883528758	39854	846.71	388.00	1162.22	531.31	2.92	236.58	1.00	73.31	5829.19	-5741.93	4238.71
Fixation L	1	2	3883528758	3883707746	178988	1163.07	529.38	17	26	-1	13.04	13.04
Fixation R	1	2	3883528758	3883707746	178988	1163.07	529.38	17	26	-1	14.51	14.51
Saccade L	1	2	3883707746	3883747497	39751	1162.14	538.45	1396.07	373.97	2.55	177.49	1.00	64.17	4334.17	-4108.22	3474.62
Saccade R	1	2	3883707746	3883747497	39751	1162.14	538.45	1396.07	373.97	2.55	177.49	1.00	64.17	4334.17	-4108.22	3474.62
Fixation L	1	3	3883747497	3884145355	397858	1382.37	415.20	22	62	-1	10.96	10.96
Fixation R	1	3	3883747497	3884145355	397858	1382.37	415.20	22	62	-1	12.02	12.02
Saccade L	1	3	3884145355	3884204976	59621	1374.00	413.85	1084.91	821.95	5.20	236.98	0.33	87.23	5857.42	-4541.47	4140.49
Saccade R	1	3	3884145355	3884204976	59621	1374.00	413.85	1084.91	821.95	5.20	236.98	0.33	87.23	5857.42	-4541.47	4140.49
Fixation L	1	4	3884204976	3884383969	178993	1088.67	821.06	20	10	-1	10.43	10.43
Fixation R	1	4	3884204976	3884383969	178993	1088.67	821.06	20	10	-1	11.26	11.26
Saccade L	1	4	3884383969	3884423716	39747	1089.71	815.60	585.54	959.73	4.47	343.92	0.50	112.38	8379.67	-8203.07	6449.69
Saccade R	1	4	3884383969	3884423716	39747	1089.71	815.60	585.54	959.73	4.47	343.92	0.50	112.38	8379.67	-8203.07	6449.69
Fixation L	1	5	3884423716	3884622710	198994	581.08	969.88	17	16	-1	10.76	10.76
Fixation R	1	5	3884423716	3884622710	198994	581.08	969.88	17	16	-1	11.96	11.96
Saccade L	1	5	3884622710	3884642580	19870	569.75	965.78	421.60	858.46	1.00	184.99	1.00	50.39	4568.62	-4599.20	3107.95
Saccade R	1	5	3884622710	3884642580	19870	569.75	965.78	421.60	858.46	1.00	184.99	1.00	50.39	4568.62	-4599.20	3107.95
Fixation L	1	6	3884642580	3885199430	556850	438.91	858.41	54	21	-1	11.31	11.31
Fixation R	1	6	3884642580	3885199430	556850	438.91	858.41	54	21	-1	12.73	12.73
Saccade L	1	6	3885199430	3885239314	39884	475.31	869.23	798.27	948.29	2.83	214.89	1.00	70.87	5248.84	-5148.37	4054.00
Saccade R	1	6	3885199430	3885239314	39884	475.31	869.23	798.27	948.29	2.83	214.89	1.00	70.87	5248.84	-5148.37	4054.00
Fixation L	1	7	3885239314	3885438165	198851	798.20	956.92	7	25	-1	11.05	11.05
Fixation R	1	7	3885239314	3885438165	198851	798.20	956.92	7	25	-1	12.57	12.57
Saccade L	1	7	3885438165	3885477912	39747	799.16	952.39	751.46	505.33	4.46	235.55	1.00	112.23	5733.22	-5811.42	5057.76
Saccade R	1	7	3885438165	3885477912	39747	799.16	952.39	751.46	505.33	4.46	235.55	1.00	112.23	5733.22	-5811.42	5057.76
Fixation L	1	8	3885477912	3885676782	198870	687.94	494.99	82	16	-1	11.36	11.36
Fixation R	1	8	3885477912	3885676782	198870	687.94	494.99	82	16	-1	12.40	12.40
Saccade L	1	8	3885676782	3885696652	19870	675.68	491.73	674.07	487.14	0.09	6.51	1.00	4.60	57.33	-58.15	56.56
Saccade R	1	8	3885676782	3885696652	19870	675.68	491.73	674.07	487.14	0.09	6.51	1.00	4.60	57.33	-58.15	56.56
Fixation L	1	9	3885696652	3885816025	119373	662.16	475.29	53	31	-1	11.24	11.24
Fixation R	1	9	3885696652	3885816025	119373	662.16	475.29	53	31	-1	12.50	12.50
Saccade L	1	9	3885816025	3885835912	19887	626.04	455.35	620.71	442.59	0.33	28.20	1.00	16.64	-27.47	-355.19	222.46
Saccade R	1	9	3885816025	3885835912	19887	626.04	455.35	620.71	442.59	0.33	28.20	1.00	16.64	-27.47	-355.19	222.46
Fixation L	1	10	3885835912	3886074632	238720	606.52	454.47	23	30	-1	10.78	10.78
Fixation R	1	10	3885835912	3886074632	238720	606.52	454.47	23	30	-1	11.88	11.88
Saccade L	1	10	3886074632	3886134258	59626	597.45	472.80	1317.50	492.82	7.40	281.61	0.67	124.03	6884.96	-6924.43	5500.07
Saccade R	1	10	3886074632	3886134258	59626	597.45	472.80	1317.50	492.82	7.40	281.61	0.67	124.03	6884.96	-6924.43	5500.07
Fixation L	1	11	3886134258	3886372996	238738	1316.31	501.59	8	17	-1	11.10	11.10
Fixation R	1	11	3886134258	3886372996	238738	1316.31	501.59	8	17	-1	11.79	11.79
Saccade L	1	11	3886372996	3886412739	39743	1321.16	501.01	1508.05	436.53	1.92	158.88	0.50	48.28	3918.42	-3319.63	2348.42
Saccade R	1	11	3886372996	3886412739	39743	1321.16	501.01	1508.05	436.53	1.92	158.88	0.50	48.28	3918.42	-3319.63	2348.42
Fixation L	1	12	3886412739	3886651485	238746	1511.21	425.58	20	31	-1	11.44	11.44
Fixation R	1	12	3886412739	3886651485	238746	1511.21	425.58	20	31	-1	11.94	11.94
Saccade L	1	12	3886651485	3886671354	19869	1500.47	437.75	1297.91	426.50	1.14	205.14	1.00	57.30	4958.07	-4983.18	3345.96
Saccade R	1	12	3886651485	3886671354	19869	1500.47	437.75	1297.91	426.50	1.14	205.14	1.00	57.30	4958.07	-4983.18	3345.96
Fixation L	1	13	3886671354	3886989590	318236	1293.80	416.47	19	28	-1	11.31	11.31
Fixation R	1	13	3886671354	3886989590	318236	1293.80	416.47	19	28	-1	11.86	11.86
