[BeGaze]
Converted from:	C:\Documents and Settings\iViewX\Desktop\EXPERIMENTATIONS\Experiments\results\finaleart\S5121332-finaleart-1.idf
Date:	27.03.2019 15:35:08
Version:	BeGaze 2.5.77
Sample Rate:	50
Subject:	S5121332
Description:	Dylan Marinho

Table Header for Fixations:
Event Type	Trial	Number	Start	End	Duration	Location X	Location Y	Dispersion X	Dispersion Y	Plane	Avg. Pupil Size X	Avg. Pupil Size Y

Table Header for Saccades:
Event Type	Trial	Number	Start	End	Duration	Start Loc.X	Start Loc.Y	End Loc.X	End Loc.Y	Amplitude	Peak Speed	Peak Speed At	Average Speed	Peak Accel.	Peak Decel.	Average Accel.

Table Header for Blinks:
Event Type	Trial	Number	Start	End	Duration

Table Header for User Events:
Event Type	Trial	Number	Start	Description

UserEvent	1	1	9488646401	# Message: REJECTED_olympia_manet_1863.jpg
Fixation L	1	1	9488656541	9488895259	238718	1026.40	427.16	21	22	-1	14.54	14.54
Fixation R	1	1	9488656541	9488895259	238718	1026.40	427.16	21	22	-1	13.88	13.88
Saccade L	1	1	9488895259	9488915128	19869	1023.74	428.30	950.35	506.97	0.64	108.83	1.00	32.29	2678.61	-2690.71	1801.62
Saccade R	1	1	9488895259	9488915128	19869	1023.74	428.30	950.35	506.97	0.64	108.83	1.00	32.29	2678.61	-2690.71	1801.62
Fixation L	1	2	9488915128	9489094133	179005	937.81	503.25	31	21	-1	14.87	14.87
Fixation R	1	2	9488915128	9489094133	179005	937.81	503.25	31	21	-1	14.20	14.20
Saccade L	1	2	9489094133	9489133868	39735	918.74	491.43	558.91	299.26	3.64	305.25	0.50	91.62	7208.33	-7577.95	4828.71
Saccade R	1	2	9489094133	9489133868	39735	918.74	491.43	558.91	299.26	3.64	305.25	0.50	91.62	7208.33	-7577.95	4828.71
Fixation L	1	3	9489133868	9489631232	497364	564.26	317.35	12	34	-1	15.46	15.46
Fixation R	1	3	9489133868	9489631232	497364	564.26	317.35	12	34	-1	14.96	14.96
Saccade L	1	3	9489631232	9489670972	39740	560.52	328.87	793.60	553.12	3.01	196.98	1.00	75.72	4570.93	-4303.00	3677.07
Saccade R	1	3	9489631232	9489670972	39740	560.52	328.87	793.60	553.12	3.01	196.98	1.00	75.72	4570.93	-4303.00	3677.07
Fixation L	1	4	9489670972	9489889703	218731	817.84	574.63	29	29	-1	16.36	16.36
Fixation R	1	4	9489670972	9489889703	218731	817.84	574.63	29	29	-1	15.71	15.71
Blink L	1	1	9489889703	9490088692	198989
Blink R	1	1	9489889703	9490088692	198989
Fixation L	1	5	9490088692	9490406920	318228	1392.72	242.86	57	42	-1	16.85	16.85
Fixation R	1	5	9490088692	9490406920	318228	1392.72	242.86	57	42	-1	16.46	16.46
Saccade L	1	4	9490406920	9490426805	19885	1360.46	253.75	1359.62	253.69	0.06	5.73	1.00	2.96	140.08	-3.22	60.00
Saccade R	1	4	9490406920	9490426805	19885	1360.46	253.75	1359.62	253.69	0.06	5.73	1.00	2.96	140.08	-3.22	60.00
Fixation L	1	6	9490426805	9490705281	278476	1354.12	256.11	10	20	-1	17.51	17.51
Fixation R	1	6	9490426805	9490705281	278476	1354.12	256.11	10	20	-1	16.88	16.88
Saccade L	1	5	9490705281	9490745031	39750	1349.40	267.76	1218.79	440.41	1.96	145.65	1.00	49.36	3554.81	-3196.45	2486.31
Saccade R	1	5	9490705281	9490745031	39750	1349.40	267.76	1218.79	440.41	1.96	145.65	1.00	49.36	3554.81	-3196.45	2486.31
Fixation L	1	7	9490745031	9490983653	238622	1209.69	468.56	14	35	-1	17.96	17.96
Fixation R	1	7	9490745031	9490983653	238622	1209.69	468.56	14	35	-1	17.38	17.38
Saccade L	1	6	9490983653	9491043387	59734	1215.28	473.77	1495.85	717.69	4.26	218.19	0.67	71.39	5451.72	-5079.14	3138.81
Saccade R	1	6	9490983653	9491043387	59734	1215.28	473.77	1495.85	717.69	4.26	218.19	0.67	71.39	5451.72	-5079.14	3138.81
Fixation L	1	8	9491043387	9491282001	238614	1508.66	710.27	61	11	-1	17.55	17.55
Fixation R	1	8	9491043387	9491282001	238614	1508.66	710.27	61	11	-1	16.73	16.73
Saccade L	1	7	9491282001	9491301874	19873	1557.52	712.93	1622.89	712.25	0.62	66.13	1.00	31.05	1610.76	-1602.04	1528.96
Saccade R	1	7	9491282001	9491301874	19873	1557.52	712.93	1622.89	712.25	0.62	66.13	1.00	31.05	1610.76	-1602.04	1528.96
Fixation L	1	9	9491301874	9491938334	636460	1606.42	741.85	24	52	-1	16.95	16.95
Fixation R	1	9	9491301874	9491938334	636460	1606.42	741.85	24	52	-1	16.04	16.04
Blink L	1	2	9491938334	9492097568	159234
Blink R	1	2	9491938334	9492097568	159234
Saccade L	1	8	9492097568	9492256690	159122	1447.46	922.75	1458.60	838.63	12.02	223.69	0.63	75.52	42032.08	-5440.62	6609.55
Saccade R	1	8	9492097568	9492256690	159122	1447.46	922.75	1458.60	838.63	12.02	223.69	0.63	75.52	42032.08	-5440.62	6609.55
Blink L	1	3	9492256690	9492415815	159125
Blink R	1	3	9492256690	9492415815	159125
Fixation L	1	10	9492415815	9492634548	218733	1422.77	734.02	31	26	-1	16.37	16.37
Fixation R	1	10	9492415815	9492634548	218733	1422.77	734.02	31	26	-1	16.27	16.27
