[BeGaze]
Converted from:	C:\Documents and Settings\iViewX\Desktop\EXPERIMENTATIONS\Experiments\results\finaleart\S5121332-finaleart-1.idf
Date:	27.03.2019 15:35:10
Version:	BeGaze 2.5.77
Sample Rate:	50
Subject:	S5121332
Description:	Dylan Marinho

Table Header for Fixations:
Event Type	Trial	Number	Start	End	Duration	Location X	Location Y	Dispersion X	Dispersion Y	Plane	Avg. Pupil Size X	Avg. Pupil Size Y

Table Header for Saccades:
Event Type	Trial	Number	Start	End	Duration	Start Loc.X	Start Loc.Y	End Loc.X	End Loc.Y	Amplitude	Peak Speed	Peak Speed At	Average Speed	Peak Accel.	Peak Decel.	Average Accel.

Table Header for Blinks:
Event Type	Trial	Number	Start	End	Duration

Table Header for User Events:
Event Type	Trial	Number	Start	Description

UserEvent	1	1	9543958870	# Message: Kiprensky-two-sitters-1800.jpg
Fixation L	1	1	9543970075	9544109313	139238	979.55	535.42	88	7	-1	15.78	15.78
Fixation R	1	1	9543970075	9544109313	139238	979.55	535.42	88	7	-1	15.77	15.77
Saccade L	1	1	9544109313	9544129178	19865	960.94	531.58	959.14	527.22	0.07	4.77	1.00	3.30	39.80	-83.55	59.96
Saccade R	1	1	9544109313	9544129178	19865	960.94	531.58	959.14	527.22	0.07	4.77	1.00	3.30	39.80	-83.55	59.96
Fixation L	1	2	9544129178	9544427541	298363	952.43	531.86	14	18	-1	16.05	16.05
Fixation R	1	2	9544129178	9544427541	298363	952.43	531.86	14	18	-1	15.85	15.85
Saccade L	1	2	9544427541	9544467422	39881	945.36	521.13	679.16	568.76	2.46	143.39	0.50	61.58	3387.62	-3121.23	3171.09
Saccade R	1	2	9544427541	9544467422	39881	945.36	521.13	679.16	568.76	2.46	143.39	0.50	61.58	3387.62	-3121.23	3171.09
Fixation L	1	3	9544467422	9544666284	198862	685.49	583.95	24	20	-1	14.65	14.65
Fixation R	1	3	9544467422	9544666284	198862	685.49	583.95	24	20	-1	14.47	14.47
Saccade L	1	3	9544666284	9544686153	19869	672.01	586.16	484.63	569.00	1.03	190.28	1.00	51.99	4698.88	-4602.91	3119.75
Saccade R	1	3	9544666284	9544686153	19869	672.01	586.16	484.63	569.00	1.03	190.28	1.00	51.99	4698.88	-4602.91	3119.75
Fixation L	1	4	9544686153	9545024253	338100	473.70	538.65	48	48	-1	13.47	13.47
Fixation R	1	4	9544686153	9545024253	338100	473.70	538.65	48	48	-1	13.19	13.19
Saccade L	1	4	9545024253	9545084000	59747	439.34	520.64	1064.72	340.58	6.93	284.09	0.67	116.00	6814.03	-6661.28	4788.22
Saccade R	1	4	9545024253	9545084000	59747	439.34	520.64	1064.72	340.58	6.93	284.09	0.67	116.00	6814.03	-6661.28	4788.22
Fixation L	1	5	9545084000	9545203244	119244	1075.78	336.30	16	7	-1	13.29	13.29
Fixation R	1	5	9545084000	9545203244	119244	1075.78	336.30	16	7	-1	13.35	13.35
Saccade L	1	5	9545203244	9545223122	19878	1073.87	332.92	1081.21	199.49	0.84	135.17	1.00	42.01	3350.24	-3243.25	2426.99
Saccade R	1	5	9545203244	9545223122	19878	1073.87	332.92	1081.21	199.49	0.84	135.17	1.00	42.01	3350.24	-3243.25	2426.99
Fixation L	1	6	9545223122	9545521467	298345	1075.22	172.87	17	62	-1	13.56	13.56
Fixation R	1	6	9545223122	9545521467	298345	1075.22	172.87	17	62	-1	13.53	13.53
Saccade L	1	6	9545521467	9545581214	59747	1069.52	213.53	1187.80	655.29	5.18	243.14	0.67	86.77	5936.03	-5654.37	3622.66
Saccade R	1	6	9545521467	9545581214	59747	1069.52	213.53	1187.80	655.29	5.18	243.14	0.67	86.77	5936.03	-5654.37	3622.66
Fixation L	1	7	9545581214	9545919330	338116	1191.75	649.37	16	37	-1	14.58	14.58
Fixation R	1	7	9545581214	9545919330	338116	1191.75	649.37	16	37	-1	14.34	14.34
Saccade L	1	7	9545919330	9545939204	19874	1182.52	634.23	1069.98	586.16	0.76	123.78	1.00	38.24	3035.36	-2991.41	2017.19
Saccade R	1	7	9545919330	9545939204	19874	1182.52	634.23	1069.98	586.16	0.76	123.78	1.00	38.24	3035.36	-2991.41	2017.19
Fixation L	1	8	9545939204	9546197817	258613	1068.39	563.28	3	29	-1	15.12	15.12
Fixation R	1	8	9545939204	9546197817	258613	1068.39	563.28	3	29	-1	14.66	14.66
Blink L	1	1	9546197817	9546317053	119236
Blink R	1	1	9546197817	9546317053	119236
Fixation L	1	9	9546317053	9546734796	417743	1348.13	463.13	24	32	-1	15.43	15.43
Fixation R	1	9	9546317053	9546734796	417743	1348.13	463.13	24	32	-1	15.68	15.68
Saccade L	1	8	9546734796	9546794523	59727	1332.10	470.05	1319.54	1047.75	5.92	308.13	0.67	99.11	7652.97	-7566.53	5157.20
Saccade R	1	8	9546734796	9546794523	59727	1332.10	470.05	1319.54	1047.75	5.92	308.13	0.67	99.11	7652.97	-7566.53	5157.20
Fixation L	1	10	9546794523	9547450858	656335	1321.16	1026.41	10	35	-1	16.74	16.74
Fixation R	1	10	9546794523	9547450858	656335	1321.16	1026.41	10	35	-1	16.65	16.65
Blink L	1	2	9547450858	9547649720	198862
Blink R	1	2	9547450858	9547649720	198862
Fixation L	1	11	9547649720	9547948074	298354	980.41	587.10	5	22	-1	16.77	16.77
Fixation R	1	11	9547649720	9547948074	298354	980.41	587.10	5	22	-1	16.62	16.62
