[BeGaze]
Converted from:	C:\Documents and Settings\iViewX\Desktop\EXPERIMENTATIONS\Experiments\results\finaleart\S6124332-finaleart-1.idf
Date:	27.03.2019 15:36:08
Version:	BeGaze 2.5.77
Sample Rate:	50
Subject:	S6124332
Description:	Romain Ferrand

Table Header for Fixations:
Event Type	Trial	Number	Start	End	Duration	Location X	Location Y	Dispersion X	Dispersion Y	Plane	Avg. Pupil Size X	Avg. Pupil Size Y

Table Header for Saccades:
Event Type	Trial	Number	Start	End	Duration	Start Loc.X	Start Loc.Y	End Loc.X	End Loc.Y	Amplitude	Peak Speed	Peak Speed At	Average Speed	Peak Accel.	Peak Decel.	Average Accel.

Table Header for Blinks:
Event Type	Trial	Number	Start	End	Duration

Table Header for User Events:
Event Type	Trial	Number	Start	Description

UserEvent	1	1	12373971696	# Message: Nature_morte_a_la_cafetiere_rouge_Vlaminck.jpg
Fixation L	1	1	12373989765	12374407507	417742	601.17	967.44	9	22	-1	18.05	18.05
Fixation R	1	1	12373989765	12374407507	417742	601.17	967.44	9	22	-1	17.15	17.15
Saccade L	1	1	12374407507	12374467115	59608	601.72	956.56	946.75	562.81	5.71	265.44	0.67	95.86	6536.56	-5979.11	3858.01
Saccade R	1	1	12374407507	12374467115	59608	601.72	956.56	946.75	562.81	5.71	265.44	0.67	95.86	6536.56	-5979.11	3858.01
Fixation L	1	2	12374467115	12374566602	99487	945.16	538.87	49	44	-1	17.72	17.72
Fixation R	1	2	12374467115	12374566602	99487	945.16	538.87	49	44	-1	16.10	16.10
Saccade L	1	2	12374566602	12374586486	19884	958.30	538.11	964.21	537.18	0.10	7.38	1.00	5.22	133.96	-82.06	77.14
Saccade R	1	2	12374566602	12374586486	19884	958.30	538.11	964.21	537.18	0.10	7.38	1.00	5.22	133.96	-82.06	77.14
Fixation L	1	3	12374586486	12374825201	238715	943.22	520.30	46	26	-1	15.97	15.97
Fixation R	1	3	12374586486	12374825201	238715	943.22	520.30	46	26	-1	13.84	13.84
Saccade L	1	3	12374825201	12374845086	19885	935.75	511.26	927.10	578.72	0.58	68.80	1.00	29.29	1375.82	-1324.81	923.89
Saccade R	1	3	12374825201	12374845086	19885	935.75	511.26	927.10	578.72	0.58	68.80	1.00	29.29	1375.82	-1324.81	923.89
Fixation L	1	4	12374845086	12375083695	238609	934.65	620.38	35	61	-1	15.14	15.14
Fixation R	1	4	12374845086	12375083695	238609	934.65	620.38	35	61	-1	11.87	11.87
Saccade L	1	4	12375083695	12375103561	19866	954.84	638.08	958.57	643.28	0.14	10.73	0.00	7.05	-86.67	-241.53	139.73
Saccade R	1	4	12375083695	12375103561	19866	954.84	638.08	958.57	643.28	0.14	10.73	0.00	7.05	-86.67	-241.53	139.73
Fixation L	1	5	12375103561	12375322428	218867	974.80	654.34	28	21	-1	14.64	14.64
Fixation R	1	5	12375103561	12375322428	218867	974.80	654.34	28	21	-1	11.47	11.47
Saccade L	1	5	12375322428	12375382051	59623	986.93	660.68	1426.74	623.35	4.84	268.86	0.67	81.18	6640.20	-6350.62	4115.13
Blink R	1	1	12375322428	12375401927	79499
Fixation L	1	6	12375382051	12375660532	278481	1438.61	614.90	32	36	-1	15.67	15.67
Fixation R	1	6	12375401927	12375660532	258605	1439.46	614.29	31	36	-1	12.43	12.43
Saccade L	1	6	12375660532	12375839521	178989	1458.95	627.40	967.65	646.43	11.28	280.90	0.11	63.00	6750.08	-4074.18	2508.61
Blink R	1	2	12375660532	12375740032	79500
Saccade R	1	5	12375740032	12375799776	59744	975.15	650.59	974.61	644.97	2.31	117.94	1.00	38.61	1997.22	-2801.13	1370.93
Fixation L	1	7	12375839521	12376098141	258620	959.03	659.11	54	21	-1	16.41	16.41
Fixation R	1	7	12375859396	12376078260	218864	956.58	660.02	52	21	-1	12.03	12.03
Blink R	1	3	12376078260	12376177626	99366
Saccade L	1	7	12376098141	12376137884	39743	979.85	660.92	960.38	395.09	3.23	161.66	0.50	81.21	3616.76	-2646.47	2581.03
Fixation L	1	8	12376137884	12376316875	178991	924.21	349.82	44	55	-1	17.08	17.08
Fixation R	1	8	12376177626	12376635091	457465	904.72	343.78	86	10	-1	15.65	15.65
Saccade L	1	8	12376316875	12376336740	19865	916.22	344.95	912.35	349.57	0.09	6.09	1.00	4.51	52.71	-49.22	44.78
Fixation L	1	9	12376336740	12376993077	656337	868.37	345.43	83	16	-1	16.80	16.80
Saccade R	1	6	12376635091	12376654975	19884	844.10	341.75	831.94	343.37	0.26	21.12	1.00	12.96	34.35	-217.96	146.65
Fixation R	1	9	12376654975	12377470551	815576	844.70	363.36	17	43	-1	15.13	15.13
Saccade L	1	9	12376993077	12377013068	19991	846.06	355.80	844.74	356.92	0.02	1.79	0.00	1.22	27.09	-27.69	24.13
Fixation L	1	10	12377013068	12377470551	457483	846.25	375.67	5	28	-1	16.96	16.96
Saccade L	1	10	12377470551	12377490424	19873	848.95	383.13	969.21	384.77	1.07	121.65	1.00	53.61	3002.52	-2961.81	2728.90
Saccade R	1	7	12377470551	12377490424	19873	848.95	383.13	969.21	384.77	1.07	121.65	1.00	53.61	3002.52	-2961.81	2728.90
Fixation L	1	11	12377490424	12377609658	119234	1043.32	378.79	88	10	-1	17.41	17.41
Fixation R	1	10	12377490424	12377609658	119234	1043.32	378.79	88	10	-1	16.48	16.48
Saccade L	1	11	12377609658	12377629671	20013	1056.58	373.77	1057.90	371.16	0.07	5.17	0.00	3.27	1.16	-78.45	40.93
Saccade R	1	8	12377609658	12377629671	20013	1056.58	373.77	1057.90	371.16	0.07	5.17	0.00	3.27	1.16	-78.45	40.93
Fixation L	1	12	12377629671	12377967767	338096	1070.04	373.76	32	9	-1	17.15	17.15
Fixation R	1	11	12377629671	12377967767	338096	1070.04	373.76	32	9	-1	16.36	16.36
