[BeGaze]
Converted from:	C:\Documents and Settings\iViewX\Desktop\EXPERIMENTATIONS\Experiments\results\finaleart\S6124332-finaleart-1.idf
Date:	27.03.2019 15:36:03
Version:	BeGaze 2.5.77
Sample Rate:	50
Subject:	S6124332
Description:	Romain Ferrand

Table Header for Fixations:
Event Type	Trial	Number	Start	End	Duration	Location X	Location Y	Dispersion X	Dispersion Y	Plane	Avg. Pupil Size X	Avg. Pupil Size Y

Table Header for Saccades:
Event Type	Trial	Number	Start	End	Duration	Start Loc.X	Start Loc.Y	End Loc.X	End Loc.Y	Amplitude	Peak Speed	Peak Speed At	Average Speed	Peak Accel.	Peak Decel.	Average Accel.

Table Header for Blinks:
Event Type	Trial	Number	Start	End	Duration

Table Header for User Events:
Event Type	Trial	Number	Start	Description

UserEvent	1	1	12118826483	# Message: Fleurs_et_fruits_camoin_1942.jpg
Fixation L	1	1	12118834532	12119132874	298342	566.24	975.20	20	11	-1	17.43	17.43
Fixation R	1	1	12118834532	12119132874	298342	566.24	975.20	20	11	-1	17.58	17.58
Saccade L	1	1	12119132874	12119192534	59660	562.16	970.84	833.98	632.09	5.90	240.98	0.33	98.92	5966.42	-4231.56	3893.31
Saccade R	1	1	12119132874	12119192534	59660	562.16	970.84	833.98	632.09	5.90	240.98	0.33	98.92	5966.42	-4231.56	3893.31
Fixation L	1	2	12119192534	12119371474	178940	903.83	622.94	81	15	-1	17.22	17.22
Fixation R	1	2	12119192534	12119371474	178940	903.83	622.94	81	15	-1	17.43	17.43
Saccade L	1	2	12119371474	12119391356	19882	914.15	626.62	927.20	523.30	0.77	105.34	1.00	38.59	2565.36	-2008.02	1856.05
Saccade R	1	2	12119371474	12119391356	19882	914.15	626.62	927.20	523.30	0.77	105.34	1.00	38.59	2565.36	-2008.02	1856.05
Fixation L	1	3	12119391356	12119570474	179118	950.47	479.05	39	60	-1	16.45	16.45
Fixation R	1	3	12119391356	12119570474	179118	950.47	479.05	39	60	-1	16.91	16.91
Saccade L	1	3	12119570474	12119669833	99359	966.24	475.60	880.18	553.56	1.90	90.79	1.00	19.11	2225.81	-1771.63	836.33
Saccade R	1	3	12119570474	12119669833	99359	966.24	475.60	880.18	553.56	1.90	90.79	1.00	19.11	2225.81	-1771.63	836.33
Fixation L	1	4	12119669833	12119868828	198995	865.10	563.92	21	18	-1	16.52	16.52
Fixation R	1	4	12119669833	12119868828	198995	865.10	563.92	21	18	-1	16.63	16.63
Saccade L	1	4	12119868828	12119908576	39748	859.10	565.27	665.85	520.88	1.66	124.68	1.00	41.67	3056.85	-3046.50	2461.23
Saccade R	1	4	12119868828	12119908576	39748	859.10	565.27	665.85	520.88	1.66	124.68	1.00	41.67	3056.85	-3046.50	2461.23
Fixation L	1	5	12119908576	12120405797	497221	643.17	497.13	48	38	-1	16.15	16.15
Fixation R	1	5	12119908576	12120405797	497221	643.17	497.13	48	38	-1	16.89	16.89
Saccade L	1	5	12120405797	12120445541	39744	617.74	487.43	530.90	595.63	1.42	96.09	0.50	35.65	2331.79	-2157.61	1807.40
Saccade R	1	5	12120405797	12120445541	39744	617.74	487.43	530.90	595.63	1.42	96.09	0.50	35.65	2331.79	-2157.61	1807.40
Fixation L	1	6	12120445541	12120743903	298362	528.29	625.54	12	42	-1	17.04	17.04
Fixation R	1	6	12120445541	12120743903	298362	528.29	625.54	12	42	-1	17.41	17.41
Saccade L	1	6	12120743903	12120803645	59742	530.47	637.82	355.97	1040.39	5.04	180.91	0.67	84.34	4447.11	-3186.87	2853.76
Saccade R	1	6	12120743903	12120803645	59742	530.47	637.82	355.97	1040.39	5.04	180.91	0.67	84.34	4447.11	-3186.87	2853.76
Fixation L	1	7	12120803645	12121042252	238607	352.29	1097.67	6	78	-1	16.56	16.56
Fixation R	1	7	12120803645	12121042252	238607	352.29	1097.67	6	78	-1	17.66	17.66
Saccade L	1	7	12121042252	12121101867	59615	352.38	1105.99	803.29	1130.89	4.75	241.38	0.67	79.73	5945.67	-5714.52	4018.16
Saccade R	1	7	12121042252	12121101867	59615	352.38	1105.99	803.29	1130.89	4.75	241.38	0.67	79.73	5945.67	-5714.52	4018.16
Fixation L	1	8	12121101867	12121300869	199002	803.52	1149.12	8	27	-1	17.95	17.95
Fixation R	1	8	12121101867	12121300869	199002	803.52	1149.12	8	27	-1	18.43	18.43
Saccade L	1	8	12121300869	12121340616	39747	807.69	1158.13	1065.25	1009.86	2.83	198.21	1.00	71.26	4896.40	-4439.55	3638.46
Saccade R	1	8	12121300869	12121340616	39747	807.69	1158.13	1065.25	1009.86	2.83	198.21	1.00	71.26	4896.40	-4439.55	3638.46
Fixation L	1	9	12121340616	12121479847	139231	1099.66	999.24	48	17	-1	18.32	18.32
Fixation R	1	9	12121340616	12121479847	139231	1099.66	999.24	48	17	-1	18.17	18.17
Saccade L	1	9	12121479847	12121519603	39756	1107.01	996.37	1194.38	739.72	2.27	158.79	0.50	57.04	3926.89	-3786.81	3168.33
Saccade R	1	9	12121479847	12121519603	39756	1107.01	996.37	1194.38	739.72	2.27	158.79	0.50	57.04	3926.89	-3786.81	3168.33
Fixation L	1	10	12121519603	12121678715	159112	1197.23	720.68	8	37	-1	17.84	17.84
Fixation R	1	10	12121519603	12121678715	159112	1197.23	720.68	8	37	-1	17.68	17.68
Saccade L	1	10	12121678715	12121698599	19884	1199.11	712.29	1200.56	618.76	0.74	94.62	1.00	37.05	2294.16	-2180.10	1712.89
Saccade R	1	10	12121678715	12121698599	19884	1199.11	712.29	1200.56	618.76	0.74	94.62	1.00	37.05	2294.16	-2180.10	1712.89
Fixation L	1	11	12121698599	12121996951	298352	1207.75	563.04	13	84	-1	17.23	17.23
Fixation R	1	11	12121698599	12121996951	298352	1207.75	563.04	13	84	-1	16.79	16.79
Saccade L	1	11	12121996951	12122076567	79616	1210.95	533.86	1214.14	512.66	9.01	250.34	1.00	113.23	3171.86	-6054.11	3916.76
Saccade R	1	11	12121996951	12122076567	79616	1210.95	533.86	1214.14	512.66	9.01	250.34	1.00	113.23	3171.86	-6054.11	3916.76
Fixation L	1	12	12122076567	12122374922	298355	1202.63	495.28	47	41	-1	16.44	16.44
Fixation R	1	12	12122076567	12122374922	298355	1202.63	495.28	47	41	-1	16.29	16.29
Saccade L	1	12	12122374922	12122414674	39752	1176.38	491.30	1007.87	263.16	2.44	151.93	0.50	61.47	3759.07	-3492.39	3375.44
Saccade R	1	12	12122374922	12122414674	39752	1176.38	491.30	1007.87	263.16	2.44	151.93	0.50	61.47	3759.07	-3492.39	3375.44
Fixation L	1	13	12122414674	12122593660	178986	989.59	255.01	37	29	-1	16.04	16.04
Fixation R	1	13	12122414674	12122593660	178986	989.59	255.01	37	29	-1	16.27	16.27
Saccade L	1	13	12122593660	12122713027	119367	970.40	233.81	907.77	198.68	6.05	181.07	0.50	50.67	3600.44	-4314.32	1251.25
Saccade R	1	13	12122593660	12122713027	119367	970.40	233.81	907.77	198.68	6.05	181.07	0.50	50.67	3600.44	-4314.32	1251.25
Fixation L	1	14	12122713027	12122812398	99371	905.01	186.61	21	41	-1	16.07	16.07
Fixation R	1	14	12122713027	12122812398	99371	905.01	186.61	21	41	-1	16.64	16.64
