[BeGaze]
Converted from:	C:\Documents and Settings\iViewX\Desktop\EXPERIMENTATIONS\Experiments\results\finaleart\S01A22542-finaleart-1.idf
Date:	27.03.2019 15:33:17
Version:	BeGaze 2.5.77
Sample Rate:	50
Subject:	S01A22542
Description:	Thibault Seve Minnaert

Table Header for Fixations:
Event Type	Trial	Number	Start	End	Duration	Location X	Location Y	Dispersion X	Dispersion Y	Plane	Avg. Pupil Size X	Avg. Pupil Size Y

Table Header for Saccades:
Event Type	Trial	Number	Start	End	Duration	Start Loc.X	Start Loc.Y	End Loc.X	End Loc.Y	Amplitude	Peak Speed	Peak Speed At	Average Speed	Peak Accel.	Peak Decel.	Average Accel.

Table Header for Blinks:
Event Type	Trial	Number	Start	End	Duration

Table Header for User Events:
Event Type	Trial	Number	Start	Description

UserEvent	1	1	8883087861	# Message: still-life-with-pumpkin-plums-cherries-figs-and-jug-Ribot-1860.jpg
Fixation L	1	1	8883097823	8883396172	298349	851.15	603.23	9	38	-1	14.64	14.64
Fixation R	1	1	8883097823	8883396172	298349	851.15	603.23	9	38	-1	14.88	14.88
Blink L	1	1	8883396172	8883535436	139264
Blink R	1	1	8883396172	8883535436	139264
Saccade L	1	1	8883535436	8883634797	99361	832.69	544.90	741.53	548.17	3.30	86.60	1.00	33.24	1786.55	-2011.91	818.18
Saccade R	1	1	8883535436	8883634797	99361	832.69	544.90	741.53	548.17	3.30	86.60	1.00	33.24	1786.55	-2011.91	818.18
Fixation L	1	2	8883634797	8884191757	556960	726.53	542.31	47	36	-1	14.40	14.40
Fixation R	1	2	8883634797	8884191757	556960	726.53	542.31	47	36	-1	14.95	14.95
Saccade L	1	2	8884191757	8884231508	39751	758.83	527.44	1199.46	626.30	3.81	359.90	0.50	95.91	8950.21	-8945.59	5505.62
Saccade R	1	2	8884191757	8884231508	39751	758.83	527.44	1199.46	626.30	3.81	359.90	0.50	95.91	8950.21	-8945.59	5505.62
Fixation L	1	3	8884231508	8884768609	537101	1185.74	634.16	32	19	-1	14.37	14.37
Fixation R	1	3	8884231508	8884768609	537101	1185.74	634.16	32	19	-1	14.73	14.73
Saccade L	1	3	8884768609	8884808346	39737	1170.95	629.98	918.20	637.40	2.20	158.69	1.00	55.33	3869.61	-3416.74	2930.43
Saccade R	1	3	8884768609	8884808346	39737	1170.95	629.98	918.20	637.40	2.20	158.69	1.00	55.33	3869.61	-3416.74	2930.43
Fixation L	1	4	8884808346	8885007220	198874	917.04	679.68	5	60	-1	13.36	13.36
Fixation R	1	4	8884808346	8885007220	198874	917.04	679.68	5	60	-1	13.79	13.79
Saccade L	1	4	8885007220	8885066969	59749	917.14	697.95	1226.46	929.88	4.23	178.20	1.00	70.79	3237.50	-3981.29	2903.49
Saccade R	1	4	8885007220	8885066969	59749	917.14	697.95	1226.46	929.88	4.23	178.20	1.00	70.79	3237.50	-3981.29	2903.49
Fixation L	1	5	8885066969	8885305585	238616	1257.58	951.93	63	32	-1	14.05	14.05
Fixation R	1	5	8885066969	8885305585	238616	1257.58	951.93	63	32	-1	14.05	14.05
Saccade L	1	5	8885305585	8885325450	19865	1290.40	962.31	1533.03	913.43	1.57	250.22	1.00	79.01	5968.97	-6208.32	4082.26
Saccade R	1	5	8885305585	8885325450	19865	1290.40	962.31	1533.03	913.43	1.57	250.22	1.00	79.01	5968.97	-6208.32	4082.26
Fixation L	1	6	8885325450	8885504571	179121	1546.24	896.75	19	40	-1	14.60	14.60
Fixation R	1	6	8885325450	8885504571	179121	1546.24	896.75	19	40	-1	14.58	14.58
Saccade L	1	6	8885504571	8885524441	19870	1547.28	895.74	1416.95	918.11	1.03	133.75	1.00	52.09	3277.61	-2956.71	2587.56
Saccade R	1	6	8885504571	8885524441	19870	1547.28	895.74	1416.95	918.11	1.03	133.75	1.00	52.09	3277.61	-2956.71	2587.56
Fixation L	1	7	8885524441	8885643694	119253	1396.94	970.14	32	66	-1	14.88	14.88
Fixation R	1	7	8885524441	8885643694	119253	1396.94	970.14	32	66	-1	14.65	14.65
Saccade L	1	7	8885643694	8885663684	19990	1393.26	984.61	1392.24	988.70	0.05	4.27	1.00	2.35	45.79	10.44	22.34
Saccade R	1	7	8885643694	8885663684	19990	1393.26	984.61	1392.24	988.70	0.05	4.27	1.00	2.35	45.79	10.44	22.34
Fixation L	1	8	8885663684	8885902306	238622	1395.74	985.70	7	6	-1	14.43	14.43
Fixation R	1	8	8885663684	8885902306	238622	1395.74	985.70	7	6	-1	14.38	14.38
Saccade L	1	8	8885902306	8885961925	59619	1399.11	984.72	674.11	930.86	7.52	304.69	0.67	126.14	7576.66	-7197.39	5889.32
Saccade R	1	8	8885902306	8885961925	59619	1399.11	984.72	674.11	930.86	7.52	304.69	0.67	126.14	7576.66	-7197.39	5889.32
Fixation L	1	9	8885961925	8886141043	179118	652.23	915.97	27	25	-1	14.48	14.48
Fixation R	1	9	8885961925	8886141043	179118	652.23	915.97	27	25	-1	14.91	14.91
Saccade L	1	9	8886141043	8886160911	19868	649.96	907.82	615.09	831.86	0.47	84.55	1.00	23.90	2049.47	-1478.72	1217.01
Saccade R	1	9	8886141043	8886160911	19868	649.96	907.82	615.09	831.86	0.47	84.55	1.00	23.90	2049.47	-1478.72	1217.01
Fixation L	1	10	8886160911	8886399527	238616	600.55	823.32	23	25	-1	14.44	14.44
Fixation R	1	10	8886160911	8886399527	238616	600.55	823.32	23	25	-1	15.13	15.13
Saccade L	1	10	8886399527	8886439396	39869	598.76	835.10	370.35	989.65	2.42	156.23	1.00	60.72	3702.09	-3606.07	3465.53
Saccade R	1	10	8886399527	8886439396	39869	598.76	835.10	370.35	989.65	2.42	156.23	1.00	60.72	3702.09	-3606.07	3465.53
Fixation L	1	11	8886439396	8886856996	417600	361.68	1004.52	36	29	-1	14.62	14.62
Fixation R	1	11	8886439396	8886856996	417600	361.68	1004.52	36	29	-1	16.06	16.06
Saccade L	1	11	8886856996	8886896752	39756	376.19	1016.84	681.38	752.48	3.40	221.01	0.50	85.60	5374.51	-5323.64	5016.04
Saccade R	1	11	8886856996	8886896752	39756	376.19	1016.84	681.38	752.48	3.40	221.01	0.50	85.60	5374.51	-5323.64	5016.04
Fixation L	1	12	8886896752	8887075865	179113	678.93	741.29	7	21	-1	14.50	14.50
Fixation R	1	12	8886896752	8887075865	179113	678.93	741.29	7	21	-1	16.35	16.35
