[BeGaze]
Converted from:	C:\Documents and Settings\iViewX\Desktop\EXPERIMENTATIONS\Experiments\results\finaleart\S02123220-finaleart-1.idf
Date:	27.03.2019 15:33:42
Version:	BeGaze 2.5.77
Sample Rate:	50
Subject:	S02123220
Description:	David Xu

Table Header for Fixations:
Event Type	Trial	Number	Start	End	Duration	Location X	Location Y	Dispersion X	Dispersion Y	Plane	Avg. Pupil Size X	Avg. Pupil Size Y

Table Header for Saccades:
Event Type	Trial	Number	Start	End	Duration	Start Loc.X	Start Loc.Y	End Loc.X	End Loc.Y	Amplitude	Peak Speed	Peak Speed At	Average Speed	Peak Accel.	Peak Decel.	Average Accel.

Table Header for Blinks:
Event Type	Trial	Number	Start	End	Duration

Table Header for User Events:
Event Type	Trial	Number	Start	Description

UserEvent	1	1	1740619950	# Message: Girtin-Kirkstall-Abbey-Yorkshire-1801.jpg
Fixation L	1	1	1740623269	1741060843	437574	1024.27	503.18	21	12	-1	14.14	14.14
Fixation R	1	1	1740623269	1741060843	437574	1024.27	503.18	21	12	-1	12.90	12.90
Saccade L	1	1	1741060843	1741100602	39759	1012.30	497.71	1305.17	620.87	2.86	217.68	0.50	71.82	5393.39	-4937.43	3958.19
Saccade R	1	1	1741060843	1741100602	39759	1012.30	497.71	1305.17	620.87	2.86	217.68	0.50	71.82	5393.39	-4937.43	3958.19
Fixation L	1	2	1741100602	1741398945	298343	1347.40	624.25	72	20	-1	12.26	12.26
Fixation R	1	2	1741100602	1741398945	298343	1347.40	624.25	72	20	-1	9.63	9.63
Saccade L	1	2	1741398945	1741478569	79624	1375.05	629.10	904.44	694.47	6.30	265.05	1.00	79.16	6556.65	-6196.92	3906.71
Saccade R	1	2	1741398945	1741478569	79624	1375.05	629.10	904.44	694.47	6.30	265.05	1.00	79.16	6556.65	-6196.92	3906.71
Fixation L	1	3	1741478569	1741677437	198868	887.77	726.48	35	52	-1	10.30	10.30
Fixation R	1	3	1741478569	1741677437	198868	887.77	726.48	35	52	-1	10.03	10.03
Saccade L	1	3	1741677437	1741697309	19872	889.41	747.27	880.28	849.57	0.65	103.89	1.00	32.72	2416.77	-2106.78	1618.61
Saccade R	1	3	1741677437	1741697309	19872	889.41	747.27	880.28	849.57	0.65	103.89	1.00	32.72	2416.77	-2106.78	1618.61
Fixation L	1	4	1741697309	1741936041	238732	885.56	845.86	65	32	-1	10.36	10.36
Fixation R	1	4	1741697309	1741936041	238732	885.56	845.86	65	32	-1	9.84	9.84
Saccade L	1	4	1741936041	1742095149	159108	848.97	834.53	467.77	769.13	7.23	192.72	0.62	45.43	4534.05	-4217.66	1784.95
Saccade R	1	4	1741936041	1742095149	159108	848.97	834.53	467.77	769.13	7.23	192.72	0.62	45.43	4534.05	-4217.66	1784.95
Fixation L	1	5	1742095149	1742214406	119257	502.59	756.58	72	24	-1	11.20	11.20
Fixation R	1	5	1742095149	1742214406	119257	502.59	756.58	72	24	-1	11.73	11.73
Saccade L	1	5	1742214406	1742274153	59747	487.40	755.56	991.29	922.55	5.97	287.27	0.67	99.91	6263.89	-7108.04	4056.20
Saccade R	1	5	1742214406	1742274153	59747	487.40	755.56	991.29	922.55	5.97	287.27	0.67	99.91	6263.89	-7108.04	4056.20
Fixation L	1	6	1742274153	1742413384	139231	970.53	924.56	69	14	-1	11.95	11.95
Fixation R	1	6	1742274153	1742413384	139231	970.53	924.56	69	14	-1	10.65	10.65
Saccade L	1	6	1742413384	1742512756	99372	991.43	922.50	983.15	908.46	5.46	148.15	0.40	54.93	2837.84	-3217.75	1975.47
Saccade R	1	6	1742413384	1742512756	99372	991.43	922.50	983.15	908.46	5.46	148.15	0.40	54.93	2837.84	-3217.75	1975.47
Fixation L	1	7	1742512756	1742731615	218859	930.64	911.57	70	28	-1	11.82	11.82
Fixation R	1	7	1742512756	1742731615	218859	930.64	911.57	70	28	-1	11.24	11.24
Saccade L	1	7	1742731615	1742751499	19884	912.86	907.29	904.64	903.88	0.24	18.41	1.00	12.12	-172.06	-344.12	250.40
Saccade R	1	7	1742731615	1742751499	19884	912.86	907.29	904.64	903.88	0.24	18.41	1.00	12.12	-172.06	-344.12	250.40
Fixation L	1	8	1742751499	1743149218	397719	909.90	898.55	54	18	-1	11.94	11.94
Fixation R	1	8	1742751499	1743149218	397719	909.90	898.55	54	18	-1	11.28	11.28
Saccade L	1	8	1743149218	1743288462	139244	943.39	885.45	1536.64	871.43	14.17	305.72	0.29	101.73	7437.94	-6023.10	3908.86
Saccade R	1	8	1743149218	1743288462	139244	943.39	885.45	1536.64	871.43	14.17	305.72	0.29	101.73	7437.94	-6023.10	3908.86
Fixation L	1	9	1743288462	1743407828	119366	1512.02	862.06	53	20	-1	12.59	12.59
Fixation R	1	9	1743288462	1743407828	119366	1512.02	862.06	53	20	-1	5.38	5.38
Saccade L	1	9	1743407828	1743467578	59750	1491.24	854.99	1463.64	698.28	4.24	140.83	1.00	71.02	2128.94	-3418.84	1871.37
Saccade R	1	9	1743407828	1743467578	59750	1491.24	854.99	1463.64	698.28	4.24	140.83	1.00	71.02	2128.94	-3418.84	1871.37
Fixation L	1	10	1743467578	1743964787	497209	1471.62	655.93	49	48	-1	11.91	11.91
Fixation R	1	10	1743467578	1743964787	497209	1471.62	655.93	49	48	-1	8.83	8.83
Saccade L	1	10	1743964787	1744004550	39763	1477.48	656.92	1151.03	675.70	2.99	207.46	0.50	75.21	5053.05	-4828.06	3839.29
Saccade R	1	10	1743964787	1744004550	39763	1477.48	656.92	1151.03	675.70	2.99	207.46	0.50	75.21	5053.05	-4828.06	3839.29
Fixation L	1	11	1744004550	1744203418	198868	1143.10	695.11	12	32	-1	11.35	11.35
Fixation R	1	11	1744004550	1744203418	198868	1143.10	695.11	12	32	-1	9.81	9.81
Saccade L	1	11	1744203418	1744243267	39849	1146.49	707.95	919.56	713.86	1.94	139.32	0.50	48.56	3415.88	-3347.05	2767.47
Saccade R	1	11	1744203418	1744243267	39849	1146.49	707.95	919.56	713.86	1.94	139.32	0.50	48.56	3415.88	-3347.05	2767.47
Fixation L	1	12	1744243267	1744501761	258494	898.40	706.89	35	60	-1	11.39	11.39
Fixation R	1	12	1744243267	1744501761	258494	898.40	706.89	35	60	-1	10.70	10.70
Saccade L	1	12	1744501761	1744601256	99495	884.13	751.04	848.61	795.31	1.99	35.84	0.20	20.01	100.55	-621.06	212.54
Saccade R	1	12	1744501761	1744601256	99495	884.13	751.04	848.61	795.31	1.99	35.84	0.20	20.01	100.55	-621.06	212.54
