[BeGaze]
Converted from:	C:\Documents and Settings\iViewX\Desktop\EXPERIMENTATIONS\Experiments\results\finaleart\S5121332-finaleart-1.idf
Date:	27.03.2019 15:35:31
Version:	BeGaze 2.5.77
Sample Rate:	50
Subject:	S5121332
Description:	Dylan Marinho

Table Header for Fixations:
Event Type	Trial	Number	Start	End	Duration	Location X	Location Y	Dispersion X	Dispersion Y	Plane	Avg. Pupil Size X	Avg. Pupil Size Y

Table Header for Saccades:
Event Type	Trial	Number	Start	End	Duration	Start Loc.X	Start Loc.Y	End Loc.X	End Loc.Y	Amplitude	Peak Speed	Peak Speed At	Average Speed	Peak Accel.	Peak Decel.	Average Accel.

Table Header for Blinks:
Event Type	Trial	Number	Start	End	Duration

Table Header for User Events:
Event Type	Trial	Number	Start	Description

UserEvent	1	1	10374366861	# Message: still-life-with-red-mullet-and-jug_gaugain_1876.jpg
Fixation L	1	1	10374385470	10375021929	636459	946.85	562.03	22	51	-1	14.61	14.61
Fixation R	1	1	10374385470	10375021929	636459	946.85	562.03	22	51	-1	14.15	14.15
Saccade L	1	1	10375021929	10375041808	19879	928.10	604.88	814.88	662.57	0.97	128.52	1.00	48.96	3166.56	-3169.61	2224.74
Saccade R	1	1	10375021929	10375041808	19879	928.10	604.88	814.88	662.57	0.97	128.52	1.00	48.96	3166.56	-3169.61	2224.74
Fixation L	1	2	10375041808	10375380037	338229	803.46	703.02	19	57	-1	15.34	15.34
Fixation R	1	2	10375041808	10375380037	338229	803.46	703.02	19	57	-1	14.80	14.80
Blink L	1	1	10375380037	10375578890	198853
Blink R	1	1	10375380037	10375578890	198853
Fixation L	1	3	10375578890	10375857382	278492	711.71	641.46	11	50	-1	16.42	16.42
Fixation R	1	3	10375578890	10375857382	278492	711.71	641.46	11	50	-1	15.91	15.91
Saccade L	1	2	10375857382	10375897122	39740	714.92	656.76	1053.95	892.07	3.47	230.64	0.50	87.24	5742.51	-5380.48	5028.66
Saccade R	1	2	10375857382	10375897122	39740	714.92	656.76	1053.95	892.07	3.47	230.64	0.50	87.24	5742.51	-5380.48	5028.66
Fixation L	1	4	10375897122	10376473967	576845	1060.54	909.06	23	38	-1	16.75	16.75
Fixation R	1	4	10375897122	10376473967	576845	1060.54	909.06	23	38	-1	15.97	15.97
Blink L	1	2	10376473967	10376633147	159180
Blink R	1	2	10376473967	10376633147	159180
Fixation L	1	5	10376633147	10377309296	676149	1103.77	382.11	20	49	-1	16.52	16.52
Fixation R	1	5	10376633147	10377309296	676149	1103.77	382.11	20	49	-1	16.08	16.08
Saccade L	1	3	10377309296	10377349034	39738	1104.52	394.37	826.92	401.91	2.36	173.11	0.50	59.35	4250.91	-4058.72	3338.79
Saccade R	1	3	10377309296	10377349034	39738	1104.52	394.37	826.92	401.91	2.36	173.11	0.50	59.35	4250.91	-4058.72	3338.79
Fixation L	1	6	10377349034	10377826386	477352	843.66	427.99	23	34	-1	17.01	17.01
Fixation R	1	6	10377349034	10377826386	477352	843.66	427.99	23	34	-1	16.64	16.64
Saccade L	1	4	10377826386	10377846259	19873	842.87	431.64	1008.11	522.17	1.29	190.54	1.00	64.86	4742.21	-4405.56	3525.81
Saccade R	1	4	10377826386	10377846259	19873	842.87	431.64	1008.11	522.17	1.29	190.54	1.00	64.86	4742.21	-4405.56	3525.81
Fixation L	1	7	10377846259	10378263984	417725	1052.76	546.88	56	37	-1	17.11	17.11
Fixation R	1	7	10377846259	10378263984	417725	1052.76	546.88	56	37	-1	16.69	16.69
