[BeGaze]
Converted from:	C:\Documents and Settings\iViewX\Desktop\EXPERIMENTATIONS\Experiments\results\finaleart\S02123220-finaleart-1.idf
Date:	27.03.2019 15:33:41
Version:	BeGaze 2.5.77
Sample Rate:	50
Subject:	S02123220
Description:	David Xu

Table Header for Fixations:
Event Type	Trial	Number	Start	End	Duration	Location X	Location Y	Dispersion X	Dispersion Y	Plane	Avg. Pupil Size X	Avg. Pupil Size Y

Table Header for Saccades:
Event Type	Trial	Number	Start	End	Duration	Start Loc.X	Start Loc.Y	End Loc.X	End Loc.Y	Amplitude	Peak Speed	Peak Speed At	Average Speed	Peak Accel.	Peak Decel.	Average Accel.

Table Header for Blinks:
Event Type	Trial	Number	Start	End	Duration

Table Header for User Events:
Event Type	Trial	Number	Start	Description

UserEvent	1	1	1695681911	# Message: void.jpg
Saccade L	1	1	1695692226	1695712089	19863	991.08	685.51	1096.04	679.43	0.84	106.35	1.00	42.43	523.58	-2487.44	1003.67
Saccade R	1	1	1695692226	1695712089	19863	991.08	685.51	1096.04	679.43	0.84	106.35	1.00	42.43	523.58	-2487.44	1003.67
Fixation L	1	1	1695712089	1696189565	477476	1096.17	651.89	29	41	-1	15.61	15.61
Fixation R	1	1	1695712089	1696189565	477476	1096.17	651.89	29	41	-1	15.07	15.07
Saccade L	1	2	1696189565	1696229315	39750	1093.75	658.68	1309.51	651.36	2.23	152.91	1.00	55.98	3554.16	-3520.99	2269.90
Saccade R	1	2	1696189565	1696229315	39750	1093.75	658.68	1309.51	651.36	2.23	152.91	1.00	55.98	3554.16	-3520.99	2269.90
Fixation L	1	2	1696229315	1696487795	258480	1351.39	630.03	54	41	-1	13.22	13.22
Fixation R	1	2	1696229315	1696487795	258480	1351.39	630.03	54	41	-1	13.37	13.37
Saccade L	1	3	1696487795	1696547549	59754	1363.93	630.91	1137.61	556.93	4.36	198.73	0.33	72.89	4934.10	-2930.74	2709.69
Saccade R	1	3	1696487795	1696547549	59754	1363.93	630.91	1137.61	556.93	4.36	198.73	0.33	72.89	4934.10	-2930.74	2709.69
Fixation L	1	3	1696547549	1696945265	397716	1123.23	571.88	24	65	-1	13.54	13.54
Fixation R	1	3	1696547549	1696945265	397716	1123.23	571.88	24	65	-1	14.29	14.29
Saccade L	1	4	1696945265	1696965268	20003	1114.45	595.87	1114.44	605.75	0.15	10.00	1.00	7.38	147.14	54.72	103.49
Saccade R	1	4	1696945265	1696965268	20003	1114.45	595.87	1114.44	605.75	0.15	10.00	1.00	7.38	147.14	54.72	103.49
Fixation L	1	4	1696965268	1697442620	477352	1111.98	613.29	13	27	-1	15.79	15.79
Fixation R	1	4	1696965268	1697442620	477352	1111.98	613.29	13	27	-1	16.55	16.55
Saccade L	1	5	1697442620	1697462481	19861	1108.52	602.77	1050.56	589.63	0.47	60.12	1.00	23.81	1474.76	-1186.19	1100.21
Saccade R	1	5	1697442620	1697462481	19861	1108.52	602.77	1050.56	589.63	0.47	60.12	1.00	23.81	1474.76	-1186.19	1100.21
Fixation L	1	5	1697462481	1697681231	218750	1029.33	578.29	45	19	-1	16.29	16.29
Fixation R	1	5	1697462481	1697681231	218750	1029.33	578.29	45	19	-1	17.34	17.34
