[BeGaze]
Converted from:	C:\Documents and Settings\iViewX\Desktop\EXPERIMENTATIONS\Experiments\results\finaleart\S02123220-finaleart-1.idf
Date:	27.03.2019 15:33:41
Version:	BeGaze 2.5.77
Sample Rate:	50
Subject:	S02123220
Description:	David Xu

Table Header for Fixations:
Event Type	Trial	Number	Start	End	Duration	Location X	Location Y	Dispersion X	Dispersion Y	Plane	Avg. Pupil Size X	Avg. Pupil Size Y

Table Header for Saccades:
Event Type	Trial	Number	Start	End	Duration	Start Loc.X	Start Loc.Y	End Loc.X	End Loc.Y	Amplitude	Peak Speed	Peak Speed At	Average Speed	Peak Accel.	Peak Decel.	Average Accel.

Table Header for Blinks:
Event Type	Trial	Number	Start	End	Duration

Table Header for User Events:
Event Type	Trial	Number	Start	Description

UserEvent	1	1	1714124992	# Message: void.jpg
Saccade L	1	1	1714130120	1714249476	119356	937.25	370.43	905.81	673.69	9.86	206.89	0.83	82.63	3535.29	-4417.53	1976.39
Saccade R	1	1	1714130120	1714249476	119356	937.25	370.43	905.81	673.69	9.86	206.89	0.83	82.63	3535.29	-4417.53	1976.39
Fixation L	1	1	1714249476	1714746686	497210	912.80	716.89	15	52	-1	12.69	12.69
Fixation R	1	1	1714249476	1714746686	497210	912.80	716.89	15	52	-1	12.51	12.51
Saccade L	1	2	1714746686	1714806348	59662	920.44	721.92	1103.85	319.58	5.19	206.57	0.67	87.00	5025.94	-3585.97	2884.56
Saccade R	1	2	1714746686	1714806348	59662	920.44	721.92	1103.85	319.58	5.19	206.57	0.67	87.00	5025.94	-3585.97	2884.56
Fixation L	1	2	1714806348	1715025182	218834	1145.80	296.78	59	38	-1	12.26	12.26
Fixation R	1	2	1714806348	1715025182	218834	1145.80	296.78	59	38	-1	11.67	11.67
Saccade L	1	3	1715025182	1715064927	39745	1141.08	307.58	965.38	318.22	1.93	142.52	1.00	48.46	3172.51	-3462.16	1838.52
Saccade R	1	3	1715025182	1715064927	39745	1141.08	307.58	965.38	318.22	1.93	142.52	1.00	48.46	3172.51	-3462.16	1838.52
Fixation L	1	3	1715064927	1715243912	178985	941.29	350.91	40	56	-1	12.90	12.90
Fixation R	1	3	1715064927	1715243912	178985	941.29	350.91	40	56	-1	12.63	12.63
Saccade L	1	4	1715243912	1715263787	19875	932.07	374.53	929.16	384.88	0.17	10.87	1.00	8.47	35.11	-55.46	39.78
Saccade R	1	4	1715243912	1715263787	19875	932.07	374.53	929.16	384.88	0.17	10.87	1.00	8.47	35.11	-55.46	39.78
Fixation L	1	4	1715263787	1715860505	596718	919.36	403.24	26	48	-1	14.19	14.19
Fixation R	1	4	1715263787	1715860505	596718	919.36	403.24	26	48	-1	13.77	13.77
Saccade L	1	5	1715860505	1715920118	59613	912.39	430.22	1048.30	507.19	2.41	83.68	1.00	40.42	1196.68	-1580.85	955.71
Saccade R	1	5	1715860505	1715920118	59613	912.39	430.22	1048.30	507.19	2.41	83.68	1.00	40.42	1196.68	-1580.85	955.71
Fixation L	1	5	1715920118	1716119115	198997	1073.31	506.60	42	56	-1	15.06	15.06
Fixation R	1	5	1715920118	1716119115	198997	1073.31	506.60	42	56	-1	13.45	13.45
