[BeGaze]
Converted from:	C:\Documents and Settings\iViewX\Desktop\EXPERIMENTATIONS\Experiments\results\finaleart\S14F27123-finaleart-1.idf
Date:	27.03.2019 15:43:36
Version:	BeGaze 2.5.77
Sample Rate:	50
Subject:	S14F27123
Description:	Anne-flore Perrin

Table Header for Fixations:
Event Type	Trial	Number	Start	End	Duration	Location X	Location Y	Dispersion X	Dispersion Y	Plane	Avg. Pupil Size X	Avg. Pupil Size Y

Table Header for Saccades:
Event Type	Trial	Number	Start	End	Duration	Start Loc.X	Start Loc.Y	End Loc.X	End Loc.Y	Amplitude	Peak Speed	Peak Speed At	Average Speed	Peak Accel.	Peak Decel.	Average Accel.

Table Header for Blinks:
Event Type	Trial	Number	Start	End	Duration

Table Header for User Events:
Event Type	Trial	Number	Start	Description

UserEvent	1	1	31321043609	# Message: void.jpg
Fixation L	1	1	31321043636	31321143129	99493	487.48	1081.05	6	16	-1	13.19	13.19
Fixation R	1	1	31321043636	31321143129	99493	487.48	1081.05	6	16	-1	13.73	13.73
Saccade L	1	1	31321143129	31321302247	159118	488.43	1088.54	321.34	1076.57	19.15	305.98	0.13	120.32	7541.93	-6799.76	4148.72
Saccade R	1	1	31321143129	31321302247	159118	488.43	1088.54	321.34	1076.57	19.15	305.98	0.13	120.32	7541.93	-6799.76	4148.72
Fixation L	1	2	31321302247	31321560732	258485	342.75	1076.53	38	25	-1	13.60	13.60
Fixation R	1	2	31321302247	31321560732	258485	342.75	1076.53	38	25	-1	15.03	15.03
Blink L	1	1	31321560732	31321938724	377992
Blink R	1	1	31321560732	31321938724	377992
Saccade L	1	2	31321938724	31321978463	39739	-1.65	0.00	787.37	612.76	18.23	1289.65	1.00	458.80	25007.87	-32240.88	20566.73
Saccade R	1	2	31321938724	31321978463	39739	-1.65	0.00	787.37	612.76	18.23	1289.65	1.00	458.80	25007.87	-32240.88	20566.73
Fixation L	1	3	31321978463	31323012791	1034328	800.78	602.95	66	31	-1	12.96	12.96
Fixation R	1	3	31321978463	31323012791	1034328	800.78	602.95	66	31	-1	13.13	13.13
Saccade L	1	3	31323012791	31323032671	19880	844.61	613.49	844.57	624.04	0.13	10.67	1.00	6.30	153.03	0.00	76.52
Saccade R	1	3	31323012791	31323032671	19880	844.61	613.49	844.57	624.04	0.13	10.67	1.00	6.30	153.03	0.00	76.52
