[BeGaze]
Converted from:	C:\Documents and Settings\iViewX\Desktop\EXPERIMENTATIONS\Experiments\results\finaleart\S12H22222-finaleart-1.idf
Date:	27.03.2019 15:40:34
Version:	BeGaze 2.5.77
Sample Rate:	50
Subject:	S12H22222
Description:	aurele barriere

Table Header for Fixations:
Event Type	Trial	Number	Start	End	Duration	Location X	Location Y	Dispersion X	Dispersion Y	Plane	Avg. Pupil Size X	Avg. Pupil Size Y

Table Header for Saccades:
Event Type	Trial	Number	Start	End	Duration	Start Loc.X	Start Loc.Y	End Loc.X	End Loc.Y	Amplitude	Peak Speed	Peak Speed At	Average Speed	Peak Accel.	Peak Decel.	Average Accel.

Table Header for Blinks:
Event Type	Trial	Number	Start	End	Duration

Table Header for User Events:
Event Type	Trial	Number	Start	Description

UserEvent	1	1	23625750907	# Message: void.jpg
Saccade L	1	1	23625768801	23625808548	39747	1046.17	738.96	1055.49	519.78	2.31	119.49	1.00	58.01	2987.15	-2918.97	2055.85
Saccade R	1	1	23625768801	23625808548	39747	1046.17	738.96	1055.49	519.78	2.31	119.49	1.00	58.01	2987.15	-2918.97	2055.85
Fixation L	1	1	23625808548	23626325791	517243	1084.61	530.39	45	26	-1	15.50	15.50
Fixation R	1	1	23625808548	23626325791	517243	1084.61	530.39	45	26	-1	14.82	14.82
Blink L	1	1	23626325791	23626465032	139241
Blink R	1	1	23626325791	23626465032	139241
Blink L	1	2	23626484903	23626763377	278474
Blink R	1	2	23626484903	23626783273	298370
Saccade L	1	2	23626763377	23626842881	79504	1050.61	480.42	1057.40	521.15	7.89	181.07	0.75	99.23	1844.55	-2520.62	1286.37
Saccade R	1	2	23626783273	23626842881	59608	1050.98	586.49	1057.40	521.15	6.01	181.07	0.67	100.84	1844.55	-2520.62	1455.08
Fixation L	1	2	23626842881	23626942373	99492	1068.11	541.38	17	81	-1	12.82	12.82
Fixation R	1	2	23626842881	23626942373	99492	1068.11	541.38	17	81	-1	13.33	13.33
Saccade L	1	3	23626942373	23626962249	19876	1059.45	534.14	1051.62	512.65	0.37	23.14	1.00	18.85	229.56	-244.62	211.16
Saccade R	1	3	23626942373	23626962249	19876	1059.45	534.14	1051.62	512.65	0.37	23.14	1.00	18.85	229.56	-244.62	211.16
Fixation L	1	3	23626962249	23627061618	99369	1035.39	546.25	28	71	-1	13.83	13.83
Fixation R	1	3	23626962249	23627061618	99369	1035.39	546.25	28	71	-1	13.61	13.61
Saccade L	1	4	23627061618	23627081617	19999	1024.81	584.35	1020.68	591.88	0.22	16.38	1.00	10.85	77.99	-192.36	95.75
Saccade R	1	4	23627061618	23627081617	19999	1024.81	584.35	1020.68	591.88	0.22	16.38	1.00	10.85	77.99	-192.36	95.75
Fixation L	1	4	23627081617	23627320235	238618	1005.14	607.32	67	27	-1	14.27	14.27
Fixation R	1	4	23627081617	23627320235	238618	1005.14	607.32	67	27	-1	14.08	14.08
Saccade L	1	5	23627320235	23627340127	19892	957.01	619.14	955.34	622.59	0.10	6.00	1.00	5.02	5.39	-40.06	19.56
Saccade R	1	5	23627320235	23627340127	19892	957.01	619.14	955.34	622.59	0.10	6.00	1.00	5.02	5.39	-40.06	19.56
Fixation L	1	5	23627340127	23627499222	159095	952.55	619.61	13	13	-1	13.66	13.66
Fixation R	1	5	23627340127	23627499222	159095	952.55	619.61	13	13	-1	13.48	13.48
Saccade L	1	6	23627499222	23627519097	19875	962.28	613.17	963.52	519.61	0.90	94.64	1.00	45.08	2317.90	-2253.54	1902.37
Saccade R	1	6	23627499222	23627519097	19875	962.28	613.17	963.52	519.61	0.90	94.64	1.00	45.08	2317.90	-2253.54	1902.37
Fixation L	1	6	23627519097	23627737959	218862	992.27	560.68	37	60	-1	13.21	13.21
Fixation R	1	6	23627519097	23627737959	218862	992.27	560.68	37	60	-1	13.03	13.03
