[BeGaze]
Converted from:	C:\Documents and Settings\iViewX\Desktop\EXPERIMENTATIONS\Experiments\results\finaleart\S12H22222-finaleart-1.idf
Date:	27.03.2019 15:40:38
Version:	BeGaze 2.5.77
Sample Rate:	50
Subject:	S12H22222
Description:	aurele barriere

Table Header for Fixations:
Event Type	Trial	Number	Start	End	Duration	Location X	Location Y	Dispersion X	Dispersion Y	Plane	Avg. Pupil Size X	Avg. Pupil Size Y

Table Header for Saccades:
Event Type	Trial	Number	Start	End	Duration	Start Loc.X	Start Loc.Y	End Loc.X	End Loc.Y	Amplitude	Peak Speed	Peak Speed At	Average Speed	Peak Accel.	Peak Decel.	Average Accel.

Table Header for Blinks:
Event Type	Trial	Number	Start	End	Duration

Table Header for User Events:
Event Type	Trial	Number	Start	Description

UserEvent	1	1	23674677431	# Message: void.jpg
Fixation L	1	1	23674678575	23674857567	178992	1055.48	369.77	25	21	-1	11.35	11.35
Fixation R	1	1	23674678575	23674857567	178992	1055.48	369.77	25	21	-1	10.94	10.94
Saccade L	1	1	23674857567	23674877558	19991	1033.82	375.33	892.10	367.23	0.95	143.58	1.00	47.31	3568.99	-3523.59	2399.24
Saccade R	1	1	23674857567	23674877558	19991	1033.82	375.33	892.10	367.23	0.95	143.58	1.00	47.31	3568.99	-3523.59	2399.24
Fixation L	1	2	23674877558	23675195770	318212	869.31	360.30	27	56	-1	11.15	11.15
Fixation R	1	2	23674877558	23675195770	318212	869.31	360.30	27	56	-1	10.82	10.82
Saccade L	1	2	23675195770	23675235531	39761	871.06	399.47	886.90	431.57	0.85	45.01	0.00	21.44	359.86	-588.48	329.64
Saccade R	1	2	23675195770	23675235531	39761	871.06	399.47	886.90	431.57	0.85	45.01	0.00	21.44	359.86	-588.48	329.64
Fixation L	1	3	23675235531	23675354902	119371	899.68	481.50	28	70	-1	11.24	11.24
Fixation R	1	3	23675235531	23675354902	119371	899.68	481.50	28	70	-1	10.77	10.77
Saccade L	1	3	23675354902	23675374774	19872	913.01	501.87	915.99	497.40	0.07	5.43	1.00	3.55	82.17	-80.97	63.71
Saccade R	1	3	23675354902	23675374774	19872	913.01	501.87	915.99	497.40	0.07	5.43	1.00	3.55	82.17	-80.97	63.71
Fixation L	1	4	23675374774	23675553759	178985	922.06	519.86	8	46	-1	11.62	11.62
Fixation R	1	4	23675374774	23675553759	178985	922.06	519.86	8	46	-1	11.43	11.43
Blink L	1	1	23675553759	23675832247	278488
Blink R	1	1	23675553759	23675832247	278488
Fixation L	1	5	23675832247	23676389096	556849	994.69	530.25	10	89	-1	13.46	13.46
Fixation R	1	5	23675832247	23676389096	556849	994.69	530.25	10	89	-1	12.96	12.96
Saccade L	1	4	23676389096	23676408980	19884	989.81	562.48	989.94	563.57	0.07	6.19	0.00	3.68	-9.14	-39.98	28.54
Saccade R	1	4	23676389096	23676408980	19884	989.81	562.48	989.94	563.57	0.07	6.19	0.00	3.68	-9.14	-39.98	28.54
Fixation L	1	6	23676408980	23676667584	258604	969.19	557.87	49	13	-1	13.40	13.40
Fixation R	1	6	23676408980	23676667584	258604	969.19	557.87	49	13	-1	12.96	12.96
