[BeGaze]
Converted from:	C:\Documents and Settings\iViewX\Desktop\EXPERIMENTATIONS\Experiments\results\finaleart\S20H24222-finaleart-1.idf
Date:	27.03.2019 15:53:29
Version:	BeGaze 2.5.77
Sample Rate:	50
Subject:	S20H24222
Description:	Hugo Brument

Table Header for Fixations:
Event Type	Trial	Number	Start	End	Duration	Location X	Location Y	Dispersion X	Dispersion Y	Plane	Avg. Pupil Size X	Avg. Pupil Size Y

Table Header for Saccades:
Event Type	Trial	Number	Start	End	Duration	Start Loc.X	Start Loc.Y	End Loc.X	End Loc.Y	Amplitude	Peak Speed	Peak Speed At	Average Speed	Peak Accel.	Peak Decel.	Average Accel.

Table Header for Blinks:
Event Type	Trial	Number	Start	End	Duration

Table Header for User Events:
Event Type	Trial	Number	Start	Description

UserEvent	1	1	11911756030	# Message: void.jpg
Fixation L	1	1	11911766190	11912203786	437596	423.05	624.45	26	32	-1	12.02	12.02
Fixation R	1	1	11911766190	11912203786	437596	423.05	624.45	26	32	-1	13.93	13.93
Blink L	1	1	11912203786	11912522013	318227
Blink R	1	1	11912203786	11912522013	318227
Fixation L	1	2	11912522013	11912959622	437609	1001.83	769.00	19	32	-1	12.08	12.08
Fixation R	1	2	11912522013	11912959622	437609	1001.83	769.00	19	32	-1	12.68	12.68
Saccade L	1	1	11912959622	11912979492	19870	1001.75	785.55	1107.76	782.70	0.61	107.27	1.00	30.63	2565.89	-2519.46	1702.12
Saccade R	1	1	11912959622	11912979492	19870	1001.75	785.55	1107.76	782.70	0.61	107.27	1.00	30.63	2565.89	-2519.46	1702.12
Fixation L	1	3	11912979492	11913317623	338131	1099.40	789.10	12	14	-1	12.81	12.81
Fixation R	1	3	11912979492	11913317623	338131	1099.40	789.10	12	14	-1	13.58	13.58
Saccade L	1	2	11913317623	11913357471	39848	1094.80	793.78	881.33	699.87	2.18	150.60	0.50	54.62	3657.13	-3225.16	2716.09
Saccade R	1	2	11913317623	11913357471	39848	1094.80	793.78	881.33	699.87	2.18	150.60	0.50	54.62	3657.13	-3225.16	2716.09
Fixation L	1	4	11913357471	11913456843	99372	865.48	666.94	30	58	-1	12.79	12.79
Fixation R	1	4	11913357471	11913456843	99372	865.48	666.94	30	58	-1	13.56	13.56
Saccade L	1	3	11913456843	11913476731	19888	850.93	641.38	855.96	629.08	0.20	16.64	0.00	10.06	117.48	-380.58	263.61
Saccade R	1	3	11913456843	11913476731	19888	850.93	641.38	855.96	629.08	0.20	16.64	0.00	10.06	117.48	-380.58	263.61
Fixation L	1	5	11913476731	11913655837	179106	854.38	630.06	5	21	-1	12.36	12.36
Fixation R	1	5	11913476731	11913655837	179106	854.38	630.06	5	21	-1	13.43	13.43
Saccade L	1	4	11913655837	11913735332	79495	856.86	641.61	915.31	592.33	2.44	89.27	0.25	30.69	2178.84	-1242.56	1011.08
Saccade R	1	4	11913655837	11913735332	79495	856.86	641.61	915.31	592.33	2.44	89.27	0.25	30.69	2178.84	-1242.56	1011.08
