[BeGaze]
Converted from:	C:\Documents and Settings\iViewX\Desktop\EXPERIMENTATIONS\Experiments\results\finaleart\S4120113-finaleart-1.idf
Date:	27.03.2019 15:34:33
Version:	BeGaze 2.5.77
Sample Rate:	50
Subject:	S4120113
Description:	Vidal Attias

Table Header for Fixations:
Event Type	Trial	Number	Start	End	Duration	Location X	Location Y	Dispersion X	Dispersion Y	Plane	Avg. Pupil Size X	Avg. Pupil Size Y

Table Header for Saccades:
Event Type	Trial	Number	Start	End	Duration	Start Loc.X	Start Loc.Y	End Loc.X	End Loc.Y	Amplitude	Peak Speed	Peak Speed At	Average Speed	Peak Accel.	Peak Decel.	Average Accel.

Table Header for Blinks:
Event Type	Trial	Number	Start	End	Duration

Table Header for User Events:
Event Type	Trial	Number	Start	Description

UserEvent	1	1	6991400116	# Message: the-banks-of-the-marne-at-dawn_dubois-pillet_1888.jpg
Fixation L	1	1	6991400847	6991917954	517107	1062.69	440.76	14	36	-1	13.14	13.14
Fixation R	1	1	6991400847	6991917954	517107	1062.69	440.76	14	36	-1	13.11	13.11
Saccade L	1	1	6991917954	6991997423	79469	1054.93	449.70	971.92	502.21	3.72	151.89	0.25	46.82	3553.40	-3579.58	1759.06
Saccade R	1	1	6991917954	6991997423	79469	1054.93	449.70	971.92	502.21	3.72	151.89	0.25	46.82	3553.40	-3579.58	1759.06
Fixation L	1	2	6991997423	6992156541	159118	973.59	504.10	20	74	-1	10.25	10.25
Fixation R	1	2	6991997423	6992156541	159118	973.59	504.10	20	74	-1	9.87	9.87
Saccade L	1	2	6992156541	6992216298	59757	961.00	552.23	939.10	620.96	2.63	108.37	0.67	44.02	1685.52	-2546.26	1211.01
Saccade R	1	2	6992156541	6992216298	59757	961.00	552.23	939.10	620.96	2.63	108.37	0.67	44.02	1685.52	-2546.26	1211.01
Fixation L	1	3	6992216298	6992554397	338099	919.81	603.86	33	62	-1	9.37	9.37
Fixation R	1	3	6992216298	6992554397	338099	919.81	603.86	33	62	-1	9.75	9.75
Saccade L	1	3	6992554397	6992594140	39743	914.63	593.38	745.98	507.84	2.19	142.53	1.00	54.99	3349.48	-3342.25	2050.31
Saccade R	1	3	6992554397	6992594140	39743	914.63	593.38	745.98	507.84	2.19	142.53	1.00	54.99	3349.48	-3342.25	2050.31
Fixation L	1	4	6992594140	6992872629	278489	725.87	466.64	25	55	-1	8.83	8.83
Fixation R	1	4	6992594140	6992872629	278489	725.87	466.64	25	55	-1	9.25	9.25
Saccade L	1	4	6992872629	6992912369	39740	721.73	452.09	513.46	339.07	2.28	186.39	1.00	57.35	4509.34	-4598.23	2775.39
Saccade R	1	4	6992872629	6992912369	39740	721.73	452.09	513.46	339.07	2.28	186.39	1.00	57.35	4509.34	-4598.23	2775.39
Fixation L	1	5	6992912369	6993190857	278488	479.93	311.16	39	57	-1	8.18	8.18
Fixation R	1	5	6992912369	6993190857	278488	479.93	311.16	39	57	-1	8.93	8.93
Saccade L	1	5	6993190857	6993250490	59633	474.78	313.02	824.81	191.34	4.88	205.88	0.67	81.85	4885.40	-4294.27	3092.86
Saccade R	1	5	6993190857	6993250490	59633	474.78	313.02	824.81	191.34	4.88	205.88	0.67	81.85	4885.40	-4294.27	3092.86
Fixation L	1	6	6993250490	6993449455	198965	814.84	179.61	47	51	-1	7.71	7.71
Fixation R	1	6	6993250490	6993449455	198965	814.84	179.61	47	51	-1	8.32	8.32
Saccade L	1	6	6993449455	6993489211	39756	851.38	170.34	1381.59	153.04	4.64	271.88	0.50	116.82	6757.57	-6687.24	6278.89
Saccade R	1	6	6993449455	6993489211	39756	851.38	170.34	1381.59	153.04	4.64	271.88	0.50	116.82	6757.57	-6687.24	6278.89
Fixation L	1	7	6993489211	6993648326	159115	1384.39	163.46	15	81	-1	8.26	8.26
Fixation R	1	7	6993489211	6993648326	159115	1384.39	163.46	15	81	-1	8.19	8.19
Saccade L	1	7	6993648326	6993747822	99496	1378.24	211.71	1581.75	203.76	3.97	183.48	1.00	39.85	4274.43	-3998.50	1368.67
Saccade R	1	7	6993648326	6993747822	99496	1378.24	211.71	1581.75	203.76	3.97	183.48	1.00	39.85	4274.43	-3998.50	1368.67
Fixation L	1	8	6993747822	6994046053	298231	1570.73	212.97	39	55	-1	9.77	9.77
Fixation R	1	8	6993747822	6994046053	298231	1570.73	212.97	39	55	-1	9.85	9.85
Saccade L	1	8	6994046053	6994066059	20006	1548.69	231.14	1541.88	232.73	0.14	9.55	1.00	7.14	-52.34	-128.72	80.92
Saccade R	1	8	6994046053	6994066059	20006	1548.69	231.14	1541.88	232.73	0.14	9.55	1.00	7.14	-52.34	-128.72	80.92
Fixation L	1	9	6994066059	6994245033	178974	1544.35	236.72	16	40	-1	10.21	10.21
Fixation R	1	9	6994066059	6994245033	178974	1544.35	236.72	16	40	-1	10.19	10.19
Saccade L	1	9	6994245033	6994304662	59629	1556.08	270.79	1570.30	627.47	5.23	215.75	0.33	87.71	5234.09	-3296.71	3168.38
Saccade R	1	9	6994245033	6994304662	59629	1556.08	270.79	1570.30	627.47	5.23	215.75	0.33	87.71	5234.09	-3296.71	3168.38
Fixation L	1	10	6994304662	6994523519	218857	1578.29	654.61	27	45	-1	10.86	10.86
Fixation R	1	10	6994304662	6994523519	218857	1578.29	654.61	27	45	-1	10.37	10.37
Saccade L	1	10	6994523519	6994543411	19892	1581.95	643.43	1659.87	777.80	1.23	157.09	1.00	61.82	3830.29	-3602.85	2953.51
Saccade R	1	10	6994523519	6994543411	19892	1581.95	643.43	1659.87	777.80	1.23	157.09	1.00	61.82	3830.29	-3602.85	2953.51
Fixation L	1	11	6994543411	6994742268	198857	1714.99	781.75	70	26	-1	10.82	10.82
Fixation R	1	11	6994543411	6994742268	198857	1714.99	781.75	70	26	-1	10.09	10.09
Saccade L	1	11	6994742268	6994861650	119382	1703.88	792.12	1493.62	1085.10	7.93	216.14	0.67	66.44	4923.81	-4042.74	2289.36
Saccade R	1	11	6994742268	6994861650	119382	1703.88	792.12	1493.62	1085.10	7.93	216.14	0.67	66.44	4923.81	-4042.74	2289.36
Fixation L	1	12	6994861650	6995159987	298337	1494.16	1092.30	49	47	-1	10.60	10.60
Fixation R	1	12	6994861650	6995159987	298337	1494.16	1092.30	49	47	-1	9.93	9.93
Saccade L	1	12	6995159987	6995179867	19880	1519.97	1117.46	1523.09	1134.35	0.53	41.32	1.00	26.72	701.94	-439.37	489.62
Saccade R	1	12	6995159987	6995179867	19880	1519.97	1117.46	1523.09	1134.35	0.53	41.32	1.00	26.72	701.94	-439.37	489.62
Fixation L	1	13	6995179867	6995299228	119361	1547.98	1115.38	39	28	-1	10.35	10.35
Fixation R	1	13	6995179867	6995299228	119361	1547.98	1115.38	39	28	-1	10.01	10.01
Saccade L	1	13	6995299228	6995398604	99376	1550.21	1105.37	1408.73	1085.19	2.33	95.71	0.20	23.47	2114.36	-2099.68	1006.27
Saccade R	1	13	6995299228	6995398604	99376	1550.21	1105.37	1408.73	1085.19	2.33	95.71	0.20	23.47	2114.36	-2099.68	1006.27
