[BeGaze]
Converted from:	C:\Documents and Settings\iViewX\Desktop\EXPERIMENTATIONS\Experiments\results\finaleart\S19F21442-finaleart-1.idf
Date:	27.03.2019 15:51:58
Version:	BeGaze 2.5.77
Sample Rate:	50
Subject:	S19F21442
Description:	Juliette Veuillez

Table Header for Fixations:
Event Type	Trial	Number	Start	End	Duration	Location X	Location Y	Dispersion X	Dispersion Y	Plane	Avg. Pupil Size X	Avg. Pupil Size Y

Table Header for Saccades:
Event Type	Trial	Number	Start	End	Duration	Start Loc.X	Start Loc.Y	End Loc.X	End Loc.Y	Amplitude	Peak Speed	Peak Speed At	Average Speed	Peak Accel.	Peak Decel.	Average Accel.

Table Header for Blinks:
Event Type	Trial	Number	Start	End	Duration

Table Header for User Events:
Event Type	Trial	Number	Start	Description

UserEvent	1	1	8319118894	# Message: Nature_Morte_Aux_Raisins_Sur_Un_Plat_Derain_1944.jpg
Fixation L	1	1	8319125756	8319543483	417727	790.21	610.21	25	48	-1	12.09	12.09
Fixation R	1	1	8319125756	8319543483	417727	790.21	610.21	25	48	-1	13.61	13.61
Saccade L	1	1	8319543483	8319563357	19874	800.39	630.16	835.20	461.28	1.14	174.38	1.00	57.30	4158.70	-4332.46	3090.17
Saccade R	1	1	8319543483	8319563357	19874	800.39	630.16	835.20	461.28	1.14	174.38	1.00	57.30	4158.70	-4332.46	3090.17
Fixation L	1	2	8319563357	8319941239	377882	870.30	421.23	40	54	-1	11.06	11.06
Fixation R	1	2	8319563357	8319941239	377882	870.30	421.23	40	54	-1	12.92	12.92
Saccade L	1	2	8319941239	8319981091	39852	872.32	415.44	576.17	206.19	3.13	225.53	0.50	78.44	5488.71	-5378.42	4394.80
Saccade R	1	2	8319941239	8319981091	39852	872.32	415.44	576.17	206.19	3.13	225.53	0.50	78.44	5488.71	-5378.42	4394.80
Fixation L	1	3	8319981091	8320160090	178999	588.06	213.70	16	17	-1	10.46	10.46
Fixation R	1	3	8319981091	8320160090	178999	588.06	213.70	16	17	-1	12.22	12.22
Saccade L	1	3	8320160090	8320179956	19866	584.01	211.15	480.08	197.48	0.67	106.04	1.00	33.67	2540.47	-2235.43	1645.02
Saccade R	1	3	8320160090	8320179956	19866	584.01	211.15	480.08	197.48	0.67	106.04	1.00	33.67	2540.47	-2235.43	1645.02
Fixation L	1	4	8320179956	8320339074	159118	462.44	178.45	26	44	-1	10.59	10.59
Fixation R	1	4	8320179956	8320339074	159118	462.44	178.45	26	44	-1	12.64	12.64
Saccade L	1	4	8320339074	8320418563	79489	453.28	153.27	513.32	145.80	1.98	64.50	1.00	24.87	1347.34	-861.29	782.22
Saccade R	1	4	8320339074	8320418563	79489	453.28	153.27	513.32	145.80	1.98	64.50	1.00	24.87	1347.34	-861.29	782.22
Fixation L	1	5	8320418563	8320597686	179123	577.60	156.37	77	18	-1	10.88	10.88
Fixation R	1	5	8320418563	8320597686	179123	577.60	156.37	77	18	-1	12.96	12.96
Saccade L	1	5	8320597686	8320617554	19868	588.64	161.39	642.58	230.30	0.59	88.52	1.00	29.70	2120.65	-1970.79	1531.13
Saccade R	1	5	8320597686	8320617554	19868	588.64	161.39	642.58	230.30	0.59	88.52	1.00	29.70	2120.65	-1970.79	1531.13
Fixation L	1	6	8320617554	8320856179	238625	665.00	231.18	30	33	-1	11.06	11.06
Fixation R	1	6	8320617554	8320856179	238625	665.00	231.18	30	33	-1	13.04	13.04
Saccade L	1	6	8320856179	8320915924	59745	666.31	228.20	807.81	524.89	3.56	226.23	0.33	59.51	5420.36	-3717.37	2536.81
Saccade R	1	6	8320856179	8320915924	59745	666.31	228.20	807.81	524.89	3.56	226.23	0.33	59.51	5420.36	-3717.37	2536.81
Fixation L	1	7	8320915924	8321452900	536976	818.66	553.83	21	67	-1	11.89	11.89
Fixation R	1	7	8320915924	8321452900	536976	818.66	553.83	21	67	-1	13.53	13.53
Saccade L	1	7	8321452900	8321492647	39747	824.92	540.42	1169.70	384.20	3.44	269.23	0.50	86.65	6375.86	-6401.49	4695.81
Saccade R	1	7	8321452900	8321492647	39747	824.92	540.42	1169.70	384.20	3.44	269.23	0.50	86.65	6375.86	-6401.49	4695.81
Fixation L	1	8	8321492647	8321810885	318238	1158.83	368.80	16	22	-1	11.17	11.17
Fixation R	1	8	8321492647	8321810885	318238	1158.83	368.80	16	22	-1	12.65	12.65
Saccade L	1	8	8321810885	8321830772	19887	1159.68	367.08	1160.01	269.31	0.78	98.89	1.00	39.46	2430.10	-2401.06	2046.43
Saccade R	1	8	8321810885	8321830772	19887	1159.68	367.08	1160.01	269.31	0.78	98.89	1.00	39.46	2430.10	-2401.06	2046.43
Fixation L	1	9	8321830772	8322288240	457468	1157.67	218.68	12	64	-1	10.68	10.68
Fixation R	1	9	8321830772	8322288240	457468	1157.67	218.68	12	64	-1	11.90	11.90
Saccade L	1	9	8322288240	8322347998	59758	1154.56	246.14	1445.18	882.49	7.54	379.96	0.33	126.11	9423.07	-7556.50	6306.97
Saccade R	1	9	8322288240	8322347998	59758	1154.56	246.14	1445.18	882.49	7.54	379.96	0.33	126.11	9423.07	-7556.50	6306.97
Fixation L	1	10	8322347998	8322546853	198855	1449.82	896.18	12	21	-1	11.51	11.51
Fixation R	1	10	8322347998	8322546853	198855	1449.82	896.18	12	21	-1	12.23	12.23
Saccade L	1	10	8322546853	8322566723	19870	1452.52	900.42	1253.82	767.17	1.48	241.87	1.00	74.27	5975.89	-5946.35	4384.90
Saccade R	1	10	8322546853	8322566723	19870	1452.52	900.42	1253.82	767.17	1.48	241.87	1.00	74.27	5975.89	-5946.35	4384.90
Fixation L	1	11	8322566723	8322705971	139248	1242.05	730.21	22	53	-1	11.24	11.24
Fixation R	1	11	8322566723	8322705971	139248	1242.05	730.21	22	53	-1	11.88	11.88
Saccade L	1	11	8322705971	8322765714	59743	1231.28	716.94	1480.62	1001.47	4.91	272.94	0.67	82.19	6244.16	-6287.36	3867.16
Saccade R	1	11	8322705971	8322765714	59743	1231.28	716.94	1480.62	1001.47	4.91	272.94	0.67	82.19	6244.16	-6287.36	3867.16
Fixation L	1	12	8322765714	8323083946	318232	1464.90	1017.15	27	22	-1	10.55	10.55
Fixation R	1	12	8322765714	8323083946	318232	1464.90	1017.15	27	22	-1	11.00	11.00
Saccade L	1	12	8323083946	8323103823	19877	1474.13	1021.17	1543.11	1023.70	0.62	69.82	1.00	31.05	1686.38	0.00	843.19
Saccade R	1	12	8323083946	8323103823	19877	1474.13	1021.17	1543.11	1023.70	0.62	69.82	1.00	31.05	1686.38	0.00	843.19
