[BeGaze]
Converted from:	C:\Documents and Settings\iViewX\Desktop\EXPERIMENTATIONS\Experiments\results\finaleart\S16F14542-finaleart-1.idf
Date:	27.03.2019 15:47:46
Version:	BeGaze 2.5.77
Sample Rate:	50
Subject:	S16F14542
Description:	Diane Dewez

Table Header for Fixations:
Event Type	Trial	Number	Start	End	Duration	Location X	Location Y	Dispersion X	Dispersion Y	Plane	Avg. Pupil Size X	Avg. Pupil Size Y

Table Header for Saccades:
Event Type	Trial	Number	Start	End	Duration	Start Loc.X	Start Loc.Y	End Loc.X	End Loc.Y	Amplitude	Peak Speed	Peak Speed At	Average Speed	Peak Accel.	Peak Decel.	Average Accel.

Table Header for Blinks:
Event Type	Trial	Number	Start	End	Duration

Table Header for User Events:
Event Type	Trial	Number	Start	Description

UserEvent	1	1	7405958066	# Message: void.jpg
Saccade L	1	1	7405966785	7406006516	39731	711.86	730.69	380.87	1013.48	4.55	285.21	0.50	114.52	4080.03	-6888.98	3715.81
Saccade R	1	1	7405966785	7406006516	39731	711.86	730.69	380.87	1013.48	4.55	285.21	0.50	114.52	4080.03	-6888.98	3715.81
Fixation L	1	1	7406006516	7406145769	139253	368.29	1012.02	19	19	-1	14.76	14.76
Fixation R	1	1	7406006516	7406145769	139253	368.29	1012.02	19	19	-1	15.10	15.10
Saccade L	1	2	7406145769	7406165648	19879	361.48	1026.51	358.40	1099.23	0.48	73.62	1.00	24.21	1807.13	-1773.47	1308.38
Saccade R	1	2	7406145769	7406165648	19879	361.48	1026.51	358.40	1099.23	0.48	73.62	1.00	24.21	1807.13	-1773.47	1308.38
Fixation L	1	2	7406165648	7406782244	616596	329.77	1107.52	39	14	-1	14.42	14.42
Fixation R	1	2	7406165648	7406782244	616596	329.77	1107.52	39	14	-1	14.61	14.61
Blink L	1	1	7406782244	7407001104	218860
Blink R	1	1	7406782244	7406861858	79614
Blink R	1	2	7406881737	7407001104	119367
Fixation L	1	3	7407001104	7407398837	397733	1137.03	256.08	21	35	-1	13.83	13.83
Fixation R	1	3	7407001104	7407398837	397733	1137.03	256.08	21	35	-1	14.07	14.07
Saccade L	1	3	7407398837	7407438587	39750	1130.42	240.99	901.71	463.61	3.05	230.61	0.50	76.64	5655.76	-4782.66	3641.66
Saccade R	1	3	7407398837	7407438587	39750	1130.42	240.99	901.71	463.61	3.05	230.61	0.50	76.64	5655.76	-4782.66	3641.66
Fixation L	1	4	7407438587	7407935936	497349	884.10	476.71	27	71	-1	14.28	14.28
Fixation R	1	4	7407438587	7407935936	497349	884.10	476.71	27	71	-1	14.36	14.36
Saccade L	1	4	7407935936	7407955805	19869	874.39	479.19	871.36	496.57	0.37	19.36	1.00	18.43	0.00	-37.74	18.87
Saccade R	1	4	7407935936	7407955805	19869	874.39	479.19	871.36	496.57	0.37	19.36	1.00	18.43	0.00	-37.74	18.87
