[BeGaze]
Converted from:	C:\Documents and Settings\iViewX\Desktop\EXPERIMENTATIONS\Experiments\results\finaleart\S14F27123-finaleart-1.idf
Date:	27.03.2019 15:44:14
Version:	BeGaze 2.5.77
Sample Rate:	50
Subject:	S14F27123
Description:	Anne-flore Perrin

Table Header for Fixations:
Event Type	Trial	Number	Start	End	Duration	Location X	Location Y	Dispersion X	Dispersion Y	Plane	Avg. Pupil Size X	Avg. Pupil Size Y

Table Header for Saccades:
Event Type	Trial	Number	Start	End	Duration	Start Loc.X	Start Loc.Y	End Loc.X	End Loc.Y	Amplitude	Peak Speed	Peak Speed At	Average Speed	Peak Accel.	Peak Decel.	Average Accel.

Table Header for Blinks:
Event Type	Trial	Number	Start	End	Duration

Table Header for User Events:
Event Type	Trial	Number	Start	Description

UserEvent	1	1	31812943738	# Message: void.jpg
Saccade L	1	1	31812946512	31813006269	59757	472.74	305.42	458.82	308.77	4.61	356.22	1.00	77.09	8747.32	-284.18	3118.04
Saccade R	1	1	31812946512	31813006269	59757	472.74	305.42	458.82	308.77	4.61	356.22	1.00	77.09	8747.32	-284.18	3118.04
Blink L	1	1	31813006269	31813523374	517105
Blink R	1	1	31813006269	31813523374	517105
Blink L	1	2	31813602887	31813980841	377954
Blink R	1	2	31813602887	31813980841	377954
Fixation L	1	1	31814060337	31814239322	178985	872.28	474.47	19	79	-1	12.21	12.21
Fixation R	1	1	31814060337	31814239322	178985	872.28	474.47	19	79	-1	12.51	12.51
Saccade L	1	2	31814239322	31814259334	20012	868.37	456.20	863.33	440.98	0.19	16.22	1.00	9.73	236.02	-165.08	175.45
Saccade R	1	2	31814239322	31814259334	20012	868.37	456.20	863.33	440.98	0.19	16.22	1.00	9.73	236.02	-165.08	175.45
Fixation L	1	2	31814259334	31814358704	99370	860.79	439.22	3	14	-1	11.27	11.27
Fixation R	1	2	31814259334	31814358704	99370	860.79	439.22	3	14	-1	11.66	11.66
Saccade L	1	3	31814358704	31814398444	39740	859.88	441.07	1040.43	393.96	1.66	111.32	0.50	41.87	2647.04	-2525.92	2149.68
Saccade R	1	3	31814358704	31814398444	39740	859.88	441.07	1040.43	393.96	1.66	111.32	0.50	41.87	2647.04	-2525.92	2149.68
Fixation L	1	3	31814398444	31814935544	537100	1031.50	383.59	43	52	-1	10.21	10.21
Fixation R	1	3	31814398444	31814935544	537100	1031.50	383.59	43	52	-1	10.36	10.36
