[BeGaze]
Converted from:	C:\Documents and Settings\iViewX\Desktop\EXPERIMENTATIONS\Experiments\results\finaleart\S14F27123-finaleart-1.idf
Date:	27.03.2019 15:43:54
Version:	BeGaze 2.5.77
Sample Rate:	50
Subject:	S14F27123
Description:	Anne-flore Perrin

Table Header for Fixations:
Event Type	Trial	Number	Start	End	Duration	Location X	Location Y	Dispersion X	Dispersion Y	Plane	Avg. Pupil Size X	Avg. Pupil Size Y

Table Header for Saccades:
Event Type	Trial	Number	Start	End	Duration	Start Loc.X	Start Loc.Y	End Loc.X	End Loc.Y	Amplitude	Peak Speed	Peak Speed At	Average Speed	Peak Accel.	Peak Decel.	Average Accel.

Table Header for Blinks:
Event Type	Trial	Number	Start	End	Duration

Table Header for User Events:
Event Type	Trial	Number	Start	Description

UserEvent	1	1	31522936524	# Message: the-large-bathers_renoir_1887.jpg
Fixation L	1	1	31522945491	31523383095	437604	746.17	581.74	17	34	-1	11.39	11.39
Fixation R	1	1	31522945491	31523383095	437604	746.17	581.74	17	34	-1	12.57	12.57
Saccade L	1	1	31523383095	31523422974	39879	755.82	585.89	473.63	521.11	2.53	254.67	0.50	63.50	6339.05	-6040.11	3344.23
Saccade R	1	1	31523383095	31523422974	39879	755.82	585.89	473.63	521.11	2.53	254.67	0.50	63.50	6339.05	-6040.11	3344.23
Fixation L	1	2	31523422974	31523582077	159103	451.53	503.10	42	30	-1	10.72	10.72
Fixation R	1	2	31523422974	31523582077	159103	451.53	503.10	42	30	-1	11.54	11.54
Saccade L	1	2	31523582077	31523601952	19875	431.44	490.51	412.34	444.28	0.48	50.60	1.00	24.25	995.63	-585.80	625.58
Saccade R	1	2	31523582077	31523601952	19875	431.44	490.51	412.34	444.28	0.48	50.60	1.00	24.25	995.63	-585.80	625.58
Fixation L	1	3	31523601952	31524039439	437487	409.29	420.78	20	43	-1	8.84	8.84
Fixation R	1	3	31523601952	31524039439	437487	409.29	420.78	20	43	-1	9.95	9.95
Saccade L	1	3	31524039439	31524079310	39871	401.22	408.97	745.74	693.39	3.84	315.52	1.00	96.29	7792.89	-7366.61	5331.87
Saccade R	1	3	31524039439	31524079310	39871	401.22	408.97	745.74	693.39	3.84	315.52	1.00	96.29	7792.89	-7366.61	5331.87
Fixation L	1	4	31524079310	31524238426	159116	729.56	700.16	22	64	-1	9.52	9.52
Fixation R	1	4	31524079310	31524238426	159116	729.56	700.16	22	64	-1	10.56	10.56
Saccade L	1	4	31524238426	31524278171	39745	728.56	657.53	962.56	717.24	2.64	209.05	0.50	66.47	5195.69	-4280.01	2600.32
Saccade R	1	4	31524238426	31524278171	39745	728.56	657.53	962.56	717.24	2.64	209.05	0.50	66.47	5195.69	-4280.01	2600.32
Fixation L	1	5	31524278171	31524417427	139256	993.54	727.52	41	38	-1	10.48	10.48
Fixation R	1	5	31524278171	31524417427	139256	993.54	727.52	41	38	-1	10.94	10.94
Saccade L	1	5	31524417427	31524437291	19864	994.01	717.98	973.63	472.07	1.57	249.47	1.00	78.98	5939.56	-5626.15	3857.16
Saccade R	1	5	31524417427	31524437291	19864	994.01	717.98	973.63	472.07	1.57	249.47	1.00	78.98	5939.56	-5626.15	3857.16
Fixation L	1	6	31524437291	31524656029	218738	946.89	458.38	33	24	-1	10.22	10.22
Fixation R	1	6	31524437291	31524656029	218738	946.89	458.38	33	24	-1	10.52	10.52
Saccade L	1	6	31524656029	31524695905	39876	942.88	452.68	832.92	326.84	1.85	101.02	1.00	46.36	2483.48	-2259.70	2260.21
Saccade R	1	6	31524656029	31524695905	39876	942.88	452.68	832.92	326.84	1.85	101.02	1.00	46.36	2483.48	-2259.70	2260.21
Fixation L	1	7	31524695905	31524855024	159119	849.50	317.43	24	18	-1	9.99	9.99
Fixation R	1	7	31524695905	31524855024	159119	849.50	317.43	24	18	-1	10.56	10.56
Saccade L	1	7	31524855024	31524874896	19872	849.84	308.78	840.07	110.14	1.11	201.11	1.00	56.08	4958.26	-4858.97	3272.72
Saccade R	1	7	31524855024	31524874896	19872	849.84	308.78	840.07	110.14	1.11	201.11	1.00	56.08	4958.26	-4858.97	3272.72
Fixation L	1	8	31524874896	31525113515	238619	816.16	77.92	39	58	-1	10.17	10.17
Fixation R	1	8	31524874896	31525113515	238619	816.16	77.92	39	58	-1	11.10	11.10
Saccade L	1	8	31525113515	31525133390	19875	800.86	51.87	799.32	46.60	0.16	19.40	1.00	8.17	-4.38	-346.22	129.59
Saccade R	1	8	31525113515	31525133390	19875	800.86	51.87	799.32	46.60	0.16	19.40	1.00	8.17	-4.38	-346.22	129.59
Fixation L	1	9	31525133390	31525272634	139244	799.66	50.93	3	18	-1	10.48	10.48
Fixation R	1	9	31525133390	31525272634	139244	799.66	50.93	3	18	-1	11.33	11.33
Saccade L	1	9	31525272634	31525352257	79623	800.93	61.77	1421.35	536.87	11.26	358.47	0.50	141.35	8713.69	-6626.79	5240.50
Saccade R	1	9	31525272634	31525352257	79623	800.93	61.77	1421.35	536.87	11.26	358.47	0.50	141.35	8713.69	-6626.79	5240.50
Fixation L	1	10	31525352257	31525650615	298358	1438.94	515.39	39	46	-1	10.91	10.91
Fixation R	1	10	31525352257	31525650615	298358	1438.94	515.39	39	46	-1	11.44	11.44
Saccade L	1	10	31525650615	31525670489	19874	1460.81	524.60	1634.46	785.84	1.89	317.01	1.00	95.19	7441.78	-7401.96	5175.26
Saccade R	1	10	31525650615	31525670489	19874	1460.81	524.60	1634.46	785.84	1.89	317.01	1.00	95.19	7441.78	-7401.96	5175.26
Fixation L	1	11	31525670489	31525809758	139269	1618.18	821.81	26	64	-1	10.56	10.56
Fixation R	1	11	31525670489	31525809758	139269	1618.18	821.81	26	64	-1	10.78	10.78
Saccade L	1	11	31525809758	31525849477	39719	1608.44	850.34	1604.34	522.16	2.81	175.45	1.00	70.82	4139.57	-3672.66	3811.51
Saccade R	1	11	31525809758	31525849477	39719	1608.44	850.34	1604.34	522.16	2.81	175.45	1.00	70.82	4139.57	-3672.66	3811.51
Fixation L	1	12	31525849477	31525988726	139249	1601.46	496.50	13	46	-1	10.67	10.67
Fixation R	1	12	31525849477	31525988726	139249	1601.46	496.50	13	46	-1	10.98	10.98
Saccade L	1	12	31525988726	31526008599	19873	1607.40	475.51	1620.94	447.35	0.33	31.60	1.00	16.81	627.38	-627.97	547.98
Saccade R	1	12	31525988726	31526008599	19873	1607.40	475.51	1620.94	447.35	0.33	31.60	1.00	16.81	627.38	-627.97	547.98
Fixation L	1	13	31526008599	31526187605	179006	1625.71	455.17	15	40	-1	10.99	10.99
Fixation R	1	13	31526008599	31526187605	179006	1625.71	455.17	15	40	-1	11.04	11.04
Saccade L	1	13	31526187605	31526207470	19865	1625.68	454.85	1535.23	332.00	1.12	154.29	1.00	56.50	2889.55	-3346.72	2208.05
Saccade R	1	13	31526187605	31526207470	19865	1625.68	454.85	1535.23	332.00	1.12	154.29	1.00	56.50	2889.55	-3346.72	2208.05
Fixation L	1	14	31526207470	31526466084	258614	1533.32	314.60	63	27	-1	11.24	11.24
Fixation R	1	14	31526207470	31526466084	258614	1533.32	314.60	63	27	-1	11.51	11.51
Saccade L	1	14	31526466084	31526485950	19866	1490.96	308.76	1452.27	297.10	0.54	40.87	1.00	26.94	736.48	-335.68	424.59
Saccade R	1	14	31526466084	31526485950	19866	1490.96	308.76	1452.27	297.10	0.54	40.87	1.00	26.94	736.48	-335.68	424.59
Fixation L	1	15	31526485950	31526664945	178995	1451.11	270.46	29	47	-1	11.13	11.13
Fixation R	1	15	31526485950	31526664945	178995	1451.11	270.46	29	47	-1	11.62	11.62
Saccade L	1	15	31526664945	31526704816	39871	1449.13	256.31	1165.10	141.68	2.73	178.42	1.00	68.37	4271.58	-3952.87	3556.53
Saccade R	1	15	31526664945	31526704816	39871	1449.13	256.31	1165.10	141.68	2.73	178.42	1.00	68.37	4271.58	-3952.87	3556.53
Fixation L	1	16	31526704816	31526923556	218740	1163.02	115.02	5	45	-1	11.36	11.36
Fixation R	1	16	31526704816	31526923556	218740	1163.02	115.02	5	45	-1	11.74	11.74
