[BeGaze]
Converted from:	C:\Documents and Settings\iViewX\Desktop\EXPERIMENTATIONS\Experiments\results\finaleart\S20H24222-finaleart-1.idf
Date:	27.03.2019 15:53:39
Version:	BeGaze 2.5.77
Sample Rate:	50
Subject:	S20H24222
Description:	Hugo Brument

Table Header for Fixations:
Event Type	Trial	Number	Start	End	Duration	Location X	Location Y	Dispersion X	Dispersion Y	Plane	Avg. Pupil Size X	Avg. Pupil Size Y

Table Header for Saccades:
Event Type	Trial	Number	Start	End	Duration	Start Loc.X	Start Loc.Y	End Loc.X	End Loc.Y	Amplitude	Peak Speed	Peak Speed At	Average Speed	Peak Accel.	Peak Decel.	Average Accel.

Table Header for Blinks:
Event Type	Trial	Number	Start	End	Duration

Table Header for User Events:
Event Type	Trial	Number	Start	Description

UserEvent	1	1	12114507738	# Message: Houses_at_Chatou_Vlaminck_1905.jpg
Fixation L	1	1	12114522717	12115039960	517243	877.20	554.71	19	59	-1	12.80	12.80
Fixation R	1	1	12114522717	12115039960	517243	877.20	554.71	19	59	-1	12.87	12.87
Saccade L	1	1	12115039960	12115059811	19851	886.23	557.90	753.23	560.36	0.73	134.54	1.00	36.98	3276.72	-3230.38	2212.03
Saccade R	1	1	12115039960	12115059811	19851	886.23	557.90	753.23	560.36	0.73	134.54	1.00	36.98	3276.72	-3230.38	2212.03
Fixation L	1	2	12115059811	12115278557	218746	746.93	581.76	15	34	-1	11.51	11.51
Fixation R	1	2	12115059811	12115278557	218746	746.93	581.76	15	34	-1	11.53	11.53
Saccade L	1	2	12115278557	12115298433	19876	738.74	594.92	641.31	663.69	0.67	120.62	1.00	33.93	2929.12	-2595.20	1873.11
Saccade R	1	2	12115278557	12115298433	19876	738.74	594.92	641.31	663.69	0.67	120.62	1.00	33.93	2929.12	-2595.20	1873.11
Fixation L	1	3	12115298433	12115517292	218859	624.25	648.91	21	37	-1	10.78	10.78
Fixation R	1	3	12115298433	12115517292	218859	624.25	648.91	21	37	-1	10.83	10.83
Saccade L	1	3	12115517292	12115576912	59620	621.26	626.44	1216.24	916.74	7.09	389.13	0.67	118.91	9591.73	-9148.16	5324.18
Saccade R	1	3	12115517292	12115576912	59620	621.26	626.44	1216.24	916.74	7.09	389.13	0.67	118.91	9591.73	-9148.16	5324.18
Fixation L	1	4	12115576912	12115755910	178998	1219.98	904.85	12	25	-1	10.84	10.84
Fixation R	1	4	12115576912	12115755910	178998	1219.98	904.85	12	25	-1	10.84	10.84
Saccade L	1	4	12115755910	12115775777	19867	1223.96	914.38	1341.04	952.85	0.89	124.65	1.00	44.95	3067.16	-2731.52	2252.22
Saccade R	1	4	12115755910	12115775777	19867	1223.96	914.38	1341.04	952.85	0.89	124.65	1.00	44.95	3067.16	-2731.52	2252.22
Fixation L	1	5	12115775777	12116054269	278492	1344.38	994.32	9	55	-1	11.59	11.59
Fixation R	1	5	12115775777	12116054269	278492	1344.38	994.32	9	55	-1	11.45	11.45
Saccade L	1	5	12116054269	12116114014	59745	1342.14	1008.70	833.64	554.24	7.25	264.11	0.67	121.27	6529.90	-5915.79	4508.24
Saccade R	1	5	12116054269	12116114014	59745	1342.14	1008.70	833.64	554.24	7.25	264.11	0.67	121.27	6529.90	-5915.79	4508.24
Fixation L	1	6	12116114014	12116312880	198866	830.76	585.88	15	51	-1	11.73	11.73
Fixation R	1	6	12116114014	12116312880	198866	830.76	585.88	15	51	-1	11.20	11.20
Saccade L	1	6	12116312880	12116332757	19877	824.15	577.13	704.48	536.11	0.86	127.95	1.00	43.36	3146.92	-2859.02	2119.64
Saccade R	1	6	12116312880	12116332757	19877	824.15	577.13	704.48	536.11	0.86	127.95	1.00	43.36	3146.92	-2859.02	2119.64
Fixation L	1	7	12116332757	12116631113	298356	683.66	499.30	26	47	-1	11.02	11.02
Fixation R	1	7	12116332757	12116631113	298356	683.66	499.30	26	47	-1	11.05	11.05
Saccade L	1	7	12116631113	12116670878	39765	684.89	488.54	1136.12	413.85	3.84	280.82	0.50	96.51	6909.01	-6813.96	5540.00
Saccade R	1	7	12116631113	12116670878	39765	684.89	488.54	1136.12	413.85	3.84	280.82	0.50	96.51	6909.01	-6813.96	5540.00
Fixation L	1	8	12116670878	12117048854	377976	1127.05	392.81	23	30	-1	10.79	10.79
Fixation R	1	8	12116670878	12117048854	377976	1127.05	392.81	23	30	-1	10.79	10.79
Saccade L	1	8	12117048854	12117088603	39749	1130.00	393.67	1237.78	199.49	1.83	143.55	0.50	46.14	3576.23	-3532.24	2692.09
Saccade R	1	8	12117048854	12117088603	39749	1130.00	393.67	1237.78	199.49	1.83	143.55	0.50	46.14	3576.23	-3532.24	2692.09
Fixation L	1	9	12117088603	12117267590	178987	1245.30	193.64	14	23	-1	10.83	10.83
Fixation R	1	9	12117088603	12117267590	178987	1245.30	193.64	14	23	-1	10.34	10.34
Saccade L	1	9	12117267590	12117307341	39751	1251.39	179.94	782.31	231.63	4.05	243.75	1.00	101.79	5766.58	-6019.24	5763.21
Saccade R	1	9	12117267590	12117307341	39751	1251.39	179.94	782.31	231.63	4.05	243.75	1.00	101.79	5766.58	-6019.24	5763.21
Fixation L	1	10	12117307341	12117685338	377997	782.11	262.25	6	66	-1	11.00	11.00
Fixation R	1	10	12117307341	12117685338	377997	782.11	262.25	6	66	-1	11.06	11.06
Saccade L	1	10	12117685338	12117725074	39736	778.23	289.65	1036.08	277.95	2.22	161.46	0.50	55.79	3938.85	-3845.62	3134.00
Saccade R	1	10	12117685338	12117725074	39736	778.23	289.65	1036.08	277.95	2.22	161.46	0.50	55.79	3938.85	-3845.62	3134.00
Fixation L	1	11	12117725074	12118142803	417729	1043.61	275.43	11	23	-1	11.53	11.53
Fixation R	1	11	12117725074	12118142803	417729	1043.61	275.43	11	23	-1	11.45	11.45
Blink L	1	1	12118142803	12118281920	139117
Blink R	1	1	12118142803	12118281920	139117
Fixation L	1	12	12118281920	12118500785	218865	962.31	566.47	15	14	-1	13.14	13.14
Fixation R	1	12	12118281920	12118500785	218865	962.31	566.47	15	14	-1	13.44	13.44
