[BeGaze]
Converted from:	C:\Documents and Settings\iViewX\Desktop\EXPERIMENTATIONS\Experiments\results\finaleart\S4120113-finaleart-1.idf
Date:	27.03.2019 15:34:43
Version:	BeGaze 2.5.77
Sample Rate:	50
Subject:	S4120113
Description:	Vidal Attias

Table Header for Fixations:
Event Type	Trial	Number	Start	End	Duration	Location X	Location Y	Dispersion X	Dispersion Y	Plane	Avg. Pupil Size X	Avg. Pupil Size Y

Table Header for Saccades:
Event Type	Trial	Number	Start	End	Duration	Start Loc.X	Start Loc.Y	End Loc.X	End Loc.Y	Amplitude	Peak Speed	Peak Speed At	Average Speed	Peak Accel.	Peak Decel.	Average Accel.

Table Header for Blinks:
Event Type	Trial	Number	Start	End	Duration

Table Header for User Events:
Event Type	Trial	Number	Start	Description

UserEvent	1	1	7722181370	# Message: landschaft_mit_dem_ondregenbogen_caspar_david_friedrich_1810.jpg
Fixation L	1	1	7722196995	7722674346	477351	681.15	915.34	23	30	-1	14.00	14.00
Fixation R	1	1	7722196995	7722674346	477351	681.15	915.34	23	30	-1	14.80	14.80
Saccade L	1	1	7722674346	7722733974	59628	696.52	913.73	1138.12	629.13	5.82	287.97	0.33	97.69	7163.51	-5326.88	4131.83
Saccade R	1	1	7722674346	7722733974	59628	696.52	913.73	1138.12	629.13	5.82	287.97	0.33	97.69	7163.51	-5326.88	4131.83
Fixation L	1	2	7722733974	7722972697	238723	1159.64	591.76	31	54	-1	14.70	14.70
Fixation R	1	2	7722733974	7722972697	238723	1159.64	591.76	31	54	-1	14.90	14.90
Saccade L	1	2	7722972697	7723012452	39755	1152.80	581.39	1463.81	540.15	2.89	193.44	1.00	72.73	4614.81	-3838.13	3434.97
Saccade R	1	2	7722972697	7723012452	39755	1152.80	581.39	1463.81	540.15	2.89	193.44	1.00	72.73	4614.81	-3838.13	3434.97
Fixation L	1	3	7723012452	7723151687	139235	1492.36	500.12	41	55	-1	13.40	13.40
Fixation R	1	3	7723012452	7723151687	139235	1492.36	500.12	41	55	-1	13.18	13.18
Saccade L	1	3	7723151687	7723171557	19870	1502.26	490.35	1503.65	475.21	0.18	15.37	1.00	9.05	259.99	-282.79	253.34
Saccade R	1	3	7723151687	7723171557	19870	1502.26	490.35	1503.65	475.21	0.18	15.37	1.00	9.05	259.99	-282.79	253.34
Fixation L	1	4	7723171557	7723370417	198860	1498.57	481.16	10	17	-1	13.40	13.40
Fixation R	1	4	7723171557	7723370417	198860	1498.57	481.16	10	17	-1	12.75	12.75
Saccade L	1	4	7723370417	7723410305	39888	1493.35	472.69	1692.77	595.49	2.70	169.68	1.00	67.74	3801.86	-3657.88	2368.32
Saccade R	1	4	7723370417	7723410305	39888	1493.35	472.69	1692.77	595.49	2.70	169.68	1.00	67.74	3801.86	-3657.88	2368.32
Fixation L	1	5	7723410305	7723529549	119244	1687.08	648.27	11	81	-1	13.96	13.96
Fixation R	1	5	7723410305	7723529549	119244	1687.08	648.27	11	81	-1	13.08	13.08
Saccade L	1	5	7723529549	7723549538	19989	1691.21	660.14	1666.73	666.67	0.38	28.04	0.00	18.79	202.05	-602.42	416.92
Saccade R	1	5	7723529549	7723549538	19989	1691.21	660.14	1666.73	666.67	0.38	28.04	0.00	18.79	202.05	-602.42	416.92
Fixation L	1	6	7723549538	7723708668	159130	1662.79	669.23	19	15	-1	14.73	14.73
Fixation R	1	6	7723549538	7723708668	159130	1662.79	669.23	19	15	-1	13.38	13.38
Saccade L	1	6	7723708668	7723768272	59604	1664.23	675.02	1013.52	951.71	7.77	453.09	0.67	130.32	11016.39	-10672.73	5958.41
Saccade R	1	6	7723708668	7723768272	59604	1664.23	675.02	1013.52	951.71	7.77	453.09	0.67	130.32	11016.39	-10672.73	5958.41
Fixation L	1	7	7723768272	7723947268	178996	1035.11	965.98	33	24	-1	14.33	14.33
Fixation R	1	7	7723768272	7723947268	178996	1035.11	965.98	33	24	-1	13.72	13.72
Saccade L	1	7	7723947268	7723987013	39745	1029.32	975.79	631.76	729.70	4.40	271.67	0.50	110.66	6671.97	-5412.81	5562.25
Saccade R	1	7	7723947268	7723987013	39745	1029.32	975.79	631.76	729.70	4.40	271.67	0.50	110.66	6671.97	-5412.81	5562.25
Fixation L	1	8	7723987013	7724484362	497349	599.20	711.84	50	37	-1	13.56	13.56
Fixation R	1	8	7723987013	7724484362	497349	599.20	711.84	50	37	-1	14.05	14.05
Saccade L	1	8	7724484362	7724603610	119248	602.92	698.15	900.69	831.91	5.66	215.81	1.00	47.45	5271.01	-5139.53	2207.08
Saccade R	1	8	7724484362	7724603610	119248	602.92	698.15	900.69	831.91	5.66	215.81	1.00	47.45	5271.01	-5139.53	2207.08
Fixation L	1	9	7724603610	7724822457	218847	924.79	841.77	44	21	-1	13.94	13.94
Fixation R	1	9	7724603610	7724822457	218847	924.79	841.77	44	21	-1	14.23	14.23
Saccade L	1	9	7724822457	7724862217	39760	945.49	828.94	1059.11	1120.54	2.72	205.90	1.00	68.48	4951.07	-5133.65	3791.03
Saccade R	1	9	7724822457	7724862217	39760	945.49	828.94	1059.11	1120.54	2.72	205.90	1.00	68.48	4951.07	-5133.65	3791.03
Fixation L	1	10	7724862217	7725240066	377849	1058.20	1101.57	53	41	-1	13.59	13.59
Fixation R	1	10	7724862217	7725240066	377849	1058.20	1101.57	53	41	-1	13.55	13.55
Saccade L	1	10	7725240066	7725260066	20000	1035.77	1080.15	1033.38	1077.25	0.07	4.09	0.00	3.29	20.25	-71.28	32.23
Saccade R	1	10	7725240066	7725260066	20000	1035.77	1080.15	1033.38	1077.25	0.07	4.09	0.00	3.29	20.25	-71.28	32.23
Fixation L	1	11	7725260066	7725816905	556839	1021.84	1073.74	24	11	-1	13.70	13.70
Fixation R	1	11	7725260066	7725816905	556839	1021.84	1073.74	24	11	-1	13.43	13.43
Saccade L	1	11	7725816905	7725956152	139247	1016.24	1071.73	989.28	676.18	6.52	119.11	0.14	46.85	2884.49	-2731.85	1819.10
Saccade R	1	11	7725816905	7725956152	139247	1016.24	1071.73	989.28	676.18	6.52	119.11	0.14	46.85	2884.49	-2731.85	1819.10
Fixation L	1	12	7725956152	7726075514	119362	975.29	676.48	26	42	-1	13.92	13.92
Fixation R	1	12	7725956152	7726075514	119362	975.29	676.48	26	42	-1	13.93	13.93
Saccade L	1	12	7726075514	7726174881	99367	962.39	681.47	901.45	575.77	2.49	111.40	0.20	25.07	2656.46	-2499.43	1027.56
Saccade R	1	12	7726075514	7726174881	99367	962.39	681.47	901.45	575.77	2.49	111.40	0.20	25.07	2656.46	-2499.43	1027.56
