[BeGaze]
Converted from:	C:\Documents and Settings\iViewX\Desktop\EXPERIMENTATIONS\Experiments\results\finaleart\S6124332-finaleart-1.idf
Date:	27.03.2019 15:35:56
Version:	BeGaze 2.5.77
Sample Rate:	50
Subject:	S6124332
Description:	Romain Ferrand

Table Header for Fixations:
Event Type	Trial	Number	Start	End	Duration	Location X	Location Y	Dispersion X	Dispersion Y	Plane	Avg. Pupil Size X	Avg. Pupil Size Y

Table Header for Saccades:
Event Type	Trial	Number	Start	End	Duration	Start Loc.X	Start Loc.Y	End Loc.X	End Loc.Y	Amplitude	Peak Speed	Peak Speed At	Average Speed	Peak Accel.	Peak Decel.	Average Accel.

Table Header for Blinks:
Event Type	Trial	Number	Start	End	Duration

Table Header for User Events:
Event Type	Trial	Number	Start	Description

UserEvent	1	1	11983705060	# Message: L-Heure_Embrasee_Rysselberghe_1897.jpg
Fixation L	1	1	11983723286	11984399617	676331	965.24	625.69	11	31	-1	18.30	18.30
Fixation R	1	1	11983723286	11984399617	676331	965.24	625.69	11	31	-1	17.46	17.46
Saccade L	1	1	11984399617	11984439370	39753	972.45	639.09	1291.97	598.99	2.77	197.41	0.50	69.79	4902.38	-4477.07	3828.12
Saccade R	1	1	11984399617	11984439370	39753	972.45	639.09	1291.97	598.99	2.77	197.41	0.50	69.79	4902.38	-4477.07	3828.12
Fixation L	1	2	11984439370	11984598489	159119	1291.34	580.68	14	59	-1	14.58	14.58
Fixation R	1	2	11984439370	11984598489	159119	1291.34	580.68	14	59	-1	14.47	14.47
Saccade L	1	2	11984598489	11984618350	19861	1296.94	625.81	1370.80	605.32	0.88	77.53	1.00	44.40	1905.31	-1433.83	1238.35
Saccade R	1	2	11984598489	11984618350	19861	1296.94	625.81	1370.80	605.32	0.88	77.53	1.00	44.40	1905.31	-1433.83	1238.35
Fixation L	1	3	11984618350	11985234946	616596	1361.60	629.03	42	41	-1	14.10	14.10
Fixation R	1	3	11984618350	11985234946	616596	1361.60	629.03	42	41	-1	14.07	14.07
Saccade L	1	3	11985234946	11985334436	99490	1350.46	609.81	1367.01	195.43	9.95	271.84	0.40	99.96	6750.31	-6621.21	3830.66
Saccade R	1	3	11985234946	11985334436	99490	1350.46	609.81	1367.01	195.43	9.95	271.84	0.40	99.96	6750.31	-6621.21	3830.66
Fixation L	1	4	11985334436	11985453684	119248	1397.96	178.30	57	28	-1	13.53	13.53
Fixation R	1	4	11985334436	11985453684	119248	1397.96	178.30	57	28	-1	13.95	13.95
Saccade L	1	4	11985453684	11985553175	99491	1403.81	178.39	1336.95	225.74	3.99	124.50	0.20	40.13	2622.11	-2967.02	1481.04
Saccade R	1	4	11985453684	11985553175	99491	1403.81	178.39	1336.95	225.74	3.99	124.50	0.20	40.13	2622.11	-2967.02	1481.04
Fixation L	1	5	11985553175	11985712288	159113	1319.29	266.12	27	68	-1	14.34	14.34
Fixation R	1	5	11985553175	11985712288	159113	1319.29	266.12	27	68	-1	14.17	14.17
Saccade L	1	5	11985712288	11985732188	19900	1318.39	284.28	1299.35	299.98	0.24	24.97	1.00	12.16	362.40	-564.99	381.69
Saccade R	1	5	11985712288	11985732188	19900	1318.39	284.28	1299.35	299.98	0.24	24.97	1.00	12.16	362.40	-564.99	381.69
Fixation L	1	6	11985732188	11985831661	99473	1302.63	297.00	9	6	-1	15.04	15.04
Fixation R	1	6	11985732188	11985831661	99473	1302.63	297.00	9	6	-1	14.75	14.75
Saccade L	1	6	11985831661	11985990770	159109	1299.26	298.93	405.65	396.31	16.54	340.45	0.25	103.97	8479.80	-6618.59	2871.35
Saccade R	1	6	11985831661	11985990770	159109	1299.26	298.93	405.65	396.31	16.54	340.45	0.25	103.97	8479.80	-6618.59	2871.35
Fixation L	1	7	11985990770	11986468110	477340	449.61	413.75	60	30	-1	15.18	15.18
Fixation R	1	7	11985990770	11986468110	477340	449.61	413.75	60	30	-1	15.39	15.39
Saccade L	1	7	11986468110	11986488014	19904	466.23	408.14	525.94	409.16	0.67	70.36	1.00	33.50	1726.34	-1069.84	1419.31
Saccade R	1	7	11986468110	11986488014	19904	466.23	408.14	525.94	409.16	0.67	70.36	1.00	33.50	1726.34	-1069.84	1419.31
Fixation L	1	8	11986488014	11986726606	238592	588.50	421.65	73	20	-1	15.10	15.10
Fixation R	1	8	11986488014	11986726606	238592	588.50	421.65	73	20	-1	15.69	15.69
Saccade L	1	8	11986726606	11986766482	39876	581.26	429.32	269.69	442.81	2.90	261.78	0.50	72.79	6524.22	-5818.92	3614.27
Saccade R	1	8	11986726606	11986766482	39876	581.26	429.32	269.69	442.81	2.90	261.78	0.50	72.79	6524.22	-5818.92	3614.27
Fixation L	1	9	11986766482	11986985215	218733	277.79	493.18	30	69	-1	15.42	15.42
Fixation R	1	9	11986766482	11986985215	218733	277.79	493.18	30	69	-1	15.70	15.70
Saccade L	1	9	11986985215	11987005086	19871	300.38	508.80	321.78	506.86	0.31	21.74	1.00	15.41	231.61	-348.42	214.91
Saccade R	1	9	11986985215	11987005086	19871	300.38	508.80	321.78	506.86	0.31	21.74	1.00	15.41	231.61	-348.42	214.91
Fixation L	1	10	11987005086	11987542178	537092	318.73	510.81	13	15	-1	15.51	15.51
Fixation R	1	10	11987005086	11987542178	537092	318.73	510.81	13	15	-1	15.92	15.92
Saccade L	1	10	11987542178	11987601800	59622	321.34	506.42	1028.05	724.39	8.19	292.99	0.67	137.35	7233.50	-5766.69	5294.55
Saccade R	1	10	11987542178	11987601800	59622	321.34	506.42	1028.05	724.39	8.19	292.99	0.67	137.35	7233.50	-5766.69	5294.55
Fixation L	1	11	11987601800	11987701296	99496	1080.84	720.09	68	13	-1	16.35	16.35
Fixation R	1	11	11987601800	11987701296	99496	1080.84	720.09	68	13	-1	15.10	15.10
