[BeGaze]
Converted from:	C:\Documents and Settings\iViewX\Desktop\EXPERIMENTATIONS\Experiments\results\finaleart\S16F14542-finaleart-1.idf
Date:	27.03.2019 15:47:20
Version:	BeGaze 2.5.77
Sample Rate:	50
Subject:	S16F14542
Description:	Diane Dewez

Table Header for Fixations:
Event Type	Trial	Number	Start	End	Duration	Location X	Location Y	Dispersion X	Dispersion Y	Plane	Avg. Pupil Size X	Avg. Pupil Size Y

Table Header for Saccades:
Event Type	Trial	Number	Start	End	Duration	Start Loc.X	Start Loc.Y	End Loc.X	End Loc.Y	Amplitude	Peak Speed	Peak Speed At	Average Speed	Peak Accel.	Peak Decel.	Average Accel.

Table Header for Blinks:
Event Type	Trial	Number	Start	End	Duration

Table Header for User Events:
Event Type	Trial	Number	Start	Description

UserEvent	1	1	7094607670	# Message: Fleurs_et_fruits_camoin_1942.jpg
Fixation L	1	1	7094621786	7094820647	198861	1084.82	589.93	52	6	-1	11.91	11.91
Fixation R	1	1	7094621786	7094820647	198861	1084.82	589.93	52	6	-1	12.04	12.04
Saccade L	1	1	7094820647	7094840662	20015	1042.47	591.46	984.86	589.96	0.56	58.30	1.00	28.21	1401.12	-1374.56	1185.61
Saccade R	1	1	7094820647	7094840662	20015	1042.47	591.46	984.86	589.96	0.56	58.30	1.00	28.21	1401.12	-1374.56	1185.61
Fixation L	1	2	7094840662	7095099127	258465	971.18	590.41	24	24	-1	12.40	12.40
Fixation R	1	2	7094840662	7095099127	258465	971.18	590.41	24	24	-1	12.73	12.73
Saccade L	1	2	7095099127	7095119001	19874	960.82	572.82	957.50	360.18	1.37	215.04	1.00	68.75	5298.76	-4848.61	3455.90
Saccade R	1	2	7095099127	7095119001	19874	960.82	572.82	957.50	360.18	1.37	215.04	1.00	68.75	5298.76	-4848.61	3455.90
Fixation L	1	3	7095119001	7095477105	358104	912.41	336.12	54	39	-1	12.43	12.43
Fixation R	1	3	7095119001	7095477105	358104	912.41	336.12	54	39	-1	12.33	12.33
Saccade L	1	3	7095477105	7095496988	19883	903.87	329.60	732.87	455.32	1.25	214.61	1.00	63.07	5207.58	-5033.81	3518.28
Saccade R	1	3	7095477105	7095496988	19883	903.87	329.60	732.87	455.32	1.25	214.61	1.00	63.07	5207.58	-5033.81	3518.28
Fixation L	1	4	7095496988	7095815228	318240	709.27	485.60	28	40	-1	11.80	11.80
Fixation R	1	4	7095496988	7095815228	318240	709.27	485.60	28	40	-1	12.02	12.02
Saccade L	1	4	7095815228	7095854963	39735	704.91	495.03	881.80	632.44	2.06	143.84	0.50	51.90	3556.69	-2996.31	2644.14
Saccade R	1	4	7095815228	7095854963	39735	704.91	495.03	881.80	632.44	2.06	143.84	0.50	51.90	3556.69	-2996.31	2644.14
Fixation L	1	5	7095854963	7095974336	119373	887.19	618.85	9	30	-1	12.43	12.43
Fixation R	1	5	7095854963	7095974336	119373	887.19	618.85	9	30	-1	12.55	12.55
Saccade L	1	5	7095974336	7096033968	59632	887.09	619.17	432.96	1139.57	7.26	370.97	0.67	121.82	9128.75	-9044.83	5203.13
Saccade R	1	5	7095974336	7096033968	59632	887.09	619.17	432.96	1139.57	7.26	370.97	0.67	121.82	9128.75	-9044.83	5203.13
Fixation L	1	6	7096033968	7096789811	755843	388.13	1152.63	67	32	-1	12.56	12.56
Fixation R	1	6	7096033968	7096789811	755843	388.13	1152.63	67	32	-1	13.16	13.16
Saccade L	1	6	7096789811	7096909171	119360	384.40	1149.91	1145.86	519.59	14.12	310.61	0.67	118.30	6884.73	-5864.14	3109.16
Blink R	1	1	7096789811	7096929034	139223
Fixation L	1	7	7096909171	7097167785	258614	1146.92	522.86	8	19	-1	12.92	12.92
Fixation R	1	7	7096929034	7097167785	238751	1147.01	523.11	8	19	-1	13.76	13.76
Saccade L	1	7	7097167785	7097207531	39746	1148.10	526.52	916.91	618.62	2.19	176.54	1.00	55.09	4255.40	-3764.79	2837.33
Saccade R	1	6	7097167785	7097207531	39746	1148.10	526.52	916.91	618.62	2.19	176.54	1.00	55.09	4255.40	-3764.79	2837.33
Fixation L	1	8	7097207531	7097426263	218732	931.52	635.02	18	40	-1	12.72	12.72
Fixation R	1	8	7097207531	7097426263	218732	931.52	635.02	18	40	-1	13.77	13.77
Saccade L	1	8	7097426263	7097466014	39751	935.07	641.69	918.64	312.71	3.11	239.94	0.50	78.23	5641.61	-4967.55	3725.38
Saccade R	1	7	7097426263	7097466014	39751	935.07	641.69	918.64	312.71	3.11	239.94	0.50	78.23	5641.61	-4967.55	3725.38
Fixation L	1	9	7097466014	7097605260	139246	901.46	279.61	27	53	-1	12.37	12.37
Fixation R	1	9	7097466014	7097605260	139246	901.46	279.61	27	53	-1	13.22	13.22
Saccade L	1	9	7097605260	7097625132	19872	898.16	270.99	893.76	234.07	0.33	37.61	1.00	16.58	715.79	-818.23	630.81
Saccade R	1	8	7097605260	7097625132	19872	898.16	270.99	893.76	234.07	0.33	37.61	1.00	16.58	715.79	-818.23	630.81
Fixation L	1	10	7097625132	7097863873	238741	896.98	245.90	48	27	-1	11.76	11.76
Fixation R	1	10	7097625132	7097863873	238741	896.98	245.90	48	27	-1	12.61	12.61
Saccade L	1	10	7097863873	7097903614	39741	856.20	230.47	676.26	430.99	2.73	223.58	0.50	68.59	5543.97	-5185.81	2904.52
Saccade R	1	9	7097863873	7097903614	39741	856.20	230.47	676.26	430.99	2.73	223.58	0.50	68.59	5543.97	-5185.81	2904.52
Fixation L	1	11	7097903614	7098201982	298368	667.52	468.07	16	82	-1	12.04	12.04
Fixation R	1	11	7097903614	7098201982	298368	667.52	468.07	16	82	-1	13.25	13.25
Saccade L	1	11	7098201982	7098261729	59747	670.38	504.66	1118.96	534.15	4.76	224.15	0.67	79.72	5559.48	-5364.26	3707.56
Saccade R	1	10	7098201982	7098261729	59747	670.38	504.66	1118.96	534.15	4.76	224.15	0.67	79.72	5559.48	-5364.26	3707.56
Fixation L	1	12	7098261729	7098559957	298228	1136.89	572.24	30	50	-1	12.32	12.32
Fixation R	1	12	7098261729	7098559957	298228	1136.89	572.24	30	50	-1	13.25	13.25
Saccade L	1	12	7098559957	7098599836	39879	1147.03	585.12	982.50	680.53	1.99	178.05	0.50	49.91	4390.58	0.00	1574.78
Saccade R	1	11	7098559957	7098599836	39879	1147.03	585.12	982.50	680.53	1.99	178.05	0.50	49.91	4390.58	0.00	1574.78
