[BeGaze]
Converted from:	C:\Documents and Settings\iViewX\Desktop\EXPERIMENTATIONS\Experiments\results\finaleart\S21F22332-finaleart-1.idf
Date:	27.03.2019 15:54:49
Version:	BeGaze 2.5.77
Sample Rate:	50
Subject:	S21F22332
Description:	Cyrielle Mailart

Table Header for Fixations:
Event Type	Trial	Number	Start	End	Duration	Location X	Location Y	Dispersion X	Dispersion Y	Plane	Avg. Pupil Size X	Avg. Pupil Size Y

Table Header for Saccades:
Event Type	Trial	Number	Start	End	Duration	Start Loc.X	Start Loc.Y	End Loc.X	End Loc.Y	Amplitude	Peak Speed	Peak Speed At	Average Speed	Peak Accel.	Peak Decel.	Average Accel.

Table Header for Blinks:
Event Type	Trial	Number	Start	End	Duration

Table Header for User Events:
Event Type	Trial	Number	Start	Description

UserEvent	1	1	2273479557	# Message: morning_Daubigny_1858.jpg
Fixation L	1	1	2273485294	2273863141	377847	924.94	523.52	13	85	-1	14.13	14.13
Fixation R	1	1	2273485294	2273863141	377847	924.94	523.52	13	85	-1	13.17	13.17
Saccade L	1	1	2273863141	2273962639	99498	928.14	465.93	969.19	766.66	5.01	205.66	1.00	50.33	4970.84	-4739.87	2270.39
Saccade R	1	1	2273863141	2273962639	99498	928.14	465.93	969.19	766.66	5.01	205.66	1.00	50.33	4970.84	-4739.87	2270.39
Fixation L	1	2	2273962639	2274101874	139235	978.27	777.68	20	21	-1	12.74	12.74
Fixation R	1	2	2273962639	2274101874	139235	978.27	777.68	20	21	-1	11.67	11.67
Saccade L	1	2	2274101874	2274141622	39748	984.26	777.29	770.65	941.48	2.51	179.59	1.00	63.12	4378.42	-4397.82	3664.67
Saccade R	1	2	2274101874	2274141622	39748	984.26	777.29	770.65	941.48	2.51	179.59	1.00	63.12	4378.42	-4397.82	3664.67
Fixation L	1	3	2274141622	2274320615	178993	770.88	935.44	10	15	-1	10.94	10.94
Fixation R	1	3	2274141622	2274320615	178993	770.88	935.44	10	15	-1	9.79	9.79
Saccade L	1	3	2274320615	2274340617	20002	775.14	932.78	649.50	932.15	0.70	127.08	1.00	35.03	3148.97	-3037.14	2099.05
Saccade R	1	3	2274320615	2274340617	20002	775.14	932.78	649.50	932.15	0.70	127.08	1.00	35.03	3148.97	-3037.14	2099.05
Fixation L	1	4	2274340617	2274579233	238616	624.33	929.84	83	11	-1	10.21	10.21
Fixation R	1	4	2274340617	2274579233	238616	624.33	929.84	83	11	-1	9.81	9.81
Saccade L	1	4	2274579233	2274599103	19870	565.91	927.50	559.49	923.33	0.40	35.70	1.00	20.26	-41.97	-698.92	393.24
Saccade R	1	4	2274579233	2274599103	19870	565.91	927.50	559.49	923.33	0.40	35.70	1.00	20.26	-41.97	-698.92	393.24
Fixation L	1	5	2274599103	2274738347	139244	559.49	923.42	13	6	-1	10.00	10.00
Fixation R	1	5	2274599103	2274738347	139244	559.49	923.42	13	6	-1	9.64	9.64
Saccade L	1	5	2274738347	2274778094	39747	555.83	919.02	801.53	923.41	2.14	150.53	0.50	53.73	3743.08	-3469.82	2963.70
Saccade R	1	5	2274738347	2274778094	39747	555.83	919.02	801.53	923.41	2.14	150.53	0.50	53.73	3743.08	-3469.82	2963.70
Fixation L	1	6	2274778094	2275215704	437610	820.37	945.90	57	37	-1	9.90	9.90
Fixation R	1	6	2274778094	2275215704	437610	820.37	945.90	57	37	-1	9.45	9.45
Saccade L	1	6	2275215704	2275235572	19868	857.07	947.24	980.23	949.83	0.75	124.60	1.00	37.74	2964.75	-3031.61	2114.94
Saccade R	1	6	2275215704	2275235572	19868	857.07	947.24	980.23	949.83	0.75	124.60	1.00	37.74	2964.75	-3031.61	2114.94
Fixation L	1	7	2275235572	2275454434	218862	959.46	946.84	32	8	-1	9.99	9.99
Fixation R	1	7	2275235572	2275454434	218862	959.46	946.84	32	8	-1	9.39	9.39
Saccade L	1	7	2275454434	2275514055	59621	947.36	952.39	141.59	870.21	8.39	384.56	0.33	140.68	9589.43	-7498.66	6741.51
Saccade R	1	7	2275454434	2275514055	59621	947.36	952.39	141.59	870.21	8.39	384.56	0.33	140.68	9589.43	-7498.66	6741.51
Fixation L	1	8	2275514055	2276090911	576856	148.23	850.35	20	29	-1	9.30	9.30
Fixation R	1	8	2275514055	2276090911	576856	148.23	850.35	20	29	-1	9.24	9.24
Saccade L	1	8	2276090911	2276130657	39746	161.37	851.78	825.64	743.58	5.84	433.58	0.50	146.82	10782.73	-10234.32	8354.97
Saccade R	1	8	2276090911	2276130657	39746	161.37	851.78	825.64	743.58	5.84	433.58	0.50	146.82	10782.73	-10234.32	8354.97
Fixation L	1	9	2276130657	2276329512	198855	818.70	762.90	10	25	-1	9.79	9.79
Fixation R	1	9	2276130657	2276329512	198855	818.70	762.90	10	25	-1	9.71	9.71
Saccade L	1	9	2276329512	2276389258	59746	818.00	762.09	74.03	817.40	7.82	368.30	0.67	130.82	9121.16	-8618.89	6032.83
Saccade R	1	9	2276329512	2276389258	59746	818.00	762.09	74.03	817.40	7.82	368.30	0.67	130.82	9121.16	-8618.89	6032.83
Fixation L	1	10	2276389258	2276568262	179004	85.49	822.11	48	37	-1	9.89	9.89
Fixation R	1	10	2276389258	2276568262	179004	85.49	822.11	48	37	-1	9.66	9.66
Saccade L	1	10	2276568262	2276588142	19880	112.15	834.54	140.81	836.30	0.27	29.04	1.00	13.75	572.09	-654.54	456.04
Saccade R	1	10	2276568262	2276588142	19880	112.15	834.54	140.81	836.30	0.27	29.04	1.00	13.75	572.09	-654.54	456.04
Fixation L	1	11	2276588142	2276965981	377839	149.82	825.08	52	29	-1	10.67	10.67
Fixation R	1	11	2276588142	2276965981	377839	149.82	825.08	52	29	-1	10.57	10.57
Saccade L	1	11	2276965981	2277025737	59756	189.03	812.78	963.16	794.01	8.39	410.11	0.33	140.36	10157.62	-7491.39	6390.29
Saccade R	1	11	2276965981	2277025737	59756	189.03	812.78	963.16	794.01	8.39	410.11	0.33	140.36	10157.62	-7491.39	6390.29
Fixation L	1	12	2277025737	2277184847	159110	962.36	771.41	7	37	-1	11.04	11.04
Fixation R	1	12	2277025737	2277184847	159110	962.36	771.41	7	37	-1	11.35	11.35
Saccade L	1	12	2277184847	2277204717	19870	966.28	772.66	1305.96	768.37	2.00	343.25	1.00	100.67	8576.84	-7954.81	5791.32
Saccade R	1	12	2277184847	2277204717	19870	966.28	772.66	1305.96	768.37	2.00	343.25	1.00	100.67	8576.84	-7954.81	5791.32
Fixation L	1	13	2277204717	2277324098	119381	1366.93	762.75	79	13	-1	11.25	11.25
Fixation R	1	13	2277204717	2277324098	119381	1366.93	762.75	79	13	-1	11.04	11.04
Saccade L	1	13	2277324098	2277363838	39740	1383.38	767.72	1751.09	757.41	3.11	280.04	0.50	78.18	6903.40	-6670.25	4502.58
Saccade R	1	13	2277324098	2277363838	39740	1383.38	767.72	1751.09	757.41	3.11	280.04	0.50	78.18	6903.40	-6670.25	4502.58
Fixation L	1	14	2277363838	2277483215	119377	1759.98	751.77	12	10	-1	11.07	11.07
Fixation R	1	14	2277363838	2277483215	119377	1759.98	751.77	12	10	-1	10.25	10.25
