[BeGaze]
Converted from:	C:\Documents and Settings\iViewX\Desktop\EXPERIMENTATIONS\Experiments\results\finaleart\S15H25531-finaleart-1.idf
Date:	27.03.2019 15:45:30
Version:	BeGaze 2.5.77
Sample Rate:	50
Subject:	S15H25531
Description:	Mikail Demirdelen

Table Header for Fixations:
Event Type	Trial	Number	Start	End	Duration	Location X	Location Y	Dispersion X	Dispersion Y	Plane	Avg. Pupil Size X	Avg. Pupil Size Y

Table Header for Saccades:
Event Type	Trial	Number	Start	End	Duration	Start Loc.X	Start Loc.Y	End Loc.X	End Loc.Y	Amplitude	Peak Speed	Peak Speed At	Average Speed	Peak Accel.	Peak Decel.	Average Accel.

Table Header for Blinks:
Event Type	Trial	Number	Start	End	Duration

Table Header for User Events:
Event Type	Trial	Number	Start	Description

UserEvent	1	1	4462083918	# Message: REJECTED_olympia_manet_1863.jpg
Fixation L	1	1	4462095869	4462453963	358094	962.45	540.42	11	54	-1	14.41	14.41
Fixation R	1	1	4462095869	4462453963	358094	962.45	540.42	11	54	-1	15.73	15.73
Saccade L	1	1	4462453963	4462493726	39763	961.78	493.92	638.88	430.61	3.25	175.80	0.50	81.81	3864.22	-3870.87	3646.13
Saccade R	1	1	4462453963	4462493726	39763	961.78	493.92	638.88	430.61	3.25	175.80	0.50	81.81	3864.22	-3870.87	3646.13
Fixation L	1	2	4462493726	4462632953	139227	647.00	414.61	39	59	-1	14.18	14.18
Fixation R	1	2	4462493726	4462632953	139227	647.00	414.61	39	59	-1	15.55	15.55
Saccade L	1	2	4462632953	4462652823	19870	621.16	404.95	562.27	401.64	0.68	59.67	1.00	34.11	1317.44	-1265.98	866.31
Saccade R	1	2	4462632953	4462652823	19870	621.16	404.95	562.27	401.64	0.68	59.67	1.00	34.11	1317.44	-1265.98	866.31
Fixation L	1	3	4462652823	4463189803	536980	544.20	382.01	33	65	-1	12.09	12.09
Fixation R	1	3	4462652823	4463189803	536980	544.20	382.01	33	65	-1	13.45	13.45
Saccade L	1	3	4463189803	4463209680	19877	551.06	429.59	576.83	544.37	1.04	118.99	1.00	52.19	2866.82	-2383.81	1789.46
Saccade R	1	3	4463189803	4463209680	19877	551.06	429.59	576.83	544.37	1.04	118.99	1.00	52.19	2866.82	-2383.81	1789.46
Fixation L	1	4	4463209680	4463687025	477345	577.76	519.11	50	44	-1	11.95	11.95
Fixation R	1	4	4463209680	4463687025	477345	577.76	519.11	50	44	-1	12.99	12.99
Saccade L	1	4	4463687025	4463746775	59750	572.78	538.29	1392.00	179.04	9.64	403.95	0.33	161.33	9894.03	-8148.60	7144.79
Saccade R	1	4	4463687025	4463746775	59750	572.78	538.29	1392.00	179.04	9.64	403.95	0.33	161.33	9894.03	-8148.60	7144.79
Fixation L	1	5	4463746775	4463945642	198867	1382.59	203.95	19	62	-1	11.98	11.98
Fixation R	1	5	4463746775	4463945642	198867	1382.59	203.95	19	62	-1	12.84	12.84
Saccade L	1	5	4463945642	4463965512	19870	1384.89	205.28	1382.28	271.39	0.40	66.93	1.00	20.32	1599.11	-1653.66	1140.65
Saccade R	1	5	4463945642	4463965512	19870	1384.89	205.28	1382.28	271.39	0.40	66.93	1.00	20.32	1599.11	-1653.66	1140.65
Fixation L	1	6	4463965512	4464124627	159115	1380.97	266.53	6	36	-1	11.82	11.82
Fixation R	1	6	4463965512	4464124627	159115	1380.97	266.53	6	36	-1	12.50	12.50
Saccade L	1	6	4464124627	4464164378	39751	1379.05	244.87	1196.41	419.47	2.58	228.50	0.50	65.03	5266.36	-4641.62	2707.41
Saccade R	1	6	4464124627	4464164378	39751	1379.05	244.87	1196.41	419.47	2.58	228.50	0.50	65.03	5266.36	-4641.62	2707.41
Fixation L	1	7	4464164378	4464323500	159122	1180.55	444.58	23	40	-1	12.46	12.46
Fixation R	1	7	4464164378	4464323500	159122	1180.55	444.58	23	40	-1	13.03	13.03
Saccade L	1	7	4464323500	4464383247	59747	1177.11	443.44	588.87	363.73	6.26	301.92	0.67	104.73	7434.84	-7216.60	4614.58
Saccade R	1	7	4464323500	4464383247	59747	1177.11	443.44	588.87	363.73	6.26	301.92	0.67	104.73	7434.84	-7216.60	4614.58
Fixation L	1	8	4464383247	4464920220	536973	570.64	364.01	42	29	-1	12.99	12.99
Fixation R	1	8	4464383247	4464920220	536973	570.64	364.01	42	29	-1	14.01	14.01
Saccade L	1	8	4464920220	4464960097	39877	549.88	346.08	652.89	553.82	2.18	136.96	1.00	54.58	3213.57	-2744.15	2619.81
Saccade R	1	8	4464920220	4464960097	39877	549.88	346.08	652.89	553.82	2.18	136.96	1.00	54.58	3213.57	-2744.15	2619.81
Fixation L	1	9	4464960097	4465377693	417596	657.45	543.50	31	44	-1	12.43	12.43
Fixation R	1	9	4464960097	4465377693	417596	657.45	543.50	31	44	-1	13.76	13.76
Saccade L	1	9	4465377693	4465417569	39876	655.01	534.27	1048.20	620.53	3.53	252.71	1.00	88.54	6274.40	-5456.72	4776.82
Saccade R	1	9	4465377693	4465417569	39876	655.01	534.27	1048.20	620.53	3.53	252.71	1.00	88.54	6274.40	-5456.72	4776.82
Fixation L	1	10	4465417569	4465676058	258489	1065.60	628.86	23	31	-1	12.63	12.63
Fixation R	1	10	4465417569	4465676058	258489	1065.60	628.86	23	31	-1	13.32	13.32
Saccade L	1	10	4465676058	4465695930	19872	1061.02	630.79	916.28	632.98	0.85	146.41	1.00	42.66	3453.03	-3474.11	2407.73
Saccade R	1	10	4465676058	4465695930	19872	1061.02	630.79	916.28	632.98	0.85	146.41	1.00	42.66	3453.03	-3474.11	2407.73
Fixation L	1	11	4465695930	4465855042	159112	914.22	641.49	18	13	-1	12.52	12.52
Fixation R	1	11	4465695930	4465855042	159112	914.22	641.49	18	13	-1	13.62	13.62
Saccade L	1	11	4465855042	4465894927	39885	905.13	643.37	650.78	502.23	3.03	228.31	1.00	75.97	5585.77	-5336.25	3282.94
Saccade R	1	11	4465855042	4465894927	39885	905.13	643.37	650.78	502.23	3.03	228.31	1.00	75.97	5585.77	-5336.25	3282.94
Fixation L	1	12	4465894927	4466073911	178984	622.63	452.52	35	63	-1	12.50	12.50
Fixation R	1	12	4465894927	4466073911	178984	622.63	452.52	35	63	-1	13.37	13.37
