[BeGaze]
Converted from:	C:\Documents and Settings\iViewX\Desktop\EXPERIMENTATIONS\Experiments\results\finaleart\S02123220-finaleart-1.idf
Date:	27.03.2019 15:33:31
Version:	BeGaze 2.5.77
Sample Rate:	50
Subject:	S02123220
Description:	David Xu

Table Header for Fixations:
Event Type	Trial	Number	Start	End	Duration	Location X	Location Y	Dispersion X	Dispersion Y	Plane	Avg. Pupil Size X	Avg. Pupil Size Y

Table Header for Saccades:
Event Type	Trial	Number	Start	End	Duration	Start Loc.X	Start Loc.Y	End Loc.X	End Loc.Y	Amplitude	Peak Speed	Peak Speed At	Average Speed	Peak Accel.	Peak Decel.	Average Accel.

Table Header for Blinks:
Event Type	Trial	Number	Start	End	Duration

Table Header for User Events:
Event Type	Trial	Number	Start	Description

UserEvent	1	1	688076957	# Message: still-life_pissarro_1867.jpg
Fixation L	1	1	688088388	688386735	298347	865.71	449.77	43	26	-1	17.73	17.73
Fixation R	1	1	688088388	688386735	298347	865.71	449.77	43	26	-1	17.07	17.07
Saccade L	1	1	688386735	688406625	19890	904.18	462.65	927.78	469.93	0.47	38.69	0.00	23.49	393.29	-441.06	422.36
Saccade R	1	1	688386735	688406625	19890	904.18	462.65	927.78	469.93	0.47	38.69	0.00	23.49	393.29	-441.06	422.36
Fixation L	1	2	688406625	688565720	159095	935.09	508.61	13	58	-1	17.99	17.99
Fixation R	1	2	688406625	688565720	159095	935.09	508.61	13	58	-1	17.21	17.21
Saccade L	1	2	688565720	688585726	20006	940.50	528.22	813.66	738.59	1.63	248.34	1.00	81.70	6143.80	-5695.19	4451.28
Saccade R	1	2	688565720	688585726	20006	940.50	528.22	813.66	738.59	1.63	248.34	1.00	81.70	6143.80	-5695.19	4451.28
Fixation L	1	3	688585726	688744842	159116	794.78	787.60	33	63	-1	16.73	16.73
Fixation R	1	3	688585726	688744842	159116	794.78	787.60	33	63	-1	16.48	16.48
Saccade L	1	3	688744842	688824340	79498	795.60	793.49	620.10	774.38	10.64	261.81	1.00	133.79	5089.20	-6364.31	4092.17
Saccade R	1	3	688744842	688824340	79498	795.60	793.49	620.10	774.38	10.64	261.81	1.00	133.79	5089.20	-6364.31	4092.17
Fixation L	1	4	688824340	688983439	159099	621.63	755.40	18	28	-1	14.75	14.75
Fixation R	1	4	688824340	688983439	159099	621.63	755.40	18	28	-1	14.52	14.52
Saccade L	1	4	688983439	689043060	59621	623.74	753.77	777.81	418.92	4.41	175.54	0.33	74.01	4248.19	-3436.69	3038.91
Saccade R	1	4	688983439	689043060	59621	623.74	753.77	777.81	418.92	4.41	175.54	0.33	74.01	4248.19	-3436.69	3038.91
Fixation L	1	5	689043060	689401175	358115	734.35	415.54	62	28	-1	14.31	14.31
Fixation R	1	5	689043060	689401175	358115	734.35	415.54	62	28	-1	13.27	13.27
Saccade L	1	5	689401175	689440920	39745	720.87	398.10	701.46	299.49	1.09	97.43	1.00	27.36	2229.15	-2352.18	1207.34
Saccade R	1	5	689401175	689440920	39745	720.87	398.10	701.46	299.49	1.09	97.43	1.00	27.36	2229.15	-2352.18	1207.34
Fixation L	1	6	689440920	689659652	218732	702.15	333.84	13	81	-1	14.40	14.40
Fixation R	1	6	689440920	689659652	218732	702.15	333.84	13	81	-1	14.02	14.02
Saccade L	1	6	689659652	689779027	119375	700.02	381.32	1434.94	203.49	16.84	617.00	0.83	141.06	13753.66	-14678.21	5733.94
Saccade R	1	6	689659652	689779027	119375	700.02	381.32	1434.94	203.49	16.84	617.00	0.83	141.06	13753.66	-14678.21	5733.94
Fixation L	1	7	689779027	689997883	218856	1421.29	158.91	28	65	-1	15.70	15.70
Fixation R	1	7	689779027	689997883	218856	1421.29	158.91	28	65	-1	11.57	11.57
Saccade L	1	7	689997883	690017758	19875	1417.57	137.71	1418.02	131.23	0.13	10.33	0.00	6.76	-41.22	-210.31	111.36
Saccade R	1	7	689997883	690017758	19875	1417.57	137.71	1418.02	131.23	0.13	10.33	0.00	6.76	-41.22	-210.31	111.36
Fixation L	1	8	690017758	690137122	119364	1431.62	124.54	71	26	-1	15.79	15.79
Fixation R	1	8	690017758	690137122	119364	1431.62	124.54	71	26	-1	10.58	10.58
Saccade L	1	8	690137122	690156999	19877	1434.16	106.71	1440.03	98.70	0.54	63.82	1.00	26.92	649.38	-1344.05	709.11
Saccade R	1	8	690137122	690236488	99366	1434.16	106.71	1447.74	110.78	2.53	63.82	1.00	25.45	649.38	-1344.05	547.83
Fixation L	1	9	690156999	690375739	218740	1457.99	100.47	50	32	-1	15.63	15.63
Fixation R	1	9	690256372	690415488	159116	1456.35	110.31	26	64	-1	14.35	14.35
Saccade L	1	9	690375739	690395609	19870	1445.65	119.67	1453.25	140.47	0.43	28.04	0.00	21.51	210.32	-419.33	226.09
Fixation L	1	10	690395609	690514982	119373	1423.65	167.55	53	40	-1	16.15	16.15
Saccade R	1	9	690415488	690435363	19875	1451.48	151.46	1425.64	167.59	0.39	30.82	1.00	19.78	210.32	-512.53	269.17
Fixation R	1	10	690435363	690534856	99493	1411.44	178.30	25	21	-1	15.42	15.42
Saccade L	1	10	690514982	690813339	298357	1400.21	180.02	1552.19	170.74	23.45	571.71	1.00	78.60	13682.61	-13908.61	3383.33
Saccade R	1	10	690534856	690813339	278483	1407.81	188.92	1552.19	170.74	22.99	571.71	1.00	82.54	13682.61	-13908.61	3594.65
Fixation L	1	11	690813339	690912839	99500	1573.30	152.18	42	41	-1	17.21	17.21
Fixation R	1	11	690813339	690912839	99500	1573.30	152.18	42	41	-1	15.72	15.72
Saccade L	1	11	690912839	691032077	119238	1594.82	146.42	1457.62	171.24	4.78	116.53	0.33	40.11	2246.18	-2814.25	1523.10
Saccade R	1	11	690912839	691032077	119238	1594.82	146.42	1457.62	171.24	4.78	116.53	0.33	40.11	2246.18	-2814.25	1523.10
Fixation L	1	12	691032077	691310546	278469	1434.44	197.79	28	45	-1	17.87	17.87
Fixation R	1	12	691032077	691310546	278469	1434.44	197.79	28	45	-1	16.72	16.72
Saccade L	1	12	691310546	691390195	79649	1438.69	216.30	1317.58	953.60	11.30	511.26	0.50	141.82	12534.78	-10777.58	6020.66
Saccade R	1	12	691310546	691390195	79649	1438.69	216.30	1317.58	953.60	11.30	511.26	0.50	141.82	12534.78	-10777.58	6020.66
Fixation L	1	13	691390195	691529294	139099	1341.05	959.22	35	17	-1	18.89	18.89
Fixation R	1	13	691390195	691529294	139099	1341.05	959.22	35	17	-1	16.11	16.11
Saccade L	1	13	691529294	691569172	39878	1328.57	950.79	1233.18	867.52	1.50	88.09	0.50	37.68	2073.10	-1459.29	1176.03
Saccade R	1	13	691529294	691569172	39878	1328.57	950.79	1233.18	867.52	1.50	88.09	0.50	37.68	2073.10	-1459.29	1176.03
Fixation L	1	14	691569172	691708412	139240	1220.07	836.23	19	50	-1	18.08	18.08
Fixation R	1	14	691569172	691708412	139240	1220.07	836.23	19	50	-1	17.22	17.22
Saccade L	1	14	691708412	691748161	39749	1219.87	820.70	1082.31	527.87	3.02	172.44	1.00	75.92	4074.71	-3983.22	3686.83
Saccade R	1	14	691708412	691748161	39749	1219.87	820.70	1082.31	527.87	3.02	172.44	1.00	75.92	4074.71	-3983.22	3686.83
Fixation L	1	15	691748161	691927146	178985	1087.09	493.25	10	47	-1	16.27	16.27
Fixation R	1	15	691748161	691927146	178985	1087.09	493.25	10	47	-1	16.32	16.32
Saccade L	1	15	691927146	692066393	139247	1089.04	499.50	613.08	856.67	17.35	447.78	0.43	124.61	6626.41	-7726.17	4260.37
Saccade R	1	15	691927146	692066393	139247	1089.04	499.50	613.08	856.67	17.35	447.78	0.43	124.61	6626.41	-7726.17	4260.37
