[BeGaze]
Converted from:	C:\Documents and Settings\iViewX\Desktop\EXPERIMENTATIONS\Experiments\results\finaleart\S14F27123-finaleart-1.idf
Date:	27.03.2019 15:42:55
Version:	BeGaze 2.5.77
Sample Rate:	50
Subject:	S14F27123
Description:	Anne-flore Perrin

Table Header for Fixations:
Event Type	Trial	Number	Start	End	Duration	Location X	Location Y	Dispersion X	Dispersion Y	Plane	Avg. Pupil Size X	Avg. Pupil Size Y

Table Header for Saccades:
Event Type	Trial	Number	Start	End	Duration	Start Loc.X	Start Loc.Y	End Loc.X	End Loc.Y	Amplitude	Peak Speed	Peak Speed At	Average Speed	Peak Accel.	Peak Decel.	Average Accel.

Table Header for Blinks:
Event Type	Trial	Number	Start	End	Duration

Table Header for User Events:
Event Type	Trial	Number	Start	Description

UserEvent	1	1	30394279619	# Message: Un_Jardin_Maison_Baptiste_Butler_1895.jpg
Fixation L	1	1	30394287778	30394765134	477356	885.38	596.91	13	16	-1	14.26	14.26
Fixation R	1	1	30394287778	30394765134	477356	885.38	596.91	13	16	-1	13.89	13.89
Saccade L	1	1	30394765134	30394785007	19873	890.53	599.19	744.48	589.64	0.84	148.02	1.00	42.20	3565.82	-3571.09	2401.27
Saccade R	1	1	30394765134	30394785007	19873	890.53	599.19	744.48	589.64	0.84	148.02	1.00	42.20	3565.82	-3571.09	2401.27
Fixation L	1	2	30394785007	30394924243	139236	739.52	569.35	20	37	-1	12.81	12.81
Fixation R	1	2	30394785007	30394924243	139236	739.52	569.35	20	37	-1	13.02	13.02
Saccade L	1	2	30394924243	30394963999	39756	729.28	551.68	595.44	340.26	2.66	153.63	1.00	67.03	3787.19	-3364.25	2874.24
Saccade R	1	2	30394924243	30394963999	39756	729.28	551.68	595.44	340.26	2.66	153.63	1.00	67.03	3787.19	-3364.25	2874.24
Fixation L	1	3	30394963999	30395202734	238735	623.13	360.22	49	39	-1	10.44	10.44
Fixation R	1	3	30394963999	30395202734	238735	623.13	360.22	49	39	-1	10.94	10.94
Saccade L	1	3	30395202734	30395242482	39748	623.32	373.66	1012.22	367.82	3.39	227.05	0.50	85.26	5498.79	-5063.24	4662.31
Saccade R	1	3	30395202734	30395242482	39748	623.32	373.66	1012.22	367.82	3.39	227.05	0.50	85.26	5498.79	-5063.24	4662.31
Fixation L	1	4	30395242482	30395341977	99495	1008.56	338.96	6	40	-1	10.22	10.22
Fixation R	1	4	30395242482	30395341977	99495	1008.56	338.96	6	40	-1	10.61	10.61
Saccade L	1	4	30395341977	30395381721	39744	1008.26	326.92	1404.33	292.39	3.83	239.03	1.00	96.26	5905.00	-5344.46	4380.85
Saccade R	1	4	30395341977	30395381721	39744	1008.26	326.92	1404.33	292.39	3.83	239.03	1.00	96.26	5905.00	-5344.46	4380.85
Fixation L	1	5	30395381721	30395560719	178998	1421.38	251.99	31	64	-1	10.40	10.40
Fixation R	1	5	30395381721	30395560719	178998	1421.38	251.99	31	64	-1	10.71	10.71
Saccade L	1	5	30395560719	30395600465	39746	1417.77	261.06	1534.95	201.38	1.29	98.57	1.00	32.42	2389.54	-2340.47	1577.98
Saccade R	1	5	30395560719	30395600465	39746	1417.77	261.06	1534.95	201.38	1.29	98.57	1.00	32.42	2389.54	-2340.47	1577.98
Fixation L	1	6	30395600465	30395739707	139242	1530.19	188.28	23	18	-1	10.61	10.61
Fixation R	1	6	30395600465	30395739707	139242	1530.19	188.28	23	18	-1	10.93	10.93
Saccade L	1	6	30395739707	30395799470	59763	1520.43	184.92	1296.48	828.33	7.61	328.58	0.67	127.27	7962.00	-7089.28	5635.23
Saccade R	1	6	30395739707	30395799470	59763	1520.43	184.92	1296.48	828.33	7.61	328.58	0.67	127.27	7962.00	-7089.28	5635.23
Fixation L	1	7	30395799470	30396018198	218728	1271.42	780.96	33	64	-1	11.48	11.48
Fixation R	1	7	30395799470	30396018198	218728	1271.42	780.96	33	64	-1	11.48	11.48
Saccade L	1	7	30396018198	30396038069	19871	1271.95	763.42	1273.03	761.43	0.06	5.10	0.00	2.95	13.31	-61.64	32.69
Saccade R	1	7	30396018198	30396038069	19871	1271.95	763.42	1273.03	761.43	0.06	5.10	0.00	2.95	13.31	-61.64	32.69
Fixation L	1	8	30396038069	30396177311	139242	1277.99	755.71	9	12	-1	11.83	11.83
Fixation R	1	8	30396038069	30396177311	139242	1277.99	755.71	9	12	-1	11.59	11.59
Saccade L	1	8	30396177311	30396217069	39758	1282.17	748.48	821.81	788.48	4.17	345.90	0.50	104.96	8534.63	-7387.37	5363.42
Saccade R	1	8	30396177311	30396217069	39758	1282.17	748.48	821.81	788.48	4.17	345.90	0.50	104.96	8534.63	-7387.37	5363.42
Fixation L	1	9	30396217069	30396396056	178987	818.27	818.08	6	49	-1	11.61	11.61
Fixation R	1	9	30396217069	30396396056	178987	818.27	818.08	6	49	-1	11.55	11.55
Saccade L	1	9	30396396056	30396435929	39873	820.96	827.84	530.22	827.28	2.42	167.75	1.00	60.58	4075.58	-4172.19	3615.00
Saccade R	1	9	30396396056	30396435929	39873	820.96	827.84	530.22	827.28	2.42	167.75	1.00	60.58	4075.58	-4172.19	3615.00
Fixation L	1	10	30396435929	30396694422	258493	541.05	815.09	18	22	-1	11.11	11.11
Fixation R	1	10	30396435929	30396694422	258493	541.05	815.09	18	22	-1	11.69	11.69
Saccade L	1	10	30396694422	30396734290	39868	547.52	806.88	680.68	702.66	2.53	130.97	0.50	63.51	3217.91	-982.96	1804.88
Saccade R	1	10	30396694422	30396734290	39868	547.52	806.88	680.68	702.66	2.53	130.97	0.50	63.51	3217.91	-982.96	1804.88
Fixation L	1	11	30396734290	30396893409	159119	683.86	766.08	5	92	-1	10.87	10.87
Fixation R	1	11	30396734290	30396893409	159119	683.86	766.08	5	92	-1	11.90	11.90
Saccade L	1	11	30396893409	30396913288	19879	683.51	774.58	777.54	572.00	1.74	225.82	1.00	87.54	4389.54	-5022.86	3577.69
Saccade R	1	11	30396893409	30396913288	19879	683.51	774.58	777.54	572.00	1.74	225.82	1.00	87.54	4389.54	-5022.86	3577.69
Fixation L	1	12	30396913288	30397052526	139238	817.69	577.24	59	22	-1	11.05	11.05
Fixation R	1	12	30396913288	30397052526	139238	817.69	577.24	59	22	-1	11.64	11.64
Saccade L	1	12	30397052526	30397072422	19896	829.52	568.01	1001.14	344.61	1.55	284.75	1.00	78.11	6963.87	-6945.21	4661.94
Saccade R	1	12	30397052526	30397072422	19896	829.52	568.01	1001.14	344.61	1.55	284.75	1.00	78.11	6963.87	-6945.21	4661.94
Fixation L	1	13	30397072422	30397191649	119227	1000.72	356.71	14	32	-1	10.68	10.68
Fixation R	1	13	30397072422	30397191649	119227	1000.72	356.71	14	32	-1	11.13	11.13
Saccade L	1	13	30397191649	30397211642	19993	999.10	358.76	1003.46	224.10	0.88	136.26	1.00	44.18	2976.82	-3341.50	2234.37
Saccade R	1	13	30397191649	30397211642	19993	999.10	358.76	1003.46	224.10	0.88	136.26	1.00	44.18	2976.82	-3341.50	2234.37
Fixation L	1	14	30397211642	30397589502	377860	997.50	225.08	15	24	-1	10.39	10.39
Fixation R	1	14	30397211642	30397589502	377860	997.50	225.08	15	24	-1	10.78	10.78
Saccade L	1	14	30397589502	30397609379	19877	993.92	242.30	1072.68	226.49	0.54	81.26	1.00	27.32	1807.75	-1571.74	1160.98
Saccade R	1	14	30397589502	30397609379	19877	993.92	242.30	1072.68	226.49	0.54	81.26	1.00	27.32	1807.75	-1571.74	1160.98
Fixation L	1	15	30397609379	30397927611	318232	1076.74	213.46	60	35	-1	10.89	10.89
Fixation R	1	15	30397609379	30397927611	318232	1076.74	213.46	60	35	-1	11.10	11.10
Saccade L	1	15	30397927611	30398066858	139247	1031.71	195.39	598.26	244.73	7.13	266.69	0.86	51.21	6606.36	-5830.20	2318.66
Saccade R	1	15	30397927611	30398066858	139247	1031.71	195.39	598.26	244.73	7.13	266.69	0.86	51.21	6606.36	-5830.20	2318.66
Fixation L	1	16	30398066858	30398245848	178990	619.27	294.75	33	64	-1	11.15	11.15
Fixation R	1	16	30398066858	30398245848	178990	619.27	294.75	33	64	-1	11.42	11.42
Saccade L	1	16	30398245848	30398265728	19880	628.21	302.01	628.23	311.77	0.11	9.88	1.00	5.48	230.24	0.00	115.12
Saccade R	1	16	30398245848	30398265728	19880	628.21	302.01	628.23	311.77	0.11	9.88	1.00	5.48	230.24	0.00	115.12
