[BeGaze]
Converted from:	C:\Documents and Settings\iViewX\Desktop\EXPERIMENTATIONS\Experiments\results\finaleart\S13H22431-finaleart-1.idf
Date:	27.03.2019 15:42:16
Version:	BeGaze 2.5.77
Sample Rate:	50
Subject:	S13H22431
Description:	Jimmy Petit

Table Header for Fixations:
Event Type	Trial	Number	Start	End	Duration	Location X	Location Y	Dispersion X	Dispersion Y	Plane	Avg. Pupil Size X	Avg. Pupil Size Y

Table Header for Saccades:
Event Type	Trial	Number	Start	End	Duration	Start Loc.X	Start Loc.Y	End Loc.X	End Loc.Y	Amplitude	Peak Speed	Peak Speed At	Average Speed	Peak Accel.	Peak Decel.	Average Accel.

Table Header for Blinks:
Event Type	Trial	Number	Start	End	Duration

Table Header for User Events:
Event Type	Trial	Number	Start	Description

UserEvent	1	1	28191583841	# Message: after_a_rain_country_road_Vasilyev_1869.jpg
Fixation L	1	1	28191603071	28191782182	179111	707.82	450.42	8	39	-1	15.56	15.56
Fixation R	1	1	28191603071	28191782182	179111	707.82	450.42	8	39	-1	16.26	16.26
Saccade L	1	1	28191782182	28191802050	19868	709.74	465.63	754.34	491.51	0.44	52.17	1.00	22.19	1149.80	-1132.82	881.94
Saccade R	1	1	28191782182	28191802050	19868	709.74	465.63	754.34	491.51	0.44	52.17	1.00	22.19	1149.80	-1132.82	881.94
Fixation L	1	2	28191802050	28192100428	298378	764.77	513.15	54	32	-1	15.99	15.99
Fixation R	1	2	28191802050	28192100428	298378	764.77	513.15	54	32	-1	16.62	16.62
Saccade L	1	2	28192100428	28192120288	19860	787.53	514.98	798.66	644.64	0.70	131.63	1.00	35.32	3159.73	-3246.37	2143.57
Saccade R	1	2	28192100428	28192120288	19860	787.53	514.98	798.66	644.64	0.70	131.63	1.00	35.32	3159.73	-3246.37	2143.57
Fixation L	1	3	28192120288	28192279405	159117	804.22	643.05	13	12	-1	14.58	14.58
Fixation R	1	3	28192120288	28192279405	159117	804.22	643.05	13	12	-1	15.46	15.46
Saccade L	1	3	28192279405	28192299284	19879	809.25	646.44	805.43	744.18	0.81	98.95	1.00	40.66	2344.72	-2421.14	1876.00
Saccade R	1	3	28192279405	28192299284	19879	809.25	646.44	805.43	744.18	0.81	98.95	1.00	40.66	2344.72	-2421.14	1876.00
Fixation L	1	4	28192299284	28192736886	437602	812.94	779.89	18	45	-1	13.28	13.28
Fixation R	1	4	28192299284	28192736886	437602	812.94	779.89	18	45	-1	13.71	13.71
Saccade L	1	4	28192736886	28192776632	39746	822.43	765.89	579.83	716.73	2.59	162.63	1.00	65.28	3957.36	-3781.57	2631.30
Saccade R	1	4	28192736886	28192776632	39746	822.43	765.89	579.83	716.73	2.59	162.63	1.00	65.28	3957.36	-3781.57	2631.30
Fixation L	1	5	28192776632	28192935754	159122	563.70	661.30	25	74	-1	13.52	13.52
Fixation R	1	5	28192776632	28192935754	159122	563.70	661.30	25	74	-1	13.95	13.95
Saccade L	1	5	28192935754	28192955643	19889	554.09	646.44	553.20	647.38	0.08	8.07	1.00	3.84	109.96	-169.07	108.59
Saccade R	1	5	28192935754	28192955643	19889	554.09	646.44	553.20	647.38	0.08	8.07	1.00	3.84	109.96	-169.07	108.59
Fixation L	1	6	28192955643	28193313611	357968	544.24	640.98	50	20	-1	13.30	13.30
Fixation R	1	6	28192955643	28193313611	357968	544.24	640.98	50	20	-1	13.84	13.84
Saccade L	1	6	28193313611	28193333615	20004	584.06	641.85	674.28	646.54	0.79	91.39	1.00	39.58	2110.71	-2151.77	1776.28
Saccade R	1	6	28193313611	28193333615	20004	584.06	641.85	674.28	646.54	0.79	91.39	1.00	39.58	2110.71	-2151.77	1776.28
Fixation L	1	7	28193333615	28193512604	178989	684.29	654.62	18	29	-1	13.06	13.06
Fixation R	1	7	28193333615	28193512604	178989	684.29	654.62	18	29	-1	14.00	14.00
Saccade L	1	7	28193512604	28193532477	19873	692.58	675.62	869.43	751.37	1.32	194.55	1.00	66.59	4771.29	-4595.99	3273.62
Saccade R	1	7	28193512604	28193532477	19873	692.58	675.62	869.43	751.37	1.32	194.55	1.00	66.59	4771.29	-4595.99	3273.62
Fixation L	1	8	28193532477	28193751219	218742	884.24	786.33	23	45	-1	13.56	13.56
Fixation R	1	8	28193532477	28193751219	218742	884.24	786.33	23	45	-1	13.96	13.96
Saccade L	1	8	28193751219	28193810966	59747	892.70	792.62	1266.05	762.07	4.01	148.07	0.67	67.16	3637.93	-3394.66	2765.55
Saccade R	1	8	28193751219	28193810966	59747	892.70	792.62	1266.05	762.07	4.01	148.07	0.67	67.16	3637.93	-3394.66	2765.55
Fixation L	1	9	28193810966	28194745803	934837	1249.70	740.32	50	47	-1	13.50	13.50
Fixation R	1	9	28193810966	28194745803	934837	1249.70	740.32	50	47	-1	13.57	13.57
Saccade L	1	9	28194745803	28194765675	19872	1279.66	719.39	1282.88	717.61	0.18	13.37	1.00	8.99	15.98	-72.80	49.64
Saccade R	1	9	28194745803	28194765675	19872	1279.66	719.39	1282.88	717.61	0.18	13.37	1.00	8.99	15.98	-72.80	49.64
Fixation L	1	10	28194765675	28194984415	218740	1281.85	723.08	23	42	-1	13.53	13.53
Fixation R	1	10	28194765675	28194984415	218740	1281.85	723.08	23	42	-1	13.50	13.50
Saccade L	1	10	28194984415	28195024164	39749	1263.41	747.63	993.92	985.83	3.38	209.14	0.50	84.99	5095.85	-4317.44	4137.36
Saccade R	1	10	28194984415	28195024164	39749	1263.41	747.63	993.92	985.83	3.38	209.14	0.50	84.99	5095.85	-4317.44	4137.36
Fixation L	1	11	28195024164	28195402151	377987	960.32	994.13	69	20	-1	14.15	14.15
Fixation R	1	11	28195024164	28195402151	377987	960.32	994.13	69	20	-1	14.34	14.34
Saccade L	1	11	28195402151	28195422020	19869	924.18	985.59	889.31	970.98	0.45	38.25	1.00	22.66	905.09	-619.41	709.92
Saccade R	1	11	28195402151	28195422020	19869	924.18	985.59	889.31	970.98	0.45	38.25	1.00	22.66	905.09	-619.41	709.92
Fixation L	1	12	28195422020	28195581138	159118	883.14	947.20	13	37	-1	13.98	13.98
Fixation R	1	12	28195422020	28195581138	159118	883.14	947.20	13	37	-1	14.56	14.56
