[BeGaze]
Converted from:	C:\Documents and Settings\iViewX\Desktop\EXPERIMENTATIONS\Experiments\results\finaleart\S18F56223-finaleart-1.idf
Date:	27.03.2019 15:48:14
Version:	BeGaze 2.5.77
Sample Rate:	50
Subject:	S18F56223
Description:	Pascale Sebillot

Table Header for Fixations:
Event Type	Trial	Number	Start	End	Duration	Location X	Location Y	Dispersion X	Dispersion Y	Plane	Avg. Pupil Size X	Avg. Pupil Size Y

Table Header for Saccades:
Event Type	Trial	Number	Start	End	Duration	Start Loc.X	Start Loc.Y	End Loc.X	End Loc.Y	Amplitude	Peak Speed	Peak Speed At	Average Speed	Peak Accel.	Peak Decel.	Average Accel.

Table Header for Blinks:
Event Type	Trial	Number	Start	End	Duration

Table Header for User Events:
Event Type	Trial	Number	Start	Description

UserEvent	1	1	2229424508	# Message: the-reclining-shepherdess_morisot_1891.jpg
Saccade L	1	1	2229427012	2230521094	1094082	803.75	553.61	1315.64	687.70	288.47	773.61	0.04	263.66	19340.15	-15446.61	5448.70
Saccade R	1	1	2229427012	2230521094	1094082	803.75	553.61	1315.64	687.70	288.47	773.61	0.04	263.66	19340.15	-15446.61	5448.70
Fixation L	1	1	2230521094	2230700079	178985	1299.92	720.00	23	72	-1	11.67	11.67
Fixation R	1	1	2230521094	2230700079	178985	1299.92	720.00	23	72	-1	11.25	11.25
Saccade L	1	2	2230700079	2230759707	59628	1295.32	693.42	1075.55	884.77	4.63	242.04	0.33	77.63	5578.93	-5184.85	2879.25
Saccade R	1	2	2230700079	2230759707	59628	1295.32	693.42	1075.55	884.77	4.63	242.04	0.33	77.63	5578.93	-5184.85	2879.25
Fixation L	1	2	2230759707	2230958569	198862	1079.21	841.60	21	57	-1	12.24	12.24
Fixation R	1	2	2230759707	2230958569	198862	1079.21	841.60	21	57	-1	11.97	11.97
Saccade L	1	3	2230958569	2231137557	178988	1086.49	827.58	850.07	364.39	14.30	415.11	0.78	79.90	10057.91	-8664.19	3348.36
Saccade R	1	3	2230958569	2231137557	178988	1086.49	827.58	850.07	364.39	14.30	415.11	0.78	79.90	10057.91	-8664.19	3348.36
Fixation L	1	3	2231137557	2231296800	159243	855.36	395.07	17	75	-1	12.98	12.98
Fixation R	1	3	2231137557	2231296800	159243	855.36	395.07	17	75	-1	12.42	12.42
Saccade L	1	4	2231296800	2231316673	19873	857.89	419.98	855.70	442.89	0.29	23.29	1.00	14.39	137.95	-376.88	238.35
Saccade R	1	4	2231296800	2231316673	19873	857.89	419.98	855.70	442.89	0.29	23.29	1.00	14.39	137.95	-376.88	238.35
Fixation L	1	4	2231316673	2231475798	159125	857.92	447.67	14	19	-1	12.87	12.87
Fixation R	1	4	2231316673	2231475798	159125	857.92	447.67	14	19	-1	12.56	12.56
Saccade L	1	5	2231475798	2231495668	19870	863.92	457.57	786.18	378.72	0.94	112.00	1.00	47.47	2477.11	-2305.12	1944.95
Saccade R	1	5	2231475798	2231495668	19870	863.92	457.57	786.18	378.72	0.94	112.00	1.00	47.47	2477.11	-2305.12	1944.95
Fixation L	1	5	2231495668	2231734288	238620	813.61	372.22	52	40	-1	12.88	12.88
Fixation R	1	5	2231495668	2231734288	238620	813.61	372.22	52	40	-1	12.27	12.27
Saccade L	1	6	2231734288	2231953152	218864	806.32	363.51	438.47	200.00	28.93	239.45	0.91	132.17	5677.12	-4739.30	2844.74
Saccade R	1	6	2231734288	2231953152	218864	806.32	363.51	438.47	200.00	28.93	239.45	0.91	132.17	5677.12	-4739.30	2844.74
Fixation L	1	6	2231953152	2232072386	119234	467.00	194.86	55	22	-1	12.46	12.46
Fixation R	1	6	2231953152	2232072386	119234	467.00	194.86	55	22	-1	12.51	12.51
Saccade L	1	7	2232072386	2232410648	338262	476.70	203.90	1455.92	509.81	78.81	526.93	0.71	232.99	9817.37	-12256.98	6413.12
Saccade R	1	7	2232072386	2232410648	338262	476.70	203.90	1455.92	509.81	78.81	526.93	0.71	232.99	9817.37	-12256.98	6413.12
Fixation L	1	7	2232410648	2232589622	178974	1462.18	515.02	57	25	-1	12.34	12.34
Fixation R	1	7	2232410648	2232589622	178974	1462.18	515.02	57	25	-1	12.03	12.03
Saccade L	1	8	2232589622	2232768604	178982	1476.65	510.78	1403.28	716.53	28.89	396.95	0.11	161.39	9476.27	-9762.28	5283.66
Saccade R	1	8	2232589622	2232768604	178982	1476.65	510.78	1403.28	716.53	28.89	396.95	0.11	161.39	9476.27	-9762.28	5283.66
Fixation L	1	8	2232768604	2233007350	238746	1417.63	739.53	23	46	-1	13.51	13.51
Fixation R	1	8	2232768604	2233007350	238746	1417.63	739.53	23	46	-1	12.53	12.53
Saccade L	1	9	2233007350	2233086844	79494	1424.99	746.96	1425.42	459.99	13.91	445.92	0.75	174.97	9435.09	-10827.27	7040.15
Saccade R	1	9	2233007350	2233086844	79494	1424.99	746.96	1425.42	459.99	13.91	445.92	0.75	174.97	9435.09	-10827.27	7040.15
Fixation L	1	9	2233086844	2233305583	218739	1436.70	470.08	23	42	-1	12.98	12.98
Fixation R	1	9	2233086844	2233305583	218739	1436.70	470.08	23	42	-1	12.35	12.35
Saccade L	1	10	2233305583	2233325600	20017	1447.23	464.43	1444.79	721.11	1.71	259.49	1.00	85.28	6291.23	-5013.86	4271.39
Saccade R	1	10	2233305583	2233325600	20017	1447.23	464.43	1444.79	721.11	1.71	259.49	1.00	85.28	6291.23	-5013.86	4271.39
Fixation L	1	10	2233325600	2233424955	99355	1442.39	745.27	8	76	-1	13.48	13.48
Fixation R	1	10	2233325600	2233424955	99355	1442.39	745.27	8	76	-1	12.58	12.58
