[BeGaze]
Converted from:	C:\Documents and Settings\iViewX\Desktop\EXPERIMENTATIONS\Experiments\results\finaleart\S01A22542-finaleart-1.idf
Date:	27.03.2019 15:33:21
Version:	BeGaze 2.5.77
Sample Rate:	50
Subject:	S01A22542
Description:	Thibault Seve Minnaert

Table Header for Fixations:
Event Type	Trial	Number	Start	End	Duration	Location X	Location Y	Dispersion X	Dispersion Y	Plane	Avg. Pupil Size X	Avg. Pupil Size Y

Table Header for Saccades:
Event Type	Trial	Number	Start	End	Duration	Start Loc.X	Start Loc.Y	End Loc.X	End Loc.Y	Amplitude	Peak Speed	Peak Speed At	Average Speed	Peak Accel.	Peak Decel.	Average Accel.

Table Header for Blinks:
Event Type	Trial	Number	Start	End	Duration

Table Header for User Events:
Event Type	Trial	Number	Start	Description

UserEvent	1	1	9469004684	# Message: cows_at_a_pond_Bilders_1856.jpg
Fixation L	1	1	9469011405	9469429230	417825	868.30	562.54	60	31	-1	15.33	15.33
Fixation R	1	1	9469011405	9469429230	417825	868.30	562.54	60	31	-1	15.45	15.45
Saccade L	1	1	9469429230	9469449015	19785	877.36	581.27	996.35	674.36	0.85	152.80	1.00	43.01	3775.61	-3712.65	2591.09
Saccade R	1	1	9469429230	9469449015	19785	877.36	581.27	996.35	674.36	0.85	152.80	1.00	43.01	3775.61	-3712.65	2591.09
Fixation L	1	2	9469449015	9469568395	119380	996.83	678.53	6	8	-1	15.22	15.22
Fixation R	1	2	9469449015	9469568395	119380	996.83	678.53	6	8	-1	15.45	15.45
Saccade L	1	2	9469568395	9469608154	39759	1000.16	676.59	772.70	670.31	2.04	116.83	1.00	51.42	2827.23	-2519.39	2613.83
Saccade R	1	2	9469568395	9469608154	39759	1000.16	676.59	772.70	670.31	2.04	116.83	1.00	51.42	2827.23	-2519.39	2613.83
Fixation L	1	3	9469608154	9470503197	895043	762.59	654.66	52	45	-1	12.01	12.01
Fixation R	1	3	9469608154	9470503197	895043	762.59	654.66	52	45	-1	12.61	12.61
Saccade L	1	3	9470503197	9470523068	19871	740.40	668.40	753.02	678.28	0.16	16.21	1.00	8.03	278.56	-316.41	228.93
Saccade R	1	3	9470503197	9470523068	19871	740.40	668.40	753.02	678.28	0.16	16.21	1.00	8.03	278.56	-316.41	228.93
Fixation L	1	4	9470523068	9470682188	159120	755.88	669.24	15	17	-1	11.69	11.69
Fixation R	1	4	9470523068	9470682188	159120	755.88	669.24	15	17	-1	12.44	12.44
Saccade L	1	4	9470682188	9470721937	39749	763.78	663.90	1010.50	672.14	2.15	153.69	0.50	54.04	3698.03	-3533.15	2957.65
Saccade R	1	4	9470682188	9470721937	39749	763.78	663.90	1010.50	672.14	2.15	153.69	0.50	54.04	3698.03	-3533.15	2957.65
Fixation L	1	5	9470721937	9471239173	517236	1013.77	688.74	47	25	-1	12.50	12.50
Fixation R	1	5	9470721937	9471239173	517236	1013.77	688.74	47	25	-1	12.45	12.45
Saccade L	1	5	9471239173	9471259036	19863	1010.69	683.83	1117.73	679.90	0.72	108.34	1.00	36.27	2666.46	-2541.08	1780.41
Saccade R	1	5	9471239173	9471259036	19863	1010.69	683.83	1117.73	679.90	0.72	108.34	1.00	36.27	2666.46	-2541.08	1780.41
Fixation L	1	6	9471259036	9471796021	536985	1137.77	684.32	24	13	-1	12.26	12.26
Fixation R	1	6	9471259036	9471796021	536985	1137.77	684.32	24	13	-1	12.41	12.41
Saccade L	1	6	9471796021	9471835898	39877	1142.24	690.16	1476.72	572.88	3.47	215.32	1.00	86.96	5289.10	-5063.04	4056.83
Saccade R	1	6	9471796021	9471835898	39877	1142.24	690.16	1476.72	572.88	3.47	215.32	1.00	86.96	5289.10	-5063.04	4056.83
Fixation L	1	7	9471835898	9471995011	159113	1517.94	539.89	52	43	-1	12.10	12.10
Fixation R	1	7	9471835898	9471995011	159113	1517.94	539.89	52	43	-1	12.21	12.21
Saccade L	1	7	9471995011	9472134247	139236	1529.66	529.57	1548.27	460.44	3.22	61.91	0.86	23.15	973.73	-1450.90	591.87
Saccade R	1	7	9471995011	9472134247	139236	1529.66	529.57	1548.27	460.44	3.22	61.91	0.86	23.15	973.73	-1450.90	591.87
Fixation L	1	8	9472134247	9472273361	139114	1557.10	466.22	22	52	-1	12.48	12.48
Fixation R	1	8	9472134247	9472273361	139114	1557.10	466.22	22	52	-1	12.04	12.04
Saccade L	1	8	9472273361	9472293358	19997	1562.65	438.53	1580.68	374.85	0.62	66.95	1.00	30.81	1332.86	-1476.20	1005.37
Saccade R	1	8	9472273361	9472293358	19997	1562.65	438.53	1580.68	374.85	0.62	66.95	1.00	30.81	1332.86	-1476.20	1005.37
Fixation L	1	9	9472293358	9472412616	119258	1593.66	367.60	22	77	-1	12.37	12.37
Fixation R	1	9	9472293358	9472412616	119258	1593.66	367.60	22	77	-1	11.87	11.87
Saccade L	1	9	9472412616	9472432483	19867	1602.92	428.89	1608.63	413.43	0.54	76.79	0.00	27.05	306.23	-1661.61	763.88
Saccade R	1	9	9472412616	9472432483	19867	1602.92	428.89	1608.63	413.43	0.54	76.79	0.00	27.05	306.23	-1661.61	763.88
Fixation L	1	10	9472432483	9472631468	198985	1608.58	374.87	3	79	-1	12.33	12.33
Fixation R	1	10	9472432483	9472631468	198985	1608.58	374.87	3	79	-1	11.85	11.85
Saccade L	1	10	9472631468	9472710966	79498	1609.50	367.26	1701.56	378.42	3.97	111.18	0.25	49.94	2765.73	-1852.16	1409.60
Saccade R	1	10	9472631468	9472710966	79498	1609.50	367.26	1701.56	378.42	3.97	111.18	0.25	49.94	2765.73	-1852.16	1409.60
Fixation L	1	11	9472710966	9472810473	99507	1693.80	410.46	26	66	-1	12.06	12.06
Fixation R	1	11	9472710966	9472810473	99507	1693.80	410.46	26	66	-1	11.60	11.60
Saccade L	1	11	9472810473	9472830336	19863	1675.07	445.17	1674.05	451.80	0.25	25.91	0.00	12.57	142.12	-481.72	242.44
Saccade R	1	11	9472810473	9472830336	19863	1675.07	445.17	1674.05	451.80	0.25	25.91	0.00	12.57	142.12	-481.72	242.44
Fixation L	1	12	9472830336	9472989454	159118	1665.52	462.26	17	22	-1	12.13	12.13
Fixation R	1	12	9472830336	9472989454	159118	1665.52	462.26	17	22	-1	11.70	11.70
