[BeGaze]
Converted from:	C:\Documents and Settings\iViewX\Desktop\EXPERIMENTATIONS\Experiments\results\finaleart\S8119532-finaleart-1.idf
Date:	27.03.2019 16:00:30
Version:	BeGaze 2.5.77
Sample Rate:	50
Subject:	S8119532
Description:	Alexandre Drewery

Table Header for Fixations:
Event Type	Trial	Number	Start	End	Duration	Location X	Location Y	Dispersion X	Dispersion Y	Plane	Avg. Pupil Size X	Avg. Pupil Size Y

Table Header for Saccades:
Event Type	Trial	Number	Start	End	Duration	Start Loc.X	Start Loc.Y	End Loc.X	End Loc.Y	Amplitude	Peak Speed	Peak Speed At	Average Speed	Peak Accel.	Peak Decel.	Average Accel.

Table Header for Blinks:
Event Type	Trial	Number	Start	End	Duration

Table Header for User Events:
Event Type	Trial	Number	Start	Description

UserEvent	1	1	3178038257	# Message: nasturtiums-dahlias-in-a-basket_gauguin_1884.jpg
Fixation L	1	1	3178047004	3178882332	835328	949.57	584.06	42	39	-1	13.97	13.97
Fixation R	1	1	3178047004	3178882332	835328	949.57	584.06	42	39	-1	14.61	14.61
Saccade L	1	1	3178882332	3179160828	278496	929.79	596.38	710.96	305.08	18.06	187.29	0.79	64.84	2847.43	-4030.09	1753.84
Saccade R	1	1	3178882332	3179160828	278496	929.79	596.38	710.96	305.08	18.06	187.29	0.79	64.84	2847.43	-4030.09	1753.84
Fixation L	1	2	3179160828	3179339817	178989	707.33	319.62	16	31	-1	13.51	13.51
Fixation R	1	2	3179160828	3179339817	178989	707.33	319.62	16	31	-1	14.08	14.08
Saccade L	1	2	3179339817	3179697806	357989	698.38	316.36	1334.52	632.21	28.52	374.70	0.56	79.68	8740.54	-8428.17	2395.13
Saccade R	1	2	3179339817	3179697806	357989	698.38	316.36	1334.52	632.21	28.52	374.70	0.56	79.68	8740.54	-8428.17	2395.13
Fixation L	1	3	3179697806	3179936541	238735	1337.73	651.77	12	64	-1	14.26	14.26
Fixation R	1	3	3179697806	3179936541	238735	1337.73	651.77	12	64	-1	14.11	14.11
Saccade L	1	3	3179936541	3179976285	39744	1331.98	674.92	947.91	673.31	3.42	236.09	0.50	86.13	5586.62	-5589.10	4554.71
Saccade R	1	3	3179936541	3179976285	39744	1331.98	674.92	947.91	673.31	3.42	236.09	0.50	86.13	5586.62	-5589.10	4554.71
Fixation L	1	4	3179976285	3180175152	198867	938.06	630.79	15	60	-1	14.46	14.46
Fixation R	1	4	3179976285	3180175152	198867	938.06	630.79	15	60	-1	14.69	14.69
Saccade L	1	4	3180175152	3180553140	377988	934.42	615.85	1563.57	595.75	26.25	391.45	0.32	69.45	9068.17	-9216.59	2349.30
Saccade R	1	4	3180175152	3180553140	377988	934.42	615.85	1563.57	595.75	26.25	391.45	0.32	69.45	9068.17	-9216.59	2349.30
Fixation L	1	5	3180553140	3180652512	99372	1553.10	591.94	56	41	-1	14.46	14.46
Fixation R	1	5	3180553140	3180652512	99372	1553.10	591.94	56	41	-1	14.03	14.03
Saccade L	1	5	3180652512	3180831496	178984	1515.88	580.15	1412.54	594.03	9.88	130.14	1.00	55.22	2411.57	-2334.55	1244.59
Saccade R	1	5	3180652512	3180831496	178984	1515.88	580.15	1412.54	594.03	9.88	130.14	1.00	55.22	2411.57	-2334.55	1244.59
Fixation L	1	6	3180831496	3180950864	119368	1391.29	607.92	31	41	-1	14.49	14.49
Fixation R	1	6	3180831496	3180950864	119368	1391.29	607.92	31	41	-1	13.93	13.93
Saccade L	1	6	3180950864	3180990734	39870	1381.06	608.89	983.03	630.29	3.45	231.77	1.00	86.43	5738.24	-5307.25	4735.10
Saccade R	1	6	3180950864	3180990734	39870	1381.06	608.89	983.03	630.29	3.45	231.77	1.00	86.43	5738.24	-5307.25	4735.10
Fixation L	1	7	3180990734	3181189606	198872	966.43	614.20	27	44	-1	14.68	14.68
Fixation R	1	7	3180990734	3181189606	198872	966.43	614.20	27	44	-1	14.56	14.56
Saccade L	1	7	3181189606	3181209477	19871	955.26	591.79	857.99	596.38	0.83	98.51	1.00	41.79	1744.79	-2225.95	1505.21
Saccade R	1	7	3181189606	3181209477	19871	955.26	591.79	857.99	596.38	0.83	98.51	1.00	41.79	1744.79	-2225.95	1505.21
Fixation L	1	8	3181209477	3181408346	198869	841.76	573.22	22	55	-1	14.50	14.50
Fixation R	1	8	3181209477	3181408346	198869	841.76	573.22	22	55	-1	14.59	14.59
Saccade L	1	8	3181408346	3181448094	39748	837.48	554.83	834.92	446.92	1.83	105.62	0.50	46.16	2224.42	-2244.30	2076.62
Saccade R	1	8	3181408346	3181448094	39748	837.48	554.83	834.92	446.92	1.83	105.62	0.50	46.16	2224.42	-2244.30	2076.62
Fixation L	1	9	3181448094	3181627205	179111	826.63	417.48	12	39	-1	14.42	14.42
Fixation R	1	9	3181448094	3181627205	179111	826.63	417.48	12	39	-1	14.51	14.51
Blink L	1	1	3181627205	3181806193	178988
Blink R	1	1	3181627205	3181806193	178988
Saccade L	1	9	3181806193	3182024940	218747	573.88	341.10	386.93	190.69	13.74	148.82	0.73	62.82	2518.47	-3211.34	1266.14
Saccade R	1	9	3181806193	3182024940	218747	573.88	341.10	386.93	190.69	13.74	148.82	0.73	62.82	2518.47	-3211.34	1266.14
