[BeGaze]
Converted from:	C:\Documents and Settings\iViewX\Desktop\EXPERIMENTATIONS\Experiments\results\finaleart\S7121223-finaleart-1.idf
Date:	27.03.2019 15:36:59
Version:	BeGaze 2.5.77
Sample Rate:	50
Subject:	S7121223
Description:	Gregoire pacreau

Table Header for Fixations:
Event Type	Trial	Number	Start	End	Duration	Location X	Location Y	Dispersion X	Dispersion Y	Plane	Avg. Pupil Size X	Avg. Pupil Size Y

Table Header for Saccades:
Event Type	Trial	Number	Start	End	Duration	Start Loc.X	Start Loc.Y	End Loc.X	End Loc.Y	Amplitude	Peak Speed	Peak Speed At	Average Speed	Peak Accel.	Peak Decel.	Average Accel.

Table Header for Blinks:
Event Type	Trial	Number	Start	End	Duration

Table Header for User Events:
Event Type	Trial	Number	Start	Description

UserEvent	1	1	4452260388	# Message: red-mullets_monet_1869.jpg
Fixation L	1	1	4452276423	4452694031	417608	953.98	468.14	35	23	-1	14.92	14.92
Fixation R	1	1	4452276423	4452694031	417608	953.98	468.14	35	23	-1	15.20	15.20
Saccade L	1	1	4452694031	4452713886	19855	984.08	474.69	1066.19	467.87	0.61	83.34	1.00	30.79	2067.18	-1739.90	1378.08
Saccade R	1	1	4452694031	4452713886	19855	984.08	474.69	1066.19	467.87	0.61	83.34	1.00	30.79	2067.18	-1739.90	1378.08
Fixation L	1	2	4452713886	4452853112	139226	1070.15	448.07	6	46	-1	14.57	14.57
Fixation R	1	2	4452713886	4452853112	139226	1070.15	448.07	6	46	-1	14.47	14.47
Saccade L	1	2	4452853112	4452872988	19876	1072.75	428.93	954.72	426.88	0.90	119.40	1.00	45.46	2651.01	-2782.51	2091.85
Saccade R	1	2	4452853112	4452872988	19876	1072.75	428.93	954.72	426.88	0.90	119.40	1.00	45.46	2651.01	-2782.51	2091.85
Fixation L	1	3	4452872988	4453131606	258618	913.73	428.56	48	10	-1	11.74	11.74
Fixation R	1	3	4452872988	4453131606	258618	913.73	428.56	48	10	-1	11.58	11.58
Saccade L	1	3	4453131606	4453151472	19866	908.80	424.02	977.30	379.05	0.65	82.89	1.00	32.48	2031.20	-1880.91	1576.64
Saccade R	1	3	4453131606	4453151472	19866	908.80	424.02	977.30	379.05	0.65	82.89	1.00	32.48	2031.20	-1880.91	1576.64
Fixation L	1	4	4453151472	4453350336	198864	1006.35	344.45	36	43	-1	11.49	11.49
Fixation R	1	4	4453151472	4453350336	198864	1006.35	344.45	36	43	-1	11.21	11.21
Saccade L	1	4	4453350336	4453370218	19882	1013.29	339.09	1016.63	295.51	0.40	44.22	1.00	20.28	1090.63	-949.59	957.34
Saccade R	1	4	4453350336	4453370218	19882	1013.29	339.09	1016.63	295.51	0.40	44.22	1.00	20.28	1090.63	-949.59	957.34
Fixation L	1	5	4453370218	4453927187	556969	1025.14	252.42	37	56	-1	12.79	12.79
Fixation R	1	5	4453370218	4453927187	556969	1025.14	252.42	37	56	-1	12.86	12.86
Saccade L	1	5	4453927187	4453986807	59620	1015.83	251.84	684.49	775.61	6.75	288.40	0.33	113.30	7122.72	-5555.39	5068.10
Saccade R	1	5	4453927187	4453986807	59620	1015.83	251.84	684.49	775.61	6.75	288.40	0.33	113.30	7122.72	-5555.39	5068.10
Fixation L	1	6	4453986807	4454265296	278489	671.65	800.61	30	63	-1	14.01	14.01
Fixation R	1	6	4453986807	4454265296	278489	671.65	800.61	30	63	-1	14.51	14.51
Saccade L	1	6	4454265296	4454285174	19878	653.79	833.45	650.60	859.88	0.40	33.40	1.00	20.20	82.75	-630.03	291.51
Saccade R	1	6	4454265296	4454285174	19878	653.79	833.45	650.60	859.88	0.40	33.40	1.00	20.20	82.75	-630.03	291.51
Fixation L	1	7	4454285174	4454782388	497214	620.00	840.39	40	34	-1	12.11	12.11
Fixation R	1	7	4454285174	4454782388	497214	620.00	840.39	40	34	-1	12.52	12.52
Saccade L	1	7	4454782388	4454802264	19876	627.88	829.51	716.86	766.18	0.83	110.48	1.00	41.92	2689.73	-2599.30	2068.45
Saccade R	1	7	4454782388	4454802264	19876	627.88	829.51	716.86	766.18	0.83	110.48	1.00	41.92	2689.73	-2599.30	2068.45
Fixation L	1	8	4454802264	4455080752	278488	729.62	726.81	21	65	-1	11.75	11.75
Fixation R	1	8	4454802264	4455080752	278488	729.62	726.81	21	65	-1	12.05	12.05
Saccade L	1	8	4455080752	4455100623	19871	738.85	732.12	915.52	669.10	1.18	189.68	1.00	59.59	4663.77	-4684.26	3264.63
Saccade R	1	8	4455080752	4455100623	19871	738.85	732.12	915.52	669.10	1.18	189.68	1.00	59.59	4663.77	-4684.26	3264.63
Fixation L	1	9	4455100623	4455498491	397868	916.49	685.00	6	31	-1	12.62	12.62
Fixation R	1	9	4455100623	4455498491	397868	916.49	685.00	6	31	-1	12.60	12.60
Saccade L	1	9	4455498491	4455538228	39737	918.31	697.94	1073.27	680.89	1.55	88.64	0.50	38.95	2158.59	-1641.75	1721.22
Saccade R	1	9	4455498491	4455538228	39737	918.31	697.94	1073.27	680.89	1.55	88.64	0.50	38.95	2158.59	-1641.75	1721.22
Fixation L	1	10	4455538228	4455916078	377850	1080.03	645.66	10	47	-1	13.07	13.07
Fixation R	1	10	4455538228	4455916078	377850	1080.03	645.66	10	47	-1	13.00	13.00
Saccade L	1	10	4455916078	4455935956	19878	1079.31	633.78	920.25	609.75	1.14	162.69	1.00	57.59	4047.76	-3900.18	3168.26
Saccade R	1	10	4455916078	4455935956	19878	1079.31	633.78	920.25	609.75	1.14	162.69	1.00	57.59	4047.76	-3900.18	3168.26
Fixation L	1	11	4455935956	4456055333	119377	858.35	599.13	77	21	-1	12.39	12.39
Fixation R	1	11	4455935956	4456055333	119377	858.35	599.13	77	21	-1	12.20	12.20
Saccade L	1	11	4456055333	4456075208	19875	843.02	595.76	841.44	593.35	0.12	7.86	1.00	5.86	-35.39	-123.47	72.49
Saccade R	1	11	4456055333	4456075208	19875	843.02	595.76	841.44	593.35	0.12	7.86	1.00	5.86	-35.39	-123.47	72.49
Fixation L	1	12	4456075208	4456214442	139234	839.96	587.61	2	10	-1	12.86	12.86
Fixation R	1	12	4456075208	4456214442	139234	839.96	587.61	2	10	-1	12.48	12.48
Saccade L	1	12	4456214442	4456254187	39745	838.68	582.98	837.27	486.78	1.07	99.95	0.50	26.94	2446.88	0.00	817.76
Saccade R	1	12	4456214442	4456254187	39745	838.68	582.98	837.27	486.78	1.07	99.95	0.50	26.94	2446.88	0.00	817.76
