[BeGaze]
Converted from:	C:\Documents and Settings\iViewX\Desktop\EXPERIMENTATIONS\Experiments\results\finaleart\S12H22222-finaleart-1.idf
Date:	27.03.2019 15:40:03
Version:	BeGaze 2.5.77
Sample Rate:	50
Subject:	S12H22222
Description:	aurele barriere

Table Header for Fixations:
Event Type	Trial	Number	Start	End	Duration	Location X	Location Y	Dispersion X	Dispersion Y	Plane	Avg. Pupil Size X	Avg. Pupil Size Y

Table Header for Saccades:
Event Type	Trial	Number	Start	End	Duration	Start Loc.X	Start Loc.Y	End Loc.X	End Loc.Y	Amplitude	Peak Speed	Peak Speed At	Average Speed	Peak Accel.	Peak Decel.	Average Accel.

Table Header for Blinks:
Event Type	Trial	Number	Start	End	Duration

Table Header for User Events:
Event Type	Trial	Number	Start	Description

UserEvent	1	1	23097205515	# Message: still-life_matisse_0.jpg
Fixation L	1	1	23097209053	23097746145	537092	931.77	522.18	39	36	-1	14.66	14.66
Fixation R	1	1	23097209053	23097746145	537092	931.77	522.18	39	36	-1	14.32	14.32
Saccade L	1	1	23097746145	23097766012	19867	909.88	532.23	926.49	580.96	0.31	52.07	1.00	15.60	1298.04	-886.47	756.54
Saccade R	1	1	23097746145	23097766012	19867	909.88	532.23	926.49	580.96	0.31	52.07	1.00	15.60	1298.04	-886.47	756.54
Fixation L	1	2	23097766012	23097925129	159117	939.96	583.00	24	17	-1	14.93	14.93
Fixation R	1	2	23097766012	23097925129	159117	939.96	583.00	24	17	-1	14.87	14.87
Saccade L	1	2	23097925129	23097984759	59630	948.66	587.76	666.14	539.93	3.81	172.29	0.67	63.83	4195.02	-2588.30	2203.81
Saccade R	1	2	23097925129	23097984759	59630	948.66	587.76	666.14	539.93	3.81	172.29	0.67	63.83	4195.02	-2588.30	2203.81
Fixation L	1	3	23097984759	23098084258	99499	651.80	493.19	24	66	-1	14.59	14.59
Fixation R	1	3	23097984759	23098084258	99499	651.80	493.19	24	66	-1	14.57	14.57
Saccade L	1	3	23098084258	23098104126	19868	642.02	480.52	640.98	464.04	0.17	16.71	1.00	8.71	251.75	-352.02	233.12
Saccade R	1	3	23098084258	23098104126	19868	642.02	480.52	640.98	464.04	0.17	16.71	1.00	8.71	251.75	-352.02	233.12
Fixation L	1	4	23098104126	23098303120	198994	633.88	455.32	24	41	-1	14.02	14.02
Fixation R	1	4	23098104126	23098303120	198994	633.88	455.32	24	41	-1	13.92	13.92
Saccade L	1	4	23098303120	23098322993	19873	620.71	424.49	612.89	385.83	0.53	39.90	1.00	26.67	394.07	-936.34	470.31
Saccade R	1	4	23098303120	23098322993	19873	620.71	424.49	612.89	385.83	0.53	39.90	1.00	26.67	394.07	-936.34	470.31
Fixation L	1	5	23098322993	23098840111	517118	625.59	402.55	39	22	-1	13.37	13.37
Fixation R	1	5	23098322993	23098840111	517118	625.59	402.55	39	22	-1	13.54	13.54
Saccade L	1	5	23098840111	23098879839	39728	651.45	408.17	958.23	221.64	3.12	185.74	1.00	78.45	4591.81	-4427.83	4413.12
Saccade R	1	5	23098840111	23098879839	39728	651.45	408.17	958.23	221.64	3.12	185.74	1.00	78.45	4591.81	-4427.83	4413.12
Fixation L	1	6	23098879839	23099257835	377996	963.77	236.26	22	29	-1	12.77	12.77
Fixation R	1	6	23098879839	23099257835	377996	963.77	236.26	22	29	-1	12.83	12.83
Saccade L	1	6	23099257835	23099297573	39738	974.81	251.03	1169.85	464.96	2.68	243.36	0.50	67.41	6066.09	-5815.63	3696.58
Saccade R	1	6	23099257835	23099297573	39738	974.81	251.03	1169.85	464.96	2.68	243.36	0.50	67.41	6066.09	-5815.63	3696.58
Fixation L	1	7	23099297573	23099615810	318237	1181.19	493.75	21	41	-1	12.97	12.97
Fixation R	1	7	23099297573	23099615810	318237	1181.19	493.75	21	41	-1	13.01	13.01
Saccade L	1	7	23099615810	23099635677	19867	1185.47	503.15	1315.10	490.58	0.72	131.73	1.00	36.28	3206.32	-3134.73	2142.11
Saccade R	1	7	23099615810	23099635677	19867	1185.47	503.15	1315.10	490.58	0.72	131.73	1.00	36.28	3206.32	-3134.73	2142.11
Fixation L	1	8	23099635677	23100252285	616608	1305.16	472.97	35	58	-1	12.64	12.64
Fixation R	1	8	23099635677	23100252285	616608	1305.16	472.97	35	58	-1	12.51	12.51
Saccade L	1	8	23100252285	23100272152	19867	1288.86	436.62	1238.04	439.37	0.57	60.11	1.00	28.67	1477.14	-1027.62	1246.65
Saccade R	1	8	23100252285	23100272152	19867	1288.86	436.62	1238.04	439.37	0.57	60.11	1.00	28.67	1477.14	-1027.62	1246.65
Fixation L	1	9	23100272152	23100431271	159119	1180.94	455.94	69	29	-1	12.74	12.74
Fixation R	1	9	23100272152	23100431271	159119	1180.94	455.94	69	29	-1	12.31	12.31
Saccade L	1	9	23100431271	23100550645	119374	1171.76	468.84	1484.48	276.92	5.44	256.69	0.83	45.60	6344.02	-6318.20	2200.93
Saccade R	1	9	23100431271	23100550645	119374	1171.76	468.84	1484.48	276.92	5.44	256.69	0.83	45.60	6344.02	-6318.20	2200.93
Fixation L	1	10	23100550645	23100868878	318233	1479.52	278.38	19	24	-1	12.90	12.90
Fixation R	1	10	23100550645	23100868878	318233	1479.52	278.38	19	24	-1	12.64	12.64
Saccade L	1	10	23100868878	23100888757	19879	1477.66	280.17	1561.89	278.23	0.76	85.23	1.00	38.36	2048.06	-1996.97	1647.35
Saccade R	1	10	23100868878	23100888757	19879	1477.66	280.17	1561.89	278.23	0.76	85.23	1.00	38.36	2048.06	-1996.97	1647.35
Fixation L	1	11	23100888757	23101147365	258608	1592.88	292.76	53	33	-1	13.58	13.58
Fixation R	1	11	23100888757	23101147365	258608	1592.88	292.76	53	33	-1	13.09	13.09
Saccade L	1	11	23101147365	23101187113	39748	1589.86	302.02	1574.93	162.48	2.90	158.74	0.50	73.03	3884.11	0.00	2150.20
Saccade R	1	11	23101147365	23101187113	39748	1589.86	302.02	1574.93	162.48	2.90	158.74	0.50	73.03	3884.11	0.00	2150.20
