[BeGaze]
Converted from:	C:\Documents and Settings\iViewX\Desktop\EXPERIMENTATIONS\Experiments\results\finaleart\S7121223-finaleart-1.idf
Date:	27.03.2019 15:37:02
Version:	BeGaze 2.5.77
Sample Rate:	50
Subject:	S7121223
Description:	Gregoire pacreau

Table Header for Fixations:
Event Type	Trial	Number	Start	End	Duration	Location X	Location Y	Dispersion X	Dispersion Y	Plane	Avg. Pupil Size X	Avg. Pupil Size Y

Table Header for Saccades:
Event Type	Trial	Number	Start	End	Duration	Start Loc.X	Start Loc.Y	End Loc.X	End Loc.Y	Amplitude	Peak Speed	Peak Speed At	Average Speed	Peak Accel.	Peak Decel.	Average Accel.

Table Header for Blinks:
Event Type	Trial	Number	Start	End	Duration

Table Header for User Events:
Event Type	Trial	Number	Start	Description

UserEvent	1	1	4803951754	# Message: Young_Girls_Playing_With_A_Lion_Club_Valtat_1905.jpg
Fixation L	1	1	4803964133	4804322514	358381	818.28	488.35	10	20	-1	17.04	17.04
Fixation R	1	1	4803964133	4804322514	358381	818.28	488.35	10	20	-1	16.51	16.51
Saccade L	1	1	4804322514	4804342370	19856	821.30	495.88	980.84	496.60	0.89	161.36	1.00	45.06	4005.02	-4002.68	2721.76
Saccade R	1	1	4804322514	4804342370	19856	821.30	495.88	980.84	496.60	0.89	161.36	1.00	45.06	4005.02	-4002.68	2721.76
Fixation L	1	2	4804342370	4804800467	458097	1005.96	480.62	38	34	-1	14.73	14.73
Fixation R	1	2	4804342370	4804800467	458097	1005.96	480.62	38	34	-1	13.61	13.61
Saccade L	1	2	4804800467	4804820334	19867	1017.77	464.68	901.65	462.91	0.65	117.46	1.00	32.58	2882.56	-2905.03	1948.81
Saccade R	1	2	4804800467	4804820334	19867	1017.77	464.68	901.65	462.91	0.65	117.46	1.00	32.58	2882.56	-2905.03	1948.81
Fixation L	1	3	4804820334	4805138942	318608	899.20	448.67	5	24	-1	12.34	12.34
Fixation R	1	3	4804820334	4805138942	318608	899.20	448.67	5	24	-1	11.08	11.08
Saccade L	1	3	4805138942	4805158812	19870	901.72	438.16	900.60	570.46	0.78	133.82	1.00	39.47	3296.09	-3123.87	2272.42
Saccade R	1	3	4805138942	4805158812	19870	901.72	438.16	900.60	570.46	0.78	133.82	1.00	39.47	3296.09	-3123.87	2272.42
Fixation L	1	4	4805158812	4805437548	278736	907.55	599.94	12	82	-1	12.46	12.46
Fixation R	1	4	4805158812	4805437548	278736	907.55	599.94	12	82	-1	11.21	11.21
Saccade L	1	4	4805437548	4805457551	20003	912.07	653.00	913.04	691.83	0.46	50.33	0.00	23.00	951.09	-1230.60	1002.04
Saccade R	1	4	4805437548	4805457551	20003	912.07	653.00	913.04	691.83	0.46	50.33	0.00	23.00	951.09	-1230.60	1002.04
Fixation L	1	5	4805457551	4805616792	159241	913.71	700.96	4	16	-1	12.85	12.85
Fixation R	1	5	4805457551	4805616792	159241	913.71	700.96	4	16	-1	11.64	11.64
Blink L	1	1	4805616792	4805815917	199125
Blink R	1	1	4805616792	4805815917	199125
Fixation L	1	6	4805815917	4806015017	199100	1099.61	726.69	13	43	-1	13.02	13.02
Fixation R	1	6	4805815917	4806015017	199100	1099.61	726.69	13	43	-1	12.63	12.63
Saccade L	1	5	4806015017	4806035018	20001	1101.19	754.19	1100.40	815.28	0.53	61.81	1.00	26.41	1503.25	-1228.45	996.80
Saccade R	1	5	4806015017	4806035018	20001	1101.19	754.19	1100.40	815.28	0.53	61.81	1.00	26.41	1503.25	-1228.45	996.80
Fixation L	1	7	4806035018	4806413379	378361	1099.17	818.57	32	35	-1	12.90	12.90
Fixation R	1	7	4806035018	4806413379	378361	1099.17	818.57	32	35	-1	12.61	12.61
Saccade L	1	6	4806413379	4806433246	19867	1070.25	835.04	981.21	979.50	1.04	171.61	1.00	52.28	4214.04	-4176.86	3047.30
Saccade R	1	6	4806413379	4806433246	19867	1070.25	835.04	981.21	979.50	1.04	171.61	1.00	52.28	4214.04	-4176.86	3047.30
Fixation L	1	8	4806433246	4807309320	876074	993.95	995.17	53	36	-1	13.09	13.09
Fixation R	1	8	4806433246	4807309320	876074	993.95	995.17	53	36	-1	12.85	12.85
Saccade L	1	7	4807309320	4807329348	20028	1029.45	1006.33	1040.59	988.34	0.23	21.41	1.00	11.48	508.33	1.48	196.97
Saccade R	1	7	4807309320	4807329348	20028	1029.45	1006.33	1040.59	988.34	0.23	21.41	1.00	11.48	508.33	1.48	196.97
Fixation L	1	9	4807329348	4807488568	159220	1072.51	978.31	47	15	-1	13.30	13.30
Fixation R	1	9	4807329348	4807488568	159220	1072.51	978.31	47	15	-1	12.64	12.64
Saccade L	1	8	4807488568	4807508445	19877	1088.01	974.02	1089.69	842.65	0.89	132.89	1.00	44.85	3236.13	-3140.74	2410.53
Saccade R	1	8	4807488568	4807508445	19877	1088.01	974.02	1089.69	842.65	0.89	132.89	1.00	44.85	3236.13	-3140.74	2410.53
Fixation L	1	10	4807508445	4807787321	278876	1094.53	808.23	9	50	-1	13.48	13.48
Fixation R	1	10	4807508445	4807787321	278876	1094.53	808.23	9	50	-1	13.36	13.36
Saccade L	1	9	4807787321	4807807184	19863	1098.97	792.04	1189.23	765.18	0.71	95.26	1.00	35.54	2246.85	-2322.72	1816.06
Saccade R	1	9	4807787321	4807807184	19863	1098.97	792.04	1189.23	765.18	0.71	95.26	1.00	35.54	2246.85	-2322.72	1816.06
Fixation L	1	11	4807807184	4807946539	139355	1194.22	721.19	8	60	-1	13.44	13.44
Fixation R	1	11	4807807184	4807946539	139355	1194.22	721.19	8	60	-1	13.17	13.17
