[BeGaze]
Converted from:	C:\Documents and Settings\iViewX\Desktop\EXPERIMENTATIONS\Experiments\results\finaleart\S8119532-finaleart-1.idf
Date:	27.03.2019 15:59:54
Version:	BeGaze 2.5.77
Sample Rate:	50
Subject:	S8119532
Description:	Alexandre Drewery

Table Header for Fixations:
Event Type	Trial	Number	Start	End	Duration	Location X	Location Y	Dispersion X	Dispersion Y	Plane	Avg. Pupil Size X	Avg. Pupil Size Y

Table Header for Saccades:
Event Type	Trial	Number	Start	End	Duration	Start Loc.X	Start Loc.Y	End Loc.X	End Loc.Y	Amplitude	Peak Speed	Peak Speed At	Average Speed	Peak Accel.	Peak Decel.	Average Accel.

Table Header for Blinks:
Event Type	Trial	Number	Start	End	Duration

Table Header for User Events:
Event Type	Trial	Number	Start	Description

UserEvent	1	1	2768321140	# Message: Paysage_a_La_Ciotat_(La_Pointe_du-Capucin)_friesz_1907.jpg
Fixation L	1	1	2768335043	2768891898	556855	932.45	623.37	54	34	-1	14.39	14.39
Fixation R	1	1	2768335043	2768891898	556855	932.45	623.37	54	34	-1	15.36	15.36
Saccade L	1	1	2768891898	2768911898	20000	954.14	644.25	951.31	658.03	0.36	23.09	0.00	18.01	-5.91	-218.58	125.89
Saccade R	1	1	2768891898	2768911898	20000	954.14	644.25	951.31	658.03	0.36	23.09	0.00	18.01	-5.91	-218.58	125.89
Fixation L	1	2	2768911898	2769110745	198847	961.79	656.37	16	18	-1	15.14	15.14
Fixation R	1	2	2768911898	2769110745	198847	961.79	656.37	16	18	-1	16.18	16.18
Saccade L	1	2	2769110745	2769130624	19879	965.28	655.89	845.89	746.76	1.00	151.75	1.00	50.54	3502.81	-3605.88	2596.56
Saccade R	1	2	2769110745	2769130624	19879	965.28	655.89	845.89	746.76	1.00	151.75	1.00	50.54	3502.81	-3605.88	2596.56
Fixation L	1	3	2769130624	2769548355	417731	803.69	759.88	56	37	-1	13.17	13.17
Fixation R	1	3	2769130624	2769548355	417731	803.69	759.88	56	37	-1	14.06	14.06
Saccade L	1	3	2769548355	2769568215	19860	814.75	762.36	907.28	800.10	1.02	101.08	1.00	51.55	1717.73	-1803.72	1248.82
Saccade R	1	3	2769548355	2769568215	19860	814.75	762.36	907.28	800.10	1.02	101.08	1.00	51.55	1717.73	-1803.72	1248.82
Fixation L	1	4	2769568215	2769707465	139250	910.69	814.34	8	55	-1	12.04	12.04
Fixation R	1	4	2769568215	2769707465	139250	910.69	814.34	8	55	-1	12.42	12.42
Saccade L	1	4	2769707465	2769767090	59625	913.25	806.33	1332.56	356.83	6.67	322.58	0.67	111.92	7972.37	-7059.81	4578.65
Saccade R	1	4	2769707465	2769767090	59625	913.25	806.33	1332.56	356.83	6.67	322.58	0.67	111.92	7972.37	-7059.81	4578.65
Fixation L	1	5	2769767090	2769926213	159123	1336.60	321.47	19	67	-1	11.47	11.47
Fixation R	1	5	2769767090	2769926213	159123	1336.60	321.47	19	67	-1	11.27	11.27
Saccade L	1	5	2769926213	2769946080	19867	1339.42	333.42	1365.71	215.10	0.81	122.60	1.00	40.57	2507.95	-2792.49	1800.51
Saccade R	1	5	2769926213	2769946080	19867	1339.42	333.42	1365.71	215.10	0.81	122.60	1.00	40.57	2507.95	-2792.49	1800.51
Fixation L	1	6	2769946080	2770085319	139239	1378.04	222.73	22	58	-1	11.35	11.35
Fixation R	1	6	2769946080	2770085319	139239	1378.04	222.73	22	58	-1	10.85	10.85
Saccade L	1	6	2770085319	2770105197	19878	1383.31	251.86	1377.03	284.33	0.41	33.46	1.00	20.43	257.16	-651.12	410.55
Saccade R	1	6	2770085319	2770105197	19878	1383.31	251.86	1377.03	284.33	0.41	33.46	1.00	20.43	257.16	-651.12	410.55
Fixation L	1	7	2770105197	2770304064	198867	1374.32	256.39	11	74	-1	10.86	10.86
Fixation R	1	7	2770105197	2770304064	198867	1374.32	256.39	11	74	-1	10.44	10.44
Saccade L	1	7	2770304064	2770324055	19991	1370.94	210.20	1441.50	327.42	1.04	138.39	1.00	52.12	3412.37	-2872.73	2159.22
Saccade R	1	7	2770304064	2770324055	19991	1370.94	210.20	1441.50	327.42	1.04	138.39	1.00	52.12	3412.37	-2872.73	2159.22
Fixation L	1	8	2770324055	2770522928	198873	1439.77	348.74	32	31	-1	10.40	10.40
Fixation R	1	8	2770324055	2770522928	198873	1439.77	348.74	32	31	-1	10.07	10.07
Saccade L	1	8	2770522928	2770542805	19877	1447.67	354.29	1436.60	459.40	0.60	106.90	1.00	29.95	2635.08	-2503.49	1750.78
Saccade R	1	8	2770522928	2770542805	19877	1447.67	354.29	1436.60	459.40	0.60	106.90	1.00	29.95	2635.08	-2503.49	1750.78
Fixation L	1	9	2770542805	2770721793	178988	1429.84	462.06	25	8	-1	10.40	10.40
Fixation R	1	9	2770542805	2770721793	178988	1429.84	462.06	25	8	-1	10.40	10.40
Saccade L	1	9	2770721793	2770741674	19881	1413.52	465.30	1248.61	566.02	1.15	195.41	1.00	57.86	4779.16	-4796.29	3246.90
Saccade R	1	9	2770721793	2770741674	19881	1413.52	465.30	1248.61	566.02	1.15	195.41	1.00	57.86	4779.16	-4796.29	3246.90
Fixation L	1	10	2770741674	2770841164	99490	1243.57	546.40	9	55	-1	10.98	10.98
Fixation R	1	10	2770741674	2770841164	99490	1243.57	546.40	9	55	-1	11.01	11.01
Saccade L	1	10	2770841164	2770880906	39742	1238.61	555.21	955.47	464.94	2.92	165.54	1.00	73.39	3934.15	-3280.56	3131.35
Saccade R	1	10	2770841164	2770880906	39742	1238.61	555.21	955.47	464.94	2.92	165.54	1.00	73.39	3934.15	-3280.56	3131.35
Fixation L	1	11	2770880906	2771020149	139243	927.42	438.42	41	52	-1	10.88	10.88
Fixation R	1	11	2770880906	2771020149	139243	927.42	438.42	41	52	-1	11.39	11.39
Saccade L	1	11	2771020149	2771040036	19887	913.53	412.87	918.91	402.41	0.30	18.66	0.00	15.23	-55.14	-70.86	64.02
Saccade R	1	11	2771020149	2771040036	19887	913.53	412.87	918.91	402.41	0.30	18.66	0.00	15.23	-55.14	-70.86	64.02
Fixation L	1	12	2771040036	2771159397	119361	914.39	397.08	7	26	-1	11.03	11.03
Fixation R	1	12	2771040036	2771159397	119361	914.39	397.08	7	26	-1	11.54	11.54
Saccade L	1	12	2771159397	2771179270	19873	913.02	411.18	1015.34	507.74	1.08	142.30	1.00	54.48	3031.08	-2873.34	1972.79
Saccade R	1	12	2771159397	2771179270	19873	913.02	411.18	1015.34	507.74	1.08	142.30	1.00	54.48	3031.08	-2873.34	1972.79
Fixation L	1	13	2771179270	2771278771	99501	1000.81	500.66	32	42	-1	11.24	11.24
Fixation R	1	13	2771179270	2771278771	99501	1000.81	500.66	32	42	-1	11.75	11.75
Saccade L	1	13	2771278771	2771378136	99365	995.43	486.55	1170.22	492.86	4.25	104.49	1.00	42.78	2050.65	-2155.17	1194.02
Saccade R	1	13	2771278771	2771378136	99365	995.43	486.55	1170.22	492.86	4.25	104.49	1.00	42.78	2050.65	-2155.17	1194.02
Fixation L	1	14	2771378136	2771497501	119365	1174.93	484.55	61	29	-1	11.54	11.54
Fixation R	1	14	2771378136	2771497501	119365	1174.93	484.55	61	29	-1	12.13	12.13
Saccade L	1	14	2771497501	2771537259	39758	1127.87	486.57	696.36	435.88	4.43	305.15	0.50	111.49	7276.77	-6395.27	4471.60
Saccade R	1	14	2771497501	2771537259	39758	1127.87	486.57	696.36	435.88	4.43	305.15	0.50	111.49	7276.77	-6395.27	4471.60
Fixation L	1	15	2771537259	2771855515	318256	714.19	447.16	31	57	-1	11.39	11.39
Fixation R	1	15	2771537259	2771855515	318256	714.19	447.16	31	57	-1	12.33	12.33
Saccade L	1	15	2771855515	2771935110	79595	728.22	478.68	760.80	496.99	2.61	74.78	1.00	32.79	1499.53	-1837.22	986.29
Saccade R	1	15	2771855515	2771935110	79595	728.22	478.68	760.80	496.99	2.61	74.78	1.00	32.79	1499.53	-1837.22	986.29
Fixation L	1	16	2771935110	2772193723	258613	774.56	503.87	18	21	-1	11.79	11.79
Fixation R	1	16	2771935110	2772193723	258613	774.56	503.87	18	21	-1	12.64	12.64
Saccade L	1	16	2772193723	2772312961	119238	775.91	500.61	1230.16	674.07	9.00	353.08	0.17	75.49	8769.48	-8184.52	3488.34
Saccade R	1	16	2772193723	2772312961	119238	775.91	500.61	1230.16	674.07	9.00	353.08	0.17	75.49	8769.48	-8184.52	3488.34
