[BeGaze]
Converted from:	C:\Documents and Settings\iViewX\Desktop\EXPERIMENTATIONS\Experiments\results\finaleart\S4120113-finaleart-1.idf
Date:	27.03.2019 15:34:36
Version:	BeGaze 2.5.77
Sample Rate:	50
Subject:	S4120113
Description:	Vidal Attias

Table Header for Fixations:
Event Type	Trial	Number	Start	End	Duration	Location X	Location Y	Dispersion X	Dispersion Y	Plane	Avg. Pupil Size X	Avg. Pupil Size Y

Table Header for Saccades:
Event Type	Trial	Number	Start	End	Duration	Start Loc.X	Start Loc.Y	End Loc.X	End Loc.Y	Amplitude	Peak Speed	Peak Speed At	Average Speed	Peak Accel.	Peak Decel.	Average Accel.

Table Header for Blinks:
Event Type	Trial	Number	Start	End	Duration

Table Header for User Events:
Event Type	Trial	Number	Start	Description

UserEvent	1	1	7226550884	# Message: void.jpg
Fixation L	1	1	7226569889	7226669386	99497	288.52	439.84	11	16	-1	13.27	13.27
Fixation R	1	1	7226569889	7226669386	99497	288.52	439.84	11	16	-1	14.13	14.13
Saccade L	1	1	7226669386	7226709126	39740	293.24	446.56	559.88	327.53	2.64	187.77	1.00	66.47	4634.96	-4631.35	3591.88
Saccade R	1	1	7226669386	7226709126	39740	293.24	446.56	559.88	327.53	2.64	187.77	1.00	66.47	4634.96	-4631.35	3591.88
Fixation L	1	2	7226709126	7226967743	258617	570.59	300.92	20	49	-1	13.32	13.32
Fixation R	1	2	7226709126	7226967743	258617	570.59	300.92	20	49	-1	14.11	14.11
Blink L	1	1	7226967743	7227226222	258479
Blink R	1	1	7226967743	7227226222	258479
Saccade L	1	2	7227226222	7227266097	39875	1214.22	491.55	1210.60	484.21	8.09	445.73	0.50	202.97	11037.61	-10962.87	10307.25
Saccade R	1	2	7227226222	7227266097	39875	1214.22	491.55	1210.60	484.21	8.09	445.73	0.50	202.97	11037.61	-10962.87	10307.25
Fixation L	1	3	7227266097	7227405351	139254	1210.33	486.00	7	14	-1	13.73	13.73
Fixation R	1	3	7227266097	7227405351	139254	1210.33	486.00	7	14	-1	11.80	11.80
Saccade L	1	3	7227405351	7227445091	39740	1208.41	493.70	1212.05	487.76	2.44	146.53	0.50	61.52	3633.58	-3406.09	3477.56
Saccade R	1	3	7227405351	7227445091	39740	1208.41	493.70	1212.05	487.76	2.44	146.53	0.50	61.52	3633.58	-3406.09	3477.56
Fixation L	1	4	7227445091	7227882690	437599	1196.64	500.87	35	27	-1	12.90	12.90
Fixation R	1	4	7227445091	7227882690	437599	1196.64	500.87	35	27	-1	12.51	12.51
Saccade L	1	4	7227882690	7227902561	19871	1176.25	499.64	1084.17	498.37	0.65	93.15	1.00	32.77	1988.31	-2239.16	1488.78
Saccade R	1	4	7227882690	7227902561	19871	1176.25	499.64	1084.17	498.37	0.65	93.15	1.00	32.77	1988.31	-2239.16	1488.78
Fixation L	1	5	7227902561	7228539042	636481	1068.24	482.49	34	41	-1	13.36	13.36
Fixation R	1	5	7227902561	7228539042	636481	1068.24	482.49	34	41	-1	13.02	13.02
