[BeGaze]
Converted from:	C:\Documents and Settings\iViewX\Desktop\EXPERIMENTATIONS\Experiments\results\finaleart\S16F14542-finaleart-1.idf
Date:	27.03.2019 15:47:11
Version:	BeGaze 2.5.77
Sample Rate:	50
Subject:	S16F14542
Description:	Diane Dewez

Table Header for Fixations:
Event Type	Trial	Number	Start	End	Duration	Location X	Location Y	Dispersion X	Dispersion Y	Plane	Avg. Pupil Size X	Avg. Pupil Size Y

Table Header for Saccades:
Event Type	Trial	Number	Start	End	Duration	Start Loc.X	Start Loc.Y	End Loc.X	End Loc.Y	Amplitude	Peak Speed	Peak Speed At	Average Speed	Peak Accel.	Peak Decel.	Average Accel.

Table Header for Blinks:
Event Type	Trial	Number	Start	End	Duration

Table Header for User Events:
Event Type	Trial	Number	Start	Description

UserEvent	1	1	7021292245	# Message: still-life-fruits-on-a-table_manet_1864.jpg
Saccade L	1	1	7021307658	7021327522	19864	817.50	669.10	952.50	619.17	1.15	145.58	1.00	57.89	701.84	-3115.63	1272.49
Saccade R	1	1	7021307658	7021327522	19864	817.50	669.10	952.50	619.17	1.15	145.58	1.00	57.89	701.84	-3115.63	1272.49
Fixation L	1	1	7021327522	7021963994	636472	952.02	585.73	11	55	-1	14.29	14.29
Fixation R	1	1	7021327522	7021963994	636472	952.02	585.73	11	55	-1	14.30	14.30
Saccade L	1	2	7021963994	7022003872	39878	953.89	563.77	776.92	561.81	1.60	138.88	1.00	40.14	3321.76	-3444.46	2208.74
Saccade R	1	2	7021963994	7022003872	39878	953.89	563.77	776.92	561.81	1.60	138.88	1.00	40.14	3321.76	-3444.46	2208.74
Fixation L	1	2	7022003872	7022202735	198863	771.11	550.26	7	24	-1	13.13	13.13
Fixation R	1	2	7022003872	7022202735	198863	771.11	550.26	7	24	-1	13.00	13.00
Saccade L	1	3	7022202735	7022282360	79625	769.63	546.89	1416.58	852.22	8.89	281.08	0.50	111.68	6902.64	-5680.12	4209.09
Saccade R	1	3	7022202735	7022282360	79625	769.63	546.89	1416.58	852.22	8.89	281.08	0.50	111.68	6902.64	-5680.12	4209.09
Fixation L	1	3	7022282360	7022640333	357973	1435.79	860.27	33	20	-1	13.62	13.62
Fixation R	1	3	7022282360	7022640333	357973	1435.79	860.27	33	20	-1	12.99	12.99
Saccade L	1	4	7022640333	7022660217	19884	1430.01	862.25	1534.06	1064.58	1.42	230.04	1.00	71.40	5640.85	-5381.23	4050.06
Saccade R	1	4	7022640333	7022660217	19884	1430.01	862.25	1534.06	1064.58	1.42	230.04	1.00	71.40	5640.85	-5381.23	4050.06
Fixation L	1	4	7022660217	7022759722	99505	1569.14	1098.70	50	45	-1	13.49	13.49
Fixation R	1	4	7022660217	7022759722	99505	1569.14	1098.70	50	45	-1	12.16	12.16
Saccade L	1	5	7022759722	7022779584	19862	1584.95	1102.19	1589.48	1098.95	0.13	11.03	0.00	6.34	67.78	-131.06	74.52
Saccade R	1	5	7022759722	7022779584	19862	1584.95	1102.19	1589.48	1098.95	0.13	11.03	0.00	6.34	67.78	-131.06	74.52
Fixation L	1	5	7022779584	7022998324	218740	1604.95	1099.00	22	8	-1	13.37	13.37
Fixation R	1	5	7022779584	7022998324	218740	1604.95	1099.00	22	8	-1	12.12	12.12
Saccade L	1	6	7022998324	7023077942	79618	1611.92	1101.29	762.56	829.87	10.69	296.64	0.50	134.27	7374.23	-6929.77	4805.00
Saccade R	1	6	7022998324	7023077942	79618	1611.92	1101.29	762.56	829.87	10.69	296.64	0.50	134.27	7374.23	-6929.77	4805.00
Fixation L	1	6	7023077942	7023336424	258482	747.10	824.93	31	11	-1	12.79	12.79
Fixation R	1	6	7023077942	7023336424	258482	747.10	824.93	31	11	-1	12.64	12.64
Saccade L	1	7	7023336424	7023376305	39881	731.50	823.31	388.62	820.26	2.85	200.74	0.50	71.41	4983.22	-4885.64	4229.21
Saccade R	1	7	7023336424	7023376305	39881	731.50	823.31	388.62	820.26	2.85	200.74	0.50	71.41	4983.22	-4885.64	4229.21
Fixation L	1	7	7023376305	7023614915	238610	387.86	816.44	8	13	-1	12.65	12.65
Fixation R	1	7	7023376305	7023614915	238610	387.86	816.44	8	13	-1	12.63	12.63
Saccade L	1	8	7023614915	7023654663	39748	387.49	808.84	653.36	489.87	3.46	264.54	0.50	87.16	6590.29	-6407.05	5108.26
Saccade R	1	8	7023614915	7023654663	39748	387.49	808.84	653.36	489.87	3.46	264.54	0.50	87.16	6590.29	-6407.05	5108.26
Fixation L	1	8	7023654663	7023953032	298369	664.32	484.72	24	72	-1	13.28	13.28
Fixation R	1	8	7023654663	7023953032	298369	664.32	484.72	24	72	-1	12.97	12.97
Saccade L	1	9	7023953032	7023972900	19868	672.49	440.22	671.75	404.55	0.40	36.10	1.00	19.99	566.13	-562.97	552.38
Saccade R	1	9	7023953032	7023972900	19868	672.49	440.22	671.75	404.55	0.40	36.10	1.00	19.99	566.13	-562.97	552.38
Fixation L	1	9	7023972900	7024132016	159116	675.37	406.78	6	24	-1	13.29	13.29
Fixation R	1	9	7023972900	7024132016	159116	675.37	406.78	6	24	-1	13.30	13.30
Blink L	1	1	7024132016	7024311130	179114
Blink R	1	1	7024132016	7024311130	179114
Fixation L	1	10	7024311130	7024629362	318232	1362.87	285.96	43	43	-1	14.39	14.39
Fixation R	1	10	7024311130	7024629362	318232	1362.87	285.96	43	43	-1	14.23	14.23
Saccade L	1	10	7024629362	7024649241	19879	1388.74	299.41	1401.46	367.51	0.67	70.08	1.00	33.72	1221.81	-1401.73	1162.32
Saccade R	1	10	7024629362	7024649241	19879	1388.74	299.41	1401.46	367.51	0.67	70.08	1.00	33.72	1221.81	-1401.73	1162.32
Fixation L	1	11	7024649241	7024947603	298362	1420.02	392.30	41	39	-1	14.62	14.62
Fixation R	1	11	7024649241	7024947603	298362	1420.02	392.30	41	39	-1	14.54	14.54
Saccade L	1	11	7024947603	7025007222	59619	1441.22	402.44	964.02	444.44	5.08	222.73	0.67	85.18	5496.11	-5259.87	4118.99
Saccade R	1	11	7024947603	7025007222	59619	1441.22	402.44	964.02	444.44	5.08	222.73	0.67	85.18	5496.11	-5259.87	4118.99
Fixation L	1	12	7025007222	7025285707	278485	938.02	465.06	34	61	-1	14.95	14.95
Fixation R	1	12	7025007222	7025285707	278485	938.02	465.06	34	61	-1	14.94	14.94
