[BeGaze]
Converted from:	C:\Documents and Settings\iViewX\Desktop\EXPERIMENTATIONS\Experiments\results\finaleart\S12H22222-finaleart-1.idf
Date:	27.03.2019 15:40:52
Version:	BeGaze 2.5.77
Sample Rate:	50
Subject:	S12H22222
Description:	aurele barriere

Table Header for Fixations:
Event Type	Trial	Number	Start	End	Duration	Location X	Location Y	Dispersion X	Dispersion Y	Plane	Avg. Pupil Size X	Avg. Pupil Size Y

Table Header for Saccades:
Event Type	Trial	Number	Start	End	Duration	Start Loc.X	Start Loc.Y	End Loc.X	End Loc.Y	Amplitude	Peak Speed	Peak Speed At	Average Speed	Peak Accel.	Peak Decel.	Average Accel.

Table Header for Blinks:
Event Type	Trial	Number	Start	End	Duration

Table Header for User Events:
Event Type	Trial	Number	Start	Description

UserEvent	1	1	23873509971	# Message: L-Heure_Embrasee_Rysselberghe_1897.jpg
Fixation L	1	1	23873521039	23873958659	437620	981.91	500.61	53	34	-1	13.99	13.99
Fixation R	1	1	23873521039	23873958659	437620	981.91	500.61	53	34	-1	13.45	13.45
Saccade L	1	1	23873958659	23873978512	19853	968.46	522.42	891.90	520.65	0.59	77.47	1.00	29.82	1746.38	-1901.95	1357.48
Saccade R	1	1	23873958659	23873978512	19853	968.46	522.42	891.90	520.65	0.59	77.47	1.00	29.82	1746.38	-1901.95	1357.48
Fixation L	1	2	23873978512	23874117764	139252	903.83	519.90	25	6	-1	12.92	12.92
Fixation R	1	2	23873978512	23874117764	139252	903.83	519.90	25	6	-1	12.38	12.38
Saccade L	1	2	23874117764	23874157495	39731	895.86	516.42	545.63	410.76	3.15	224.20	0.50	79.25	5493.47	-5338.08	4448.75
Saccade R	1	2	23874117764	23874157495	39731	895.86	516.42	545.63	410.76	3.15	224.20	0.50	79.25	5493.47	-5338.08	4448.75
Fixation L	1	3	23874157495	23874555354	397859	523.66	407.55	39	48	-1	9.91	9.91
Fixation R	1	3	23874157495	23874555354	397859	523.66	407.55	39	48	-1	9.74	9.74
Saccade L	1	3	23874555354	23874575240	19886	506.23	427.71	485.64	420.95	0.52	57.61	1.00	26.10	1257.94	-483.73	616.83
Saccade R	1	3	23874555354	23874575240	19886	506.23	427.71	485.64	420.95	0.52	57.61	1.00	26.10	1257.94	-483.73	616.83
Fixation L	1	4	23874575240	23874754220	178980	433.43	429.59	61	17	-1	9.73	9.73
Fixation R	1	4	23874575240	23874754220	178980	433.43	429.59	61	17	-1	9.50	9.50
Saccade L	1	4	23874754220	23874774094	19874	436.24	424.15	441.32	393.93	0.55	59.90	1.00	27.48	1112.55	-597.33	798.31
Saccade R	1	4	23874754220	23874774094	19874	436.24	424.15	441.32	393.93	0.55	59.90	1.00	27.48	1112.55	-597.33	798.31
Fixation L	1	5	23874774094	23875012840	238746	491.52	401.57	59	35	-1	10.00	10.00
Fixation R	1	5	23874774094	23875012840	238746	491.52	401.57	59	35	-1	9.98	9.98
Saccade L	1	5	23875012840	23875092335	79495	494.36	386.68	1403.98	298.31	10.82	385.60	0.50	136.15	9482.83	-8749.10	6118.34
Saccade R	1	5	23875012840	23875092335	79495	494.36	386.68	1403.98	298.31	10.82	385.60	0.50	136.15	9482.83	-8749.10	6118.34
Fixation L	1	6	23875092335	23875331095	238760	1404.80	303.43	5	12	-1	10.30	10.30
Fixation R	1	6	23875092335	23875331095	238760	1404.80	303.43	5	12	-1	10.27	10.27
Saccade L	1	6	23875331095	23875370832	39737	1404.37	305.72	1060.56	627.18	4.19	258.11	1.00	105.48	6413.23	-6198.30	5705.96
Saccade R	1	6	23875331095	23875370832	39737	1404.37	305.72	1060.56	627.18	4.19	258.11	1.00	105.48	6413.23	-6198.30	5705.96
Fixation L	1	7	23875370832	23875589556	218724	1041.37	659.24	24	39	-1	10.83	10.83
Fixation R	1	7	23875370832	23875589556	218724	1041.37	659.24	24	39	-1	10.86	10.86
Saccade L	1	7	23875589556	23875609440	19884	1036.00	659.93	1197.38	685.97	0.89	165.32	1.00	44.66	4100.27	-4015.87	2783.96
Saccade R	1	7	23875589556	23875609440	19884	1036.00	659.93	1197.38	685.97	0.89	165.32	1.00	44.66	4100.27	-4015.87	2783.96
Fixation L	1	8	23875609440	23875788429	178989	1208.12	701.94	16	32	-1	11.04	11.04
Fixation R	1	8	23875609440	23875788429	178989	1208.12	701.94	16	32	-1	11.10	11.10
Saccade L	1	8	23875788429	23875828308	39879	1213.64	712.30	1497.19	632.31	2.59	152.61	1.00	64.83	3748.37	-3578.02	3522.43
Saccade R	1	8	23875788429	23875828308	39879	1213.64	712.30	1497.19	632.31	2.59	152.61	1.00	64.83	3748.37	-3578.02	3522.43
Fixation L	1	9	23875828308	23876285779	457471	1464.61	654.16	45	40	-1	10.90	10.90
Fixation R	1	9	23875828308	23876285779	457471	1464.61	654.16	45	40	-1	10.61	10.61
Saccade L	1	9	23876285779	23876365282	79503	1455.78	657.72	1570.83	331.37	4.49	132.96	1.00	56.44	2259.15	-3107.18	1754.77
Saccade R	1	9	23876285779	23876365282	79503	1455.78	657.72	1570.83	331.37	4.49	132.96	1.00	56.44	2259.15	-3107.18	1754.77
Fixation L	1	10	23876365282	23877001752	636470	1584.22	312.57	22	44	-1	10.68	10.68
Fixation R	1	10	23876365282	23877001752	636470	1584.22	312.57	22	44	-1	10.65	10.65
Saccade L	1	10	23877001752	23877021625	19873	1569.78	316.72	1351.20	354.06	1.22	224.21	1.00	61.24	5595.96	-5057.06	3591.04
Saccade R	1	10	23877001752	23877021625	19873	1569.78	316.72	1351.20	354.06	1.22	224.21	1.00	61.24	5595.96	-5057.06	3591.04
Fixation L	1	11	23877021625	23877359864	338239	1370.79	314.86	28	52	-1	11.47	11.47
Fixation R	1	11	23877021625	23877359864	338239	1370.79	314.86	28	52	-1	11.26	11.26
Saccade L	1	11	23877359864	23877498983	139119	1379.35	302.50	1068.19	507.43	6.58	205.74	0.29	47.27	5106.99	-4667.62	1923.37
Saccade R	1	11	23877359864	23877498983	139119	1379.35	302.50	1068.19	507.43	6.58	205.74	0.29	47.27	5106.99	-4667.62	1923.37
