[BeGaze]
Converted from:	C:\Documents and Settings\iViewX\Desktop\EXPERIMENTATIONS\Experiments\results\finaleart\S14F27123-finaleart-1.idf
Date:	27.03.2019 15:43:23
Version:	BeGaze 2.5.77
Sample Rate:	50
Subject:	S14F27123
Description:	Anne-flore Perrin

Table Header for Fixations:
Event Type	Trial	Number	Start	End	Duration	Location X	Location Y	Dispersion X	Dispersion Y	Plane	Avg. Pupil Size X	Avg. Pupil Size Y

Table Header for Saccades:
Event Type	Trial	Number	Start	End	Duration	Start Loc.X	Start Loc.Y	End Loc.X	End Loc.Y	Amplitude	Peak Speed	Peak Speed At	Average Speed	Peak Accel.	Peak Decel.	Average Accel.

Table Header for Blinks:
Event Type	Trial	Number	Start	End	Duration

Table Header for User Events:
Event Type	Trial	Number	Start	Description

UserEvent	1	1	30929138862	# Message: manet-the-salmon-1868.jpg
Fixation L	1	1	30929142406	30929599888	457482	763.11	682.43	13	30	-1	12.48	12.48
Fixation R	1	1	30929142406	30929599888	457482	763.11	682.43	13	30	-1	12.72	12.72
Saccade L	1	1	30929599888	30929619761	19873	765.31	691.33	863.87	535.47	1.30	186.49	1.00	65.48	4562.02	-3853.51	3361.92
Saccade R	1	1	30929599888	30929619761	19873	765.31	691.33	863.87	535.47	1.30	186.49	1.00	65.48	4562.02	-3853.51	3361.92
Fixation L	1	2	30929619761	30929798743	178982	884.17	561.47	31	67	-1	11.29	11.29
Fixation R	1	2	30929619761	30929798743	178982	884.17	561.47	31	67	-1	11.72	11.72
Saccade L	1	2	30929798743	30929818611	19868	887.50	539.74	1066.62	529.87	1.08	181.41	1.00	54.56	3956.81	-4199.29	2750.95
Saccade R	1	2	30929798743	30929818611	19868	887.50	539.74	1066.62	529.87	1.08	181.41	1.00	54.56	3956.81	-4199.29	2750.95
Fixation L	1	3	30929818611	30930116985	298374	1066.51	513.11	3	36	-1	10.07	10.07
Fixation R	1	3	30929818611	30930116985	298374	1066.51	513.11	3	36	-1	10.36	10.36
Saccade L	1	3	30930116985	30930136852	19867	1065.49	515.01	883.56	520.34	1.11	184.06	1.00	56.05	4493.16	-4376.01	3180.59
Saccade R	1	3	30930116985	30930136852	19867	1065.49	515.01	883.56	520.34	1.11	184.06	1.00	56.05	4493.16	-4376.01	3180.59
Fixation L	1	4	30930136852	30930335855	199003	868.33	560.87	21	68	-1	11.08	11.08
Fixation R	1	4	30930136852	30930335855	199003	868.33	560.87	21	68	-1	11.41	11.41
Saccade L	1	4	30930335855	30930375602	39747	874.53	578.01	1371.52	459.71	4.32	337.34	0.50	108.78	8386.75	-8162.75	6233.33
Saccade R	1	4	30930335855	30930375602	39747	874.53	578.01	1371.52	459.71	4.32	337.34	0.50	108.78	8386.75	-8162.75	6233.33
Fixation L	1	5	30930375602	30930654083	278481	1381.55	458.86	36	22	-1	11.80	11.80
Fixation R	1	5	30930375602	30930654083	278481	1381.55	458.86	36	22	-1	12.01	12.01
Saccade L	1	5	30930654083	30930673955	19872	1407.38	467.71	1399.60	563.98	0.69	97.69	1.00	34.87	2298.28	-2142.70	1494.27
Saccade R	1	5	30930654083	30930673955	19872	1407.38	467.71	1399.60	563.98	0.69	97.69	1.00	34.87	2298.28	-2142.70	1494.27
Fixation L	1	6	30930673955	30930793324	119369	1409.65	557.52	16	17	-1	11.66	11.66
Fixation R	1	6	30930673955	30930793324	119369	1409.65	557.52	16	17	-1	11.55	11.55
Saccade L	1	6	30930793324	30930813201	19877	1411.93	564.59	1244.46	454.17	1.32	202.84	1.00	66.66	4893.04	-4823.70	3659.25
Saccade R	1	6	30930793324	30930813201	19877	1411.93	564.59	1244.46	454.17	1.32	202.84	1.00	66.66	4893.04	-4823.70	3659.25
Fixation L	1	7	30930813201	30930992189	178988	1183.09	440.90	76	18	-1	11.87	11.87
Fixation R	1	7	30930813201	30930992189	178988	1183.09	440.90	76	18	-1	11.69	11.69
Saccade L	1	7	30930992189	30931031946	39757	1170.19	443.97	1149.48	390.86	0.60	56.56	1.00	15.00	1356.83	-961.71	638.53
Saccade R	1	7	30930992189	30931031946	39757	1170.19	443.97	1149.48	390.86	0.60	56.56	1.00	15.00	1356.83	-961.71	638.53
Fixation L	1	8	30931031946	30931151308	119362	1142.64	370.92	12	37	-1	11.82	11.82
Fixation R	1	8	30931031946	30931151308	119362	1142.64	370.92	12	37	-1	11.34	11.34
Saccade L	1	8	30931151308	30931210932	59624	1137.25	353.09	517.47	498.87	6.87	388.59	0.67	115.26	9581.79	-9386.86	5153.21
Saccade R	1	8	30931151308	30931210932	59624	1137.25	353.09	517.47	498.87	6.87	388.59	0.67	115.26	9581.79	-9386.86	5153.21
Fixation L	1	9	30931210932	30931370054	159122	536.54	518.95	28	30	-1	11.95	11.95
Fixation R	1	9	30931210932	30931370054	159122	536.54	518.95	28	30	-1	11.91	11.91
Saccade L	1	9	30931370054	30931409929	39875	539.15	524.76	407.59	837.90	3.02	202.48	1.00	75.82	4985.82	-4423.00	4171.18
Saccade R	1	9	30931370054	30931409929	39875	539.15	524.76	407.59	837.90	3.02	202.48	1.00	75.82	4985.82	-4423.00	4171.18
Fixation L	1	10	30931409929	30931688288	278359	415.35	852.44	16	74	-1	12.20	12.20
Fixation R	1	10	30931409929	30931688288	278359	415.35	852.44	16	74	-1	12.83	12.83
Saccade L	1	10	30931688288	30931708157	19869	413.44	902.40	413.54	983.59	0.78	82.12	1.00	39.15	1811.68	-1938.35	1580.81
Saccade R	1	10	30931688288	30931708157	19869	413.44	902.40	413.54	983.59	0.78	82.12	1.00	39.15	1811.68	-1938.35	1580.81
Fixation L	1	11	30931708157	30931807650	99493	398.95	986.89	21	4	-1	11.94	11.94
Fixation R	1	11	30931708157	30931807650	99493	398.95	986.89	21	4	-1	12.77	12.77
Blink L	1	1	30931807650	30932026394	218744
Blink R	1	1	30931807650	30932026394	218744
Blink L	1	2	30932046413	30932444128	397715
Blink R	1	2	30932046413	30932444128	397715
Fixation L	1	12	30932444128	30932623120	178992	1305.24	267.32	17	19	-1	12.20	12.20
Fixation R	1	12	30932444128	30932623120	178992	1305.24	267.32	17	19	-1	12.21	12.21
Saccade L	1	11	30932623120	30932642994	19874	1304.80	254.93	1291.43	177.18	0.64	79.80	1.00	32.00	1877.74	-1661.32	1337.39
Saccade R	1	11	30932623120	30932642994	19874	1304.80	254.93	1291.43	177.18	0.64	79.80	1.00	32.00	1877.74	-1661.32	1337.39
Fixation L	1	13	30932642994	30932822115	179121	1276.68	201.15	35	42	-1	12.54	12.54
Fixation R	1	13	30932642994	30932822115	179121	1276.68	201.15	35	42	-1	12.57	12.57
Saccade L	1	12	30932822115	30932861864	39749	1258.69	195.18	662.76	272.67	5.02	384.05	0.50	126.41	9501.19	-9333.18	7345.39
Saccade R	1	12	30932822115	30932861864	39749	1258.69	195.18	662.76	272.67	5.02	384.05	0.50	126.41	9501.19	-9333.18	7345.39
Fixation L	1	14	30932861864	30933140352	278488	659.82	266.73	8	15	-1	13.39	13.39
Fixation R	1	14	30932861864	30933140352	278488	659.82	266.73	8	15	-1	13.92	13.92
