[BeGaze]
Converted from:	C:\Documents and Settings\iViewX\Desktop\EXPERIMENTATIONS\Experiments\results\finaleart\S14F27123-finaleart-1.idf
Date:	27.03.2019 15:43:33
Version:	BeGaze 2.5.77
Sample Rate:	50
Subject:	S14F27123
Description:	Anne-flore Perrin

Table Header for Fixations:
Event Type	Trial	Number	Start	End	Duration	Location X	Location Y	Dispersion X	Dispersion Y	Plane	Avg. Pupil Size X	Avg. Pupil Size Y

Table Header for Saccades:
Event Type	Trial	Number	Start	End	Duration	Start Loc.X	Start Loc.Y	End Loc.X	End Loc.Y	Amplitude	Peak Speed	Peak Speed At	Average Speed	Peak Accel.	Peak Decel.	Average Accel.

Table Header for Blinks:
Event Type	Trial	Number	Start	End	Duration

Table Header for User Events:
Event Type	Trial	Number	Start	Description

UserEvent	1	1	31286462497	# Message: delacroix-Reclining-Odalisque-or-Woman-with-a-Parakeet-1827.jpg
Fixation L	1	1	31286474654	31286872502	397848	393.01	575.65	15	15	-1	13.09	13.09
Fixation R	1	1	31286474654	31286872502	397848	393.01	575.65	15	15	-1	13.61	13.61
Saccade L	1	1	31286872502	31286912232	39730	385.39	570.94	710.32	657.76	3.01	241.70	1.00	75.73	5990.83	-5359.71	3928.69
Saccade R	1	1	31286872502	31286912232	39730	385.39	570.94	710.32	657.76	3.01	241.70	1.00	75.73	5990.83	-5359.71	3928.69
Fixation L	1	2	31286912232	31287170850	258618	707.65	630.26	29	46	-1	12.85	12.85
Fixation R	1	2	31286912232	31287170850	258618	707.65	630.26	29	46	-1	13.55	13.55
Saccade L	1	2	31287170850	31287190720	19870	685.42	624.93	402.07	626.01	1.78	286.41	1.00	89.81	6998.86	-6893.91	4719.10
Saccade R	1	2	31287170850	31287190720	19870	685.42	624.93	402.07	626.01	1.78	286.41	1.00	89.81	6998.86	-6893.91	4719.10
Fixation L	1	3	31287190720	31287389595	198875	361.84	644.00	48	30	-1	12.10	12.10
Fixation R	1	3	31287190720	31287389595	198875	361.84	644.00	48	30	-1	12.33	12.33
Saccade L	1	3	31287389595	31287409485	19890	354.00	655.62	350.81	543.97	0.63	112.98	1.00	31.65	2751.68	-2583.45	1843.55
Saccade R	1	3	31287389595	31287409485	19890	354.00	655.62	350.81	543.97	0.63	112.98	1.00	31.65	2751.68	-2583.45	1843.55
Fixation L	1	4	31287409485	31287568578	159093	341.55	538.95	43	19	-1	12.27	12.27
Fixation R	1	4	31287409485	31287568578	159093	341.55	538.95	43	19	-1	12.57	12.57
Saccade L	1	4	31287568578	31287588480	19902	363.85	528.60	517.11	412.65	1.18	194.34	1.00	59.41	4783.13	-4546.63	3344.51
Saccade R	1	4	31287568578	31287588480	19902	363.85	528.60	517.11	412.65	1.18	194.34	1.00	59.41	4783.13	-4546.63	3344.51
Fixation L	1	5	31287588480	31287727700	139220	523.63	393.42	11	34	-1	11.46	11.46
Fixation R	1	5	31287588480	31287727700	139220	523.63	393.42	11	34	-1	12.33	12.33
Saccade L	1	5	31287727700	31287767454	39754	523.35	381.10	843.52	380.63	2.78	190.33	1.00	69.83	4629.93	-4692.18	3872.62
Saccade R	1	5	31287727700	31287767454	39754	523.35	381.10	843.52	380.63	2.78	190.33	1.00	69.83	4629.93	-4692.18	3872.62
Fixation L	1	6	31287767454	31287926567	159113	833.73	372.73	14	14	-1	11.70	11.70
Fixation R	1	6	31287767454	31287926567	159113	833.73	372.73	14	14	-1	12.63	12.63
Saccade L	1	6	31287926567	31287966441	39874	830.72	366.51	1288.16	295.43	3.86	248.08	0.50	96.72	6158.81	-5988.19	5460.94
Saccade R	1	6	31287926567	31287966441	39874	830.72	366.51	1288.16	295.43	3.86	248.08	0.50	96.72	6158.81	-5988.19	5460.94
Fixation L	1	7	31287966441	31288105683	139242	1292.84	298.28	11	69	-1	12.03	12.03
Fixation R	1	7	31287966441	31288105683	139242	1292.84	298.28	11	69	-1	12.50	12.50
Saccade L	1	7	31288105683	31288145431	39748	1291.14	314.27	1439.09	277.37	1.61	113.53	1.00	40.43	2152.49	-2770.63	1741.56
Saccade R	1	7	31288105683	31288145431	39748	1291.14	314.27	1439.09	277.37	1.61	113.53	1.00	40.43	2152.49	-2770.63	1741.56
Fixation L	1	8	31288145431	31288483541	338110	1428.93	264.26	33	28	-1	12.27	12.27
Fixation R	1	8	31288145431	31288483541	338110	1428.93	264.26	33	28	-1	12.75	12.75
Saccade L	1	8	31288483541	31288523288	39747	1410.34	272.24	1319.08	383.40	1.47	93.27	0.50	36.91	2239.94	-1749.59	1585.72
Saccade R	1	8	31288483541	31288523288	39747	1410.34	272.24	1319.08	383.40	1.47	93.27	0.50	36.91	2239.94	-1749.59	1585.72
Fixation L	1	9	31288523288	31288762023	238735	1316.23	375.69	15	49	-1	13.16	13.16
Fixation R	1	9	31288523288	31288762023	238735	1316.23	375.69	15	49	-1	13.26	13.26
Saccade L	1	9	31288762023	31288781913	19890	1319.72	374.68	1437.51	506.92	1.29	179.09	1.00	64.86	4289.83	-4315.57	3385.48
Saccade R	1	9	31288762023	31288781913	19890	1319.72	374.68	1437.51	506.92	1.29	179.09	1.00	64.86	4289.83	-4315.57	3385.48
Fixation L	1	10	31288781913	31288941027	159114	1433.36	572.71	8	88	-1	13.83	13.83
Fixation R	1	10	31288781913	31288941027	159114	1433.36	572.71	8	88	-1	13.77	13.77
Saccade L	1	10	31288941027	31288960894	19867	1431.60	595.32	1430.82	601.69	0.12	6.81	1.00	6.05	56.65	-56.68	39.02
Saccade R	1	10	31288941027	31288960894	19867	1431.60	595.32	1430.82	601.69	0.12	6.81	1.00	6.05	56.65	-56.68	39.02
Fixation L	1	11	31288960894	31289179634	218740	1431.43	594.77	4	16	-1	13.45	13.45
Fixation R	1	11	31288960894	31289179634	218740	1431.43	594.77	4	16	-1	13.23	13.23
Saccade L	1	11	31289179634	31289219510	39876	1430.18	585.11	1497.39	857.03	2.63	157.55	1.00	65.93	3789.49	-3744.45	3238.82
Saccade R	1	11	31289179634	31289219510	39876	1430.18	585.11	1497.39	857.03	2.63	157.55	1.00	65.93	3789.49	-3744.45	3238.82
Fixation L	1	12	31289219510	31289358756	139246	1486.52	838.10	55	36	-1	13.47	13.47
Fixation R	1	12	31289219510	31289358756	139246	1486.52	838.10	55	36	-1	13.17	13.17
Saccade L	1	12	31289358756	31289398512	39756	1442.51	841.04	1244.29	533.04	3.80	264.62	0.50	95.60	6442.42	-6112.93	4407.46
Saccade R	1	12	31289358756	31289398512	39756	1442.51	841.04	1244.29	533.04	3.80	264.62	0.50	95.60	6442.42	-6112.93	4407.46
Fixation L	1	13	31289398512	31289637131	238619	1222.08	523.82	55	21	-1	13.59	13.59
Fixation R	1	13	31289398512	31289637131	238619	1222.08	523.82	55	21	-1	13.48	13.48
Saccade L	1	13	31289637131	31289657123	19992	1188.31	527.41	1003.75	654.50	1.35	226.56	1.00	67.61	5605.66	-5615.72	3891.68
Saccade R	1	13	31289637131	31289657123	19992	1188.31	527.41	1003.75	654.50	1.35	226.56	1.00	67.61	5605.66	-5615.72	3891.68
Fixation L	1	14	31289657123	31289836106	178983	997.26	646.90	47	15	-1	13.67	13.67
Fixation R	1	14	31289657123	31289836106	178983	997.26	646.90	47	15	-1	13.54	13.54
Saccade L	1	14	31289836106	31289855989	19883	957.04	657.91	630.96	800.19	2.17	359.43	1.00	109.28	8806.12	-8729.44	6061.90
Saccade R	1	14	31289836106	31289855989	19883	957.04	657.91	630.96	800.19	2.17	359.43	1.00	109.28	8806.12	-8729.44	6061.90
Fixation L	1	15	31289855989	31290034979	178990	633.25	832.73	12	44	-1	13.56	13.56
Fixation R	1	15	31289855989	31290034979	178990	633.25	832.73	12	44	-1	13.73	13.73
Saccade L	1	15	31290034979	31290074729	39750	632.68	838.21	410.13	926.75	2.41	213.77	0.50	60.72	5160.46	-5138.10	3037.99
Saccade R	1	15	31290034979	31290074729	39750	632.68	838.21	410.13	926.75	2.41	213.77	0.50	60.72	5160.46	-5138.10	3037.99
Fixation L	1	16	31290074729	31290353218	278489	398.16	905.44	18	59	-1	12.48	12.48
Fixation R	1	16	31290074729	31290353218	278489	398.16	905.44	18	59	-1	13.63	13.63
Saccade L	1	16	31290353218	31290452707	99489	400.85	910.50	395.47	1007.87	1.84	52.79	0.20	18.44	980.85	-739.53	520.78
Saccade R	1	16	31290353218	31290452707	99489	400.85	910.50	395.47	1007.87	1.84	52.79	0.20	18.44	980.85	-739.53	520.78
