[BeGaze]
Converted from:	C:\Documents and Settings\iViewX\Desktop\EXPERIMENTATIONS\Experiments\results\finaleart\S21F22332-finaleart-1.idf
Date:	27.03.2019 15:55:12
Version:	BeGaze 2.5.77
Sample Rate:	50
Subject:	S21F22332
Description:	Cyrielle Mailart

Table Header for Fixations:
Event Type	Trial	Number	Start	End	Duration	Location X	Location Y	Dispersion X	Dispersion Y	Plane	Avg. Pupil Size X	Avg. Pupil Size Y

Table Header for Saccades:
Event Type	Trial	Number	Start	End	Duration	Start Loc.X	Start Loc.Y	End Loc.X	End Loc.Y	Amplitude	Peak Speed	Peak Speed At	Average Speed	Peak Accel.	Peak Decel.	Average Accel.

Table Header for Blinks:
Event Type	Trial	Number	Start	End	Duration

Table Header for User Events:
Event Type	Trial	Number	Start	Description

UserEvent	1	1	2504549677	# Message: void.jpg
Saccade L	1	1	2504556000	2504595748	39748	1241.13	602.39	869.50	369.31	5.28	298.95	1.00	132.82	7473.80	-7325.46	4477.19
Saccade R	1	1	2504556000	2504595748	39748	1241.13	602.39	869.50	369.31	5.28	298.95	1.00	132.82	7473.80	-7325.46	4477.19
Fixation L	1	1	2504595748	2504894098	298350	824.44	396.08	54	43	-1	14.84	14.84
Fixation R	1	1	2504595748	2504894098	298350	824.44	396.08	54	43	-1	14.42	14.42
Saccade L	1	2	2504894098	2504913993	19895	814.84	380.32	812.24	390.29	0.13	10.43	1.00	6.45	106.33	-169.30	128.88
Saccade R	1	2	2504894098	2504913993	19895	814.84	380.32	812.24	390.29	0.13	10.43	1.00	6.45	106.33	-169.30	128.88
Fixation L	1	2	2504913993	2505013476	99483	811.65	388.32	2	5	-1	14.53	14.53
Fixation R	1	2	2504913993	2505013476	99483	811.65	388.32	2	5	-1	14.14	14.14
Blink L	1	1	2505013476	2505411209	397733
Blink R	1	1	2505013476	2505411209	397733
Fixation L	1	3	2505411209	2505988054	576845	867.47	303.61	30	42	-1	13.14	13.14
Fixation R	1	3	2505411209	2505988054	576845	867.47	303.61	30	42	-1	12.18	12.18
Blink L	1	2	2505988054	2506167037	178983
Blink R	1	2	2505988054	2506167037	178983
Fixation L	1	4	2506167037	2506505140	338103	905.53	378.63	29	69	-1	13.42	13.42
Fixation R	1	4	2506167037	2506505140	338103	905.53	378.63	29	69	-1	12.79	12.79
Saccade L	1	3	2506505140	2506545018	39878	912.20	382.53	954.60	407.52	1.41	92.24	0.50	35.24	2246.09	0.00	1107.11
Saccade R	1	3	2506505140	2506545018	39878	912.20	382.53	954.60	407.52	1.41	92.24	0.50	35.24	2246.09	0.00	1107.11
