[BeGaze]
Converted from:	C:\Documents and Settings\iViewX\Desktop\EXPERIMENTATIONS\Experiments\results\finaleart\S22H22551-finaleart-1.idf
Date:	27.03.2019 15:56:46
Version:	BeGaze 2.5.77
Sample Rate:	50
Subject:	S22H22551
Description:	Mathieu Chambre

Table Header for Fixations:
Event Type	Trial	Number	Start	End	Duration	Location X	Location Y	Dispersion X	Dispersion Y	Plane	Avg. Pupil Size X	Avg. Pupil Size Y

Table Header for Saccades:
Event Type	Trial	Number	Start	End	Duration	Start Loc.X	Start Loc.Y	End Loc.X	End Loc.Y	Amplitude	Peak Speed	Peak Speed At	Average Speed	Peak Accel.	Peak Decel.	Average Accel.

Table Header for Blinks:
Event Type	Trial	Number	Start	End	Duration

Table Header for User Events:
Event Type	Trial	Number	Start	Description

UserEvent	1	1	4701250079	# Message: Georges-braque-still-life-with-jugs-and-pipe-1906.jpg
Fixation L	1	1	4701259588	4701736947	477359	1016.51	494.19	48	20	-1	20.77	20.77
Fixation R	1	1	4701259588	4701736947	477359	1016.51	494.19	48	20	-1	21.25	21.25
Saccade L	1	1	4701736947	4701756803	19856	1015.22	478.13	819.88	467.97	1.36	197.80	1.00	68.51	4487.76	-4708.66	3121.91
Saccade R	1	1	4701736947	4701756803	19856	1015.22	478.13	819.88	467.97	1.36	197.80	1.00	68.51	4487.76	-4708.66	3121.91
Fixation L	1	2	4701756803	4701995548	238745	789.29	457.15	36	19	-1	17.14	17.14
Fixation R	1	2	4701756803	4701995548	238745	789.29	457.15	36	19	-1	17.72	17.72
Saccade L	1	2	4701995548	4702015421	19873	783.84	452.59	782.64	564.44	0.76	113.14	1.00	38.00	2775.08	-2802.16	2148.39
Saccade R	1	2	4701995548	4702015421	19873	783.84	452.59	782.64	564.44	0.76	113.14	1.00	38.00	2775.08	-2802.16	2148.39
Fixation L	1	3	4702015421	4702174534	159113	781.65	603.55	13	85	-1	14.93	14.93
Fixation R	1	3	4702015421	4702174534	159113	781.65	603.55	13	85	-1	15.81	15.81
Saccade L	1	3	4702174534	4702214278	39744	783.29	604.70	1023.42	622.27	2.36	144.76	0.50	59.29	2467.79	-3496.40	2659.96
Saccade R	1	3	4702174534	4702214278	39744	783.29	604.70	1023.42	622.27	2.36	144.76	0.50	59.29	2467.79	-3496.40	2659.96
Fixation L	1	4	4702214278	4702433145	218867	1028.93	644.12	17	47	-1	14.86	14.86
Fixation R	1	4	4702214278	4702433145	218867	1028.93	644.12	17	47	-1	15.53	15.53
Saccade L	1	4	4702433145	4702472888	39743	1039.89	669.70	1252.29	988.64	3.72	266.86	0.50	93.55	6538.21	-6330.27	5071.81
Saccade R	1	4	4702433145	4702472888	39743	1039.89	669.70	1252.29	988.64	3.72	266.86	0.50	93.55	6538.21	-6330.27	5071.81
Fixation L	1	5	4702472888	4702810993	338105	1266.87	985.54	44	46	-1	15.35	15.35
Fixation R	1	5	4702472888	4702810993	338105	1266.87	985.54	44	46	-1	15.88	15.88
Saccade L	1	5	4702810993	4702850752	39759	1294.68	1013.55	1450.92	558.57	4.07	311.61	0.50	102.34	7614.10	-7543.17	5929.57
Saccade R	1	5	4702810993	4702850752	39759	1294.68	1013.55	1450.92	558.57	4.07	311.61	0.50	102.34	7614.10	-7543.17	5929.57
Fixation L	1	6	4702850752	4703029864	179112	1454.54	543.99	8	25	-1	15.13	15.13
Fixation R	1	6	4702850752	4703029864	179112	1454.54	543.99	8	25	-1	15.54	15.54
Saccade L	1	6	4703029864	4703069611	39747	1451.85	549.46	1419.68	269.47	2.37	187.49	0.50	59.53	4650.17	-4546.64	3467.99
Saccade R	1	6	4703029864	4703069611	39747	1451.85	549.46	1419.68	269.47	2.37	187.49	0.50	59.53	4650.17	-4546.64	3467.99
Fixation L	1	7	4703069611	4703208855	139244	1411.34	270.17	22	7	-1	15.27	15.27
Fixation R	1	7	4703069611	4703208855	139244	1411.34	270.17	22	7	-1	15.30	15.30
Saccade L	1	7	4703208855	4703248594	39739	1400.82	274.34	1057.86	271.67	3.47	223.13	1.00	87.38	5426.54	-5516.07	3757.13
Saccade R	1	7	4703208855	4703248594	39739	1400.82	274.34	1057.86	271.67	3.47	223.13	1.00	87.38	5426.54	-5516.07	3757.13
Fixation L	1	8	4703248594	4703487211	238617	989.41	268.80	80	10	-1	15.89	15.89
Fixation R	1	8	4703248594	4703487211	238617	989.41	268.80	80	10	-1	16.18	16.18
Saccade L	1	8	4703487211	4703507205	19994	983.46	264.24	861.39	411.43	1.05	193.37	1.00	52.62	4805.08	-4490.54	3197.84
Saccade R	1	8	4703487211	4703507205	19994	983.46	264.24	861.39	411.43	1.05	193.37	1.00	52.62	4805.08	-4490.54	3197.84
Fixation L	1	9	4703507205	4703765702	258497	866.92	428.61	13	27	-1	16.68	16.68
Fixation R	1	9	4703507205	4703765702	258497	866.92	428.61	13	27	-1	17.37	17.37
Blink L	1	1	4703765702	4703964685	198983
Blink R	1	1	4703765702	4703964685	198983
Fixation L	1	10	4703964685	4704103803	139118	643.12	511.47	22	60	-1	17.08	17.08
Fixation R	1	10	4703964685	4704103803	139118	643.12	511.47	22	60	-1	17.34	17.34
Saccade L	1	9	4704103803	4704123804	20001	633.87	555.49	497.97	850.80	2.10	328.50	1.00	104.86	8051.70	-7486.82	5249.22
Saccade R	1	9	4704103803	4704123804	20001	633.87	555.49	497.97	850.80	2.10	328.50	1.00	104.86	8051.70	-7486.82	5249.22
Fixation L	1	11	4704123804	4704302799	178995	505.61	909.29	12	73	-1	17.64	17.64
Fixation R	1	11	4704123804	4704302799	178995	505.61	909.29	12	73	-1	17.73	17.73
Saccade L	1	10	4704302799	4704322668	19869	508.66	924.15	400.01	1048.13	1.04	166.72	1.00	52.19	4110.52	-3546.00	2754.47
Saccade R	1	10	4704302799	4704322668	19869	508.66	924.15	400.01	1048.13	1.04	166.72	1.00	52.19	4110.52	-3546.00	2754.47
Fixation L	1	12	4704322668	4704879525	556857	409.84	1051.03	37	26	-1	16.76	16.76
Fixation R	1	12	4704322668	4704879525	556857	409.84	1051.03	37	26	-1	17.21	17.21
Saccade L	1	11	4704879525	4704998912	119387	403.99	1030.77	872.85	660.54	10.33	385.71	0.17	86.48	9500.13	-9145.42	4282.90
Saccade R	1	11	4704879525	4704998912	119387	403.99	1030.77	872.85	660.54	10.33	385.71	0.17	86.48	9500.13	-9145.42	4282.90
Fixation L	1	13	4704998912	4705098383	99471	903.41	660.84	92	7	-1	16.34	16.34
Fixation R	1	13	4704998912	4705098383	99471	903.41	660.84	92	7	-1	16.84	16.84
Saccade L	1	12	4705098383	4705237620	139237	946.22	659.74	1106.27	465.17	4.61	217.74	0.57	33.12	5375.40	-5328.69	1640.32
Saccade R	1	12	4705098383	4705237620	139237	946.22	659.74	1106.27	465.17	4.61	217.74	0.57	33.12	5375.40	-5328.69	1640.32
