[BeGaze]
Converted from:	C:\Documents and Settings\iViewX\Desktop\EXPERIMENTATIONS\Experiments\results\finaleart\S02123220-finaleart-1.idf
Date:	27.03.2019 15:33:40
Version:	BeGaze 2.5.77
Sample Rate:	50
Subject:	S02123220
Description:	David Xu

Table Header for Fixations:
Event Type	Trial	Number	Start	End	Duration	Location X	Location Y	Dispersion X	Dispersion Y	Plane	Avg. Pupil Size X	Avg. Pupil Size Y

Table Header for Saccades:
Event Type	Trial	Number	Start	End	Duration	Start Loc.X	Start Loc.Y	End Loc.X	End Loc.Y	Amplitude	Peak Speed	Peak Speed At	Average Speed	Peak Accel.	Peak Decel.	Average Accel.

Table Header for Blinks:
Event Type	Trial	Number	Start	End	Duration

Table Header for User Events:
Event Type	Trial	Number	Start	Description

UserEvent	1	1	1524764303	# Message: void.jpg
Fixation L	1	1	1524773080	1524912310	139230	1102.43	904.68	37	55	-1	14.53	14.53
Fixation R	1	1	1524773080	1524912310	139230	1102.43	904.68	37	55	-1	11.05	11.05
Saccade L	1	1	1524912310	1525071440	159130	1126.01	937.25	1216.30	439.20	9.14	274.99	0.88	57.43	6752.73	-6386.22	1946.21
Saccade R	1	1	1524912310	1525071440	159130	1126.01	937.25	1216.30	439.20	9.14	274.99	0.88	57.43	6752.73	-6386.22	1946.21
Fixation L	1	2	1525071440	1525369788	298348	1203.42	405.90	41	49	-1	13.46	13.46
Fixation R	1	2	1525071440	1525369788	298348	1203.42	405.90	41	49	-1	13.29	13.29
Saccade L	1	2	1525369788	1525389665	19877	1221.91	389.82	1223.65	379.76	0.24	15.41	0.00	12.08	42.95	-152.36	77.09
Saccade R	1	2	1525369788	1525389665	19877	1221.91	389.82	1223.65	379.76	0.24	15.41	0.00	12.08	42.95	-152.36	77.09
Fixation L	1	3	1525389665	1525509048	119383	1227.46	393.03	6	20	-1	11.43	11.43
Fixation R	1	3	1525389665	1525509048	119383	1227.46	393.03	6	20	-1	11.35	11.35
Saccade L	1	3	1525509048	1525528910	19862	1225.17	385.21	1099.50	399.07	0.87	127.88	1.00	43.59	3100.42	-2850.06	2139.44
Saccade R	1	3	1525509048	1525528910	19862	1225.17	385.21	1099.50	399.07	0.87	127.88	1.00	43.59	3100.42	-2850.06	2139.44
Fixation L	1	4	1525528910	1525847127	318217	1074.91	413.55	43	53	-1	11.40	11.40
Fixation R	1	4	1525528910	1525847127	318217	1074.91	413.55	43	53	-1	11.30	11.30
Saccade L	1	4	1525847127	1525867012	19885	1066.77	447.54	1064.31	451.93	0.14	12.77	0.00	7.09	-51.67	-236.02	129.97
Saccade R	1	4	1525847127	1525867012	19885	1066.77	447.54	1064.31	451.93	0.14	12.77	0.00	7.09	-51.67	-236.02	129.97
Fixation L	1	5	1525867012	1526304609	437597	1061.08	465.97	39	36	-1	13.05	13.05
Fixation R	1	5	1525867012	1526304609	437597	1061.08	465.97	39	36	-1	12.88	12.88
Saccade L	1	5	1526304609	1526324481	19872	1029.45	487.96	1007.06	492.69	0.39	27.02	0.00	19.79	92.02	-437.39	240.72
Saccade R	1	5	1526304609	1526324481	19872	1029.45	487.96	1007.06	492.69	0.39	27.02	0.00	19.79	92.02	-437.39	240.72
Fixation L	1	6	1526324481	1526762086	437605	1001.15	496.05	21	16	-1	13.84	13.84
Fixation R	1	6	1526324481	1526762086	437605	1001.15	496.05	21	16	-1	13.57	13.57
