[BeGaze]
Converted from:	C:\Documents and Settings\iViewX\Desktop\EXPERIMENTATIONS\Experiments\results\finaleart\S01A22542-finaleart-1.idf
Date:	27.03.2019 15:33:16
Version:	BeGaze 2.5.77
Sample Rate:	50
Subject:	S01A22542
Description:	Thibault Seve Minnaert

Table Header for Fixations:
Event Type	Trial	Number	Start	End	Duration	Location X	Location Y	Dispersion X	Dispersion Y	Plane	Avg. Pupil Size X	Avg. Pupil Size Y

Table Header for Saccades:
Event Type	Trial	Number	Start	End	Duration	Start Loc.X	Start Loc.Y	End Loc.X	End Loc.Y	Amplitude	Peak Speed	Peak Speed At	Average Speed	Peak Accel.	Peak Decel.	Average Accel.

Table Header for Blinks:
Event Type	Trial	Number	Start	End	Duration

Table Header for User Events:
Event Type	Trial	Number	Start	Description

UserEvent	1	1	8718234548	# Message: void.jpg
Saccade L	1	1	8718250959	8718310707	59748	733.23	289.19	736.46	217.94	1.34	70.58	1.00	22.41	1720.70	-1625.43	857.50
Saccade R	1	1	8718250959	8718310707	59748	733.23	289.19	736.46	217.94	1.34	70.58	1.00	22.41	1720.70	-1625.43	857.50
Fixation L	1	1	8718310707	8718689058	378351	755.33	185.98	34	45	-1	15.79	15.79
Fixation R	1	1	8718310707	8718689058	378351	755.33	185.98	34	45	-1	15.94	15.94
Saccade L	1	2	8718689058	8718708933	19875	770.63	214.84	946.02	436.95	1.74	286.06	1.00	87.50	6962.07	-6994.16	4715.62
Saccade R	1	2	8718689058	8718708933	19875	770.63	214.84	946.02	436.95	1.74	286.06	1.00	87.50	6962.07	-6994.16	4715.62
Fixation L	1	2	8718708933	8718947794	238861	953.23	470.38	15	50	-1	16.87	16.87
Fixation R	1	2	8718708933	8718947794	238861	953.23	470.38	15	50	-1	16.87	16.87
Blink L	1	1	8718947794	8719107167	159373
Blink R	1	1	8718947794	8719107167	159373
Fixation L	1	3	8719107167	8719405765	298598	964.40	357.49	15	60	-1	16.58	16.58
Fixation R	1	3	8719107167	8719405765	298598	964.40	357.49	15	60	-1	16.89	16.89
Saccade L	1	3	8719405765	8719445639	39874	972.58	378.95	897.06	523.88	1.88	146.81	1.00	47.13	3621.16	-3465.02	2391.10
Saccade R	1	3	8719405765	8719445639	39874	972.58	378.95	897.06	523.88	1.88	146.81	1.00	47.13	3621.16	-3465.02	2391.10
Fixation L	1	4	8719445639	8719784006	338367	881.17	501.74	33	35	-1	16.80	16.80
Fixation R	1	4	8719445639	8719784006	338367	881.17	501.74	33	35	-1	17.31	17.31
Saccade L	1	4	8719784006	8719803994	19988	907.49	488.79	998.51	487.91	0.64	92.08	1.00	31.83	2253.62	-2223.85	1673.27
Saccade R	1	4	8719784006	8719803994	19988	907.49	488.79	998.51	487.91	0.64	92.08	1.00	31.83	2253.62	-2223.85	1673.27
Fixation L	1	5	8719803994	8719983125	179131	1002.34	481.01	8	16	-1	16.15	16.15
Fixation R	1	5	8719803994	8719983125	179131	1002.34	481.01	8	16	-1	16.68	16.68
Saccade L	1	5	8719983125	8720003110	19985	1003.18	471.17	859.47	479.45	1.01	145.59	1.00	50.44	3545.69	-3461.16	2681.49
Saccade R	1	5	8719983125	8720003110	19985	1003.18	471.17	859.47	479.45	1.01	145.59	1.00	50.44	3545.69	-3461.16	2681.49
Fixation L	1	6	8720003110	8720222102	218992	806.18	486.63	63	12	-1	15.96	15.96
Fixation R	1	6	8720003110	8720222102	218992	806.18	486.63	63	12	-1	16.39	16.39
