[BeGaze]
Converted from:	C:\Documents and Settings\iViewX\Desktop\EXPERIMENTATIONS\Experiments\results\finaleart\S12H22222-finaleart-1.idf
Date:	27.03.2019 15:40:11
Version:	BeGaze 2.5.77
Sample Rate:	50
Subject:	S12H22222
Description:	aurele barriere

Table Header for Fixations:
Event Type	Trial	Number	Start	End	Duration	Location X	Location Y	Dispersion X	Dispersion Y	Plane	Avg. Pupil Size X	Avg. Pupil Size Y

Table Header for Saccades:
Event Type	Trial	Number	Start	End	Duration	Start Loc.X	Start Loc.Y	End Loc.X	End Loc.Y	Amplitude	Peak Speed	Peak Speed At	Average Speed	Peak Accel.	Peak Decel.	Average Accel.

Table Header for Blinks:
Event Type	Trial	Number	Start	End	Duration

Table Header for User Events:
Event Type	Trial	Number	Start	Description

UserEvent	1	1	23188898221	# Message: The_Luxembourg_Gardens_Matisse_1901.jpg
Fixation L	1	1	23188902572	23189519164	616592	940.48	550.95	13	41	-1	13.52	13.52
Fixation R	1	1	23188902572	23189519164	616592	940.48	550.95	13	41	-1	13.13	13.13
Saccade L	1	1	23189519164	23189558897	39733	939.79	560.95	752.05	561.46	1.68	123.71	0.50	42.18	3033.05	-3081.13	2496.44
Saccade R	1	1	23189519164	23189558897	39733	939.79	560.95	752.05	561.46	1.68	123.71	0.50	42.18	3033.05	-3081.13	2496.44
Fixation L	1	2	23189558897	23189757767	198870	756.63	582.16	8	77	-1	12.87	12.87
Fixation R	1	2	23189558897	23189757767	198870	756.63	582.16	8	77	-1	12.71	12.71
Saccade L	1	2	23189757767	23189777635	19868	756.07	639.23	750.85	750.39	0.91	112.56	1.00	45.88	2726.89	-2691.83	2104.30
Saccade R	1	2	23189757767	23189777635	19868	756.07	639.23	750.85	750.39	0.91	112.56	1.00	45.88	2726.89	-2691.83	2104.30
Fixation L	1	3	23189777635	23189936757	159122	737.23	730.18	23	31	-1	13.32	13.32
Fixation R	1	3	23189777635	23189936757	159122	737.23	730.18	23	31	-1	13.39	13.39
Saccade L	1	3	23189936757	23189976625	39868	727.34	719.35	1251.31	391.52	5.17	327.96	0.50	129.69	8168.03	-7939.60	7748.62
Saccade R	1	3	23189936757	23189976625	39868	727.34	719.35	1251.31	391.52	5.17	327.96	0.50	129.69	8168.03	-7939.60	7748.62
Fixation L	1	4	23189976625	23190374374	397749	1254.68	409.21	10	47	-1	14.16	14.16
Fixation R	1	4	23189976625	23190374374	397749	1254.68	409.21	10	47	-1	13.60	13.60
Saccade L	1	4	23190374374	23190434109	59735	1250.32	422.97	832.79	298.36	4.79	225.78	0.67	80.26	5586.49	-5050.13	3935.88
Saccade R	1	4	23190374374	23190434109	59735	1250.32	422.97	832.79	298.36	4.79	225.78	0.67	80.26	5586.49	-5050.13	3935.88
Fixation L	1	5	23190434109	23191130206	696097	810.44	267.44	29	55	-1	14.61	14.61
Fixation R	1	5	23190434109	23191130206	696097	810.44	267.44	29	55	-1	14.37	14.37
Saccade L	1	5	23191130206	23191150081	19875	808.68	261.30	697.70	272.52	0.72	112.82	1.00	36.31	2761.67	-2641.19	1975.54
Saccade R	1	5	23191130206	23191150081	19875	808.68	261.30	697.70	272.52	0.72	112.82	1.00	36.31	2761.67	-2641.19	1975.54
Fixation L	1	6	23191150081	23191408691	258610	682.43	279.17	25	22	-1	15.32	15.32
Fixation R	1	6	23191150081	23191408691	258610	682.43	279.17	25	22	-1	15.15	15.15
Saccade L	1	6	23191408691	23191448443	39752	682.77	293.82	1066.00	445.98	3.65	270.92	0.50	91.82	6737.98	-5925.71	4944.10
Saccade R	1	6	23191408691	23191448443	39752	682.77	293.82	1066.00	445.98	3.65	270.92	0.50	91.82	6737.98	-5925.71	4944.10
Fixation L	1	7	23191448443	23191707048	258605	1067.11	484.83	11	53	-1	15.75	15.75
Fixation R	1	7	23191448443	23191707048	258605	1067.11	484.83	11	53	-1	15.35	15.35
Saccade L	1	7	23191707048	23191746801	39753	1074.88	495.54	1346.44	640.58	2.70	177.91	1.00	68.02	4347.62	-4006.20	3758.57
Saccade R	1	7	23191707048	23191746801	39753	1074.88	495.54	1346.44	640.58	2.70	177.91	1.00	68.02	4347.62	-4006.20	3758.57
Fixation L	1	8	23191746801	23192124655	377854	1349.99	676.56	16	54	-1	15.12	15.12
Fixation R	1	8	23191746801	23192124655	377854	1349.99	676.56	16	54	-1	14.60	14.60
Saccade L	1	8	23192124655	23192184408	59753	1355.10	670.47	1356.48	250.73	4.36	203.03	0.67	73.04	5008.50	-4960.76	3106.73
Saccade R	1	8	23192124655	23192184408	59753	1355.10	670.47	1356.48	250.73	4.36	203.03	0.67	73.04	5008.50	-4960.76	3106.73
Fixation L	1	9	23192184408	23192562261	377853	1354.95	257.13	14	19	-1	15.03	15.03
Fixation R	1	9	23192184408	23192562261	377853	1354.95	257.13	14	19	-1	14.45	14.45
Saccade L	1	9	23192562261	23192602015	39754	1348.40	255.47	1034.83	509.10	3.46	304.11	0.50	86.97	7516.19	-7341.94	4901.49
Saccade R	1	9	23192562261	23192602015	39754	1348.40	255.47	1034.83	509.10	3.46	304.11	0.50	86.97	7516.19	-7341.94	4901.49
Fixation L	1	10	23192602015	23192880501	278486	1038.37	514.12	11	14	-1	16.02	16.02
Fixation R	1	10	23192602015	23192880501	278486	1038.37	514.12	11	14	-1	15.08	15.08
