[BeGaze]
Converted from:	C:\Documents and Settings\iViewX\Desktop\EXPERIMENTATIONS\Experiments\results\finaleart\S8119532-finaleart-1.idf
Date:	27.03.2019 16:01:07
Version:	BeGaze 2.5.77
Sample Rate:	50
Subject:	S8119532
Description:	Alexandre Drewery

Table Header for Fixations:
Event Type	Trial	Number	Start	End	Duration	Location X	Location Y	Dispersion X	Dispersion Y	Plane	Avg. Pupil Size X	Avg. Pupil Size Y

Table Header for Saccades:
Event Type	Trial	Number	Start	End	Duration	Start Loc.X	Start Loc.Y	End Loc.X	End Loc.Y	Amplitude	Peak Speed	Peak Speed At	Average Speed	Peak Accel.	Peak Decel.	Average Accel.

Table Header for Blinks:
Event Type	Trial	Number	Start	End	Duration

Table Header for User Events:
Event Type	Trial	Number	Start	Description

UserEvent	1	1	3478745833	# Message: the_kiss_gericault_1816.jpg
Fixation L	1	1	3478758473	3478997220	238747	986.83	407.06	53	44	-1	12.89	12.89
Fixation R	1	1	3478758473	3478997220	238747	986.83	407.06	53	44	-1	13.89	13.89
Saccade L	1	1	3478997220	3479017077	19857	992.60	408.86	990.61	440.69	0.29	32.26	1.00	14.46	407.56	-768.19	399.67
Saccade R	1	1	3478997220	3479017077	19857	992.60	408.86	990.61	440.69	0.29	32.26	1.00	14.46	407.56	-768.19	399.67
Fixation L	1	2	3479017077	3479534189	517112	991.06	415.95	13	84	-1	13.16	13.16
Fixation R	1	2	3479017077	3479534189	517112	991.06	415.95	13	84	-1	14.16	14.16
Saccade L	1	2	3479534189	3479812664	278475	993.71	414.41	1199.97	192.21	16.96	137.23	1.00	60.91	3033.00	-2602.04	1665.70
Saccade R	1	2	3479534189	3479812664	278475	993.71	414.41	1199.97	192.21	16.96	137.23	1.00	60.91	3033.00	-2602.04	1665.70
Fixation L	1	3	3479812664	3479951917	139253	1197.76	149.37	26	73	-1	12.40	12.40
Fixation R	1	3	3479812664	3479951917	139253	1197.76	149.37	26	73	-1	12.76	12.76
Saccade L	1	3	3479951917	3480031537	79620	1196.02	158.33	1177.55	211.00	1.91	66.34	1.00	23.96	1416.90	-1427.62	656.53
Saccade R	1	3	3479951917	3480031537	79620	1196.02	158.33	1177.55	211.00	1.91	66.34	1.00	23.96	1416.90	-1427.62	656.53
Fixation L	1	4	3480031537	3480210517	178980	1176.48	222.50	34	47	-1	12.34	12.34
Fixation R	1	4	3480031537	3480210517	178980	1176.48	222.50	34	47	-1	12.74	12.74
Saccade L	1	4	3480210517	3480270146	59629	1159.89	193.08	1167.31	161.09	2.57	67.61	1.00	43.02	610.19	-1404.24	839.73
Saccade R	1	4	3480210517	3480270146	59629	1159.89	193.08	1167.31	161.09	2.57	67.61	1.00	43.02	610.19	-1404.24	839.73
Fixation L	1	5	3480270146	3480508890	238744	1158.71	149.16	13	45	-1	13.03	13.03
Fixation R	1	5	3480270146	3480508890	238744	1158.71	149.16	13	45	-1	13.63	13.63
Saccade L	1	5	3480508890	3480548638	39748	1161.06	146.98	1067.08	196.69	1.65	71.93	0.50	41.56	1404.17	-953.11	847.10
Saccade R	1	5	3480508890	3480548638	39748	1161.06	146.98	1067.08	196.69	1.65	71.93	0.50	41.56	1404.17	-953.11	847.10
Fixation L	1	6	3480548638	3480846993	298355	1066.01	245.17	21	65	-1	13.61	13.61
Fixation R	1	6	3480548638	3480846993	298355	1066.01	245.17	21	65	-1	14.37	14.37
Saccade L	1	6	3480846993	3480886744	39751	1064.53	253.78	1244.62	323.00	1.82	122.24	1.00	45.78	2719.69	-2553.00	2102.94
Saccade R	1	6	3480846993	3480886744	39751	1064.53	253.78	1244.62	323.00	1.82	122.24	1.00	45.78	2719.69	-2553.00	2102.94
Fixation L	1	7	3480886744	3481125473	238729	1250.95	329.02	12	54	-1	14.18	14.18
Fixation R	1	7	3480886744	3481125473	238729	1250.95	329.02	12	54	-1	14.52	14.52
Saccade L	1	7	3481125473	3481244725	119252	1244.54	300.88	1165.90	240.21	4.12	77.55	0.83	34.56	1733.86	-1615.52	1175.86
Saccade R	1	7	3481125473	3481244725	119252	1244.54	300.88	1165.90	240.21	4.12	77.55	0.83	34.56	1733.86	-1615.52	1175.86
Fixation L	1	8	3481244725	3481364096	119371	1180.90	221.25	35	30	-1	14.30	14.30
Fixation R	1	8	3481244725	3481364096	119371	1180.90	221.25	35	30	-1	14.41	14.41
Saccade L	1	8	3481364096	3481523213	159117	1166.85	214.26	992.76	429.20	10.76	240.82	0.12	67.65	5546.95	-4320.52	1920.68
Saccade R	1	8	3481364096	3481523213	159117	1166.85	214.26	992.76	429.20	10.76	240.82	0.12	67.65	5546.95	-4320.52	1920.68
Fixation L	1	9	3481523213	3481642582	119369	1000.30	476.47	15	67	-1	13.95	13.95
Fixation R	1	9	3481523213	3481642582	119369	1000.30	476.47	15	67	-1	14.33	14.33
Saccade L	1	9	3481642582	3481682325	39743	1000.79	489.59	728.05	519.54	2.58	243.98	0.50	64.83	5922.73	-5312.48	2983.58
Saccade R	1	9	3481642582	3481682325	39743	1000.79	489.59	728.05	519.54	2.58	243.98	0.50	64.83	5922.73	-5312.48	2983.58
Fixation L	1	10	3481682325	3481861316	178991	724.74	558.58	25	72	-1	13.67	13.67
Fixation R	1	10	3481682325	3481861316	178991	724.74	558.58	25	72	-1	14.47	14.47
Saccade L	1	10	3481861316	3482020433	159117	739.27	586.63	1008.50	245.26	9.17	220.12	0.38	57.65	5445.24	-5186.58	2153.01
Saccade R	1	10	3481861316	3482020433	159117	739.27	586.63	1008.50	245.26	9.17	220.12	0.38	57.65	5445.24	-5186.58	2153.01
Fixation L	1	11	3482020433	3482179554	159121	1019.26	275.85	17	55	-1	12.97	12.97
Fixation R	1	11	3482020433	3482179554	159121	1019.26	275.85	17	55	-1	13.92	13.92
Saccade L	1	11	3482179554	3482199420	19866	1020.13	275.26	1149.81	251.06	0.91	133.43	1.00	45.78	2778.89	-1865.41	1592.26
Saccade R	1	11	3482179554	3482199420	19866	1020.13	275.26	1149.81	251.06	0.91	133.43	1.00	45.78	2778.89	-1865.41	1592.26
Fixation L	1	12	3482199420	3482458040	258620	1140.22	253.79	67	28	-1	13.04	13.04
Fixation R	1	12	3482199420	3482458040	258620	1140.22	253.79	67	28	-1	13.81	13.81
Saccade L	1	12	3482458040	3482537674	79634	1134.05	258.23	1194.82	337.88	3.03	74.55	1.00	38.02	1083.78	-780.84	608.51
Saccade R	1	12	3482458040	3482537674	79634	1134.05	258.23	1194.82	337.88	3.03	74.55	1.00	38.02	1083.78	-780.84	608.51
Fixation L	1	13	3482537674	3482676899	139225	1210.73	321.40	49	35	-1	13.47	13.47
Fixation R	1	13	3482537674	3482676899	139225	1210.73	321.40	49	35	-1	14.07	14.07
Saccade L	1	13	3482676899	3482736520	59621	1204.25	304.76	1208.07	264.07	1.57	44.10	1.00	26.25	462.82	0.00	245.08
Saccade R	1	13	3482676899	3482736520	59621	1204.25	304.76	1208.07	264.07	1.57	44.10	1.00	26.25	462.82	0.00	245.08
