[BeGaze]
Converted from:	C:\Documents and Settings\iViewX\Desktop\EXPERIMENTATIONS\Experiments\results\finaleart\S15H25531-finaleart-1.idf
Date:	27.03.2019 15:44:58
Version:	BeGaze 2.5.77
Sample Rate:	50
Subject:	S15H25531
Description:	Mikail Demirdelen

Table Header for Fixations:
Event Type	Trial	Number	Start	End	Duration	Location X	Location Y	Dispersion X	Dispersion Y	Plane	Avg. Pupil Size X	Avg. Pupil Size Y

Table Header for Saccades:
Event Type	Trial	Number	Start	End	Duration	Start Loc.X	Start Loc.Y	End Loc.X	End Loc.Y	Amplitude	Peak Speed	Peak Speed At	Average Speed	Peak Accel.	Peak Decel.	Average Accel.

Table Header for Blinks:
Event Type	Trial	Number	Start	End	Duration

Table Header for User Events:
Event Type	Trial	Number	Start	Description

UserEvent	1	1	4005084080	# Message: void.jpg
Saccade L	1	1	4005096571	4005176080	79509	867.92	301.96	708.57	244.28	2.89	174.95	1.00	36.29	4159.37	-3917.55	1501.41
Saccade R	1	1	4005096571	4005176080	79509	867.92	301.96	708.57	244.28	2.89	174.95	1.00	36.29	4159.37	-3917.55	1501.41
Fixation L	1	1	4005176080	4005295434	119354	695.94	197.58	24	75	-1	12.07	12.07
Fixation R	1	1	4005176080	4005295434	119354	695.94	197.58	24	75	-1	13.75	13.75
Saccade L	1	2	4005295434	4005315312	19878	683.84	169.12	681.89	175.60	0.19	15.92	1.00	9.60	264.10	-86.01	120.43
Saccade R	1	2	4005295434	4005315312	19878	683.84	169.12	681.89	175.60	0.19	15.92	1.00	9.60	264.10	-86.01	120.43
Fixation L	1	2	4005315312	4005613664	298352	684.24	193.48	26	32	-1	12.00	12.00
Fixation R	1	2	4005315312	4005613664	298352	684.24	193.48	26	32	-1	13.12	13.12
Saccade L	1	3	4005613664	4005693308	79644	669.28	207.71	689.72	381.01	2.67	70.28	0.25	33.49	1334.51	-744.84	545.92
Saccade R	1	3	4005613664	4005693308	79644	669.28	207.71	689.72	381.01	2.67	70.28	0.25	33.49	1334.51	-744.84	545.92
Fixation L	1	3	4005693308	4006329765	636457	727.66	414.85	51	43	-1	13.32	13.32
Fixation R	1	3	4005693308	4006329765	636457	727.66	414.85	51	43	-1	14.94	14.94
Saccade L	1	4	4006329765	4006488876	159111	741.49	420.58	752.19	453.23	13.23	419.93	0.75	83.16	10365.53	-6740.37	3291.44
Saccade R	1	4	4006329765	4006488876	159111	741.49	420.58	752.19	453.23	13.23	419.93	0.75	83.16	10365.53	-6740.37	3291.44
Fixation L	1	4	4006488876	4006846865	357989	789.40	457.70	54	44	-1	14.41	14.41
Fixation R	1	4	4006488876	4006846865	357989	789.40	457.70	54	44	-1	15.84	15.84
Saccade L	1	5	4006846865	4006926485	79620	804.98	442.45	927.59	433.12	2.01	121.27	1.00	25.25	2817.02	-2908.35	1111.66
Saccade R	1	5	4006846865	4006926485	79620	804.98	442.45	927.59	433.12	2.01	121.27	1.00	25.25	2817.02	-2908.35	1111.66
Fixation L	1	5	4006926485	4007065597	139112	919.17	416.03	16	27	-1	14.26	14.26
Fixation R	1	5	4006926485	4007065597	139112	919.17	416.03	16	27	-1	14.99	14.99
