[BeGaze]
Converted from:	C:\Documents and Settings\iViewX\Desktop\EXPERIMENTATIONS\Experiments\results\finaleart\S7121223-finaleart-1.idf
Date:	27.03.2019 15:36:46
Version:	BeGaze 2.5.77
Sample Rate:	50
Subject:	S7121223
Description:	Gregoire pacreau

Table Header for Fixations:
Event Type	Trial	Number	Start	End	Duration	Location X	Location Y	Dispersion X	Dispersion Y	Plane	Avg. Pupil Size X	Avg. Pupil Size Y

Table Header for Saccades:
Event Type	Trial	Number	Start	End	Duration	Start Loc.X	Start Loc.Y	End Loc.X	End Loc.Y	Amplitude	Peak Speed	Peak Speed At	Average Speed	Peak Accel.	Peak Decel.	Average Accel.

Table Header for Blinks:
Event Type	Trial	Number	Start	End	Duration

Table Header for User Events:
Event Type	Trial	Number	Start	Description

UserEvent	1	1	4092467803	# Message: void.jpg
Saccade L	1	1	4092468980	4092588504	119524	730.02	670.39	470.88	616.07	4.67	145.83	0.83	39.08	3522.25	-3190.20	1464.99
Saccade R	1	1	4092468980	4092588504	119524	730.02	670.39	470.88	616.07	4.67	145.83	0.83	39.08	3522.25	-3190.20	1464.99
Fixation L	1	1	4092588504	4093125844	537340	478.87	588.12	32	34	-1	13.12	13.12
Fixation R	1	1	4092588504	4093125844	537340	478.87	588.12	32	34	-1	13.29	13.29
Saccade L	1	2	4093125844	4093205458	79614	503.71	585.53	1211.67	591.33	8.48	219.11	0.25	106.54	5467.73	-4084.95	3434.01
Saccade R	1	2	4093125844	4093205458	79614	503.71	585.53	1211.67	591.33	8.48	219.11	0.25	106.54	5467.73	-4084.95	3434.01
Fixation L	1	2	4093205458	4093404436	198978	1220.22	587.18	13	27	-1	13.55	13.55
Fixation R	1	2	4093205458	4093404436	198978	1220.22	587.18	13	27	-1	13.84	13.84
Saccade L	1	3	4093404436	4093464181	59745	1225.53	582.72	847.73	783.48	4.95	207.63	0.67	82.89	5084.48	-3975.97	3216.25
Saccade R	1	3	4093404436	4093464181	59745	1225.53	582.72	847.73	783.48	4.95	207.63	0.67	82.89	5084.48	-3975.97	3216.25
Fixation L	1	3	4093464181	4093981649	517468	813.27	812.75	45	44	-1	14.17	14.17
Fixation R	1	3	4093464181	4093981649	517468	813.27	812.75	45	44	-1	14.56	14.56
Saccade L	1	4	4093981649	4094041392	59743	801.87	813.19	657.41	506.34	3.59	146.21	0.33	60.02	3586.26	-2767.87	2534.80
Saccade R	1	4	4093981649	4094041392	59743	801.87	813.19	657.41	506.34	3.59	146.21	0.33	60.02	3586.26	-2767.87	2534.80
Fixation L	1	4	4094041392	4094459375	417983	651.80	500.44	9	36	-1	13.95	13.95
Fixation R	1	4	4094041392	4094459375	417983	651.80	500.44	9	36	-1	14.63	14.63
