[BeGaze]
Converted from:	C:\Documents and Settings\iViewX\Desktop\EXPERIMENTATIONS\Experiments\results\finaleart\S02123220-finaleart-1.idf
Date:	27.03.2019 15:33:40
Version:	BeGaze 2.5.77
Sample Rate:	50
Subject:	S02123220
Description:	David Xu

Table Header for Fixations:
Event Type	Trial	Number	Start	End	Duration	Location X	Location Y	Dispersion X	Dispersion Y	Plane	Avg. Pupil Size X	Avg. Pupil Size Y

Table Header for Saccades:
Event Type	Trial	Number	Start	End	Duration	Start Loc.X	Start Loc.Y	End Loc.X	End Loc.Y	Amplitude	Peak Speed	Peak Speed At	Average Speed	Peak Accel.	Peak Decel.	Average Accel.

Table Header for Blinks:
Event Type	Trial	Number	Start	End	Duration

Table Header for User Events:
Event Type	Trial	Number	Start	Description

UserEvent	1	1	1518642862	# Message: void.jpg
Fixation L	1	1	1518647077	1518905576	258499	1232.71	912.71	43	31	-1	13.02	13.02
Saccade R	1	1	1518647077	1518726567	79490	1224.26	903.53	1230.99	913.18	0.59	19.74	0.75	7.49	445.37	-350.41	241.03
Fixation R	1	1	1518746454	1518905576	159122	1238.02	915.45	43	31	-1	9.96	9.96
Saccade L	1	1	1518905576	1518925447	19871	1206.83	894.20	1135.04	799.43	0.96	120.26	1.00	48.42	2897.87	-2800.77	2227.01
Saccade R	1	2	1518905576	1518925447	19871	1206.83	894.20	1135.04	799.43	0.96	120.26	1.00	48.42	2897.87	-2800.77	2227.01
Fixation L	1	2	1518925447	1519124413	198966	1121.53	786.04	28	17	-1	13.52	13.52
Fixation R	1	2	1518925447	1519124413	198966	1121.53	786.04	28	17	-1	11.30	11.30
Saccade L	1	2	1519124413	1519164162	39749	1106.92	782.30	1112.31	688.72	2.22	167.58	1.00	55.81	2391.16	-186.50	1443.38
Saccade R	1	3	1519124413	1519164162	39749	1106.92	782.30	1112.31	688.72	2.22	167.58	1.00	55.81	2391.16	-186.50	1443.38
Blink L	1	1	1519164162	1519402778	238616
Blink R	1	1	1519164162	1519402778	238616
Fixation L	1	3	1519402778	1519621636	218858	873.71	374.37	24	48	-1	12.72	12.72
Fixation R	1	3	1519402778	1519621636	218858	873.71	374.37	24	48	-1	11.89	11.89
Blink L	1	2	1519621636	1519999489	377853
Blink R	1	2	1519621636	1519999489	377853
Fixation L	1	4	1519999489	1520198488	198999	1028.07	438.36	39	33	-1	14.10	14.10
Fixation R	1	4	1519999489	1520198488	198999	1028.07	438.36	39	33	-1	12.67	12.67
Saccade L	1	3	1520198488	1520218351	19863	998.15	447.18	946.46	442.73	0.63	52.48	1.00	31.80	1225.29	-993.42	804.30
Saccade R	1	4	1520198488	1520218351	19863	998.15	447.18	946.46	442.73	0.63	52.48	1.00	31.80	1225.29	-993.42	804.30
Fixation L	1	5	1520218351	1520576334	357983	927.99	410.89	33	58	-1	12.57	12.57
Fixation R	1	5	1520218351	1520576334	357983	927.99	410.89	33	58	-1	11.44	11.44
Saccade L	1	4	1520576334	1520635958	59624	930.71	384.03	918.82	347.35	1.24	40.56	0.33	20.73	769.08	-685.35	403.72
Saccade R	1	5	1520576334	1520635958	59624	930.71	384.03	918.82	347.35	1.24	40.56	0.33	20.73	769.08	-685.35	403.72
