[BeGaze]
Converted from:	C:\Documents and Settings\iViewX\Desktop\EXPERIMENTATIONS\Experiments\results\finaleart\S14F27123-finaleart-1.idf
Date:	27.03.2019 15:44:02
Version:	BeGaze 2.5.77
Sample Rate:	50
Subject:	S14F27123
Description:	Anne-flore Perrin

Table Header for Fixations:
Event Type	Trial	Number	Start	End	Duration	Location X	Location Y	Dispersion X	Dispersion Y	Plane	Avg. Pupil Size X	Avg. Pupil Size Y

Table Header for Saccades:
Event Type	Trial	Number	Start	End	Duration	Start Loc.X	Start Loc.Y	End Loc.X	End Loc.Y	Amplitude	Peak Speed	Peak Speed At	Average Speed	Peak Accel.	Peak Decel.	Average Accel.

Table Header for Blinks:
Event Type	Trial	Number	Start	End	Duration

Table Header for User Events:
Event Type	Trial	Number	Start	Description

UserEvent	1	1	31602237042	# Message: dead_hare_ward.jpg
Fixation L	1	1	31602246687	31602385931	139244	664.20	962.87	8	14	-1	16.54	16.54
Fixation R	1	1	31602246687	31602385931	139244	664.20	962.87	8	14	-1	12.77	12.77
Blink L	1	1	31602385931	31602465527	79596
Blink R	1	1	31602385931	31602465527	79596
Saccade L	1	1	31602465527	31602485403	19876	668.57	973.11	667.85	973.38	11.71	1177.33	1.00	588.96	29318.95	-29309.12	19549.17
Saccade R	1	1	31602465527	31602485403	19876	668.57	973.11	667.85	973.38	11.71	1177.33	1.00	588.96	29318.95	-29309.12	19549.17
Blink L	1	2	31602485403	31602803638	318235
Blink R	1	2	31602485403	31602803638	318235
Blink L	1	3	31602803638	31603042258	238620
Blink R	1	3	31602803638	31603042258	238620
Fixation L	1	2	31603042258	31603181495	139237	624.14	707.01	7	30	-1	12.44	12.44
Fixation R	1	2	31603042258	31603181495	139237	624.14	707.01	7	30	-1	12.49	12.49
Saccade L	1	2	31603181495	31603221246	39751	627.83	719.33	938.98	611.41	2.89	218.10	0.50	72.77	5295.76	-4921.05	3936.68
Saccade R	1	2	31603181495	31603221246	39751	627.83	719.33	938.98	611.41	2.89	218.10	0.50	72.77	5295.76	-4921.05	3936.68
Fixation L	1	3	31603221246	31603420243	198997	946.20	589.20	9	29	-1	12.50	12.50
Fixation R	1	3	31603221246	31603420243	198997	946.20	589.20	9	29	-1	12.90	12.90
Blink L	1	4	31603420243	31603758349	338106
Blink R	1	4	31603420243	31603758349	338106
Fixation L	1	4	31603758349	31603937335	178986	1234.91	343.96	9	35	-1	13.23	13.23
Fixation R	1	4	31603758349	31603937335	178986	1234.91	343.96	9	35	-1	13.10	13.10
Saccade L	1	3	31603937335	31603977095	39760	1240.60	314.83	1285.25	232.73	3.04	189.13	0.50	76.35	4718.52	-3272.33	2949.85
Saccade R	1	3	31603937335	31603977095	39760	1240.60	314.83	1285.25	232.73	3.04	189.13	0.50	76.35	4718.52	-3272.33	2949.85
Fixation L	1	5	31603977095	31604176081	198986	1267.65	194.28	31	54	-1	12.91	12.91
Fixation R	1	5	31603977095	31604176081	198986	1267.65	194.28	31	54	-1	12.93	12.93
Saccade L	1	4	31604176081	31604195955	19874	1273.03	208.87	1307.63	162.01	0.44	58.92	1.00	22.11	1217.12	-917.84	748.38
Saccade R	1	4	31604176081	31604195955	19874	1273.03	208.87	1307.63	162.01	0.44	58.92	1.00	22.11	1217.12	-917.84	748.38
Fixation L	1	6	31604195955	31604434576	238621	1313.23	156.00	28	42	-1	12.56	12.56
Fixation R	1	6	31604195955	31604434576	238621	1313.23	156.00	28	42	-1	12.48	12.48
Saccade L	1	5	31604434576	31604454442	19866	1312.46	177.81	1079.54	433.30	2.15	349.32	1.00	108.37	8672.30	-8554.98	6052.30
Saccade R	1	5	31604434576	31604454442	19866	1312.46	177.81	1079.54	433.30	2.15	349.32	1.00	108.37	8672.30	-8554.98	6052.30
Fixation L	1	7	31604454442	31604713056	258614	1063.07	478.19	26	64	-1	13.27	13.27
Fixation R	1	7	31604454442	31604713056	258614	1063.07	478.19	26	64	-1	13.29	13.29
Saccade L	1	6	31604713056	31604752809	39753	1053.05	463.87	598.93	588.70	4.09	254.74	0.50	102.82	6260.48	-5781.64	5734.36
Saccade R	1	6	31604713056	31604752809	39753	1053.05	463.87	598.93	588.70	4.09	254.74	0.50	102.82	6260.48	-5781.64	5734.36
Fixation L	1	8	31604752809	31605051165	298356	632.43	608.41	42	32	-1	12.89	12.89
Fixation R	1	8	31604752809	31605051165	298356	632.43	608.41	42	32	-1	13.22	13.22
Saccade L	1	7	31605051165	31605090915	39750	641.21	611.80	547.56	886.81	3.16	215.90	0.50	79.38	5210.25	-5258.35	4639.21
Saccade R	1	7	31605051165	31605090915	39750	641.21	611.80	547.56	886.81	3.16	215.90	0.50	79.38	5210.25	-5258.35	4639.21
Fixation L	1	9	31605090915	31605647890	556975	540.38	921.41	20	77	-1	13.41	13.41
Fixation R	1	9	31605090915	31605647890	556975	540.38	921.41	20	77	-1	14.01	14.01
