[BeGaze]
Converted from:	C:\Documents and Settings\iViewX\Desktop\EXPERIMENTATIONS\Experiments\results\finaleart\S13H22431-finaleart-1.idf
Date:	27.03.2019 15:41:45
Version:	BeGaze 2.5.77
Sample Rate:	50
Subject:	S13H22431
Description:	Jimmy Petit

Table Header for Fixations:
Event Type	Trial	Number	Start	End	Duration	Location X	Location Y	Dispersion X	Dispersion Y	Plane	Avg. Pupil Size X	Avg. Pupil Size Y

Table Header for Saccades:
Event Type	Trial	Number	Start	End	Duration	Start Loc.X	Start Loc.Y	End Loc.X	End Loc.Y	Amplitude	Peak Speed	Peak Speed At	Average Speed	Peak Accel.	Peak Decel.	Average Accel.

Table Header for Blinks:
Event Type	Trial	Number	Start	End	Duration

Table Header for User Events:
Event Type	Trial	Number	Start	Description

UserEvent	1	1	27792427348	# Message: goya-Pavo-muerto-1812.jpg
Fixation L	1	1	27792435188	27792634032	198844	797.89	378.87	12	21	-1	14.80	14.80
Fixation R	1	1	27792435188	27792634032	198844	797.89	378.87	12	21	-1	16.13	16.13
Saccade L	1	1	27792634032	27792653899	19867	793.23	390.71	883.76	393.19	0.58	91.61	1.00	29.36	2142.66	-2018.16	1449.66
Saccade R	1	1	27792634032	27792653899	19867	793.23	390.71	883.76	393.19	0.58	91.61	1.00	29.36	2142.66	-2018.16	1449.66
Fixation L	1	2	27792653899	27792833013	179114	903.75	406.94	25	28	-1	15.63	15.63
Fixation R	1	2	27792653899	27792833013	179114	903.75	406.94	25	28	-1	16.81	16.81
Saccade L	1	2	27792833013	27792852900	19887	905.44	422.05	915.84	536.43	0.64	116.16	1.00	32.04	2779.88	-2691.65	1841.99
Saccade R	1	2	27792833013	27792852900	19887	905.44	422.05	915.84	536.43	0.64	116.16	1.00	32.04	2779.88	-2691.65	1841.99
Fixation L	1	3	27792852900	27793191020	338120	940.41	527.20	48	16	-1	16.13	16.13
Fixation R	1	3	27792852900	27793191020	338120	940.41	527.20	48	16	-1	17.22	17.22
Saccade L	1	3	27793191020	27793210885	19865	964.13	522.78	1014.02	569.43	0.54	69.09	1.00	27.24	1705.90	-1343.76	1115.84
Saccade R	1	3	27793191020	27793210885	19865	964.13	522.78	1014.02	569.43	0.54	69.09	1.00	27.24	1705.90	-1343.76	1115.84
Fixation L	1	4	27793210885	27793429615	218730	1031.55	576.56	33	49	-1	16.65	16.65
Fixation R	1	4	27793210885	27793429615	218730	1031.55	576.56	33	49	-1	17.08	17.08
Saccade L	1	4	27793429615	27793449491	19876	1013.82	545.17	997.77	523.41	0.38	27.36	1.00	19.22	71.85	-393.53	233.51
Saccade R	1	4	27793429615	27793449491	19876	1013.82	545.17	997.77	523.41	0.38	27.36	1.00	19.22	71.85	-393.53	233.51
Fixation L	1	5	27793449491	27793608617	159126	987.56	513.66	49	31	-1	16.59	16.59
Fixation R	1	5	27793449491	27793608617	159126	987.56	513.66	49	31	-1	16.98	16.98
Saccade L	1	5	27793608617	27793628614	19997	947.84	497.94	904.02	488.39	0.50	45.37	1.00	24.99	1105.58	-1021.98	1005.58
Saccade R	1	5	27793608617	27793628614	19997	947.84	497.94	904.02	488.39	0.50	45.37	1.00	24.99	1105.58	-1021.98	1005.58
Fixation L	1	6	27793628614	27794105963	477349	881.62	473.08	41	33	-1	15.97	15.97
Fixation R	1	6	27793628614	27794105963	477349	881.62	473.08	41	33	-1	16.47	16.47
Saccade L	1	6	27794105963	27794125837	19874	915.09	470.11	973.23	467.53	0.53	58.87	1.00	26.51	1449.88	-1281.28	1171.27
Saccade R	1	6	27794105963	27794125837	19874	915.09	470.11	973.23	467.53	0.53	58.87	1.00	26.51	1449.88	-1281.28	1171.27
Fixation L	1	7	27794125837	27794483823	357986	995.84	444.10	42	36	-1	16.38	16.38
Fixation R	1	7	27794125837	27794483823	357986	995.84	444.10	42	36	-1	17.18	17.18
Saccade L	1	7	27794483823	27794523576	39753	1013.54	440.96	1105.87	667.73	2.20	165.46	0.50	55.46	4023.29	-3946.03	3068.22
Saccade R	1	7	27794483823	27794523576	39753	1013.54	440.96	1105.87	667.73	2.20	165.46	0.50	55.46	4023.29	-3946.03	3068.22
Fixation L	1	8	27794523576	27794762305	238729	1107.60	644.25	8	59	-1	17.21	17.21
Fixation R	1	8	27794523576	27794762305	238729	1107.60	644.25	8	59	-1	17.70	17.70
Saccade L	1	8	27794762305	27794782181	19876	1112.89	608.30	1166.80	549.38	0.75	80.79	1.00	37.74	2001.55	-1899.10	1407.79
Saccade R	1	8	27794762305	27794782181	19876	1112.89	608.30	1166.80	549.38	0.75	80.79	1.00	37.74	2001.55	-1899.10	1407.79
Fixation L	1	9	27794782181	27794901550	119369	1177.95	516.06	18	44	-1	16.83	16.83
Fixation R	1	9	27794782181	27794901550	119369	1177.95	516.06	18	44	-1	17.33	17.33
Blink L	1	1	27794901550	27795040802	139252
Blink R	1	1	27794901550	27795040802	139252
Fixation L	1	10	27795040802	27795279412	238610	984.85	514.10	57	10	-1	16.88	16.88
Fixation R	1	10	27795040802	27795279412	238610	984.85	514.10	57	10	-1	17.22	17.22
Saccade L	1	9	27795279412	27795319161	39749	941.36	517.96	402.41	355.01	5.05	328.58	0.50	126.99	8058.69	-8030.97	6636.01
Saccade R	1	9	27795279412	27795319161	39749	941.36	517.96	402.41	355.01	5.05	328.58	0.50	126.99	8058.69	-8030.97	6636.01
Fixation L	1	11	27795319161	27795677270	358109	397.37	363.51	17	32	-1	17.01	17.01
Fixation R	1	11	27795319161	27795677270	358109	397.37	363.51	17	32	-1	17.34	17.34
Saccade L	1	10	27795677270	27795736893	59623	399.06	368.12	589.14	803.16	5.21	228.40	0.67	87.45	5580.82	-5454.13	4049.03
Saccade R	1	10	27795677270	27795736893	59623	399.06	368.12	589.14	803.16	5.21	228.40	0.67	87.45	5580.82	-5454.13	4049.03
Fixation L	1	12	27795736893	27795955754	218861	584.53	792.32	20	23	-1	16.85	16.85
Fixation R	1	12	27795736893	27795955754	218861	584.53	792.32	20	23	-1	17.72	17.72
Saccade L	1	11	27795955754	27795975629	19875	591.73	789.36	630.44	858.81	0.52	80.43	1.00	26.36	1939.24	-1694.48	1281.26
Saccade R	1	11	27795955754	27795975629	19875	591.73	789.36	630.44	858.81	0.52	80.43	1.00	26.36	1939.24	-1694.48	1281.26
Fixation L	1	13	27795975629	27796254004	278375	635.45	866.17	19	20	-1	17.45	17.45
Fixation R	1	13	27795975629	27796254004	278375	635.45	866.17	19	20	-1	18.54	18.54
Saccade L	1	12	27796254004	27796313744	59740	640.96	866.01	1084.81	801.04	4.71	205.26	0.67	78.90	5044.83	-4910.30	3566.78
Saccade R	1	12	27796254004	27796313744	59740	640.96	866.01	1084.81	801.04	4.71	205.26	0.67	78.90	5044.83	-4910.30	3566.78
Fixation L	1	14	27796313744	27796413118	99374	1086.56	794.13	7	33	-1	17.47	17.47
Fixation R	1	14	27796313744	27796413118	99374	1086.56	794.13	7	33	-1	18.59	18.59
