[BeGaze]
Converted from:	C:\Documents and Settings\iViewX\Desktop\EXPERIMENTATIONS\Experiments\results\finaleart\S13H22431-finaleart-1.idf
Date:	27.03.2019 15:41:14
Version:	BeGaze 2.5.77
Sample Rate:	50
Subject:	S13H22431
Description:	Jimmy Petit

Table Header for Fixations:
Event Type	Trial	Number	Start	End	Duration	Location X	Location Y	Dispersion X	Dispersion Y	Plane	Avg. Pupil Size X	Avg. Pupil Size Y

Table Header for Saccades:
Event Type	Trial	Number	Start	End	Duration	Start Loc.X	Start Loc.Y	End Loc.X	End Loc.Y	Amplitude	Peak Speed	Peak Speed At	Average Speed	Peak Accel.	Peak Decel.	Average Accel.

Table Header for Blinks:
Event Type	Trial	Number	Start	End	Duration

Table Header for User Events:
Event Type	Trial	Number	Start	Description

UserEvent	1	1	27175280227	# Message: oysters_manet_1862.jpg
Fixation L	1	1	27175297996	27175397392	99396	749.20	325.46	11	8	-1	18.50	18.50
Fixation R	1	1	27175297996	27175397392	99396	749.20	325.46	11	8	-1	18.14	18.14
Saccade L	1	1	27175397392	27175437120	39728	744.79	320.97	512.02	382.21	2.28	144.34	1.00	57.44	3487.15	-3328.42	2799.29
Saccade R	1	1	27175397392	27175437120	39728	744.79	320.97	512.02	382.21	2.28	144.34	1.00	57.44	3487.15	-3328.42	2799.29
Fixation L	1	2	27175437120	27175556482	119362	506.08	405.64	15	31	-1	18.80	18.80
Fixation R	1	2	27175437120	27175556482	119362	506.08	405.64	15	31	-1	18.75	18.75
Saccade L	1	2	27175556482	27175715603	159121	499.14	412.56	822.78	594.31	12.38	344.88	0.88	77.82	8484.95	-8445.47	3227.65
Saccade R	1	2	27175556482	27175715603	159121	499.14	412.56	822.78	594.31	12.38	344.88	0.88	77.82	8484.95	-8445.47	3227.65
Fixation L	1	3	27175715603	27175994091	278488	831.31	567.76	30	43	-1	19.22	19.22
Fixation R	1	3	27175715603	27175994091	278488	831.31	567.76	30	43	-1	19.27	19.27
Saccade L	1	3	27175994091	27176013956	19865	849.55	567.13	886.93	558.75	0.43	38.75	1.00	21.40	921.54	-779.06	632.88
Saccade R	1	3	27175994091	27176013956	19865	849.55	567.13	886.93	558.75	0.43	38.75	1.00	21.40	921.54	-779.06	632.88
Fixation L	1	4	27176013956	27176192955	178999	909.38	569.17	62	17	-1	18.27	18.27
Fixation R	1	4	27176013956	27176192955	178999	909.38	569.17	62	17	-1	18.08	18.08
Saccade L	1	4	27176192955	27176212823	19868	949.63	576.48	1183.50	579.39	1.49	236.47	1.00	75.00	5877.12	-5678.15	4063.78
Saccade R	1	4	27176192955	27176212823	19868	949.63	576.48	1183.50	579.39	1.49	236.47	1.00	75.00	5877.12	-5678.15	4063.78
Fixation L	1	5	27176212823	27176411821	198998	1187.37	611.52	13	52	-1	17.68	17.68
Fixation R	1	5	27176212823	27176411821	198998	1187.37	611.52	13	52	-1	17.38	17.38
Saccade L	1	5	27176411821	27176431691	19870	1196.50	632.04	1273.86	633.31	0.50	78.27	1.00	25.06	1831.94	-1803.54	1277.61
Saccade R	1	5	27176411821	27176431691	19870	1196.50	632.04	1273.86	633.31	0.50	78.27	1.00	25.06	1831.94	-1803.54	1277.61
Fixation L	1	6	27176431691	27176590809	159118	1274.36	642.94	37	31	-1	17.26	17.26
Fixation R	1	6	27176431691	27176590809	159118	1274.36	642.94	37	31	-1	16.73	16.73
Saccade L	1	6	27176590809	27176610689	19880	1296.28	664.22	1336.32	661.52	0.50	40.60	1.00	25.14	810.85	-932.41	812.51
Saccade R	1	6	27176590809	27176610689	19880	1296.28	664.22	1336.32	661.52	0.50	40.60	1.00	25.14	810.85	-932.41	812.51
Fixation L	1	7	27176610689	27176948795	338106	1350.55	678.96	19	36	-1	16.26	16.26
Fixation R	1	7	27176610689	27176948795	338106	1350.55	678.96	19	36	-1	15.64	15.64
Saccade L	1	7	27176948795	27177068157	119362	1342.85	698.02	1172.15	831.94	3.87	139.82	1.00	32.45	3325.88	-3175.12	1241.15
Saccade R	1	7	27176948795	27177068157	119362	1342.85	698.02	1172.15	831.94	3.87	139.82	1.00	32.45	3325.88	-3175.12	1241.15
Fixation L	1	8	27177068157	27177625140	556983	1169.99	831.29	40	22	-1	15.90	15.90
Fixation R	1	8	27177068157	27177625140	556983	1169.99	831.29	40	22	-1	15.35	15.35
Saccade L	1	8	27177625140	27177664889	39749	1154.37	819.63	910.36	823.44	2.02	132.54	0.50	50.81	3308.63	-3171.79	3004.35
Saccade R	1	8	27177625140	27177664889	39749	1154.37	819.63	910.36	823.44	2.02	132.54	0.50	50.81	3308.63	-3171.79	3004.35
Fixation L	1	9	27177664889	27178082496	417607	891.70	827.54	53	6	-1	15.64	15.64
Fixation R	1	9	27177664889	27178082496	417607	891.70	827.54	53	6	-1	15.33	15.33
Saccade L	1	9	27178082496	27178142240	59744	857.33	826.62	1394.36	504.16	6.98	310.72	0.67	116.75	7691.06	-6761.07	4826.37
Saccade R	1	9	27178082496	27178142240	59744	857.33	826.62	1394.36	504.16	6.98	310.72	0.67	116.75	7691.06	-6761.07	4826.37
Fixation L	1	10	27178142240	27178619594	477354	1413.04	482.86	32	40	-1	15.29	15.29
Fixation R	1	10	27178142240	27178619594	477354	1413.04	482.86	32	40	-1	15.17	15.17
Saccade L	1	10	27178619594	27178659349	39755	1424.75	465.16	939.88	520.44	4.05	280.12	0.50	101.97	6945.08	-6776.83	5972.93
Saccade R	1	10	27178619594	27178659349	39755	1424.75	465.16	939.88	520.44	4.05	280.12	0.50	101.97	6945.08	-6776.83	5972.93
Fixation L	1	11	27178659349	27178818464	159115	927.62	522.50	21	48	-1	15.88	15.88
Fixation R	1	11	27178659349	27178818464	159115	927.62	522.50	21	48	-1	15.54	15.54
Saccade L	1	11	27178818464	27178858214	39750	917.89	534.41	688.11	530.66	2.17	133.76	0.50	54.52	2949.57	-3063.01	2604.23
Saccade R	1	11	27178818464	27178858214	39750	917.89	534.41	688.11	530.66	2.17	133.76	0.50	54.52	2949.57	-3063.01	2604.23
Fixation L	1	12	27178858214	27179096954	238740	684.27	514.33	41	34	-1	16.12	16.12
Fixation R	1	12	27178858214	27179096954	238740	684.27	514.33	41	34	-1	15.65	15.65
Saccade L	1	12	27179096954	27179116821	19867	647.57	496.04	578.21	490.22	0.61	70.40	1.00	30.56	1730.52	-1306.64	1314.98
Saccade R	1	12	27179096954	27179116821	19867	647.57	496.04	578.21	490.22	0.61	70.40	1.00	30.56	1730.52	-1306.64	1314.98
Fixation L	1	13	27179116821	27179275937	159116	564.57	484.29	27	19	-1	15.65	15.65
Fixation R	1	13	27179116821	27179275937	159116	564.57	484.29	27	19	-1	15.25	15.25
