[BeGaze]
Converted from:	C:\Documents and Settings\iViewX\Desktop\EXPERIMENTATIONS\Experiments\results\finaleart\S5121332-finaleart-1.idf
Date:	27.03.2019 15:34:59
Version:	BeGaze 2.5.77
Sample Rate:	50
Subject:	S5121332
Description:	Dylan Marinho

Table Header for Fixations:
Event Type	Trial	Number	Start	End	Duration	Location X	Location Y	Dispersion X	Dispersion Y	Plane	Avg. Pupil Size X	Avg. Pupil Size Y

Table Header for Saccades:
Event Type	Trial	Number	Start	End	Duration	Start Loc.X	Start Loc.Y	End Loc.X	End Loc.Y	Amplitude	Peak Speed	Peak Speed At	Average Speed	Peak Accel.	Peak Decel.	Average Accel.

Table Header for Blinks:
Event Type	Trial	Number	Start	End	Duration

Table Header for User Events:
Event Type	Trial	Number	Start	Description

UserEvent	1	1	9079048577	# Message: chase-a-study-in-curves-1890.jpg
Fixation L	1	1	9079067008	9079544359	477351	958.88	566.95	12	17	-1	17.73	17.73
Fixation R	1	1	9079067008	9079544359	477351	958.88	566.95	12	17	-1	17.19	17.19
Saccade L	1	1	9079544359	9079584223	39864	955.91	564.91	526.23	584.88	3.73	244.21	0.50	93.57	5937.28	-5811.69	5171.77
Saccade R	1	1	9079544359	9079584223	39864	955.91	564.91	526.23	584.88	3.73	244.21	0.50	93.57	5937.28	-5811.69	5171.77
Fixation L	1	2	9079584223	9079783104	198881	537.68	607.27	58	34	-1	17.86	17.86
Fixation R	1	2	9079584223	9079783104	198881	537.68	607.27	58	34	-1	17.64	17.64
Saccade L	1	2	9079783104	9079802957	19853	491.23	619.15	300.68	615.91	1.28	192.73	1.00	64.28	4747.34	-4659.26	3594.87
Saccade R	1	2	9079783104	9079802957	19853	491.23	619.15	300.68	615.91	1.28	192.73	1.00	64.28	4747.34	-4659.26	3594.87
Fixation L	1	3	9079802957	9080379805	576848	297.59	600.09	31	24	-1	17.53	17.53
Fixation R	1	3	9079802957	9080379805	576848	297.59	600.09	31	24	-1	17.19	17.19
Saccade L	1	3	9080379805	9080439423	59618	306.52	617.06	1004.95	525.19	7.44	282.03	0.67	124.81	6911.95	-6929.25	5376.73
Saccade R	1	3	9080379805	9080439423	59618	306.52	617.06	1004.95	525.19	7.44	282.03	0.67	124.81	6911.95	-6929.25	5376.73
Fixation L	1	4	9080439423	9080598542	159119	995.48	519.95	14	16	-1	17.86	17.86
Fixation R	1	4	9080439423	9080598542	159119	995.48	519.95	14	16	-1	17.51	17.51
Saccade L	1	4	9080598542	9080618409	19867	991.92	513.08	1002.52	417.76	0.87	97.02	1.00	43.90	2414.50	-2091.86	2116.68
Saccade R	1	4	9080598542	9080618409	19867	991.92	513.08	1002.52	417.76	0.87	97.02	1.00	43.90	2414.50	-2091.86	2116.68
Fixation L	1	5	9080618409	9080777519	159110	1015.35	365.03	25	74	-1	17.92	17.92
Fixation R	1	5	9080618409	9080777519	159110	1015.35	365.03	25	74	-1	17.39	17.39
Saccade L	1	5	9080777519	9080797509	19990	1027.63	359.07	1029.02	363.83	0.06	5.02	1.00	2.96	63.57	-102.17	59.20
Saccade R	1	5	9080777519	9080797509	19990	1027.63	359.07	1029.02	363.83	0.06	5.02	1.00	2.96	63.57	-102.17	59.20
Fixation L	1	6	9080797509	9081016263	218754	1033.24	364.89	7	8	-1	17.98	17.98
Fixation R	1	6	9080797509	9081016263	218754	1033.24	364.89	7	8	-1	17.55	17.55
Saccade L	1	6	9081016263	9081075882	59619	1036.35	370.37	1326.29	751.11	5.17	230.41	0.67	86.72	5637.70	-5381.48	3573.48
Saccade R	1	6	9081016263	9081075882	59619	1036.35	370.37	1326.29	751.11	5.17	230.41	0.67	86.72	5637.70	-5381.48	3573.48
Fixation L	1	7	9081075882	9081314614	238732	1326.24	737.80	16	23	-1	18.63	18.63
Fixation R	1	7	9081075882	9081314614	238732	1326.24	737.80	16	23	-1	18.26	18.26
Saccade L	1	7	9081314614	9081354379	39765	1333.52	738.91	1643.73	744.08	2.68	173.25	0.50	67.36	4198.68	-4311.59	3755.30
Saccade R	1	7	9081314614	9081354379	39765	1333.52	738.91	1643.73	744.08	2.68	173.25	0.50	67.36	4198.68	-4311.59	3755.30
Fixation L	1	8	9081354379	9081513478	159099	1638.73	745.45	10	9	-1	18.58	18.58
Fixation R	1	8	9081354379	9081513478	159099	1638.73	745.45	10	9	-1	18.09	18.09
Blink L	1	1	9081513478	9081712334	198856
Blink R	1	1	9081513478	9081712334	198856
Saccade L	1	8	9081712334	9081791957	79623	1643.88	732.23	1521.20	627.50	2.73	117.09	1.00	34.32	2819.12	-2681.53	1296.17
Saccade R	1	8	9081712334	9081791957	79623	1643.88	732.23	1521.20	627.50	2.73	117.09	1.00	34.32	2819.12	-2681.53	1296.17
Fixation L	1	9	9081791957	9083005259	1213302	1509.84	609.96	29	46	-1	18.58	18.58
Fixation R	1	9	9081791957	9083005259	1213302	1509.84	609.96	29	46	-1	19.14	19.14
Saccade L	1	9	9083005259	9083045001	39742	1494.08	612.39	1539.44	468.20	1.60	102.67	0.50	40.32	2517.46	0.00	1275.08
Saccade R	1	9	9083005259	9083045001	39742	1494.08	612.39	1539.44	468.20	1.60	102.67	0.50	40.32	2517.46	0.00	1275.08
