[BeGaze]
Converted from:	C:\Documents and Settings\iViewX\Desktop\EXPERIMENTATIONS\Experiments\results\finaleart\S15H25531-finaleart-1.idf
Date:	27.03.2019 15:45:45
Version:	BeGaze 2.5.77
Sample Rate:	50
Subject:	S15H25531
Description:	Mikail Demirdelen

Table Header for Fixations:
Event Type	Trial	Number	Start	End	Duration	Location X	Location Y	Dispersion X	Dispersion Y	Plane	Avg. Pupil Size X	Avg. Pupil Size Y

Table Header for Saccades:
Event Type	Trial	Number	Start	End	Duration	Start Loc.X	Start Loc.Y	End Loc.X	End Loc.Y	Amplitude	Peak Speed	Peak Speed At	Average Speed	Peak Accel.	Peak Decel.	Average Accel.

Table Header for Blinks:
Event Type	Trial	Number	Start	End	Duration

Table Header for User Events:
Event Type	Trial	Number	Start	Description

UserEvent	1	1	4596391543	# Message: La_Ferme_des_Collettes_Renoir_1908.jpg
Fixation L	1	1	4596403317	4596622052	218735	946.85	621.01	55	43	-1	10.24	10.24
Fixation R	1	1	4596403317	4596622052	218735	946.85	621.01	55	43	-1	10.80	10.80
Saccade L	1	1	4596622052	4596641923	19871	970.42	607.53	965.93	577.86	0.27	30.36	1.00	13.37	649.49	-9.50	285.68
Saccade R	1	1	4596622052	4596641923	19871	970.42	607.53	965.93	577.86	0.27	30.36	1.00	13.37	649.49	-9.50	285.68
Fixation L	1	2	4596641923	4596880653	238730	963.88	594.71	7	51	-1	10.09	10.09
Fixation R	1	2	4596641923	4596880653	238730	963.88	594.71	7	51	-1	10.59	10.59
Saccade L	1	2	4596880653	4596900531	19878	963.43	608.55	877.47	570.35	0.82	95.14	1.00	41.34	1314.05	-1838.23	1103.97
Saccade R	1	2	4596880653	4596900531	19878	963.43	608.55	877.47	570.35	0.82	95.14	1.00	41.34	1314.05	-1838.23	1103.97
Fixation L	1	3	4596900531	4597000030	99499	869.77	573.40	13	21	-1	9.79	9.79
Fixation R	1	3	4596900531	4597000030	99499	869.77	573.40	13	21	-1	10.74	10.74
Saccade L	1	3	4597000030	4597039781	39751	864.43	571.28	846.06	421.66	1.90	110.65	0.50	47.68	2293.07	-1431.51	1498.52
Saccade R	1	3	4597000030	4597039781	39751	864.43	571.28	846.06	421.66	1.90	110.65	0.50	47.68	2293.07	-1431.51	1498.52
Fixation L	1	4	4597039781	4597318263	278482	814.89	381.78	42	51	-1	10.15	10.15
Fixation R	1	4	4597039781	4597318263	278482	814.89	381.78	42	51	-1	11.08	11.08
Saccade L	1	4	4597318263	4597338140	19877	803.88	387.08	926.40	384.93	0.67	123.94	1.00	33.51	3088.32	-2904.88	2038.83
Saccade R	1	4	4597318263	4597338140	19877	803.88	387.08	926.40	384.93	0.67	123.94	1.00	33.51	3088.32	-2904.88	2038.83
Fixation L	1	5	4597338140	4597497258	159118	911.48	382.53	21	8	-1	10.09	10.09
Fixation R	1	5	4597338140	4597497258	159118	911.48	382.53	21	8	-1	10.88	10.88
Saccade L	1	5	4597497258	4597556879	59621	904.45	377.89	1414.64	382.79	5.27	274.39	0.67	88.35	6730.18	-6712.30	4061.59
Saccade R	1	5	4597497258	4597556879	59621	904.45	377.89	1414.64	382.79	5.27	274.39	0.67	88.35	6730.18	-6712.30	4061.59
Fixation L	1	6	4597556879	4597855242	298363	1417.56	404.93	7	45	-1	10.23	10.23
Fixation R	1	6	4597556879	4597855242	298363	1417.56	404.93	7	45	-1	10.90	10.90
Saccade L	1	6	4597855242	4597875115	19873	1415.84	425.04	1301.08	437.72	0.96	116.78	1.00	48.13	2878.31	-2812.65	2510.95
Saccade R	1	6	4597855242	4597875115	19873	1415.84	425.04	1301.08	437.72	0.96	116.78	1.00	48.13	2878.31	-2812.65	2510.95
Fixation L	1	7	4597875115	4598034236	159121	1237.20	437.32	74	9	-1	10.50	10.50
Fixation R	1	7	4597875115	4598034236	159121	1237.20	437.32	74	9	-1	11.17	11.17
Saccade L	1	7	4598034236	4598074105	39869	1230.01	438.38	979.27	455.48	2.24	154.56	1.00	56.11	3749.16	-3587.36	2944.29
Saccade R	1	7	4598034236	4598074105	39869	1230.01	438.38	979.27	455.48	2.24	154.56	1.00	56.11	3749.16	-3587.36	2944.29
Fixation L	1	8	4598074105	4598253089	178984	977.70	473.11	9	26	-1	10.48	10.48
Fixation R	1	8	4598074105	4598253089	178984	977.70	473.11	9	26	-1	11.11	11.11
Saccade L	1	8	4598253089	4598292843	39754	973.96	482.20	1149.20	697.77	2.34	145.73	0.50	58.96	3584.83	-3497.60	3447.10
Saccade R	1	8	4598253089	4598292843	39754	973.96	482.20	1149.20	697.77	2.34	145.73	0.50	58.96	3584.83	-3497.60	3447.10
Fixation L	1	9	4598292843	4598471840	178997	1136.81	706.42	29	18	-1	11.06	11.06
Fixation R	1	9	4598292843	4598471840	178997	1136.81	706.42	29	18	-1	12.19	12.19
Saccade L	1	9	4598471840	4598491711	19871	1119.90	716.09	882.72	706.96	1.34	239.97	1.00	67.49	5913.87	-5744.14	3908.08
Saccade R	1	9	4598471840	4598491711	19871	1119.90	716.09	882.72	706.96	1.34	239.97	1.00	67.49	5913.87	-5744.14	3908.08
Fixation L	1	10	4598491711	4598889567	397856	886.18	698.93	10	25	-1	11.13	11.13
Fixation R	1	10	4598491711	4598889567	397856	886.18	698.93	10	25	-1	12.43	12.43
Saccade L	1	10	4598889567	4598909435	19868	890.56	695.16	1011.24	757.48	1.05	137.37	1.00	53.06	3114.54	-2288.20	2217.69
Saccade R	1	10	4598889567	4598909435	19868	890.56	695.16	1011.24	757.48	1.05	137.37	1.00	53.06	3114.54	-2288.20	2217.69
Fixation L	1	11	4598909435	4599048684	139249	1054.84	760.05	52	45	-1	11.22	11.22
Fixation R	1	11	4598909435	4599048684	139249	1054.84	760.05	52	45	-1	12.33	12.33
Saccade L	1	11	4599048684	4599108303	59619	1063.45	766.86	760.16	374.06	5.17	223.05	0.67	86.73	5521.86	-5393.28	3736.31
Saccade R	1	11	4599048684	4599108303	59619	1063.45	766.86	760.16	374.06	5.17	223.05	0.67	86.73	5521.86	-5393.28	3736.31
Fixation L	1	12	4599108303	4599406663	298360	750.42	390.30	16	35	-1	10.62	10.62
Fixation R	1	12	4599108303	4599406663	298360	750.42	390.30	16	35	-1	11.95	11.95
Saccade L	1	12	4599406663	4599426542	19879	743.41	396.23	810.24	389.05	0.45	67.99	1.00	22.43	1445.20	-1609.13	1030.94
Saccade R	1	12	4599406663	4599426542	19879	743.41	396.23	810.24	389.05	0.45	67.99	1.00	22.43	1445.20	-1609.13	1030.94
Fixation L	1	13	4599426542	4599705026	278484	818.60	369.84	16	41	-1	10.43	10.43
Fixation R	1	13	4599426542	4599705026	278484	818.60	369.84	16	41	-1	11.55	11.55
Saccade L	1	13	4599705026	4599724895	19869	821.03	359.79	755.33	371.16	0.46	67.45	1.00	23.24	1541.16	-1505.48	1087.22
Saccade R	1	13	4599705026	4599724895	19869	821.03	359.79	755.33	371.16	0.46	67.45	1.00	23.24	1541.16	-1505.48	1087.22
Fixation L	1	14	4599724895	4599903897	179002	733.38	375.14	70	27	-1	10.42	10.42
Fixation R	1	14	4599724895	4599903897	179002	733.38	375.14	70	27	-1	11.62	11.62
Saccade L	1	14	4599903897	4599943755	39858	684.83	392.76	608.00	416.78	1.26	68.76	0.50	31.64	1559.61	-1306.15	1004.16
Saccade R	1	14	4599903897	4599943755	39858	684.83	392.76	608.00	416.78	1.26	68.76	0.50	31.64	1559.61	-1306.15	1004.16
Fixation L	1	15	4599943755	4600043132	99377	597.07	459.11	18	73	-1	10.33	10.33
Fixation R	1	15	4599943755	4600043132	99377	597.07	459.11	18	73	-1	11.64	11.64
Saccade L	1	15	4600043132	4600063023	19891	589.87	490.24	591.58	507.01	0.19	17.06	1.00	9.55	142.82	-226.32	151.96
Saccade R	1	15	4600043132	4600063023	19891	589.87	490.24	591.58	507.01	0.19	17.06	1.00	9.55	142.82	-226.32	151.96
Fixation L	1	16	4600063023	4600162500	99477	588.21	520.33	6	22	-1	10.31	10.31
Fixation R	1	16	4600063023	4600162500	99477	588.21	520.33	6	22	-1	11.80	11.80
Saccade L	1	16	4600162500	4600202254	39754	585.42	529.50	933.52	506.70	2.88	236.56	1.00	72.43	5808.98	-5472.24	4240.48
Saccade R	1	16	4600162500	4600202254	39754	585.42	529.50	933.52	506.70	2.88	236.56	1.00	72.43	5808.98	-5472.24	4240.48
Fixation L	1	17	4600202254	4600381369	179115	940.16	483.60	12	40	-1	10.50	10.50
Fixation R	1	17	4600202254	4600381369	179115	940.16	483.60	12	40	-1	11.40	11.40
