[BeGaze]
Converted from:	C:\Documents and Settings\iViewX\Desktop\EXPERIMENTATIONS\Experiments\results\finaleart\S18F56223-finaleart-1.idf
Date:	27.03.2019 15:48:12
Version:	BeGaze 2.5.77
Sample Rate:	50
Subject:	S18F56223
Description:	Pascale Sebillot

Table Header for Fixations:
Event Type	Trial	Number	Start	End	Duration	Location X	Location Y	Dispersion X	Dispersion Y	Plane	Avg. Pupil Size X	Avg. Pupil Size Y

Table Header for Saccades:
Event Type	Trial	Number	Start	End	Duration	Start Loc.X	Start Loc.Y	End Loc.X	End Loc.Y	Amplitude	Peak Speed	Peak Speed At	Average Speed	Peak Accel.	Peak Decel.	Average Accel.

Table Header for Blinks:
Event Type	Trial	Number	Start	End	Duration

Table Header for User Events:
Event Type	Trial	Number	Start	Description

UserEvent	1	1	2215162840	# Message: void.jpg
Fixation L	1	1	2215165891	2215265270	99379	230.50	291.37	69	29	-1	13.78	13.78
Fixation R	1	1	2215165891	2215265270	99379	230.50	291.37	69	29	-1	13.32	13.32
Saccade L	1	1	2215265270	2215285257	19987	257.71	269.95	272.75	301.12	0.60	43.55	0.00	30.05	192.76	-730.87	419.76
Saccade R	1	1	2215265270	2215285257	19987	257.71	269.95	272.75	301.12	0.60	43.55	0.00	30.05	192.76	-730.87	419.76
Fixation L	1	2	2215285257	2215404502	119245	286.84	304.76	66	18	-1	14.02	14.02
Fixation R	1	2	2215285257	2215404502	119245	286.84	304.76	66	18	-1	13.86	13.86
Saccade L	1	2	2215404502	2215921751	517249	325.00	306.01	733.42	772.38	104.79	641.51	0.31	202.59	14551.09	-15603.57	6866.09
Saccade R	1	2	2215404502	2215921751	517249	325.00	306.01	733.42	772.38	104.79	641.51	0.31	202.59	14551.09	-15603.57	6866.09
Fixation L	1	3	2215921751	2216021113	99362	708.99	794.58	56	42	-1	13.69	13.69
Fixation R	1	3	2215921751	2216021113	99362	708.99	794.58	56	42	-1	13.26	13.26
Saccade L	1	3	2216021113	2216100717	79604	677.01	803.51	860.78	513.83	6.45	373.16	1.00	80.97	8253.57	-8238.80	2997.78
Saccade R	1	3	2216021113	2216100717	79604	677.01	803.51	860.78	513.83	6.45	373.16	1.00	80.97	8253.57	-8238.80	2997.78
Fixation L	1	4	2216100717	2216220092	119375	836.53	530.03	41	45	-1	13.72	13.72
Fixation R	1	4	2216100717	2216220092	119375	836.53	530.03	41	45	-1	13.49	13.49
Saccade L	1	4	2216220092	2216259831	39739	819.03	526.05	814.27	521.44	6.87	417.51	1.00	172.79	10245.09	-10221.51	10082.65
Saccade R	1	4	2216220092	2216259831	39739	819.03	526.05	814.27	521.44	6.87	417.51	1.00	172.79	10245.09	-10221.51	10082.65
Fixation L	1	5	2216259831	2216359334	99503	811.38	512.82	25	68	-1	14.07	14.07
Fixation R	1	5	2216259831	2216359334	99503	811.38	512.82	25	68	-1	13.61	13.61
Saccade L	1	5	2216359334	2216458698	99364	793.76	558.31	694.36	563.61	22.51	426.49	1.00	226.55	8161.79	-10167.23	5547.85
Saccade R	1	5	2216359334	2216458698	99364	793.76	558.31	694.36	563.61	22.51	426.49	1.00	226.55	8161.79	-10167.23	5547.85
Fixation L	1	6	2216458698	2216558207	99509	689.46	572.20	8	29	-1	14.32	14.32
Fixation R	1	6	2216458698	2216558207	99509	689.46	572.20	8	29	-1	13.64	13.64
Saccade L	1	6	2216558207	2216637688	79481	688.61	586.05	681.33	609.45	21.35	476.91	1.00	268.63	11070.41	-11534.90	7569.30
Saccade R	1	6	2216558207	2216637688	79481	688.61	586.05	681.33	609.45	21.35	476.91	1.00	268.63	11070.41	-11534.90	7569.30
Fixation L	1	7	2216637688	2216757062	119374	679.99	598.92	11	57	-1	14.57	14.57
Fixation R	1	7	2216637688	2216757062	119374	679.99	598.92	11	57	-1	13.95	13.95
Saccade L	1	7	2216757062	2216916178	159116	674.13	633.76	667.27	689.04	18.71	334.16	0.25	117.61	7393.59	-8293.34	5591.46
Saccade R	1	7	2216757062	2216916178	159116	674.13	633.76	667.27	689.04	18.71	334.16	0.25	117.61	7393.59	-8293.34	5591.46
Fixation L	1	8	2216916178	2217154922	238744	665.26	705.69	14	45	-1	15.27	15.27
Fixation R	1	8	2216916178	2217154922	238744	665.26	705.69	14	45	-1	14.82	14.82
