[BeGaze]
Converted from:	C:\Documents and Settings\iViewX\Desktop\EXPERIMENTATIONS\Experiments\results\finaleart\S12H22222-finaleart-1.idf
Date:	27.03.2019 15:40:20
Version:	BeGaze 2.5.77
Sample Rate:	50
Subject:	S12H22222
Description:	aurele barriere

Table Header for Fixations:
Event Type	Trial	Number	Start	End	Duration	Location X	Location Y	Dispersion X	Dispersion Y	Plane	Avg. Pupil Size X	Avg. Pupil Size Y

Table Header for Saccades:
Event Type	Trial	Number	Start	End	Duration	Start Loc.X	Start Loc.Y	End Loc.X	End Loc.Y	Amplitude	Peak Speed	Peak Speed At	Average Speed	Peak Accel.	Peak Decel.	Average Accel.

Table Header for Blinks:
Event Type	Trial	Number	Start	End	Duration

Table Header for User Events:
Event Type	Trial	Number	Start	Description

UserEvent	1	1	23397565142	# Message: void.jpg
Fixation L	1	1	23397569636	23397768465	198829	821.23	320.13	88	7	-1	13.45	13.45
Fixation R	1	1	23397569636	23397768465	198829	821.23	320.13	88	7	-1	12.90	12.90
Saccade L	1	1	23397768465	23397788334	19869	759.64	320.69	752.14	319.95	0.18	16.61	1.00	9.26	-134.56	-224.56	186.57
Saccade R	1	1	23397768465	23397788334	19869	759.64	320.69	752.14	319.95	0.18	16.61	1.00	9.26	-134.56	-224.56	186.57
Fixation L	1	2	23397788334	23398106575	318241	745.49	311.46	17	19	-1	13.54	13.54
Fixation R	1	2	23397788334	23398106575	318241	745.49	311.46	17	19	-1	12.94	12.94
Saccade L	1	2	23398106575	23398206069	99494	753.54	306.36	994.64	474.05	4.40	88.79	0.20	44.27	2172.67	-1750.92	1318.95
Saccade R	1	2	23398106575	23398206069	99494	753.54	306.36	994.64	474.05	4.40	88.79	0.20	44.27	2172.67	-1750.92	1318.95
Fixation L	1	3	23398206069	23398802798	596729	1001.19	513.74	14	84	-1	13.96	13.96
Fixation R	1	3	23398206069	23398802798	596729	1001.19	513.74	14	84	-1	13.58	13.58
Saccade L	1	3	23398802798	23398822663	19865	1003.78	553.49	1003.22	558.95	0.14	13.92	0.00	7.02	18.20	-253.24	120.00
Saccade R	1	3	23398802798	23398822663	19865	1003.78	553.49	1003.22	558.95	0.14	13.92	0.00	7.02	18.20	-253.24	120.00
Fixation L	1	4	23398822663	23399558637	735974	1009.40	570.57	11	19	-1	14.90	14.90
Fixation R	1	4	23398822663	23399558637	735974	1009.40	570.57	11	19	-1	14.52	14.52
