[BeGaze]
Converted from:	C:\Documents and Settings\iViewX\Desktop\EXPERIMENTATIONS\Experiments\results\finaleart\S02123220-finaleart-1.idf
Date:	27.03.2019 15:33:29
Version:	BeGaze 2.5.77
Sample Rate:	50
Subject:	S02123220
Description:	David Xu

Table Header for Fixations:
Event Type	Trial	Number	Start	End	Duration	Location X	Location Y	Dispersion X	Dispersion Y	Plane	Avg. Pupil Size X	Avg. Pupil Size Y

Table Header for Saccades:
Event Type	Trial	Number	Start	End	Duration	Start Loc.X	Start Loc.Y	End Loc.X	End Loc.Y	Amplitude	Peak Speed	Peak Speed At	Average Speed	Peak Accel.	Peak Decel.	Average Accel.

Table Header for Blinks:
Event Type	Trial	Number	Start	End	Duration

Table Header for User Events:
Event Type	Trial	Number	Start	Description

UserEvent	1	1	477071596	# Message: goya-Pavo-muerto-1812.jpg
Fixation L	1	1	477082903	477540366	457463	889.16	564.23	71	19	-1	17.39	17.39
Fixation R	1	1	477082903	477540366	457463	889.16	564.23	71	19	-1	16.98	16.98
Saccade L	1	1	477540366	477560239	19873	865.61	557.45	969.56	554.52	0.70	105.19	1.00	35.29	2570.21	-2329.17	1676.50
Saccade R	1	1	477540366	477560239	19873	865.61	557.45	969.56	554.52	0.70	105.19	1.00	35.29	2570.21	-2329.17	1676.50
Fixation L	1	2	477560239	478097331	537092	979.02	574.64	50	36	-1	17.49	17.49
Fixation R	1	2	477560239	478097331	537092	979.02	574.64	50	36	-1	16.63	16.63
Saccade L	1	2	478097331	478117202	19871	944.50	573.28	926.84	565.97	0.40	51.26	0.00	19.98	422.65	-1108.91	605.36
Saccade R	1	2	478097331	478117202	19871	944.50	573.28	926.84	565.97	0.40	51.26	0.00	19.98	422.65	-1108.91	605.36
Fixation L	1	3	478117202	478475173	357971	902.90	560.88	58	41	-1	17.86	17.86
Fixation R	1	3	478117202	478475173	357971	902.90	560.88	58	41	-1	17.30	17.30
Saccade L	1	3	478475173	478495058	19885	872.93	578.92	871.44	582.10	0.08	10.70	1.00	4.20	-15.33	-178.77	74.66
Saccade R	1	3	478475173	478495058	19885	872.93	578.92	871.44	582.10	0.08	10.70	1.00	4.20	-15.33	-178.77	74.66
Fixation L	1	4	478495058	479032152	537094	871.20	587.72	5	26	-1	18.17	18.17
Fixation R	1	4	478495058	479032152	537094	871.20	587.72	5	26	-1	17.38	17.38
Saccade L	1	4	479032152	479052022	19870	870.85	594.04	951.42	601.74	0.64	81.88	1.00	32.34	2020.15	-1625.34	1545.01
Saccade R	1	4	479032152	479052022	19870	870.85	594.04	951.42	601.74	0.64	81.88	1.00	32.34	2020.15	-1625.34	1545.01
Fixation L	1	5	479052022	479410002	357980	1007.47	613.49	66	24	-1	18.36	18.36
Fixation R	1	5	479052022	479410002	357980	1007.47	613.49	66	24	-1	17.15	17.15
Saccade L	1	5	479410002	479429873	19871	1018.14	620.50	1023.75	703.42	0.61	84.06	1.00	30.86	2033.62	-1725.28	1452.14
Saccade R	1	5	479410002	479429873	19871	1018.14	620.50	1023.75	703.42	0.61	84.06	1.00	30.86	2033.62	-1725.28	1452.14
Fixation L	1	6	479429873	479569116	139243	1043.31	723.43	57	31	-1	18.70	18.70
Fixation R	1	6	479429873	479569116	139243	1043.31	723.43	57	31	-1	17.23	17.23
Saccade L	1	6	479569116	479608861	39745	1004.53	734.68	674.14	863.10	3.41	260.41	0.50	85.71	6401.73	-6382.78	3998.96
Saccade R	1	6	479569116	479608861	39745	1004.53	734.68	674.14	863.10	3.41	260.41	0.50	85.71	6401.73	-6382.78	3998.96
Fixation L	1	7	479608861	479927086	318225	662.98	854.87	20	12	-1	18.72	18.72
Fixation R	1	7	479608861	479927086	318225	662.98	854.87	20	12	-1	18.17	18.17
Saccade L	1	7	479927086	479947098	20012	659.27	854.85	576.78	976.09	0.88	148.31	1.00	44.15	3605.55	-3451.65	2512.99
Saccade R	1	7	479927086	479947098	20012	659.27	854.85	576.78	976.09	0.88	148.31	1.00	44.15	3605.55	-3451.65	2512.99
Fixation L	1	8	479947098	480185702	238604	571.69	1001.66	35	35	-1	18.55	18.55
Fixation R	1	8	479947098	480185702	238604	571.69	1001.66	35	35	-1	18.26	18.26
Saccade L	1	8	480185702	480205570	19868	543.43	1001.03	490.61	1004.08	0.53	53.53	1.00	26.66	1056.34	-1200.74	983.80
Saccade R	1	8	480185702	480205570	19868	543.43	1001.03	490.61	1004.08	0.53	53.53	1.00	26.66	1056.34	-1200.74	983.80
Fixation L	1	9	480205570	480324949	119379	482.46	996.51	15	11	-1	18.26	18.26
Fixation R	1	9	480205570	480324949	119379	482.46	996.51	15	11	-1	18.33	18.33
Saccade L	1	9	480324949	480364685	39736	481.75	997.16	844.65	1036.53	3.52	275.89	1.00	88.63	6736.60	-6235.72	4721.18
Saccade R	1	9	480324949	480364685	39736	481.75	997.16	844.65	1036.53	3.52	275.89	1.00	88.63	6736.60	-6235.72	4721.18
Fixation L	1	10	480364685	480921658	556973	866.73	1054.81	31	68	-1	19.10	19.10
Fixation R	1	10	480364685	480921658	556973	866.73	1054.81	31	68	-1	18.27	18.27
Saccade L	1	10	480921658	480961402	39744	862.83	1067.69	875.43	520.44	4.64	309.80	0.50	116.71	7617.72	-7423.39	6695.98
Saccade R	1	10	480921658	480961402	39744	862.83	1067.69	875.43	520.44	4.64	309.80	0.50	116.71	7617.72	-7423.39	6695.98
Fixation L	1	11	480961402	481060896	99494	882.44	532.45	15	18	-1	19.43	19.43
Fixation R	1	11	480961402	481060896	99494	882.44	532.45	15	18	-1	18.42	18.42
