[BeGaze]
Converted from:	C:\Documents and Settings\iViewX\Desktop\EXPERIMENTATIONS\Experiments\results\finaleart\S22H22551-finaleart-1.idf
Date:	27.03.2019 15:57:58
Version:	BeGaze 2.5.77
Sample Rate:	50
Subject:	S22H22551
Description:	Mathieu Chambre

Table Header for Fixations:
Event Type	Trial	Number	Start	End	Duration	Location X	Location Y	Dispersion X	Dispersion Y	Plane	Avg. Pupil Size X	Avg. Pupil Size Y

Table Header for Saccades:
Event Type	Trial	Number	Start	End	Duration	Start Loc.X	Start Loc.Y	End Loc.X	End Loc.Y	Amplitude	Peak Speed	Peak Speed At	Average Speed	Peak Accel.	Peak Decel.	Average Accel.

Table Header for Blinks:
Event Type	Trial	Number	Start	End	Duration

Table Header for User Events:
Event Type	Trial	Number	Start	Description

UserEvent	1	1	5295811492	# Message: void.jpg
Saccade L	1	1	5295817873	5295837746	19873	585.98	1090.69	401.20	1072.19	1.37	187.79	1.00	68.88	470.84	-4575.13	1681.99
Saccade R	1	1	5295817873	5295837746	19873	585.98	1090.69	401.20	1072.19	1.37	187.79	1.00	68.88	470.84	-4575.13	1681.99
Fixation L	1	1	5295837746	5295977270	139524	422.78	1058.42	50	25	-1	21.22	21.22
Fixation R	1	1	5295837746	5295977270	139524	422.78	1058.42	50	25	-1	21.27	21.27
Saccade L	1	2	5295977270	5295996862	19592	451.83	1046.20	683.77	789.18	1.93	349.80	1.00	98.43	8587.04	-8612.44	5898.22
Saccade R	1	2	5295977270	5295996862	19592	451.83	1046.20	683.77	789.18	1.93	349.80	1.00	98.43	8587.04	-8612.44	5898.22
Fixation L	1	2	5295996862	5296255472	258610	689.03	777.03	9	33	-1	19.62	19.62
Fixation R	1	2	5295996862	5296255472	258610	689.03	777.03	9	33	-1	19.62	19.62
Blink L	1	1	5296255472	5296434456	178984
Blink R	1	1	5296255472	5296434456	178984
Fixation L	1	3	5296434456	5297269790	835334	1078.70	388.34	42	42	-1	17.27	17.27
Fixation R	1	3	5296434456	5297269790	835334	1078.70	388.34	42	42	-1	16.91	16.91
Saccade L	1	3	5297269790	5297289676	19886	1051.42	390.79	1035.68	406.09	0.28	26.10	1.00	14.28	53.52	-272.25	140.97
Saccade R	1	3	5297269790	5297289676	19886	1051.42	390.79	1035.68	406.09	0.28	26.10	1.00	14.28	53.52	-272.25	140.97
Fixation L	1	4	5297289676	5297627901	338225	1019.33	428.96	54	41	-1	17.57	17.57
Fixation R	1	4	5297289676	5297627901	338225	1019.33	428.96	54	41	-1	17.35	17.35
Saccade L	1	4	5297627901	5297647765	19864	986.71	447.77	978.29	450.89	0.13	9.08	1.00	6.54	34.41	-94.79	54.08
Saccade R	1	4	5297627901	5297647765	19864	986.71	447.77	978.29	450.89	0.13	9.08	1.00	6.54	34.41	-94.79	54.08
Fixation L	1	5	5297647765	5297806887	159122	974.02	459.13	10	11	-1	18.06	18.06
Fixation R	1	5	5297647765	5297806887	159122	974.02	459.13	10	11	-1	17.78	17.78
