[BeGaze]
Converted from:	C:\Documents and Settings\iViewX\Desktop\EXPERIMENTATIONS\Experiments\results\finaleart\S3121421-finaleart-1.idf
Date:	27.03.2019 15:33:53
Version:	BeGaze 2.5.77
Sample Rate:	50
Subject:	S3121421
Description:	Jean Jouve

Table Header for Fixations:
Event Type	Trial	Number	Start	End	Duration	Location X	Location Y	Dispersion X	Dispersion Y	Plane	Avg. Pupil Size X	Avg. Pupil Size Y

Table Header for Saccades:
Event Type	Trial	Number	Start	End	Duration	Start Loc.X	Start Loc.Y	End Loc.X	End Loc.Y	Amplitude	Peak Speed	Peak Speed At	Average Speed	Peak Accel.	Peak Decel.	Average Accel.

Table Header for Blinks:
Event Type	Trial	Number	Start	End	Duration

Table Header for User Events:
Event Type	Trial	Number	Start	Description

UserEvent	1	1	4241134119	# Message: void.jpg
Saccade L	1	1	4241152439	4241231931	79492	598.95	138.74	604.92	162.97	8.74	631.20	1.00	109.90	15472.22	-65.04	2622.66
Saccade R	1	1	4241152439	4241231931	79492	598.95	138.74	604.92	162.97	8.74	631.20	1.00	109.90	15472.22	-65.04	2622.66
Blink L	1	1	4241231931	4241391040	159109
Blink R	1	1	4241311558	4241391040	79482
Fixation L	1	1	4241391040	4241888263	497223	627.15	298.61	21	42	-1	11.23	11.23
Fixation R	1	1	4241391040	4241888263	497223	627.15	298.61	21	42	-1	11.85	11.85
Saccade L	1	2	4241888263	4241948011	59748	638.14	306.96	868.21	484.34	3.44	157.68	0.67	57.53	3897.52	-3209.38	2138.96
Saccade R	1	2	4241888263	4241948011	59748	638.14	306.96	868.21	484.34	3.44	157.68	0.67	57.53	3897.52	-3209.38	2138.96
Fixation L	1	2	4241948011	4242266244	318233	902.16	520.91	45	54	-1	11.87	11.87
Fixation R	1	2	4241948011	4242266244	318233	902.16	520.91	45	54	-1	12.48	12.48
Saccade L	1	3	4242266244	4242286119	19875	913.73	532.23	914.72	535.97	0.20	17.73	1.00	9.88	129.67	-345.53	234.74
Saccade R	1	3	4242266244	4242286119	19875	913.73	532.23	914.72	535.97	0.20	17.73	1.00	9.88	129.67	-345.53	234.74
Fixation L	1	3	4242286119	4242385488	99369	917.02	535.64	4	8	-1	12.21	12.21
Fixation R	1	3	4242286119	4242385488	99369	917.02	535.64	4	8	-1	12.70	12.70
Blink L	1	2	4242385488	4242544728	159240
Blink R	1	2	4242385488	4242544728	159240
Saccade L	1	4	4242544728	4242564591	19863	984.62	541.32	994.01	648.92	6.22	1125.86	1.00	313.33	244.21	-25415.42	9359.87
Saccade R	1	4	4242544728	4242564591	19863	984.62	541.32	994.01	648.92	6.22	1125.86	1.00	313.33	244.21	-25415.42	9359.87
Fixation L	1	4	4242564591	4243122178	557587	1007.30	622.38	29	43	-1	11.68	11.68
Fixation R	1	4	4242564591	4243122178	557587	1007.30	622.38	29	43	-1	12.15	12.15
