[BeGaze]
Converted from:	C:\Documents and Settings\iViewX\Desktop\EXPERIMENTATIONS\Experiments\results\finaleart\S02123220-finaleart-1.idf
Date:	27.03.2019 15:33:39
Version:	BeGaze 2.5.77
Sample Rate:	50
Subject:	S02123220
Description:	David Xu

Table Header for Fixations:
Event Type	Trial	Number	Start	End	Duration	Location X	Location Y	Dispersion X	Dispersion Y	Plane	Avg. Pupil Size X	Avg. Pupil Size Y

Table Header for Saccades:
Event Type	Trial	Number	Start	End	Duration	Start Loc.X	Start Loc.Y	End Loc.X	End Loc.Y	Amplitude	Peak Speed	Peak Speed At	Average Speed	Peak Accel.	Peak Decel.	Average Accel.

Table Header for Blinks:
Event Type	Trial	Number	Start	End	Duration

Table Header for User Events:
Event Type	Trial	Number	Start	Description

UserEvent	1	1	1484085682	# Message: cross-La-fuite-des-nymphes-1906.jpg
Fixation L	1	1	1484098554	1484416772	318218	951.60	285.17	25	55	-1	13.99	13.99
Fixation R	1	1	1484098554	1484416772	318218	951.60	285.17	25	55	-1	13.83	13.83
Saccade L	1	1	1484416772	1484456563	39791	964.26	320.48	1298.55	335.11	3.17	217.30	1.00	79.64	5356.95	-5107.65	3868.07
Saccade R	1	1	1484416772	1484456563	39791	964.26	320.48	1298.55	335.11	3.17	217.30	1.00	79.64	5356.95	-5107.65	3868.07
Fixation L	1	2	1484456563	1484854254	397691	1274.43	378.13	33	60	-1	12.61	12.61
Fixation R	1	2	1484456563	1484854254	397691	1274.43	378.13	33	60	-1	11.98	11.98
Saccade L	1	2	1484854254	1484874263	20009	1268.23	376.90	1277.67	431.42	0.36	55.98	1.00	18.22	1197.75	-604.49	618.59
Saccade R	1	2	1484854254	1484874263	20009	1268.23	376.90	1277.67	431.42	0.36	55.98	1.00	18.22	1197.75	-604.49	618.59
Fixation L	1	3	1484874263	1485013357	139094	1275.33	464.15	22	60	-1	11.70	11.70
Fixation R	1	3	1484874263	1485013357	139094	1275.33	464.15	22	60	-1	10.64	10.64
Saccade L	1	3	1485013357	1485073111	59754	1261.33	491.81	1270.10	620.06	1.92	109.65	1.00	32.19	2229.89	-1985.45	1101.57
Saccade R	1	3	1485013357	1485073111	59754	1261.33	491.81	1270.10	620.06	1.92	109.65	1.00	32.19	2229.89	-1985.45	1101.57
Fixation L	1	4	1485073111	1485291840	218729	1265.74	638.36	26	64	-1	11.84	11.84
Fixation R	1	4	1485073111	1485291840	218729	1265.74	638.36	26	64	-1	9.01	9.01
Blink L	1	1	1485291840	1485470840	179000
Blink R	1	1	1485291840	1485470840	179000
Blink L	1	2	1485490697	1485729443	238746
Blink R	1	2	1485490697	1485729443	238746
Fixation L	1	5	1485729443	1486087419	357976	871.19	628.46	29	27	-1	11.44	11.44
Fixation R	1	5	1485729443	1486087419	357976	871.19	628.46	29	27	-1	10.48	10.48
Saccade L	1	4	1486087419	1486127169	39750	863.82	634.41	613.75	480.54	2.81	176.98	1.00	70.66	4142.09	-3735.94	3631.40
Saccade R	1	4	1486087419	1486127169	39750	863.82	634.41	613.75	480.54	2.81	176.98	1.00	70.66	4142.09	-3735.94	3631.40
Fixation L	1	6	1486127169	1486485264	358095	593.80	450.72	31	39	-1	11.00	11.00
Fixation R	1	6	1486127169	1486485264	358095	593.80	450.72	31	39	-1	12.14	12.14
Saccade L	1	5	1486485264	1486505147	19883	587.31	457.71	418.95	435.59	0.98	171.72	1.00	49.44	4247.26	-4226.13	2941.91
Saccade R	1	5	1486485264	1486505147	19883	587.31	457.71	418.95	435.59	0.98	171.72	1.00	49.44	4247.26	-4226.13	2941.91
Fixation L	1	7	1486505147	1486843255	338108	417.20	433.19	18	33	-1	10.82	10.82
Fixation R	1	7	1486505147	1486843255	338108	417.20	433.19	18	33	-1	12.38	12.38
Saccade L	1	6	1486843255	1486902993	59738	427.75	423.60	884.69	322.78	5.13	182.10	0.33	85.82	4203.90	-4173.34	3389.03
Saccade R	1	6	1486843255	1486902993	59738	427.75	423.60	884.69	322.78	5.13	182.10	0.33	85.82	4203.90	-4173.34	3389.03
Fixation L	1	8	1486902993	1487201232	298239	900.83	306.83	30	36	-1	11.68	11.68
Fixation R	1	8	1486902993	1487201232	298239	900.83	306.83	30	36	-1	12.07	12.07
Saccade L	1	7	1487201232	1487221235	20003	914.89	299.02	818.63	312.18	0.80	98.28	1.00	39.94	2396.75	-2332.13	2050.63
Saccade R	1	7	1487201232	1487221235	20003	914.89	299.02	818.63	312.18	0.80	98.28	1.00	39.94	2396.75	-2332.13	2050.63
Fixation L	1	9	1487221235	1487519588	298353	770.09	324.17	61	38	-1	11.73	11.73
Fixation R	1	9	1487221235	1487519588	298353	770.09	324.17	61	38	-1	12.23	12.23
Saccade L	1	8	1487519588	1487539452	19864	780.20	299.18	772.31	298.54	0.32	31.31	1.00	16.31	204.10	-9.83	114.92
Saccade R	1	8	1487519588	1487539452	19864	780.20	299.18	772.31	298.54	0.32	31.31	1.00	16.31	204.10	-9.83	114.92
Fixation L	1	10	1487539452	1487758189	218737	789.01	249.15	28	67	-1	11.98	11.98
Fixation R	1	10	1487539452	1487758189	218737	789.01	249.15	28	67	-1	12.38	12.38
Saccade L	1	9	1487758189	1487837818	79629	800.39	231.37	1546.20	573.54	9.98	331.91	0.75	125.32	7633.68	-7520.02	5050.62
Saccade R	1	9	1487758189	1487837818	79629	800.39	231.37	1546.20	573.54	9.98	331.91	0.75	125.32	7633.68	-7520.02	5050.62
Fixation L	1	11	1487837818	1487976929	139111	1553.33	573.75	15	45	-1	12.47	12.47
Fixation R	1	11	1487837818	1487976929	139111	1553.33	573.75	15	45	-1	9.05	9.05
Saccade L	1	10	1487976929	1488076426	99497	1546.77	590.13	1525.16	623.78	2.55	50.37	0.20	25.64	1147.93	-638.12	525.62
Saccade R	1	10	1487976929	1488076426	99497	1546.77	590.13	1525.16	623.78	2.55	50.37	0.20	25.64	1147.93	-638.12	525.62
