[BeGaze]
Converted from:	C:\Documents and Settings\iViewX\Desktop\EXPERIMENTATIONS\Experiments\results\finaleart\S15H25531-finaleart-1.idf
Date:	27.03.2019 15:45:25
Version:	BeGaze 2.5.77
Sample Rate:	50
Subject:	S15H25531
Description:	Mikail Demirdelen

Table Header for Fixations:
Event Type	Trial	Number	Start	End	Duration	Location X	Location Y	Dispersion X	Dispersion Y	Plane	Avg. Pupil Size X	Avg. Pupil Size Y

Table Header for Saccades:
Event Type	Trial	Number	Start	End	Duration	Start Loc.X	Start Loc.Y	End Loc.X	End Loc.Y	Amplitude	Peak Speed	Peak Speed At	Average Speed	Peak Accel.	Peak Decel.	Average Accel.

Table Header for Blinks:
Event Type	Trial	Number	Start	End	Duration

Table Header for User Events:
Event Type	Trial	Number	Start	Description

UserEvent	1	1	4319042804	# Message: the-large-bathers_renoir_1887.jpg
Fixation L	1	1	4319058197	4319754407	696210	987.91	529.72	9	37	-1	11.31	11.31
Fixation R	1	1	4319058197	4319754407	696210	987.91	529.72	9	37	-1	12.25	12.25
Saccade L	1	1	4319754407	4319794162	39755	985.76	550.96	884.56	333.79	2.30	130.93	0.50	57.91	3211.77	-2226.40	2594.46
Saccade R	1	1	4319754407	4319794162	39755	985.76	550.96	884.56	333.79	2.30	130.93	0.50	57.91	3211.77	-2226.40	2594.46
Fixation L	1	2	4319794162	4319953266	159104	885.18	277.70	14	82	-1	10.50	10.50
Fixation R	1	2	4319794162	4319953266	159104	885.18	277.70	14	82	-1	11.31	11.31
Saccade L	1	2	4319953266	4319973148	19882	879.04	272.40	871.72	282.51	0.19	12.63	1.00	9.61	169.80	-4.79	61.71
Saccade R	1	2	4319953266	4319973148	19882	879.04	272.40	871.72	282.51	0.19	12.63	1.00	9.61	169.80	-4.79	61.71
Fixation L	1	3	4319973148	4320072643	99495	866.81	270.72	16	22	-1	10.26	10.26
Fixation R	1	3	4319973148	4320072643	99495	866.81	270.72	16	22	-1	10.79	10.79
Saccade L	1	3	4320072643	4320092513	19870	861.83	267.03	855.19	130.39	0.85	138.36	1.00	42.94	3308.20	-3278.88	2313.36
Saccade R	1	3	4320072643	4320092513	19870	861.83	267.03	855.19	130.39	0.85	138.36	1.00	42.94	3308.20	-3278.88	2313.36
Fixation L	1	4	4320092513	4320709104	616591	830.21	108.90	34	39	-1	10.02	10.02
Fixation R	1	4	4320092513	4320709104	616591	830.21	108.90	34	39	-1	10.70	10.70
Saccade L	1	4	4320709104	4320768735	59631	821.03	115.57	395.45	456.06	6.09	280.45	0.67	102.19	6980.27	-6515.71	5165.42
Saccade R	1	4	4320709104	4320768735	59631	821.03	115.57	395.45	456.06	6.09	280.45	0.67	102.19	6980.27	-6515.71	5165.42
Fixation L	1	5	4320768735	4320967593	198858	392.04	477.13	49	35	-1	10.35	10.35
Fixation R	1	5	4320768735	4320967593	198858	392.04	477.13	49	35	-1	11.51	11.51
Saccade L	1	5	4320967593	4320987471	19878	426.59	487.11	441.69	490.75	0.37	21.11	1.00	18.84	-86.89	-159.05	127.01
Saccade R	1	5	4320967593	4320987471	19878	426.59	487.11	441.69	490.75	0.37	21.11	1.00	18.84	-86.89	-159.05	127.01
Fixation L	1	6	4320987471	4321086966	99495	448.78	506.49	16	22	-1	10.53	10.53
Fixation R	1	6	4320987471	4321086966	99495	448.78	506.49	16	22	-1	11.74	11.74
Saccade L	1	6	4321086966	4321106841	19875	446.89	511.39	572.54	647.03	1.17	186.97	1.00	59.10	4476.29	-4610.75	3300.82
Saccade R	1	6	4321086966	4321106841	19875	446.89	511.39	572.54	647.03	1.17	186.97	1.00	59.10	4476.29	-4610.75	3300.82
Fixation L	1	7	4321106841	4321484824	377983	552.92	680.04	23	57	-1	11.31	11.31
Fixation R	1	7	4321106841	4321484824	377983	552.92	680.04	23	57	-1	12.19	12.19
Saccade L	1	7	4321484824	4321524589	39765	552.16	657.46	823.33	444.07	3.64	205.05	1.00	91.44	5068.54	-5025.74	3881.00
Saccade R	1	7	4321484824	4321524589	39765	552.16	657.46	823.33	444.07	3.64	205.05	1.00	91.44	5068.54	-5025.74	3881.00
Fixation L	1	8	4321524589	4321763183	238594	827.35	368.39	10	87	-1	11.28	11.28
Fixation R	1	8	4321524589	4321763183	238594	827.35	368.39	10	87	-1	12.16	12.16
Saccade L	1	8	4321763183	4321783176	19993	832.93	362.31	836.43	365.58	0.05	4.84	1.00	2.57	84.03	-28.79	42.80
Saccade R	1	8	4321763183	4321783176	19993	832.93	362.31	836.43	365.58	0.05	4.84	1.00	2.57	84.03	-28.79	42.80
Fixation L	1	9	4321783176	4321882555	99379	834.91	363.91	6	7	-1	11.04	11.04
Fixation R	1	9	4321783176	4321882555	99379	834.91	363.91	6	7	-1	11.98	11.98
Saccade L	1	9	4321882555	4321942298	59743	830.58	361.90	1534.22	570.19	7.84	327.88	0.67	131.16	8116.11	-7816.52	5604.91
Saccade R	1	9	4321882555	4321942298	59743	830.58	361.90	1534.22	570.19	7.84	327.88	0.67	131.16	8116.11	-7816.52	5604.91
Fixation L	1	10	4321942298	4322081423	139125	1515.22	586.17	31	28	-1	11.07	11.07
Fixation R	1	10	4321942298	4322081423	139125	1515.22	586.17	31	28	-1	11.82	11.82
Saccade L	1	10	4322081423	4322101417	19994	1505.94	591.74	1434.28	533.59	0.78	93.35	1.00	38.98	2200.54	-1768.93	1677.52
Saccade R	1	10	4322081423	4322101417	19994	1505.94	591.74	1434.28	533.59	0.78	93.35	1.00	38.98	2200.54	-1768.93	1677.52
Fixation L	1	11	4322101417	4322340035	238618	1435.73	488.02	32	63	-1	10.96	10.96
Fixation R	1	11	4322101417	4322340035	238618	1435.73	488.02	32	63	-1	11.73	11.73
Saccade L	1	11	4322340035	4322379783	39748	1425.39	500.45	1683.15	426.18	2.35	173.78	0.50	59.14	4320.79	-3983.86	3186.84
Saccade R	1	11	4322340035	4322379783	39748	1425.39	500.45	1683.15	426.18	2.35	173.78	0.50	59.14	4320.79	-3983.86	3186.84
Fixation L	1	12	4322379783	4322578766	198983	1664.39	420.34	26	18	-1	10.83	10.83
Fixation R	1	12	4322379783	4322578766	198983	1664.39	420.34	26	18	-1	11.49	11.49
Saccade L	1	12	4322578766	4322598637	19871	1670.49	434.26	1707.89	547.03	0.75	120.18	1.00	37.82	2914.81	-2838.61	1983.47
Saccade R	1	12	4322578766	4322598637	19871	1670.49	434.26	1707.89	547.03	0.75	120.18	1.00	37.82	2914.81	-2838.61	1983.47
Fixation L	1	13	4322598637	4322877133	278496	1712.10	551.33	16	34	-1	10.85	10.85
Fixation R	1	13	4322598637	4322877133	278496	1712.10	551.33	16	34	-1	11.53	11.53
Saccade L	1	13	4322877133	4322916880	39747	1712.39	574.50	1518.70	979.92	3.91	353.16	0.50	98.47	8825.54	-8645.02	5607.52
Saccade R	1	13	4322877133	4322916880	39747	1712.39	574.50	1518.70	979.92	3.91	353.16	0.50	98.47	8825.54	-8645.02	5607.52
Fixation L	1	14	4322916880	4323036259	119379	1530.88	961.17	21	26	-1	11.47	11.47
Fixation R	1	14	4322916880	4323036259	119379	1530.88	961.17	21	26	-1	11.85	11.85
