[BeGaze]
Converted from:	C:\Documents and Settings\iViewX\Desktop\EXPERIMENTATIONS\Experiments\results\finaleart\S15H25531-finaleart-1.idf
Date:	27.03.2019 15:45:30
Version:	BeGaze 2.5.77
Sample Rate:	50
Subject:	S15H25531
Description:	Mikail Demirdelen

Table Header for Fixations:
Event Type	Trial	Number	Start	End	Duration	Location X	Location Y	Dispersion X	Dispersion Y	Plane	Avg. Pupil Size X	Avg. Pupil Size Y

Table Header for Saccades:
Event Type	Trial	Number	Start	End	Duration	Start Loc.X	Start Loc.Y	End Loc.X	End Loc.Y	Amplitude	Peak Speed	Peak Speed At	Average Speed	Peak Accel.	Peak Decel.	Average Accel.

Table Header for Blinks:
Event Type	Trial	Number	Start	End	Duration

Table Header for User Events:
Event Type	Trial	Number	Start	Description

UserEvent	1	1	4361706413	# Message: les_poseuses_seurat_1888.jpg
Saccade L	1	1	4361722274	4361742155	19881	710.53	463.62	739.44	495.55	0.48	43.57	1.00	24.11	719.24	-400.01	373.08
Saccade R	1	1	4361722274	4361742155	19881	710.53	463.62	739.44	495.55	0.48	43.57	1.00	24.11	719.24	-400.01	373.08
Fixation L	1	1	4361742155	4362159872	417717	775.08	515.99	53	41	-1	14.10	14.10
Fixation R	1	1	4361742155	4362159872	417717	775.08	515.99	53	41	-1	14.99	14.99
Saccade L	1	2	4362159872	4362179746	19874	775.23	534.87	1003.14	491.95	1.42	234.48	1.00	71.61	5794.70	-5454.16	4123.77
Saccade R	1	2	4362159872	4362179746	19874	775.23	534.87	1003.14	491.95	1.42	234.48	1.00	71.61	5794.70	-5454.16	4123.77
Fixation L	1	2	4362179746	4362299128	119382	994.00	452.98	35	52	-1	13.23	13.23
Fixation R	1	2	4362179746	4362299128	119382	994.00	452.98	35	52	-1	13.90	13.90
Saccade L	1	3	4362299128	4362318996	19868	1005.81	439.72	1004.05	357.63	0.95	92.12	1.00	47.74	2082.31	-1749.96	1911.42
Saccade R	1	3	4362299128	4362318996	19868	1005.81	439.72	1004.05	357.63	0.95	92.12	1.00	47.74	2082.31	-1749.96	1911.42
Fixation L	1	3	4362318996	4362517875	198879	1001.47	277.13	7	91	-1	12.20	12.20
Fixation R	1	3	4362318996	4362517875	198879	1001.47	277.13	7	91	-1	13.05	13.05
Saccade L	1	4	4362517875	4362537731	19856	998.94	267.12	996.78	266.07	0.04	2.56	1.00	2.04	18.09	-9.35	10.26
Saccade R	1	4	4362517875	4362537731	19856	998.94	267.12	996.78	266.07	0.04	2.56	1.00	2.04	18.09	-9.35	10.26
Fixation L	1	4	4362537731	4362696859	159128	994.69	248.34	4	41	-1	11.56	11.56
Fixation R	1	4	4362537731	4362696859	159128	994.69	248.34	4	41	-1	12.25	12.25
Saccade L	1	5	4362696859	4362736729	39870	995.60	224.30	1458.74	430.06	4.53	270.61	0.50	113.56	6509.64	-6278.55	6208.33
Saccade R	1	5	4362696859	4362736729	39870	995.60	224.30	1458.74	430.06	4.53	270.61	0.50	113.56	6509.64	-6278.55	6208.33
Fixation L	1	5	4362736729	4362995206	258477	1440.43	459.55	24	42	-1	11.11	11.11
Fixation R	1	5	4362736729	4362995206	258477	1440.43	459.55	24	42	-1	11.68	11.68
Saccade L	1	6	4362995206	4363015090	19884	1433.79	472.46	1378.70	562.99	0.71	107.19	1.00	35.58	2584.14	-2339.26	1694.33
Saccade R	1	6	4362995206	4363015090	19884	1433.79	472.46	1378.70	562.99	0.71	107.19	1.00	35.58	2584.14	-2339.26	1694.33
Fixation L	1	6	4363015090	4363353324	338234	1341.38	571.73	46	19	-1	11.44	11.44
Fixation R	1	6	4363015090	4363353324	338234	1341.38	571.73	46	19	-1	12.13	12.13
Saccade L	1	7	4363353324	4363412940	59616	1334.00	576.73	664.21	700.43	7.02	323.82	0.67	117.82	8065.31	-7820.45	4993.93
Saccade R	1	7	4363353324	4363412940	59616	1334.00	576.73	664.21	700.43	7.02	323.82	0.67	117.82	8065.31	-7820.45	4993.93
Fixation L	1	7	4363412940	4363572062	159122	689.11	711.61	49	21	-1	11.41	11.41
Fixation R	1	7	4363412940	4363572062	159122	689.11	711.61	49	21	-1	12.74	12.74
Saccade L	1	8	4363572062	4363591930	19868	656.58	705.96	619.72	622.31	1.02	92.47	1.00	51.48	2196.06	-835.70	1121.76
Saccade R	1	8	4363572062	4363591930	19868	656.58	705.96	619.72	622.31	1.02	92.47	1.00	51.48	2196.06	-835.70	1121.76
Fixation L	1	8	4363591930	4363731179	139249	607.25	631.07	23	64	-1	11.46	11.46
Fixation R	1	8	4363591930	4363731179	139249	607.25	631.07	23	64	-1	12.13	12.13
Saccade L	1	9	4363731179	4363771054	39875	598.82	617.63	358.36	526.32	2.24	247.70	1.00	56.26	6104.95	-5901.22	3046.87
Saccade R	1	9	4363731179	4363771054	39875	598.82	617.63	358.36	526.32	2.24	247.70	1.00	56.26	6104.95	-5901.22	3046.87
Fixation L	1	9	4363771054	4363969921	198867	376.30	523.20	35	33	-1	11.31	11.31
Fixation R	1	9	4363771054	4363969921	198867	376.30	523.20	35	33	-1	12.59	12.59
Saccade L	1	10	4363969921	4364029542	59621	382.26	519.94	1040.04	200.17	7.74	313.43	0.33	129.83	7601.45	-6237.28	5613.05
Saccade R	1	10	4363969921	4364029542	59621	382.26	519.94	1040.04	200.17	7.74	313.43	0.33	129.83	7601.45	-6237.28	5613.05
Fixation L	1	10	4364029542	4364228405	198863	1012.36	227.27	36	54	-1	11.84	11.84
Fixation R	1	10	4364029542	4364228405	198863	1012.36	227.27	36	54	-1	12.83	12.83
Saccade L	1	11	4364228405	4364248406	20001	1003.96	247.03	999.96	266.60	0.24	20.21	1.00	11.77	215.35	-361.84	195.62
Saccade R	1	11	4364228405	4364248406	20001	1003.96	247.03	999.96	266.60	0.24	20.21	1.00	11.77	215.35	-361.84	195.62
Fixation L	1	11	4364248406	4364586514	338108	993.04	242.32	17	51	-1	12.18	12.18
Fixation R	1	11	4364248406	4364586514	338108	993.04	242.32	17	51	-1	13.13	13.13
Saccade L	1	12	4364586514	4364606384	19870	985.78	218.69	983.15	346.22	0.69	129.01	1.00	34.49	3104.01	-3085.80	2069.26
Saccade R	1	12	4364586514	4364606384	19870	985.78	218.69	983.15	346.22	0.69	129.01	1.00	34.49	3104.01	-3085.80	2069.26
Fixation L	1	12	4364606384	4364845001	238617	974.28	355.58	15	28	-1	12.38	12.38
Fixation R	1	12	4364606384	4364845001	238617	974.28	355.58	15	28	-1	13.18	13.18
Saccade L	1	13	4364845001	4364904742	59741	973.88	373.19	1224.83	858.01	6.55	286.29	0.33	109.69	6831.76	-5022.19	4783.12
Saccade R	1	13	4364845001	4364904742	59741	973.88	373.19	1224.83	858.01	6.55	286.29	0.33	109.69	6831.76	-5022.19	4783.12
Fixation L	1	13	4364904742	4365222986	318244	1197.03	851.97	51	26	-1	12.89	12.89
Fixation R	1	13	4364904742	4365222986	318244	1197.03	851.97	51	26	-1	13.69	13.69
Saccade L	1	14	4365222986	4365262729	39743	1173.19	843.01	868.84	921.74	3.11	220.40	0.50	78.26	5424.73	-5307.93	4379.96
Saccade R	1	14	4365222986	4365262729	39743	1173.19	843.01	868.84	921.74	3.11	220.40	0.50	78.26	5424.73	-5307.93	4379.96
Fixation L	1	14	4365262729	4365441721	178992	873.42	953.60	8	43	-1	12.84	12.84
Fixation R	1	14	4365262729	4365441721	178992	873.42	953.60	8	43	-1	13.67	13.67
Saccade L	1	15	4365441721	4365501339	59618	869.64	964.84	590.62	380.97	6.95	318.22	0.33	116.56	7897.17	-6105.12	5551.53
Saccade R	1	15	4365441721	4365501339	59618	869.64	964.84	590.62	380.97	6.95	318.22	0.33	116.56	7897.17	-6105.12	5551.53
Fixation L	1	15	4365501339	4365700335	198996	595.31	391.88	31	37	-1	12.47	12.47
Fixation R	1	15	4365501339	4365700335	198996	595.31	391.88	31	37	-1	13.91	13.91
