[BeGaze]
Converted from:	C:\Documents and Settings\iViewX\Desktop\EXPERIMENTATIONS\Experiments\results\finaleart\S8119532-finaleart-1.idf
Date:	27.03.2019 15:59:12
Version:	BeGaze 2.5.77
Sample Rate:	50
Subject:	S8119532
Description:	Alexandre Drewery

Table Header for Fixations:
Event Type	Trial	Number	Start	End	Duration	Location X	Location Y	Dispersion X	Dispersion Y	Plane	Avg. Pupil Size X	Avg. Pupil Size Y

Table Header for Saccades:
Event Type	Trial	Number	Start	End	Duration	Start Loc.X	Start Loc.Y	End Loc.X	End Loc.Y	Amplitude	Peak Speed	Peak Speed At	Average Speed	Peak Accel.	Peak Decel.	Average Accel.

Table Header for Blinks:
Event Type	Trial	Number	Start	End	Duration

Table Header for User Events:
Event Type	Trial	Number	Start	Description

UserEvent	1	1	2437285683	# Message: REJECTED_Volga_Lagoon_Vassiliev_1870.jpg
Fixation L	1	1	2437304059	2437582554	278495	845.48	392.77	53	34	-1	8.76	8.76
Fixation R	1	1	2437304059	2437582554	278495	845.48	392.77	53	34	-1	10.93	10.93
Saccade L	1	1	2437582554	2437602414	19860	890.01	418.22	909.09	434.85	0.50	58.13	0.00	25.21	470.26	-1195.40	684.28
Saccade R	1	1	2437582554	2437602414	19860	890.01	418.22	909.09	434.85	0.50	58.13	0.00	25.21	470.26	-1195.40	684.28
Fixation L	1	2	2437602414	2438000271	397857	922.97	445.58	30	52	-1	8.92	8.92
Fixation R	1	2	2437602414	2438000271	397857	922.97	445.58	30	52	-1	11.29	11.29
Saccade L	1	2	2438000271	2438020136	19865	933.86	473.89	934.73	507.26	0.58	58.20	1.00	29.28	1010.42	-374.20	681.62
Saccade R	1	2	2438000271	2438020136	19865	933.86	473.89	934.73	507.26	0.58	58.20	1.00	29.28	1010.42	-374.20	681.62
Fixation L	1	3	2438020136	2438199139	179003	931.52	551.71	7	74	-1	9.11	9.11
Fixation R	1	3	2438020136	2438199139	179003	931.52	551.71	7	74	-1	11.22	11.22
Saccade L	1	3	2438199139	2438278753	79614	931.95	536.30	727.71	875.13	7.12	213.94	0.50	89.49	4296.39	-4525.44	2619.38
Saccade R	1	3	2438199139	2438278753	79614	931.95	536.30	727.71	875.13	7.12	213.94	0.50	89.49	4296.39	-4525.44	2619.38
Fixation L	1	4	2438278753	2438437875	159122	738.81	853.83	16	47	-1	9.33	9.33
Fixation R	1	4	2438278753	2438437875	159122	738.81	853.83	16	47	-1	11.83	11.83
Saccade L	1	4	2438437875	2438457746	19871	729.79	840.03	616.42	946.09	1.28	157.02	1.00	64.56	3361.29	-3830.54	2862.77
Saccade R	1	4	2438437875	2438457746	19871	729.79	840.03	616.42	946.09	1.28	157.02	1.00	64.56	3361.29	-3830.54	2862.77
Fixation L	1	5	2438457746	2438663136	205390	609.87	895.33	12	66	-1	9.58	9.58
Fixation R	1	5	2438457746	2438663136	205390	609.87	895.33	12	66	-1	11.93	11.93
Saccade L	1	5	2438663136	2438696382	33246	603.60	901.25	409.88	951.37	2.14	202.34	1.00	64.23	4974.85	-4798.44	3327.79
Saccade R	1	5	2438663136	2438696382	33246	603.60	901.25	409.88	951.37	2.14	202.34	1.00	64.23	4974.85	-4798.44	3327.79
Fixation L	1	6	2438696382	2439114098	417716	411.82	959.65	39	58	-1	9.32	9.32
Fixation R	1	6	2438696382	2439114098	417716	411.82	959.65	39	58	-1	12.22	12.22
Saccade L	1	6	2439114098	2439133971	19873	407.42	966.66	414.77	988.27	0.20	23.10	1.00	10.19	476.53	-520.71	337.27
Saccade R	1	6	2439114098	2439133971	19873	407.42	966.66	414.77	988.27	0.20	23.10	1.00	10.19	476.53	-520.71	337.27
Fixation L	1	7	2439133971	2439293071	159100	414.25	987.40	8	15	-1	9.81	9.81
Fixation R	1	7	2439133971	2439293071	159100	414.25	987.40	8	15	-1	12.85	12.85
Saccade L	1	7	2439293071	2439352711	59640	410.35	997.05	1152.87	857.54	8.09	363.75	0.67	135.70	8877.00	-8353.47	5653.79
Saccade R	1	7	2439293071	2439352711	59640	410.35	997.05	1152.87	857.54	8.09	363.75	0.67	135.70	8877.00	-8353.47	5653.79
Fixation L	1	8	2439352711	2439531847	179136	1130.67	841.22	31	57	-1	10.55	10.55
Fixation R	1	8	2439352711	2439531847	179136	1130.67	841.22	31	57	-1	12.68	12.68
Saccade L	1	8	2439531847	2439591444	59597	1126.31	821.21	1272.50	733.10	2.81	116.15	1.00	47.10	2750.19	-2732.74	1753.98
Saccade R	1	8	2439531847	2439591444	59597	1126.31	821.21	1272.50	733.10	2.81	116.15	1.00	47.10	2750.19	-2732.74	1753.98
Fixation L	1	9	2439591444	2439730689	139245	1264.31	712.61	21	32	-1	10.97	10.97
Fixation R	1	9	2439591444	2439730689	139245	1264.31	712.61	21	32	-1	13.04	13.04
Saccade L	1	9	2439730689	2439770432	39743	1250.62	703.28	1487.80	583.07	2.92	172.05	1.00	73.47	3619.44	-4232.33	2994.48
Saccade R	1	9	2439730689	2439770432	39743	1250.62	703.28	1487.80	583.07	2.92	172.05	1.00	73.47	3619.44	-4232.33	2994.48
Fixation L	1	10	2439770432	2440088677	318245	1508.68	586.20	40	22	-1	10.86	10.86
Fixation R	1	10	2439770432	2440088677	318245	1508.68	586.20	40	22	-1	12.57	12.57
Saccade L	1	10	2440088677	2440128422	39745	1495.22	582.31	1044.69	572.62	3.93	328.99	0.50	98.79	8000.00	-8002.02	5332.70
Saccade R	1	10	2440088677	2440128422	39745	1495.22	582.31	1044.69	572.62	3.93	328.99	0.50	98.79	8000.00	-8002.02	5332.70
Fixation L	1	11	2440128422	2440307532	179110	1043.09	545.50	19	53	-1	11.47	11.47
Fixation R	1	11	2440128422	2440307532	179110	1043.09	545.50	19	53	-1	13.53	13.53
Saccade L	1	11	2440307532	2440327398	19866	1047.47	518.83	1036.03	445.74	0.86	74.83	1.00	43.54	1298.53	-850.21	773.80
Saccade R	1	11	2440307532	2440327398	19866	1047.47	518.83	1036.03	445.74	0.86	74.83	1.00	43.54	1298.53	-850.21	773.80
Fixation L	1	12	2440327398	2440426772	99374	1028.02	437.22	16	54	-1	11.19	11.19
Fixation R	1	12	2440327398	2440426772	99374	1028.02	437.22	16	54	-1	13.61	13.61
Saccade L	1	12	2440426772	2440546151	119379	1019.85	439.19	1385.78	220.61	9.24	274.18	0.33	77.42	6628.91	-6415.11	2742.54
Saccade R	1	12	2440426772	2440546151	119379	1019.85	439.19	1385.78	220.61	9.24	274.18	0.33	77.42	6628.91	-6415.11	2742.54
Fixation L	1	13	2440546151	2440665517	119366	1394.13	255.54	32	64	-1	10.70	10.70
Fixation R	1	13	2440546151	2440665517	119366	1394.13	255.54	32	64	-1	12.38	12.38
Saccade L	1	13	2440665517	2440804758	139241	1379.80	242.12	652.48	346.47	15.24	376.18	0.86	109.42	9287.77	-8332.96	4428.88
Saccade R	1	13	2440665517	2440804758	139241	1379.80	242.12	652.48	346.47	15.24	376.18	0.86	109.42	9287.77	-8332.96	4428.88
Fixation L	1	14	2440804758	2440924133	119375	618.09	383.00	44	53	-1	10.86	10.86
Fixation R	1	14	2440804758	2440924133	119375	618.09	383.00	44	53	-1	13.29	13.29
Saccade L	1	14	2440924133	2441063247	139114	607.87	400.03	412.27	439.18	5.41	233.69	0.86	38.88	5604.21	-5707.69	1714.89
Saccade R	1	14	2440924133	2441063247	139114	607.87	400.03	412.27	439.18	5.41	233.69	0.86	38.88	5604.21	-5707.69	1714.89
Fixation L	1	15	2441063247	2441162742	99495	409.34	446.76	9	19	-1	11.52	11.52
Fixation R	1	15	2441063247	2441162742	99495	409.34	446.76	9	19	-1	14.60	14.60
Saccade L	1	15	2441162742	2441301980	139238	404.03	439.10	366.80	452.35	5.93	90.28	0.14	42.60	2087.37	-2180.19	1126.12
Saccade R	1	15	2441162742	2441301980	139238	404.03	439.10	366.80	452.35	5.93	90.28	0.14	42.60	2087.37	-2180.19	1126.12
