[BeGaze]
Converted from:	C:\Documents and Settings\iViewX\Desktop\EXPERIMENTATIONS\Experiments\results\finaleart\S01A22542-finaleart-1.idf
Date:	27.03.2019 15:33:20
Version:	BeGaze 2.5.77
Sample Rate:	50
Subject:	S01A22542
Description:	Thibault Seve Minnaert

Table Header for Fixations:
Event Type	Trial	Number	Start	End	Duration	Location X	Location Y	Dispersion X	Dispersion Y	Plane	Avg. Pupil Size X	Avg. Pupil Size Y

Table Header for Saccades:
Event Type	Trial	Number	Start	End	Duration	Start Loc.X	Start Loc.Y	End Loc.X	End Loc.Y	Amplitude	Peak Speed	Peak Speed At	Average Speed	Peak Accel.	Peak Decel.	Average Accel.

Table Header for Blinks:
Event Type	Trial	Number	Start	End	Duration

Table Header for User Events:
Event Type	Trial	Number	Start	Description

UserEvent	1	1	9201948979	# Message: Nature_Morte_Aux_Raisins_Sur_Un_Plat_Derain_1944.jpg
Fixation L	1	1	9201966303	9202383915	417612	954.74	550.26	25	41	-1	14.01	14.01
Fixation R	1	1	9201966303	9202383915	417612	954.74	550.26	25	41	-1	14.83	14.83
Saccade L	1	1	9202383915	9202403801	19886	950.33	555.36	958.88	438.55	0.70	118.47	1.00	35.16	2829.03	-2692.17	1897.85
Saccade R	1	1	9202383915	9202403801	19886	950.33	555.36	958.88	438.55	0.70	118.47	1.00	35.16	2829.03	-2692.17	1897.85
Fixation L	1	2	9202403801	9202562905	159104	959.68	425.63	10	17	-1	13.95	13.95
Fixation R	1	2	9202403801	9202562905	159104	959.68	425.63	10	17	-1	14.81	14.81
Saccade L	1	2	9202562905	9202602639	39734	957.19	421.18	674.52	295.14	2.69	193.61	0.50	67.68	4774.67	-4671.63	3877.24
Saccade R	1	2	9202562905	9202602639	39734	957.19	421.18	674.52	295.14	2.69	193.61	0.50	67.68	4774.67	-4671.63	3877.24
Fixation L	1	3	9202602639	9202801529	198890	667.88	307.62	14	32	-1	12.76	12.76
Fixation R	1	3	9202602639	9202801529	198890	667.88	307.62	14	32	-1	13.80	13.80
Saccade L	1	3	9202801529	9202821379	19850	663.34	321.48	578.35	187.98	0.89	160.06	1.00	45.02	3920.76	-3974.09	2712.74
Saccade R	1	3	9202801529	9202821379	19850	663.34	321.48	578.35	187.98	0.89	160.06	1.00	45.02	3920.76	-3974.09	2712.74
Fixation L	1	4	9202821379	9203119753	298374	566.50	198.47	41	31	-1	12.06	12.06
Fixation R	1	4	9202821379	9203119753	298374	566.50	198.47	41	31	-1	13.05	13.05
Saccade L	1	4	9203119753	9203159482	39729	599.53	218.69	908.91	484.49	3.88	249.19	0.50	97.67	6138.58	-5599.09	4824.81
Saccade R	1	4	9203119753	9203159482	39729	599.53	218.69	908.91	484.49	3.88	249.19	0.50	97.67	6138.58	-5599.09	4824.81
Fixation L	1	5	9203159482	9203298735	139253	916.86	468.79	14	24	-1	12.76	12.76
Fixation R	1	5	9203159482	9203298735	139253	916.86	468.79	14	24	-1	13.79	13.79
Saccade L	1	5	9203298735	9203338488	39753	923.90	467.79	1136.01	346.92	2.24	159.15	1.00	56.41	3846.67	-3717.22	3005.62
Saccade R	1	5	9203298735	9203338488	39753	923.90	467.79	1136.01	346.92	2.24	159.15	1.00	56.41	3846.67	-3717.22	3005.62
Fixation L	1	6	9203338488	9203616843	278355	1148.82	327.39	16	43	-1	13.24	13.24
Fixation R	1	6	9203338488	9203616843	278355	1148.82	327.39	16	43	-1	13.93	13.93
Saccade L	1	6	9203616843	9203676593	59750	1148.75	334.49	1605.33	536.68	5.96	265.90	0.67	99.83	6547.89	-5359.12	4147.65
Saccade R	1	6	9203616843	9203676593	59750	1148.75	334.49	1605.33	536.68	5.96	265.90	0.67	99.83	6547.89	-5359.12	4147.65
Fixation L	1	7	9203676593	9203915195	238602	1648.83	516.58	53	28	-1	13.26	13.26
Fixation R	1	7	9203676593	9203915195	238602	1648.83	516.58	53	28	-1	13.71	13.71
Saccade L	1	7	9203915195	9203954952	39757	1617.68	519.20	1077.93	642.07	4.87	351.56	0.50	122.61	8669.40	-8735.55	6745.71
Saccade R	1	7	9203915195	9203954952	39757	1617.68	519.20	1077.93	642.07	4.87	351.56	0.50	122.61	8669.40	-8735.55	6745.71
Fixation L	1	8	9203954952	9204193557	238605	1074.44	638.14	8	18	-1	13.45	13.45
Fixation R	1	8	9203954952	9204193557	238605	1074.44	638.14	8	18	-1	13.67	13.67
Saccade L	1	8	9204193557	9204213576	20019	1069.71	630.23	1052.68	464.41	1.06	168.59	1.00	53.12	4084.51	-3940.92	2945.68
Saccade R	1	8	9204193557	9204213576	20019	1069.71	630.23	1052.68	464.41	1.06	168.59	1.00	53.12	4084.51	-3940.92	2945.68
Fixation L	1	9	9204213576	9204491933	278357	1008.22	430.93	53	45	-1	13.84	13.84
Fixation R	1	9	9204213576	9204491933	278357	1008.22	430.93	53	45	-1	14.02	14.02
Blink L	1	1	9204491933	9204591444	99511
Blink R	1	1	9204491933	9204591444	99511
Fixation L	1	10	9204591444	9204969153	377709	891.15	433.45	12	77	-1	14.43	14.43
Fixation R	1	10	9204591444	9204969153	377709	891.15	433.45	12	77	-1	15.17	15.17
Saccade L	1	9	9204969153	9204989145	19992	885.07	491.57	879.07	610.43	0.90	120.37	1.00	45.21	2868.79	-2606.24	2042.35
Saccade R	1	9	9204969153	9204989145	19992	885.07	491.57	879.07	610.43	0.90	120.37	1.00	45.21	2868.79	-2606.24	2042.35
Fixation L	1	11	9204989145	9205824374	835229	845.62	632.60	59	39	-1	13.89	13.89
Fixation R	1	11	9204989145	9205824374	835229	845.62	632.60	59	39	-1	14.78	14.78
Saccade L	1	10	9205824374	9205844240	19866	895.54	619.27	1005.33	617.36	0.87	111.08	1.00	43.66	2734.58	-2683.53	2263.39
Saccade R	1	10	9205824374	9205844240	19866	895.54	619.27	1005.33	617.36	0.87	111.08	1.00	43.66	2734.58	-2683.53	2263.39
Fixation L	1	12	9205844240	9205943731	99491	1010.77	616.59	8	2	-1	14.04	14.04
Fixation R	1	12	9205844240	9205943731	99491	1010.77	616.59	8	2	-1	14.68	14.68
