[BeGaze]
Converted from:	C:\Documents and Settings\iViewX\Desktop\EXPERIMENTATIONS\Experiments\results\finaleart\S19F21442-finaleart-1.idf
Date:	27.03.2019 15:50:21
Version:	BeGaze 2.5.77
Sample Rate:	50
Subject:	S19F21442
Description:	Juliette Veuillez

Table Header for Fixations:
Event Type	Trial	Number	Start	End	Duration	Location X	Location Y	Dispersion X	Dispersion Y	Plane	Avg. Pupil Size X	Avg. Pupil Size Y

Table Header for Saccades:
Event Type	Trial	Number	Start	End	Duration	Start Loc.X	Start Loc.Y	End Loc.X	End Loc.Y	Amplitude	Peak Speed	Peak Speed At	Average Speed	Peak Accel.	Peak Decel.	Average Accel.

Table Header for Blinks:
Event Type	Trial	Number	Start	End	Duration

Table Header for User Events:
Event Type	Trial	Number	Start	Description

UserEvent	1	1	6189638311	# Message: void.jpg
Saccade L	1	1	6189646272	6189686013	39741	1006.01	410.97	999.80	429.40	0.60	40.24	1.00	14.98	6907.77	0.00	2047.92
Saccade R	1	1	6189646272	6189884990	238718	1006.01	410.97	1273.33	570.54	17.42	291.71	0.33	72.96	6907.77	-5455.28	2464.20
Blink L	1	1	6189686013	6189805515	119502
Saccade L	1	2	6189805515	6189884990	79475	1177.85	539.70	1273.33	570.54	5.89	194.03	0.75	74.07	4697.46	-3736.78	2805.18
Fixation L	1	1	6189884990	6190004246	119256	1233.53	551.79	58	35	-1	10.97	10.97
Fixation R	1	1	6189884990	6190004246	119256	1233.53	551.79	58	35	-1	10.74	10.74
Saccade L	1	3	6190004246	6190183227	178981	1214.98	561.89	800.07	556.40	10.68	215.00	0.89	59.66	3788.97	-4755.13	1651.97
Saccade R	1	2	6190004246	6190183227	178981	1214.98	561.89	800.07	556.40	10.68	215.00	0.89	59.66	3788.97	-4755.13	1651.97
Fixation L	1	2	6190183227	6191157939	974712	807.77	594.16	30	66	-1	10.45	10.45
Fixation R	1	2	6190183227	6191157939	974712	807.77	594.16	30	66	-1	12.01	12.01
Saccade L	1	4	6191157939	6191177814	19875	826.37	613.66	848.60	632.15	0.89	55.23	1.00	45.03	168.27	-446.63	289.77
Saccade R	1	3	6191157939	6191177814	19875	826.37	613.66	848.60	632.15	0.89	55.23	1.00	45.03	168.27	-446.63	289.77
Fixation L	1	3	6191177814	6191277181	99367	823.73	603.19	35	49	-1	11.38	11.38
Fixation R	1	3	6191177814	6191277181	99367	823.73	603.19	35	49	-1	12.66	12.66
Saccade L	1	5	6191277181	6191336926	59745	813.35	586.26	811.34	563.82	2.17	81.42	0.33	36.30	1874.87	-1550.78	856.12
Saccade R	1	4	6191277181	6191336926	59745	813.35	586.26	811.34	563.82	2.17	81.42	0.33	36.30	1874.87	-1550.78	856.12
Fixation L	1	4	6191336926	6191555666	218740	821.73	597.93	21	71	-1	11.84	11.84
Fixation R	1	4	6191336926	6191555666	218740	821.73	597.93	21	71	-1	13.01	13.01
Saccade L	1	6	6191555666	6191635310	79644	821.74	603.82	791.98	598.93	1.56	39.97	0.25	19.61	848.26	-248.55	281.05
Saccade R	1	5	6191555666	6191635310	79644	821.74	603.82	791.98	598.93	1.56	39.97	0.25	19.61	848.26	-248.55	281.05
