[BeGaze]
Converted from:	C:\Documents and Settings\iViewX\Desktop\EXPERIMENTATIONS\Experiments\results\finaleart\S1022551-finaleart-1.idf
Date:	27.03.2019 15:38:05
Version:	BeGaze 2.5.77
Sample Rate:	50
Subject:	S1022551
Description:	Alexis Nebout

Table Header for Fixations:
Event Type	Trial	Number	Start	End	Duration	Location X	Location Y	Dispersion X	Dispersion Y	Plane	Avg. Pupil Size X	Avg. Pupil Size Y

Table Header for Saccades:
Event Type	Trial	Number	Start	End	Duration	Start Loc.X	Start Loc.Y	End Loc.X	End Loc.Y	Amplitude	Peak Speed	Peak Speed At	Average Speed	Peak Accel.	Peak Decel.	Average Accel.

Table Header for Blinks:
Event Type	Trial	Number	Start	End	Duration

Table Header for User Events:
Event Type	Trial	Number	Start	Description

UserEvent	1	1	8452758403	# Message: void.jpg
Fixation L	1	1	8452773900	8453113738	339838	1105.18	120.81	20	21	-1	9.11	9.11
Fixation R	1	1	8452773900	8453113738	339838	1105.18	120.81	20	21	-1	8.45	8.45
Saccade L	1	1	8453113738	8453151770	38032	1110.38	117.77	722.89	114.83	3.82	391.40	1.00	100.33	9705.04	-9655.97	6476.03
Saccade R	1	1	8453113738	8453151770	38032	1110.38	117.77	722.89	114.83	3.82	391.40	1.00	100.33	9705.04	-9655.97	6476.03
Fixation L	1	2	8453151770	8453529609	377839	709.24	101.26	21	27	-1	9.35	9.35
Fixation R	1	2	8453151770	8453529609	377839	709.24	101.26	21	27	-1	9.07	9.07
Blink L	1	1	8453529609	8453629114	99505
Blink R	1	1	8453529609	8453629114	99505
Saccade L	1	2	8453629114	8453668874	39760	0.00	4.68	0.00	1.67	25.45	2176.41	1.00	640.19	54364.64	-25360.32	27941.34
Saccade R	1	2	8453629114	8453728598	99484	0.00	4.68	782.99	585.18	58.33	2176.41	0.60	586.36	54364.64	-49805.95	28130.70
Blink L	1	2	8453668874	8453808093	139219
Fixation R	1	3	8453728598	8453971818	243220	830.66	590.78	70	11	-1	10.53	10.53
Fixation L	1	3	8453808093	8453971818	163725	847.57	590.58	6	2	-1	10.84	10.84
Saccade L	1	3	8453971818	8454009797	37979	848.26	592.04	969.60	580.41	1.38	123.29	1.00	36.31	2905.29	-2909.69	2004.84
Saccade R	1	3	8453971818	8454009797	37979	848.26	592.04	969.60	580.41	1.38	123.29	1.00	36.31	2905.29	-2909.69	2004.84
Fixation L	1	4	8454009797	8454703171	693374	965.00	560.83	36	59	-1	11.15	11.15
Fixation R	1	4	8454009797	8454703171	693374	965.00	560.83	36	59	-1	11.00	11.00
Saccade L	1	4	8454703171	8454782669	79498	994.95	609.95	959.00	528.00	62.30	2233.16	0.75	783.64	30690.64	-1677.72	17591.18
Saccade R	1	4	8454703171	8454782669	79498	994.95	609.95	959.00	528.00	62.30	2233.16	0.75	783.64	30690.64	-1677.72	17591.18
