[BeGaze]
Converted from:	C:\Documents and Settings\iViewX\Desktop\EXPERIMENTATIONS\Experiments\results\finaleart\S02123220-finaleart-1.idf
Date:	27.03.2019 15:33:44
Version:	BeGaze 2.5.77
Sample Rate:	50
Subject:	S02123220
Description:	David Xu

Table Header for Fixations:
Event Type	Trial	Number	Start	End	Duration	Location X	Location Y	Dispersion X	Dispersion Y	Plane	Avg. Pupil Size X	Avg. Pupil Size Y

Table Header for Saccades:
Event Type	Trial	Number	Start	End	Duration	Start Loc.X	Start Loc.Y	End Loc.X	End Loc.Y	Amplitude	Peak Speed	Peak Speed At	Average Speed	Peak Accel.	Peak Decel.	Average Accel.

Table Header for Blinks:
Event Type	Trial	Number	Start	End	Duration

Table Header for User Events:
Event Type	Trial	Number	Start	Description

UserEvent	1	1	2147655430	# Message: still-life-with-fish_bazille_1866.jpg
Fixation L	1	1	2147673358	2148051351	377993	929.55	437.83	15	50	-1	12.33	12.33
Fixation R	1	1	2147673358	2148051351	377993	929.55	437.83	15	50	-1	12.54	12.54
Saccade L	1	1	2148051351	2148071208	19857	935.42	462.97	940.69	525.47	0.42	63.45	1.00	21.13	1525.65	-138.03	659.06
Saccade R	1	1	2148051351	2148071208	19857	935.42	462.97	940.69	525.47	0.42	63.45	1.00	21.13	1525.65	-138.03	659.06
Fixation L	1	2	2148071208	2148170705	99497	932.55	569.43	20	75	-1	12.43	12.43
Fixation R	1	2	2148071208	2148170705	99497	932.55	569.43	20	75	-1	12.66	12.66
Saccade L	1	2	2148170705	2148210451	39746	920.54	590.72	618.84	551.70	2.87	177.17	1.00	72.21	4206.83	-4086.74	3435.87
Saccade R	1	2	2148170705	2148210451	39746	920.54	590.72	618.84	551.70	2.87	177.17	1.00	72.21	4206.83	-4086.74	3435.87
Fixation L	1	3	2148210451	2148449063	238612	601.45	518.43	47	47	-1	11.55	11.55
Fixation R	1	3	2148210451	2148449063	238612	601.45	518.43	47	47	-1	12.37	12.37
Saccade L	1	3	2148449063	2148667915	218852	571.03	527.20	647.24	758.05	11.87	271.15	0.91	54.23	6326.94	-6051.97	1666.64
Saccade R	1	3	2148449063	2148667915	218852	571.03	527.20	647.24	758.05	11.87	271.15	0.91	54.23	6326.94	-6051.97	1666.64
Fixation L	1	4	2148667915	2148986149	318234	659.62	766.41	44	42	-1	12.13	12.13
Fixation R	1	4	2148667915	2148986149	318234	659.62	766.41	44	42	-1	12.66	12.66
Saccade L	1	4	2148986149	2149006022	19873	637.56	775.45	637.31	819.12	0.50	44.18	1.00	25.13	869.27	337.01	684.77
Saccade R	1	4	2148986149	2149006022	19873	637.56	775.45	637.31	819.12	0.50	44.18	1.00	25.13	869.27	337.01	684.77
Fixation L	1	5	2149006022	2149125395	119373	633.20	802.10	16	60	-1	12.50	12.50
Fixation R	1	5	2149006022	2149125395	119373	633.20	802.10	16	60	-1	13.09	13.09
Saccade L	1	5	2149125395	2149165134	39739	625.61	775.01	568.03	617.60	2.00	156.54	1.00	50.26	3206.30	-3386.66	1691.89
Saccade R	1	5	2149125395	2149165134	39739	625.61	775.01	568.03	617.60	2.00	156.54	1.00	50.26	3206.30	-3386.66	1691.89
Fixation L	1	6	2149165134	2149284501	119367	563.00	593.75	29	33	-1	12.53	12.53
Fixation R	1	6	2149165134	2149284501	119367	563.00	593.75	29	33	-1	13.30	13.30
Saccade L	1	6	2149284501	2149324245	39744	554.99	590.10	512.57	480.78	1.23	69.17	0.50	30.97	1577.66	-1007.33	1163.34
Saccade R	1	6	2149284501	2149324245	39744	554.99	590.10	512.57	480.78	1.23	69.17	0.50	30.97	1577.66	-1007.33	1163.34
Fixation L	1	7	2149324245	2149542987	218742	483.15	437.65	41	56	-1	12.19	12.19
Fixation R	1	7	2149324245	2149542987	218742	483.15	437.65	41	56	-1	13.29	13.29
Saccade L	1	7	2149542987	2149721984	178997	479.26	424.47	1366.02	612.24	14.77	346.46	0.78	82.50	8539.45	-7366.96	2930.47
Saccade R	1	7	2149542987	2149721984	178997	479.26	424.47	1366.02	612.24	14.77	346.46	0.78	82.50	8539.45	-7366.96	2930.47
Fixation L	1	8	2149721984	2150099971	377987	1332.86	630.66	60	32	-1	13.05	13.05
Fixation R	1	8	2149721984	2150099971	377987	1332.86	630.66	60	32	-1	12.25	12.25
Saccade L	1	8	2150099971	2150119825	19854	1305.65	644.33	1235.07	742.92	0.95	122.64	1.00	47.98	3046.33	-2507.27	1870.52
Saccade R	1	8	2150099971	2150119825	19854	1305.65	644.33	1235.07	742.92	0.95	122.64	1.00	47.98	3046.33	-2507.27	1870.52
Fixation L	1	9	2150119825	2150278949	159124	1209.70	729.12	35	31	-1	12.79	12.79
Fixation R	1	9	2150119825	2150278949	159124	1209.70	729.12	35	31	-1	11.89	11.89
Saccade L	1	9	2150278949	2150338560	59611	1199.81	729.39	825.45	606.43	4.59	206.51	0.67	76.97	5101.61	-3961.34	3328.29
Saccade R	1	9	2150278949	2150338560	59611	1199.81	729.39	825.45	606.43	4.59	206.51	0.67	76.97	5101.61	-3961.34	3328.29
Fixation L	1	10	2150338560	2150497676	159116	804.73	579.93	33	46	-1	12.30	12.30
Fixation R	1	10	2150338560	2150497676	159116	804.73	579.93	33	46	-1	12.42	12.42
Saccade L	1	10	2150497676	2150537560	39884	791.83	571.55	483.17	422.41	3.23	220.52	1.00	81.06	5349.59	-4837.25	4043.15
Saccade R	1	10	2150497676	2150537560	39884	791.83	571.55	483.17	422.41	3.23	220.52	1.00	81.06	5349.59	-4837.25	4043.15
Fixation L	1	11	2150537560	2151034778	497218	491.00	425.88	28	62	-1	12.43	12.43
Fixation R	1	11	2150537560	2151034778	497218	491.00	425.88	28	62	-1	13.08	13.08
Saccade L	1	11	2151034778	2151114277	79499	503.78	451.09	1201.02	541.03	8.31	310.23	0.50	104.47	7659.74	-6299.02	4680.47
Saccade R	1	11	2151034778	2151114277	79499	503.78	451.09	1201.02	541.03	8.31	310.23	0.50	104.47	7659.74	-6299.02	4680.47
Fixation L	1	12	2151114277	2151412622	298345	1187.41	566.53	36	52	-1	13.79	13.79
Fixation R	1	12	2151114277	2151412622	298345	1187.41	566.53	36	52	-1	13.48	13.48
Saccade L	1	12	2151412622	2151452503	39881	1169.64	593.01	803.30	737.79	3.89	227.07	0.50	97.66	5463.25	-4352.47	4726.62
Saccade R	1	12	2151412622	2151452503	39881	1169.64	593.01	803.30	737.79	3.89	227.07	0.50	97.66	5463.25	-4352.47	4726.62
Fixation L	1	13	2151452503	2151611619	159116	764.51	730.70	50	25	-1	13.44	13.44
Fixation R	1	13	2151452503	2151611619	159116	764.51	730.70	50	25	-1	13.36	13.36
Saccade L	1	13	2151611619	2151651351	39732	752.31	735.18	714.00	702.33	0.68	28.47	1.00	17.03	514.97	0.00	335.19
Saccade R	1	13	2151611619	2151651351	39732	752.31	735.18	714.00	702.33	0.68	28.47	1.00	17.03	514.97	0.00	335.19
