[BeGaze]
Converted from:	C:\Documents and Settings\iViewX\Desktop\EXPERIMENTATIONS\Experiments\results\finaleart\S21F22332-finaleart-1.idf
Date:	27.03.2019 15:55:09
Version:	BeGaze 2.5.77
Sample Rate:	50
Subject:	S21F22332
Description:	Cyrielle Mailart

Table Header for Fixations:
Event Type	Trial	Number	Start	End	Duration	Location X	Location Y	Dispersion X	Dispersion Y	Plane	Avg. Pupil Size X	Avg. Pupil Size Y

Table Header for Saccades:
Event Type	Trial	Number	Start	End	Duration	Start Loc.X	Start Loc.Y	End Loc.X	End Loc.Y	Amplitude	Peak Speed	Peak Speed At	Average Speed	Peak Accel.	Peak Decel.	Average Accel.

Table Header for Blinks:
Event Type	Trial	Number	Start	End	Duration

Table Header for User Events:
Event Type	Trial	Number	Start	Description

UserEvent	1	1	2486232765	# Message: void.jpg
Fixation L	1	1	2486237339	2486436193	198854	432.50	706.22	37	59	-1	14.83	14.83
Fixation R	1	1	2486237339	2486436193	198854	432.50	706.22	37	59	-1	14.57	14.57
Saccade L	1	1	2486436193	2486475944	39751	453.76	686.01	750.92	879.62	3.19	318.68	0.50	80.23	7899.88	-7255.82	4203.01
Saccade R	1	1	2486436193	2486475944	39751	453.76	686.01	750.92	879.62	3.19	318.68	0.50	80.23	7899.88	-7255.82	4203.01
Fixation L	1	2	2486475944	2486674929	198985	779.61	888.33	36	14	-1	14.44	14.44
Fixation R	1	2	2486475944	2486674929	198985	779.61	888.33	36	14	-1	14.21	14.21
Blink L	1	1	2486674929	2486853912	178983
Blink R	1	1	2486674929	2486853912	178983
Fixation L	1	3	2486853912	2487132457	278545	1021.15	487.59	23	29	-1	14.09	14.09
Fixation R	1	3	2486853912	2487132457	278545	1021.15	487.59	23	29	-1	12.85	12.85
Blink L	1	2	2487132457	2487410768	278311
Blink R	1	2	2487132457	2487410768	278311
Fixation L	1	4	2487410768	2487749005	338237	1036.54	433.11	13	42	-1	14.15	14.15
Fixation R	1	4	2487410768	2487749005	338237	1036.54	433.11	13	42	-1	13.00	13.00
Saccade L	1	2	2487749005	2487768875	19870	1029.20	437.39	923.89	420.05	0.69	107.95	1.00	34.82	2678.15	-2571.88	1969.31
Saccade R	1	2	2487749005	2487768875	19870	1029.20	437.39	923.89	420.05	0.69	107.95	1.00	34.82	2678.15	-2571.88	1969.31
Fixation L	1	5	2487768875	2487967741	198866	942.84	425.17	25	20	-1	13.82	13.82
Fixation R	1	5	2487768875	2487967741	198866	942.84	425.17	25	20	-1	13.03	13.03
Saccade L	1	3	2487967741	2488226352	258611	945.33	416.34	931.59	424.99	114.83	2010.14	0.54	444.04	50253.49	-46396.94	18743.85
Blink R	1	3	2487967741	2488226352	258611
