[BeGaze]
Converted from:	C:\Documents and Settings\iViewX\Desktop\EXPERIMENTATIONS\Experiments\results\finaleart\S1022551-finaleart-1.idf
Date:	27.03.2019 15:37:40
Version:	BeGaze 2.5.77
Sample Rate:	50
Subject:	S1022551
Description:	Alexis Nebout

Table Header for Fixations:
Event Type	Trial	Number	Start	End	Duration	Location X	Location Y	Dispersion X	Dispersion Y	Plane	Avg. Pupil Size X	Avg. Pupil Size Y

Table Header for Saccades:
Event Type	Trial	Number	Start	End	Duration	Start Loc.X	Start Loc.Y	End Loc.X	End Loc.Y	Amplitude	Peak Speed	Peak Speed At	Average Speed	Peak Accel.	Peak Decel.	Average Accel.

Table Header for Blinks:
Event Type	Trial	Number	Start	End	Duration

Table Header for User Events:
Event Type	Trial	Number	Start	Description

UserEvent	1	1	7839950874	# Message: REJECTED_rose_in_a_bowl_fantin_latour_1883.jpg
Fixation L	1	1	7839955596	7840592106	636510	1001.76	521.31	8	25	-1	13.99	13.99
Fixation R	1	1	7839955596	7840592106	636510	1001.76	521.31	8	25	-1	13.55	13.55
Saccade L	1	1	7840592106	7840611949	19843	1005.71	524.15	905.27	493.13	0.59	106.34	1.00	29.56	2503.90	-2473.81	1682.65
Saccade R	1	1	7840592106	7840611949	19843	1005.71	524.15	905.27	493.13	0.59	106.34	1.00	29.56	2503.90	-2473.81	1682.65
Fixation L	1	2	7840611949	7841011237	399288	903.57	474.35	53	44	-1	13.49	13.49
Fixation R	1	2	7840611949	7841011237	399288	903.57	474.35	53	44	-1	13.34	13.34
Saccade L	1	2	7841011237	7841029674	18437	949.37	459.28	964.47	459.79	0.36	54.27	0.00	19.36	221.62	-1320.44	525.46
Saccade R	1	2	7841011237	7841029674	18437	949.37	459.28	964.47	459.79	0.36	54.27	0.00	19.36	221.62	-1320.44	525.46
Fixation L	1	3	7841029674	7841129038	99364	963.55	477.48	9	39	-1	13.90	13.90
Fixation R	1	3	7841029674	7841129038	99364	963.55	477.48	9	39	-1	13.94	13.94
Saccade L	1	3	7841129038	7841168903	39865	964.00	499.55	725.68	523.73	2.21	185.37	0.50	55.33	4397.30	-4414.36	2796.26
Saccade R	1	3	7841129038	7841168903	39865	964.00	499.55	725.68	523.73	2.21	185.37	0.50	55.33	4397.30	-4414.36	2796.26
Fixation L	1	4	7841168903	7841407527	238624	722.18	535.56	11	29	-1	13.75	13.75
Fixation R	1	4	7841168903	7841407527	238624	722.18	535.56	11	29	-1	14.16	14.16
Saccade L	1	4	7841407527	7841447273	39746	725.01	543.06	971.73	451.97	2.35	150.79	1.00	59.05	3753.12	-3198.15	3234.17
Saccade R	1	4	7841407527	7841447273	39746	725.01	543.06	971.73	451.97	2.35	150.79	1.00	59.05	3753.12	-3198.15	3234.17
Fixation L	1	5	7841447273	7841705883	258610	967.50	491.59	7	55	-1	13.94	13.94
Fixation R	1	5	7841447273	7841705883	258610	967.50	491.59	7	55	-1	14.45	14.45
Blink L	1	1	7841705883	7841805385	99502
Blink R	1	1	7841705883	7841805385	99502
Fixation L	1	6	7841805385	7842063863	258478	965.31	520.36	6	80	-1	15.86	15.86
Fixation R	1	6	7841805385	7842063863	258478	965.31	520.36	6	80	-1	14.98	14.98
Saccade L	1	5	7842063863	7842103736	39873	961.57	519.09	832.09	536.70	1.23	115.22	1.00	30.74	2831.67	-2715.23	1489.42
Saccade R	1	5	7842063863	7842103736	39873	961.57	519.09	832.09	536.70	1.23	115.22	1.00	30.74	2831.67	-2715.23	1489.42
Fixation L	1	7	7842103736	7842382117	278381	816.80	562.47	51	34	-1	16.16	16.16
Fixation R	1	7	7842103736	7842382117	278381	816.80	562.47	51	34	-1	15.13	15.13
Saccade L	1	6	7842382117	7842402096	19979	859.14	569.83	1170.92	576.37	1.89	315.16	1.00	94.65	7732.83	-7758.95	5527.62
Saccade R	1	6	7842382117	7842402096	19979	859.14	569.83	1170.92	576.37	1.89	315.16	1.00	94.65	7732.83	-7758.95	5527.62
Fixation L	1	8	7842402096	7842799827	397731	1186.03	604.85	26	43	-1	15.89	15.89
Fixation R	1	8	7842402096	7842799827	397731	1186.03	604.85	26	43	-1	14.57	14.57
Saccade L	1	7	7842799827	7842819711	19884	1191.94	611.16	1290.08	612.27	0.67	99.28	1.00	33.78	2458.94	-2073.30	1771.10
Saccade R	1	7	7842799827	7842819711	19884	1191.94	611.16	1290.08	612.27	0.67	99.28	1.00	33.78	2458.94	-2073.30	1771.10
Fixation L	1	9	7842819711	7843177804	358093	1349.56	622.05	69	28	-1	16.24	16.24
Fixation R	1	9	7842819711	7843177804	358093	1349.56	622.05	69	28	-1	14.67	14.67
Saccade L	1	8	7843177804	7843197696	19892	1353.28	628.55	1464.82	641.06	0.66	113.53	1.00	32.98	2798.63	-2643.51	1860.27
Saccade R	1	8	7843177804	7843197696	19892	1353.28	628.55	1464.82	641.06	0.66	113.53	1.00	32.98	2798.63	-2643.51	1860.27
Fixation L	1	10	7843197696	7843456173	258477	1462.98	639.85	33	15	-1	17.28	17.28
Fixation R	1	10	7843197696	7843456173	258477	1462.98	639.85	33	15	-1	15.39	15.39
Saccade L	1	9	7843456173	7843476169	19996	1452.54	645.00	1171.77	508.26	1.91	315.62	1.00	95.48	7480.96	-7415.61	5192.85
Saccade R	1	9	7843456173	7843476169	19996	1452.54	645.00	1171.77	508.26	1.91	315.62	1.00	95.48	7480.96	-7415.61	5192.85
Fixation L	1	11	7843476169	7843973396	497227	1107.16	491.38	71	23	-1	17.08	17.08
Fixation R	1	11	7843476169	7843973396	497227	1107.16	491.38	71	23	-1	15.01	15.01
