[BeGaze]
Converted from:	C:\Documents and Settings\iViewX\Desktop\EXPERIMENTATIONS\Experiments\results\finaleart\S18F56223-finaleart-1.idf
Date:	27.03.2019 15:49:24
Version:	BeGaze 2.5.77
Sample Rate:	50
Subject:	S18F56223
Description:	Pascale Sebillot

Table Header for Fixations:
Event Type	Trial	Number	Start	End	Duration	Location X	Location Y	Dispersion X	Dispersion Y	Plane	Avg. Pupil Size X	Avg. Pupil Size Y

Table Header for Saccades:
Event Type	Trial	Number	Start	End	Duration	Start Loc.X	Start Loc.Y	End Loc.X	End Loc.Y	Amplitude	Peak Speed	Peak Speed At	Average Speed	Peak Accel.	Peak Decel.	Average Accel.

Table Header for Blinks:
Event Type	Trial	Number	Start	End	Duration

Table Header for User Events:
Event Type	Trial	Number	Start	Description

UserEvent	1	1	2935864968	# Message: Odalisque_Matisse.jpg
Fixation L	1	1	2935883937	2936301664	417727	916.81	633.96	8	21	-1	14.56	14.56
Fixation R	1	1	2935883937	2936301664	417727	916.81	633.96	8	21	-1	13.33	13.33
Saccade L	1	1	2936301664	2936361286	59622	919.68	642.90	535.30	420.30	5.29	270.45	0.67	88.65	6675.65	-6442.91	4359.25
Saccade R	1	1	2936301664	2936361286	59622	919.68	642.90	535.30	420.30	5.29	270.45	0.67	88.65	6675.65	-6442.91	4359.25
Fixation L	1	2	2936361286	2936580156	218870	548.70	455.40	35	57	-1	13.64	13.64
Fixation R	1	2	2936361286	2936580156	218870	548.70	455.40	35	57	-1	12.80	12.80
Saccade L	1	2	2936580156	2936699401	119245	564.95	477.95	748.03	497.09	3.16	141.51	1.00	26.49	3375.47	-3509.46	1107.99
Saccade R	1	2	2936580156	2936699401	119245	564.95	477.95	748.03	497.09	3.16	141.51	1.00	26.49	3375.47	-3509.46	1107.99
Fixation L	1	3	2936699401	2937097251	397850	726.82	473.91	31	36	-1	13.53	13.53
Fixation R	1	3	2936699401	2937097251	397850	726.82	473.91	31	36	-1	12.80	12.80
Saccade L	1	3	2937097251	2937117126	19875	725.32	473.22	837.65	580.10	0.94	156.81	1.00	47.23	3656.46	-3795.97	2531.78
Saccade R	1	3	2937097251	2937117126	19875	725.32	473.22	837.65	580.10	0.94	156.81	1.00	47.23	3656.46	-3795.97	2531.78
Fixation L	1	4	2937117126	2937475109	357983	829.97	591.08	20	26	-1	14.53	14.53
Fixation R	1	4	2937117126	2937475109	357983	829.97	591.08	20	26	-1	13.17	13.17
Saccade L	1	4	2937475109	2937494988	19879	816.96	577.01	737.38	404.06	1.10	192.52	1.00	55.23	4719.72	-4594.75	3273.79
Saccade R	1	4	2937475109	2937494988	19879	816.96	577.01	737.38	404.06	1.10	192.52	1.00	55.23	4719.72	-4594.75	3273.79
Fixation L	1	5	2937494988	2937654104	159116	736.94	416.93	11	21	-1	14.94	14.94
Fixation R	1	5	2937494988	2937654104	159116	736.94	416.93	11	21	-1	13.51	13.51
Saccade L	1	5	2937654104	2937693980	39876	737.80	425.41	1181.50	610.41	4.48	368.93	1.00	112.34	9134.86	-7653.00	5230.61
Saccade R	1	5	2937654104	2937693980	39876	737.80	425.41	1181.50	610.41	4.48	368.93	1.00	112.34	9134.86	-7653.00	5230.61
Fixation L	1	6	2937693980	2938111586	417606	1165.31	612.33	60	21	-1	15.08	15.08
Fixation R	1	6	2937693980	2938111586	417606	1165.31	612.33	60	21	-1	13.66	13.66
Saccade L	1	6	2938111586	2938131589	20003	1164.94	617.87	1072.84	630.00	0.80	93.97	1.00	40.05	2201.90	-2134.45	1849.69
Saccade R	1	6	2938111586	2938131589	20003	1164.94	617.87	1072.84	630.00	0.80	93.97	1.00	40.05	2201.90	-2134.45	1849.69
Fixation L	1	7	2938131589	2938310584	178995	1031.79	639.19	52	25	-1	15.26	15.26
Fixation R	1	7	2938131589	2938310584	178995	1031.79	639.19	52	25	-1	13.66	13.66
Saccade L	1	7	2938310584	2938350321	39737	1032.96	635.83	1433.53	538.64	3.72	279.06	0.50	93.59	6819.19	-6222.60	4880.20
Saccade R	1	7	2938310584	2938350321	39737	1032.96	635.83	1433.53	538.64	3.72	279.06	0.50	93.59	6819.19	-6222.60	4880.20
Fixation L	1	8	2938350321	2938688437	338116	1410.42	569.67	31	44	-1	15.20	15.20
Fixation R	1	8	2938350321	2938688437	338116	1410.42	569.67	31	44	-1	13.70	13.70
Saccade L	1	8	2938688437	2938708305	19868	1409.05	583.29	1241.51	625.16	1.19	174.65	1.00	59.70	4210.96	-3824.69	3059.70
Saccade R	1	8	2938688437	2938708305	19868	1409.05	583.29	1241.51	625.16	1.19	174.65	1.00	59.70	4210.96	-3824.69	3059.70
Fixation L	1	9	2938708305	2938807810	99505	1217.60	591.07	37	48	-1	15.00	15.00
Fixation R	1	9	2938708305	2938807810	99505	1217.60	591.07	37	48	-1	13.34	13.34
Saccade L	1	9	2938807810	2938867430	59620	1216.26	583.57	708.34	379.56	6.24	242.45	0.33	104.63	5756.29	-4049.85	4038.28
Saccade R	1	9	2938807810	2938867430	59620	1216.26	583.57	708.34	379.56	6.24	242.45	0.33	104.63	5756.29	-4049.85	4038.28
Fixation L	1	10	2938867430	2939145912	278482	733.28	398.19	37	31	-1	14.68	14.68
Fixation R	1	10	2938867430	2939145912	278482	733.28	398.19	37	31	-1	13.44	13.44
Saccade L	1	10	2939145912	2939165780	19868	730.12	397.87	782.09	209.13	1.26	197.96	1.00	63.19	4756.22	-4657.80	3271.02
Saccade R	1	10	2939145912	2939165780	19868	730.12	397.87	782.09	209.13	1.26	197.96	1.00	63.19	4756.22	-4657.80	3271.02
Fixation L	1	11	2939165780	2939404545	238765	812.80	238.07	40	42	-1	14.64	14.64
Fixation R	1	11	2939165780	2939404545	238765	812.80	238.07	40	42	-1	13.92	13.92
Saccade L	1	11	2939404545	2939424405	19860	811.96	252.01	976.16	273.59	0.95	167.49	1.00	48.04	4138.18	-3558.84	2676.81
Saccade R	1	11	2939404545	2939424405	19860	811.96	252.01	976.16	273.59	0.95	167.49	1.00	48.04	4138.18	-3558.84	2676.81
Fixation L	1	12	2939424405	2939643143	218738	993.07	281.84	43	21	-1	14.82	14.82
Fixation R	1	12	2939424405	2939643143	218738	993.07	281.84	43	21	-1	13.84	13.84
Saccade L	1	12	2939643143	2939663021	19878	1005.50	288.09	1156.94	286.85	0.85	153.17	1.00	42.71	3723.08	-3739.21	2574.60
Saccade R	1	12	2939643143	2939663021	19878	1005.50	288.09	1156.94	286.85	0.85	153.17	1.00	42.71	3723.08	-3739.21	2574.60
Fixation L	1	13	2939663021	2939862007	198986	1151.76	289.00	15	7	-1	14.82	14.82
Fixation R	1	13	2939663021	2939862007	198986	1151.76	289.00	15	7	-1	13.75	13.75
