[BeGaze]
Converted from:	C:\Documents and Settings\iViewX\Desktop\EXPERIMENTATIONS\Experiments\results\finaleart\S4120113-finaleart-1.idf
Date:	27.03.2019 15:34:44
Version:	BeGaze 2.5.77
Sample Rate:	50
Subject:	S4120113
Description:	Vidal Attias

Table Header for Fixations:
Event Type	Trial	Number	Start	End	Duration	Location X	Location Y	Dispersion X	Dispersion Y	Plane	Avg. Pupil Size X	Avg. Pupil Size Y

Table Header for Saccades:
Event Type	Trial	Number	Start	End	Duration	Start Loc.X	Start Loc.Y	End Loc.X	End Loc.Y	Amplitude	Peak Speed	Peak Speed At	Average Speed	Peak Accel.	Peak Decel.	Average Accel.

Table Header for Blinks:
Event Type	Trial	Number	Start	End	Duration

Table Header for User Events:
Event Type	Trial	Number	Start	Description

UserEvent	1	1	7746709048	# Message: cows_at_a_pond_Bilders_1856.jpg
Fixation L	1	1	7746721148	7747138878	417730	1006.13	543.41	11	36	-1	15.26	15.26
Fixation R	1	1	7746721148	7747138878	417730	1006.13	543.41	11	36	-1	14.19	14.19
Saccade L	1	1	7747138878	7747158744	19866	1007.81	541.31	1022.55	699.93	1.01	161.12	1.00	50.93	3740.18	-3835.62	2566.85
Saccade R	1	1	7747138878	7747158744	19866	1007.81	541.31	1022.55	699.93	1.01	161.12	1.00	50.93	3740.18	-3835.62	2566.85
Fixation L	1	2	7747158744	7747437222	278478	1040.86	695.64	36	54	-1	13.68	13.68
Fixation R	1	2	7747158744	7747437222	278478	1040.86	695.64	36	54	-1	12.41	12.41
Saccade L	1	2	7747437222	7747457090	19868	1059.55	727.04	1060.95	735.44	0.27	19.06	0.00	13.53	7.74	-81.49	37.53
Saccade R	1	2	7747437222	7747457090	19868	1059.55	727.04	1060.95	735.44	0.27	19.06	0.00	13.53	7.74	-81.49	37.53
Fixation L	1	3	7747457090	7747894582	437492	1080.09	745.97	43	49	-1	11.76	11.76
Fixation R	1	3	7747457090	7747894582	437492	1080.09	745.97	43	49	-1	10.93	10.93
Saccade L	1	3	7747894582	7747914571	19989	1104.88	754.53	1170.85	750.54	0.62	66.86	1.00	31.24	1282.78	-1557.39	1127.36
Saccade R	1	3	7747894582	7747914571	19989	1104.88	754.53	1170.85	750.54	0.62	66.86	1.00	31.24	1282.78	-1557.39	1127.36
Fixation L	1	4	7747914571	7748153168	238597	1177.53	744.61	12	28	-1	11.92	11.92
Fixation R	1	4	7747914571	7748153168	238597	1177.53	744.61	12	28	-1	10.57	10.57
Saccade L	1	4	7748153168	7748173054	19886	1180.19	750.22	1307.97	743.34	1.07	129.43	1.00	53.60	2504.62	-2548.83	1758.43
Saccade R	1	4	7748153168	7748173054	19886	1180.19	750.22	1307.97	743.34	1.07	129.43	1.00	53.60	2504.62	-2548.83	1758.43
Fixation L	1	5	7748173054	7748451543	278489	1284.37	732.84	32	37	-1	12.18	12.18
Fixation R	1	5	7748173054	7748451543	278489	1284.37	732.84	32	37	-1	10.57	10.57
Saccade L	1	5	7748451543	7748511163	59620	1285.35	715.51	1538.69	566.77	3.58	189.22	0.33	60.12	4451.61	-3089.16	2409.76
Saccade R	1	5	7748451543	7748511163	59620	1285.35	715.51	1538.69	566.77	3.58	189.22	0.33	60.12	4451.61	-3089.16	2409.76
Fixation L	1	6	7748511163	7748789636	278473	1556.97	564.96	22	28	-1	12.19	12.19
Fixation R	1	6	7748511163	7748789636	278473	1556.97	564.96	22	28	-1	10.68	10.68
Saccade L	1	6	7748789636	7748849405	59769	1552.53	569.10	879.12	617.10	7.27	334.70	0.67	121.66	8282.48	-7488.60	5665.36
Saccade R	1	6	7748789636	7748849405	59769	1552.53	569.10	879.12	617.10	7.27	334.70	0.67	121.66	8282.48	-7488.60	5665.36
Fixation L	1	7	7748849405	7749764195	914790	874.58	640.19	18	76	-1	11.95	11.95
Fixation R	1	7	7748849405	7749764195	914790	874.58	640.19	18	76	-1	10.76	10.76
Saccade L	1	7	7749764195	7749784209	20014	871.73	661.39	870.01	670.57	0.13	10.06	1.00	6.64	160.04	73.88	128.36
Saccade R	1	7	7749764195	7749784209	20014	871.73	661.39	870.01	670.57	0.13	10.06	1.00	6.64	160.04	73.88	128.36
Fixation L	1	8	7749784209	7749923446	139237	861.00	675.50	15	23	-1	12.72	12.72
Fixation R	1	8	7749784209	7749923446	139237	861.00	675.50	15	23	-1	11.51	11.51
Saccade L	1	8	7749923446	7749943322	19876	854.82	684.70	770.14	711.28	0.60	89.78	1.00	30.32	2144.06	-1939.45	1506.60
Saccade R	1	8	7749923446	7749943322	19876	854.82	684.70	770.14	711.28	0.60	89.78	1.00	30.32	2144.06	-1939.45	1506.60
Fixation L	1	9	7749943322	7750341049	397727	754.74	729.34	26	56	-1	12.95	12.95
Fixation R	1	9	7749943322	7750341049	397727	754.74	729.34	26	56	-1	11.92	11.92
Saccade L	1	9	7750341049	7750380795	39746	757.37	722.92	1049.69	747.71	2.98	212.02	1.00	74.89	5024.98	-4926.60	3131.26
Saccade R	1	9	7750341049	7750380795	39746	757.37	722.92	1049.69	747.71	2.98	212.02	1.00	74.89	5024.98	-4926.60	3131.26
Fixation L	1	10	7750380795	7750639405	258610	1097.93	741.14	61	37	-1	12.48	12.48
Fixation R	1	10	7750380795	7750639405	258610	1097.93	741.14	61	37	-1	11.53	11.53
Saccade L	1	10	7750639405	7750699041	59636	1110.80	758.17	1277.62	763.23	2.70	173.38	0.33	45.22	4049.48	-4194.96	2073.41
Saccade R	1	10	7750639405	7750699041	59636	1110.80	758.17	1277.62	763.23	2.70	173.38	0.33	45.22	4049.48	-4194.96	2073.41
