[BeGaze]
Converted from:	C:\Documents and Settings\iViewX\Desktop\EXPERIMENTATIONS\Experiments\results\finaleart\S13H22431-finaleart-1.idf
Date:	27.03.2019 15:42:07
Version:	BeGaze 2.5.77
Sample Rate:	50
Subject:	S13H22431
Description:	Jimmy Petit

Table Header for Fixations:
Event Type	Trial	Number	Start	End	Duration	Location X	Location Y	Dispersion X	Dispersion Y	Plane	Avg. Pupil Size X	Avg. Pupil Size Y

Table Header for Saccades:
Event Type	Trial	Number	Start	End	Duration	Start Loc.X	Start Loc.Y	End Loc.X	End Loc.Y	Amplitude	Peak Speed	Peak Speed At	Average Speed	Peak Accel.	Peak Decel.	Average Accel.

Table Header for Blinks:
Event Type	Trial	Number	Start	End	Duration

Table Header for User Events:
Event Type	Trial	Number	Start	Description

UserEvent	1	1	28050654265	# Message: dead_hare_ward.jpg
Fixation L	1	1	28050668324	28051006551	338227	1493.43	587.66	15	14	-1	15.14	15.14
Fixation R	1	1	28050668324	28051006551	338227	1493.43	587.66	15	14	-1	14.88	14.88
Saccade L	1	1	28051006551	28051066213	59662	1483.27	581.96	1033.38	514.33	4.85	203.25	0.67	81.30	4974.87	-4679.08	3351.87
Saccade R	1	1	28051006551	28051066213	59662	1483.27	581.96	1033.38	514.33	4.85	203.25	0.67	81.30	4974.87	-4679.08	3351.87
Fixation L	1	2	28051066213	28051205427	139214	1037.03	514.95	36	23	-1	15.83	15.83
Fixation R	1	2	28051066213	28051205427	139214	1037.03	514.95	36	23	-1	15.48	15.48
Saccade L	1	2	28051205427	28051225295	19868	1011.75	531.29	791.90	717.44	1.68	291.18	1.00	84.47	7155.12	-7122.30	5069.13
Saccade R	1	2	28051205427	28051225295	19868	1011.75	531.29	791.90	717.44	1.68	291.18	1.00	84.47	7155.12	-7122.30	5069.13
Fixation L	1	3	28051225295	28051384401	159106	781.13	723.42	34	45	-1	16.19	16.19
Fixation R	1	3	28051225295	28051384401	159106	781.13	723.42	34	45	-1	16.52	16.52
Saccade L	1	3	28051384401	28051404278	19877	758.39	760.90	604.59	855.98	1.34	182.85	1.00	67.61	4343.96	-4414.93	3055.40
Saccade R	1	3	28051384401	28051404278	19877	758.39	760.90	604.59	855.98	1.34	182.85	1.00	67.61	4343.96	-4414.93	3055.40
Fixation L	1	4	28051404278	28051563399	159121	603.42	892.49	10	75	-1	16.36	16.36
Fixation R	1	4	28051404278	28051563399	159121	603.42	892.49	10	75	-1	16.89	16.89
Saccade L	1	4	28051563399	28051583281	19882	595.84	931.13	594.62	948.14	0.38	40.21	0.00	18.97	353.79	-622.67	420.69
Saccade R	1	4	28051563399	28051583281	19882	595.84	931.13	594.62	948.14	0.38	40.21	0.00	18.97	353.79	-622.67	420.69
Fixation L	1	5	28051583281	28051841887	258606	583.16	966.41	28	23	-1	15.56	15.56
Fixation R	1	5	28051583281	28051841887	258606	583.16	966.41	28	23	-1	16.17	16.17
Saccade L	1	5	28051841887	28051921506	79619	568.90	961.24	1243.36	341.01	11.12	342.26	0.50	139.72	8462.45	-5683.66	4782.37
Saccade R	1	5	28051841887	28051921506	79619	568.90	961.24	1243.36	341.01	11.12	342.26	0.50	139.72	8462.45	-5683.66	4782.37
Fixation L	1	6	28051921506	28052080626	159120	1224.04	362.52	29	29	-1	14.58	14.58
Fixation R	1	6	28051921506	28052080626	159120	1224.04	362.52	29	29	-1	15.43	15.43
Saccade L	1	6	28052080626	28052120374	39748	1222.45	370.87	1293.52	187.13	1.73	127.33	0.50	43.42	3063.74	-2926.82	2259.81
Saccade R	1	6	28052080626	28052120374	39748	1222.45	370.87	1293.52	187.13	1.73	127.33	0.50	43.42	3063.74	-2926.82	2259.81
Fixation L	1	7	28052120374	28052736979	616605	1316.76	196.60	39	37	-1	14.14	14.14
Fixation R	1	7	28052120374	28052736979	616605	1316.76	196.60	39	37	-1	14.77	14.77
Saccade L	1	7	28052736979	28052796607	59628	1305.64	210.87	1140.44	755.42	5.92	232.63	0.67	99.33	5726.39	-5457.64	3965.81
Saccade R	1	7	28052736979	28052796607	59628	1305.64	210.87	1140.44	755.42	5.92	232.63	0.67	99.33	5726.39	-5457.64	3965.81
Fixation L	1	8	28052796607	28053035337	238730	1122.27	760.18	24	26	-1	15.26	15.26
Fixation R	1	8	28052796607	28053035337	238730	1122.27	760.18	24	26	-1	15.71	15.71
Saccade L	1	8	28053035337	28053055205	19868	1117.72	754.69	1117.90	684.56	0.69	70.95	1.00	34.86	1689.99	-1325.55	1532.98
Saccade R	1	8	28053035337	28053055205	19868	1117.72	754.69	1117.90	684.56	0.69	70.95	1.00	34.86	1689.99	-1325.55	1532.98
Fixation L	1	9	28053055205	28053313694	258489	1117.32	635.21	13	74	-1	14.67	14.67
Fixation R	1	9	28053055205	28053313694	258489	1117.32	635.21	13	74	-1	15.19	15.19
Saccade L	1	9	28053313694	28053333700	20006	1108.01	654.35	971.12	661.98	0.89	138.68	1.00	44.57	3312.41	-3197.86	2315.79
Saccade R	1	9	28053313694	28053333700	20006	1108.01	654.35	971.12	661.98	0.89	138.68	1.00	44.57	3312.41	-3197.86	2315.79
Fixation L	1	10	28053333700	28053532558	198858	963.11	676.66	11	22	-1	14.30	14.30
Fixation R	1	10	28053333700	28053532558	198858	963.11	676.66	11	22	-1	14.99	14.99
Saccade L	1	10	28053532558	28053572313	39755	965.02	684.45	798.03	728.61	1.58	113.57	0.50	39.76	2742.73	-2486.79	2051.98
Saccade R	1	10	28053532558	28053572313	39755	965.02	684.45	798.03	728.61	1.58	113.57	0.50	39.76	2742.73	-2486.79	2051.98
Fixation L	1	11	28053572313	28053711559	139246	784.26	741.62	20	33	-1	14.52	14.52
Fixation R	1	11	28053572313	28053711559	139246	784.26	741.62	20	33	-1	15.35	15.35
Saccade L	1	11	28053711559	28053751304	39745	786.74	757.76	565.47	984.14	2.79	225.25	0.50	70.21	5346.18	-5482.12	3885.39
Saccade R	1	11	28053711559	28053751304	39745	786.74	757.76	565.47	984.14	2.79	225.25	0.50	70.21	5346.18	-5482.12	3885.39
Fixation L	1	12	28053751304	28054308282	556978	560.55	962.41	35	30	-1	13.94	13.94
Fixation R	1	12	28053751304	28054308282	556978	560.55	962.41	35	30	-1	14.85	14.85
Saccade L	1	12	28054308282	28054328152	19870	541.94	957.13	541.37	910.70	0.27	46.98	1.00	13.37	1149.27	-1052.99	768.57
Saccade R	1	12	28054308282	28054328152	19870	541.94	957.13	541.37	910.70	0.27	46.98	1.00	13.37	1149.27	-1052.99	768.57
Fixation L	1	13	28054328152	28054646394	318242	555.54	918.88	20	20	-1	13.77	13.77
Fixation R	1	13	28054328152	28054646394	318242	555.54	918.88	20	20	-1	14.74	14.74
