[BeGaze]
Converted from:	C:\Documents and Settings\iViewX\Desktop\EXPERIMENTATIONS\Experiments\results\finaleart\S3121421-finaleart-1.idf
Date:	27.03.2019 15:34:05
Version:	BeGaze 2.5.77
Sample Rate:	50
Subject:	S3121421
Description:	Jean Jouve

Table Header for Fixations:
Event Type	Trial	Number	Start	End	Duration	Location X	Location Y	Dispersion X	Dispersion Y	Plane	Avg. Pupil Size X	Avg. Pupil Size Y

Table Header for Saccades:
Event Type	Trial	Number	Start	End	Duration	Start Loc.X	Start Loc.Y	End Loc.X	End Loc.Y	Amplitude	Peak Speed	Peak Speed At	Average Speed	Peak Accel.	Peak Decel.	Average Accel.

Table Header for Blinks:
Event Type	Trial	Number	Start	End	Duration

Table Header for User Events:
Event Type	Trial	Number	Start	Description

UserEvent	1	1	4951142735	# Message: void.jpg
Fixation L	1	1	4951151036	4951688001	536965	377.71	561.24	50	48	-1	9.98	9.98
Fixation R	1	1	4951151036	4951688001	536965	377.71	561.24	50	48	-1	10.81	10.81
Saccade L	1	1	4951688001	4951827281	139280	418.29	586.76	1219.30	626.43	13.16	156.77	0.71	94.50	1998.93	-2712.54	1222.31
Saccade R	1	1	4951688001	4951827281	139280	418.29	586.76	1219.30	626.43	13.16	156.77	0.71	94.50	1998.93	-2712.54	1222.31
Fixation L	1	2	4951827281	4952085852	258571	1227.68	654.50	12	58	-1	10.86	10.86
Fixation R	1	2	4951827281	4952085852	258571	1227.68	654.50	12	58	-1	11.22	11.22
Saccade L	1	2	4952085852	4952125601	39749	1227.08	684.91	1509.77	722.09	2.91	162.99	0.50	73.09	3651.15	-3813.53	3088.62
Saccade R	1	2	4952085852	4952125601	39749	1227.08	684.91	1509.77	722.09	2.91	162.99	0.50	73.09	3651.15	-3813.53	3088.62
Fixation L	1	3	4952125601	4952284717	159116	1529.22	727.27	32	13	-1	11.14	11.14
Fixation R	1	3	4952125601	4952284717	159116	1529.22	727.27	32	13	-1	10.72	10.72
Saccade L	1	3	4952284717	4952344349	59632	1532.73	725.54	1250.33	357.06	5.81	216.67	0.33	97.48	5187.67	-2983.02	2666.33
Saccade R	1	3	4952284717	4952344349	59632	1532.73	725.54	1250.33	357.06	5.81	216.67	0.33	97.48	5187.67	-2983.02	2666.33
Blink L	1	1	4952344349	4952722321	377972
Blink R	1	1	4952344349	4952722321	377972
Fixation L	1	4	4952722321	4953139904	417583	864.58	354.66	16	15	-1	10.44	10.44
Fixation R	1	4	4952722321	4953139904	417583	864.58	354.66	16	15	-1	11.13	11.13
