[BeGaze]
Converted from:	C:\Documents and Settings\iViewX\Desktop\EXPERIMENTATIONS\Experiments\results\finaleart\S13H22431-finaleart-1.idf
Date:	27.03.2019 15:41:59
Version:	BeGaze 2.5.77
Sample Rate:	50
Subject:	S13H22431
Description:	Jimmy Petit

Table Header for Fixations:
Event Type	Trial	Number	Start	End	Duration	Location X	Location Y	Dispersion X	Dispersion Y	Plane	Avg. Pupil Size X	Avg. Pupil Size Y

Table Header for Saccades:
Event Type	Trial	Number	Start	End	Duration	Start Loc.X	Start Loc.Y	End Loc.X	End Loc.Y	Amplitude	Peak Speed	Peak Speed At	Average Speed	Peak Accel.	Peak Decel.	Average Accel.

Table Header for Blinks:
Event Type	Trial	Number	Start	End	Duration

Table Header for User Events:
Event Type	Trial	Number	Start	Description

UserEvent	1	1	27971081973	# Message: the-large-bathers_renoir_1887.jpg
Fixation L	1	1	27971088030	27971346638	258608	696.46	553.07	7	41	-1	14.82	14.82
Fixation R	1	1	27971088030	27971346638	258608	696.46	553.07	7	41	-1	17.02	17.02
Saccade L	1	1	27971346638	27971505758	159120	695.40	559.93	837.31	554.92	11.34	242.42	1.00	71.27	5966.93	-5830.90	2862.80
Saccade R	1	1	27971346638	27971505758	159120	695.40	559.93	837.31	554.92	11.34	242.42	1.00	71.27	5966.93	-5830.90	2862.80
Fixation L	1	2	27971505758	27971684763	179005	848.65	529.61	17	51	-1	14.68	14.68
Fixation R	1	2	27971505758	27971684763	179005	848.65	529.61	17	51	-1	16.94	16.94
Saccade L	1	2	27971684763	27971724493	39730	849.93	503.66	803.55	289.75	2.13	161.28	0.50	53.52	3944.65	-3361.14	2336.95
Saccade R	1	2	27971684763	27971724493	39730	849.93	503.66	803.55	289.75	2.13	161.28	0.50	53.52	3944.65	-3361.14	2336.95
Fixation L	1	3	27971724493	27971863732	139239	798.80	262.25	24	39	-1	12.14	12.14
Fixation R	1	3	27971724493	27971863732	139239	798.80	262.25	24	39	-1	14.03	14.03
Saccade L	1	3	27971863732	27971883624	19892	793.58	253.06	795.52	155.12	0.58	99.09	1.00	29.32	2299.30	-2397.89	1586.25
Saccade R	1	3	27971863732	27971883624	19892	793.58	253.06	795.52	155.12	0.58	99.09	1.00	29.32	2299.30	-2397.89	1586.25
Fixation L	1	4	27971883624	27972480340	596716	801.83	160.08	14	61	-1	11.71	11.71
Fixation R	1	4	27971883624	27972480340	596716	801.83	160.08	14	61	-1	13.42	13.42
Saccade L	1	4	27972480340	27972540090	59750	804.67	146.12	372.65	498.36	5.96	292.25	0.67	99.78	7287.74	-6924.27	4639.77
Saccade R	1	4	27972480340	27972540090	59750	804.67	146.12	372.65	498.36	5.96	292.25	0.67	99.78	7287.74	-6924.27	4639.77
Fixation L	1	5	27972540090	27972858319	318229	400.54	486.90	62	36	-1	12.68	12.68
Fixation R	1	5	27972540090	27972858319	318229	400.54	486.90	62	36	-1	14.70	14.70
Saccade L	1	5	27972858319	27972878195	19876	417.16	467.28	417.94	464.89	0.10	8.01	1.00	5.10	-3.73	-136.63	57.15
Saccade R	1	5	27972858319	27972878195	19876	417.16	467.28	417.94	464.89	0.10	8.01	1.00	5.10	-3.73	-136.63	57.15
Fixation L	1	6	27972878195	27972997562	119367	418.39	460.57	3	8	-1	12.34	12.34
Fixation R	1	6	27972878195	27972997562	119367	418.39	460.57	3	8	-1	14.41	14.41
Saccade L	1	6	27972997562	27973037309	39747	416.42	455.95	584.34	655.33	2.26	152.10	1.00	56.95	3649.89	-3714.61	3147.94
Saccade R	1	6	27972997562	27973037309	39747	416.42	455.95	584.34	655.33	2.26	152.10	1.00	56.95	3649.89	-3714.61	3147.94
Fixation L	1	7	27973037309	27973574296	536987	578.52	669.63	24	48	-1	13.02	13.02
Fixation R	1	7	27973037309	27973574296	536987	578.52	669.63	24	48	-1	15.03	15.03
Saccade L	1	7	27973574296	27973634040	59744	592.47	682.69	1441.84	646.01	8.87	357.98	0.33	148.41	8884.77	-6123.13	6076.61
Saccade R	1	7	27973574296	27973634040	59744	592.47	682.69	1441.84	646.01	8.87	357.98	0.33	148.41	8884.77	-6123.13	6076.61
Fixation L	1	8	27973634040	27973793151	159111	1456.01	619.71	19	33	-1	12.94	12.94
Fixation R	1	8	27973634040	27973793151	159111	1456.01	619.71	19	33	-1	14.77	14.77
Saccade L	1	8	27973793151	27973813025	19874	1460.20	612.64	1451.54	527.47	0.56	86.60	1.00	28.18	2015.51	-1482.69	1172.34
Saccade R	1	8	27973793151	27973813025	19874	1460.20	612.64	1451.54	527.47	0.56	86.60	1.00	28.18	2015.51	-1482.69	1172.34
Fixation L	1	9	27973813025	27974011891	198866	1416.50	526.86	59	33	-1	12.83	12.83
Fixation R	1	9	27973813025	27974011891	198866	1416.50	526.86	59	33	-1	14.42	14.42
Saccade L	1	9	27974011891	27974031770	19879	1392.33	519.45	1384.02	518.33	0.13	11.85	0.00	6.60	158.42	-197.88	130.95
Saccade R	1	9	27974011891	27974031770	19879	1392.33	519.45	1384.02	518.33	0.13	11.85	0.00	6.60	158.42	-197.88	130.95
Fixation L	1	10	27974031770	27974151141	119371	1373.16	518.32	19	6	-1	12.71	12.71
Fixation R	1	10	27974031770	27974151141	119371	1373.16	518.32	19	6	-1	13.99	13.99
Saccade L	1	10	27974151141	27974190881	39740	1364.61	518.48	1594.61	470.05	2.33	127.56	0.50	58.71	3118.70	-2716.75	2627.43
Saccade R	1	10	27974151141	27974190881	39740	1364.61	518.48	1594.61	470.05	2.33	127.56	0.50	58.71	3118.70	-2716.75	2627.43
Fixation L	1	11	27974190881	27974648369	457488	1618.84	448.20	43	40	-1	13.02	13.02
Fixation R	1	11	27974190881	27974648369	457488	1618.84	448.20	43	40	-1	13.86	13.86
Saccade L	1	11	27974648369	27974668237	19868	1638.19	440.00	1657.16	624.39	1.13	187.45	1.00	56.65	4504.51	-4367.91	3200.34
Saccade R	1	11	27974648369	27974668237	19868	1638.19	440.00	1657.16	624.39	1.13	187.45	1.00	56.65	4504.51	-4367.91	3200.34
Fixation L	1	12	27974668237	27974926857	258620	1691.14	607.94	48	19	-1	12.81	12.81
Fixation R	1	12	27974668237	27974926857	258620	1691.14	607.94	48	19	-1	13.64	13.64
Saccade L	1	12	27974926857	27974986474	59617	1687.92	605.57	1108.90	961.89	7.20	306.91	0.67	120.81	7561.97	-6997.37	4765.29
Saccade R	1	12	27974926857	27974986474	59617	1687.92	605.57	1108.90	961.89	7.20	306.91	0.67	120.81	7561.97	-6997.37	4765.29
Fixation L	1	13	27974986474	27975085976	99502	1125.19	956.65	20	17	-1	12.82	12.82
Fixation R	1	13	27974986474	27975085976	99502	1125.19	956.65	20	17	-1	13.58	13.58
