[BeGaze]
Converted from:	C:\Documents and Settings\iViewX\Desktop\EXPERIMENTATIONS\Experiments\results\finaleart\S8119532-finaleart-1.idf
Date:	27.03.2019 16:01:01
Version:	BeGaze 2.5.77
Sample Rate:	50
Subject:	S8119532
Description:	Alexandre Drewery

Table Header for Fixations:
Event Type	Trial	Number	Start	End	Duration	Location X	Location Y	Dispersion X	Dispersion Y	Plane	Avg. Pupil Size X	Avg. Pupil Size Y

Table Header for Saccades:
Event Type	Trial	Number	Start	End	Duration	Start Loc.X	Start Loc.Y	End Loc.X	End Loc.Y	Amplitude	Peak Speed	Peak Speed At	Average Speed	Peak Accel.	Peak Decel.	Average Accel.

Table Header for Blinks:
Event Type	Trial	Number	Start	End	Duration

Table Header for User Events:
Event Type	Trial	Number	Start	Description

UserEvent	1	1	3441748570	# Message: pears-and-grapes_gauguin_1875.jpg
Fixation L	1	1	3441782999	3442240466	457467	1211.55	643.28	38	48	-1	13.84	13.84
Fixation R	1	1	3441782999	3442240466	457467	1211.55	643.28	38	48	-1	15.79	15.79
Saccade L	1	1	3442240466	3442300152	59686	1191.28	631.08	1051.76	580.18	2.43	150.21	1.00	40.74	3646.17	-3601.07	2449.34
Saccade R	1	1	3442240466	3442300152	59686	1191.28	631.08	1051.76	580.18	2.43	150.21	1.00	40.74	3646.17	-3601.07	2449.34
Fixation L	1	2	3442300152	3442479096	178944	1048.30	581.81	29	60	-1	12.90	12.90
Fixation R	1	2	3442300152	3442479096	178944	1048.30	581.81	29	60	-1	15.35	15.35
Saccade L	1	2	3442479096	3442498958	19862	1023.98	619.49	1021.51	641.12	0.57	62.04	0.00	28.50	407.24	-946.08	521.76
Saccade R	1	2	3442479096	3442498958	19862	1023.98	619.49	1021.51	641.12	0.57	62.04	0.00	28.50	407.24	-946.08	521.76
Fixation L	1	3	3442498958	3442598455	99497	1006.86	667.18	23	35	-1	12.50	12.50
Fixation R	1	3	3442498958	3442598455	99497	1006.86	667.18	23	35	-1	15.04	15.04
Saccade L	1	3	3442598455	3442638194	39739	1003.94	677.03	531.89	805.86	4.62	276.46	1.00	116.36	6768.20	-5997.93	5550.73
Saccade R	1	3	3442598455	3442638194	39739	1003.94	677.03	531.89	805.86	4.62	276.46	1.00	116.36	6768.20	-5997.93	5550.73
Fixation L	1	4	3442638194	3442817485	179291	513.63	775.26	29	66	-1	11.40	11.40
Fixation R	1	4	3442638194	3442817485	179291	513.63	775.26	29	66	-1	14.45	14.45
Saccade L	1	4	3442817485	3442857067	39582	501.97	784.44	497.38	777.38	0.46	13.68	1.00	11.67	67.67	-128.78	102.30
Saccade R	1	4	3442817485	3442857067	39582	501.97	784.44	497.38	777.38	0.46	13.68	1.00	11.67	67.67	-128.78	102.30
Fixation L	1	5	3442857067	3442956439	99372	508.42	778.98	16	9	-1	10.91	10.91
Fixation R	1	5	3442857067	3442956439	99372	508.42	778.98	16	9	-1	14.21	14.21
Saccade L	1	5	3442956439	3442976308	19869	513.65	780.43	533.08	938.85	1.07	161.41	1.00	53.79	3928.78	-3819.72	2924.00
Saccade R	1	5	3442956439	3442976308	19869	513.65	780.43	533.08	938.85	1.07	161.41	1.00	53.79	3928.78	-3819.72	2924.00
Fixation L	1	6	3442976308	3443155416	179108	571.32	945.58	57	25	-1	10.98	10.98
Fixation R	1	6	3442976308	3443155416	179108	571.32	945.58	57	25	-1	13.87	13.87
Saccade L	1	6	3443155416	3443274667	119251	574.13	943.93	1059.28	845.00	9.89	255.97	0.33	82.91	6150.53	-5794.01	3373.74
Saccade R	1	6	3443155416	3443274667	119251	574.13	943.93	1059.28	845.00	9.89	255.97	0.33	82.91	6150.53	-5794.01	3373.74
Fixation L	1	7	3443274667	3443772026	497359	1063.80	845.19	23	58	-1	11.47	11.47
Fixation R	1	7	3443274667	3443772026	497359	1063.80	845.19	23	58	-1	13.82	13.82
Saccade L	1	7	3443772026	3443811772	39746	1075.26	821.25	1105.18	737.61	1.88	123.87	0.50	47.30	2780.90	-2405.61	1632.78
Saccade R	1	7	3443772026	3443811772	39746	1075.26	821.25	1105.18	737.61	1.88	123.87	0.50	47.30	2780.90	-2405.61	1632.78
Fixation L	1	8	3443811772	3443970892	159120	1116.95	747.93	17	82	-1	11.79	11.79
Fixation R	1	8	3443811772	3443970892	159120	1116.95	747.93	17	82	-1	14.41	14.41
Saccade L	1	8	3443970892	3443990760	19868	1123.03	741.47	1127.93	730.09	0.19	13.02	1.00	9.32	51.70	-39.44	34.41
Saccade R	1	8	3443970892	3443990760	19868	1123.03	741.47	1127.93	730.09	0.19	13.02	1.00	9.32	51.70	-39.44	34.41
Fixation L	1	9	3443990760	3444746604	755844	1126.32	745.83	37	61	-1	12.50	12.50
Fixation R	1	9	3443990760	3444746604	755844	1126.32	745.83	37	61	-1	14.87	14.87
Saccade L	1	9	3444746604	3444766465	19861	1095.49	779.48	1072.39	801.49	0.38	32.46	0.00	19.20	739.49	-662.90	659.98
Saccade R	1	9	3444746604	3444766465	19861	1095.49	779.48	1072.39	801.49	0.38	32.46	0.00	19.20	739.49	-662.90	659.98
Fixation L	1	10	3444766465	3444925583	159118	1055.51	812.50	25	43	-1	13.24	13.24
Fixation R	1	10	3444766465	3444925583	159118	1055.51	812.50	25	43	-1	15.85	15.85
Saccade L	1	10	3444925583	3444945470	19887	1046.63	823.56	1047.24	762.54	0.77	61.72	1.00	38.56	1188.12	-1186.53	1158.14
Saccade R	1	10	3444925583	3444945470	19887	1046.63	823.56	1047.24	762.54	0.77	61.72	1.00	38.56	1188.12	-1186.53	1158.14
Fixation L	1	11	3444945470	3445164325	218855	1044.28	801.32	5	60	-1	12.76	12.76
Fixation R	1	11	3444945470	3445164325	218855	1044.28	801.32	5	60	-1	15.74	15.74
Saccade L	1	11	3445164325	3445204069	39744	1045.84	791.09	1235.09	772.47	1.90	115.65	0.50	47.87	2856.41	-1987.81	2019.46
Saccade R	1	11	3445164325	3445204069	39744	1045.84	791.09	1235.09	772.47	1.90	115.65	0.50	47.87	2856.41	-1987.81	2019.46
Fixation L	1	12	3445204069	3445383064	178995	1241.75	744.42	16	50	-1	12.90	12.90
Fixation R	1	12	3445204069	3445383064	178995	1241.75	744.42	16	50	-1	15.26	15.26
Saccade L	1	12	3445383064	3445402944	19880	1251.02	729.30	1338.48	721.27	0.75	88.84	1.00	37.71	1781.86	-1926.39	1269.30
Saccade R	1	12	3445383064	3445402944	19880	1251.02	729.30	1338.48	721.27	0.75	88.84	1.00	37.71	1781.86	-1926.39	1269.30
Fixation L	1	13	3445402944	3445721176	318232	1338.28	722.07	20	43	-1	13.18	13.18
Fixation R	1	13	3445402944	3445721176	318232	1338.28	722.07	20	43	-1	15.17	15.17
