[BeGaze]
Converted from:	C:\Documents and Settings\iViewX\Desktop\EXPERIMENTATIONS\Experiments\results\finaleart\S5121332-finaleart-1.idf
Date:	27.03.2019 15:35:15
Version:	BeGaze 2.5.77
Sample Rate:	50
Subject:	S5121332
Description:	Dylan Marinho

Table Header for Fixations:
Event Type	Trial	Number	Start	End	Duration	Location X	Location Y	Dispersion X	Dispersion Y	Plane	Avg. Pupil Size X	Avg. Pupil Size Y

Table Header for Saccades:
Event Type	Trial	Number	Start	End	Duration	Start Loc.X	Start Loc.Y	End Loc.X	End Loc.Y	Amplitude	Peak Speed	Peak Speed At	Average Speed	Peak Accel.	Peak Decel.	Average Accel.

Table Header for Blinks:
Event Type	Trial	Number	Start	End	Duration

Table Header for User Events:
Event Type	Trial	Number	Start	Description

UserEvent	1	1	9772095691	# Message: REJECTED_rose_in_a_bowl_fantin_latour_1883.jpg
Fixation L	1	1	9772107562	9772425782	318220	919.86	485.81	28	71	-1	12.94	12.94
Fixation R	1	1	9772107562	9772425782	318220	919.86	485.81	28	71	-1	12.21	12.21
Saccade L	1	1	9772425782	9772445665	19883	898.98	530.47	895.42	530.64	0.07	6.00	1.00	3.41	84.03	-59.85	65.67
Saccade R	1	1	9772425782	9772445665	19883	898.98	530.47	895.42	530.64	0.07	6.00	1.00	3.41	84.03	-59.85	65.67
Fixation L	1	2	9772445665	9772803770	358105	884.44	551.24	43	53	-1	13.08	13.08
Fixation R	1	2	9772445665	9772803770	358105	884.44	551.24	43	53	-1	12.43	12.43
Saccade L	1	2	9772803770	9772823631	19861	851.84	584.44	797.34	589.84	0.46	55.40	1.00	23.12	1193.46	-1156.38	982.98
Saccade R	1	2	9772803770	9772823631	19861	851.84	584.44	797.34	589.84	0.46	55.40	1.00	23.12	1193.46	-1156.38	982.98
Fixation L	1	3	9772823631	9773082119	258488	783.50	600.02	20	17	-1	14.07	14.07
Fixation R	1	3	9772823631	9773082119	258488	783.50	600.02	20	17	-1	13.56	13.56
Saccade L	1	3	9773082119	9773141866	59747	777.04	607.26	1190.91	535.78	4.42	220.04	0.67	73.91	5469.36	-5256.30	3180.93
Saccade R	1	3	9773082119	9773141866	59747	777.04	607.26	1190.91	535.78	4.42	220.04	0.67	73.91	5469.36	-5256.30	3180.93
Fixation L	1	4	9773141866	9773499834	357968	1197.24	518.01	8	39	-1	15.18	15.18
Fixation R	1	4	9773141866	9773499834	357968	1197.24	518.01	8	39	-1	14.70	14.70
Blink L	1	1	9773499834	9773658964	159130
Blink R	1	1	9773499834	9773658964	159130
Fixation L	1	5	9773658964	9773877700	218736	1060.82	364.51	19	80	-1	16.04	16.04
Fixation R	1	5	9773658964	9773877700	218736	1060.82	364.51	19	80	-1	16.14	16.14
Saccade L	1	4	9773877700	9773937441	59741	1053.58	399.77	948.65	429.79	1.65	80.86	1.00	27.55	1738.58	-1846.83	959.42
Saccade R	1	4	9773877700	9773937441	59741	1053.58	399.77	948.65	429.79	1.65	80.86	1.00	27.55	1738.58	-1846.83	959.42
Fixation L	1	6	9773937441	9774195931	258490	926.70	454.72	29	37	-1	16.36	16.36
Fixation R	1	6	9773937441	9774195931	258490	926.70	454.72	29	37	-1	16.33	16.33
Saccade L	1	5	9774195931	9774255673	59742	923.53	460.10	1446.74	660.83	6.01	272.21	0.67	100.53	6693.76	-6481.15	4489.91
Saccade R	1	5	9774195931	9774255673	59742	923.53	460.10	1446.74	660.83	6.01	272.21	0.67	100.53	6693.76	-6481.15	4489.91
Fixation L	1	7	9774255673	9774534161	278488	1434.94	680.95	19	24	-1	16.21	16.21
Fixation R	1	7	9774255673	9774534161	278488	1434.94	680.95	19	24	-1	16.37	16.37
Blink L	1	2	9774534161	9774713140	178979
Blink R	1	2	9774534161	9774713140	178979
Fixation L	1	8	9774713140	9774991518	278378	1068.51	697.57	76	19	-1	16.59	16.59
Fixation R	1	8	9774713140	9774991518	278378	1068.51	697.57	76	19	-1	16.56	16.56
Saccade L	1	6	9774991518	9775011507	19989	1004.36	686.17	1011.43	675.24	0.48	60.40	1.00	24.22	-51.41	-1180.81	550.98
Saccade R	1	6	9774991518	9775011507	19989	1004.36	686.17	1011.43	675.24	0.48	60.40	1.00	24.22	-51.41	-1180.81	550.98
Fixation L	1	9	9775011507	9775230242	218735	999.42	676.60	61	18	-1	16.56	16.56
Fixation R	1	9	9775011507	9775230242	218735	999.42	676.60	61	18	-1	16.67	16.67
Saccade L	1	7	9775230242	9775250101	19859	950.41	668.31	770.17	538.23	1.78	224.75	1.00	89.67	5464.91	-5536.85	3815.32
Saccade R	1	7	9775230242	9775250101	19859	950.41	668.31	770.17	538.23	1.78	224.75	1.00	89.67	5464.91	-5536.85	3815.32
Fixation L	1	10	9775250101	9775568346	318245	697.89	535.37	82	17	-1	16.65	16.65
Fixation R	1	10	9775250101	9775568346	318245	697.89	535.37	82	17	-1	16.59	16.59
Saccade L	1	8	9775568346	9775588214	19868	688.08	543.06	686.36	541.72	0.04	2.65	1.00	2.13	26.45	-36.53	22.00
Saccade R	1	8	9775568346	9775588214	19868	688.08	543.06	686.36	541.72	0.04	2.65	1.00	2.13	26.45	-36.53	22.00
Fixation L	1	11	9775588214	9776125310	537096	686.37	539.93	11	8	-1	16.05	16.05
Fixation R	1	11	9775588214	9776125310	537096	686.37	539.93	11	8	-1	15.66	15.66
