[BeGaze]
Converted from:	C:\Documents and Settings\iViewX\Desktop\EXPERIMENTATIONS\Experiments\results\finaleart\S7121223-finaleart-1.idf
Date:	27.03.2019 15:36:38
Version:	BeGaze 2.5.77
Sample Rate:	50
Subject:	S7121223
Description:	Gregoire pacreau

Table Header for Fixations:
Event Type	Trial	Number	Start	End	Duration	Location X	Location Y	Dispersion X	Dispersion Y	Plane	Avg. Pupil Size X	Avg. Pupil Size Y

Table Header for Saccades:
Event Type	Trial	Number	Start	End	Duration	Start Loc.X	Start Loc.Y	End Loc.X	End Loc.Y	Amplitude	Peak Speed	Peak Speed At	Average Speed	Peak Accel.	Peak Decel.	Average Accel.

Table Header for Blinks:
Event Type	Trial	Number	Start	End	Duration

Table Header for User Events:
Event Type	Trial	Number	Start	Description

UserEvent	1	1	3795670255	# Message: metzinger-nature-morte-1905.jpg
Fixation L	1	1	3795686290	3795984889	298599	781.92	481.39	6	39	-1	14.66	14.66
Fixation R	1	1	3795686290	3795984889	298599	781.92	481.39	6	39	-1	15.74	15.74
Saccade L	1	1	3795984889	3796044553	59664	785.49	459.31	967.06	466.33	2.52	129.25	1.00	42.23	1563.39	-2356.76	1291.02
Blink R	1	1	3795984889	3796064537	79648
Fixation L	1	2	3796044553	3796263520	218967	1010.22	458.75	71	28	-1	14.39	14.39
Fixation R	1	2	3796064537	3796263520	198983	1014.14	458.07	71	28	-1	16.00	16.00
Saccade L	1	2	3796263520	3796283375	19855	1025.90	442.71	1025.55	441.33	0.25	29.26	1.00	12.58	536.47	-259.31	328.84
Saccade R	1	1	3796263520	3796283375	19855	1025.90	442.71	1025.55	441.33	0.25	29.26	1.00	12.58	536.47	-259.31	328.84
Fixation L	1	3	3796283375	3796462501	179126	990.96	472.38	48	47	-1	11.67	11.67
Fixation R	1	3	3796283375	3796462501	179126	990.96	472.38	48	47	-1	12.77	12.77
Saccade L	1	3	3796462501	3796482493	19992	977.81	488.69	984.83	576.77	0.58	89.38	1.00	29.25	2122.30	-1846.99	1471.52
Saccade R	1	2	3796462501	3796482493	19992	977.81	488.69	984.83	576.77	0.58	89.38	1.00	29.25	2122.30	-1846.99	1471.52
Fixation L	1	4	3796482493	3796900464	417971	1010.38	564.20	41	28	-1	10.94	10.94
Fixation R	1	4	3796482493	3796900464	417971	1010.38	564.20	41	28	-1	11.85	11.85
Saccade L	1	4	3796900464	3796920342	19878	979.32	564.32	844.73	770.28	1.54	248.73	1.00	77.32	6117.87	-5707.02	4094.15
Saccade R	1	3	3796900464	3796920342	19878	979.32	564.32	844.73	770.28	1.54	248.73	1.00	77.32	6117.87	-5707.02	4094.15
Fixation L	1	5	3796920342	3797298455	378113	819.96	764.93	35	33	-1	10.65	10.65
Fixation R	1	5	3796920342	3797298455	378113	819.96	764.93	35	33	-1	11.90	11.90
Saccade L	1	5	3797298455	3797318442	19987	814.78	758.55	762.89	800.88	0.60	67.74	1.00	30.05	1502.05	-1173.36	1172.06
Saccade R	1	4	3797298455	3797318442	19987	814.78	758.55	762.89	800.88	0.60	67.74	1.00	30.05	1502.05	-1173.36	1172.06
Fixation L	1	6	3797318442	3797756292	437850	738.78	852.63	29	59	-1	11.26	11.26
Fixation R	1	6	3797318442	3797756292	437850	738.78	852.63	29	59	-1	12.40	12.40
Saccade L	1	6	3797756292	3797796049	39757	735.81	851.38	728.37	952.47	0.88	77.68	1.00	22.23	1913.00	-1796.23	1194.72
Saccade R	1	5	3797756292	3797796049	39757	735.81	851.38	728.37	952.47	0.88	77.68	1.00	22.23	1913.00	-1796.23	1194.72
Fixation L	1	7	3797796049	3798015034	218985	724.33	964.59	11	17	-1	11.86	11.86
Fixation R	1	7	3797796049	3798015034	218985	724.33	964.59	11	17	-1	12.64	12.64
Saccade L	1	7	3798015034	3798054905	39871	731.66	966.30	1101.28	971.45	3.11	254.59	0.50	77.95	6289.10	-6204.37	4572.01
Saccade R	1	6	3798015034	3798054905	39871	731.66	966.30	1101.28	971.45	3.11	254.59	0.50	77.95	6289.10	-6204.37	4572.01
Fixation L	1	8	3798054905	3798293663	238758	1110.50	977.11	16	11	-1	12.25	12.25
Fixation R	1	8	3798054905	3798293663	238758	1110.50	977.11	16	11	-1	13.33	13.33
Saccade L	1	8	3798293663	3798333532	39869	1117.75	976.59	1218.35	936.93	1.59	102.32	0.50	39.79	2491.23	-989.39	1194.82
Saccade R	1	7	3798293663	3798333532	39869	1117.75	976.59	1218.35	936.93	1.59	102.32	0.50	39.79	2491.23	-989.39	1194.82
Fixation L	1	9	3798333532	3798711628	378096	1241.24	889.62	34	63	-1	12.20	12.20
Fixation R	1	9	3798333532	3798711628	378096	1241.24	889.62	34	63	-1	12.88	12.88
Saccade L	1	9	3798711628	3798731623	19995	1241.07	890.35	1339.82	889.22	0.60	99.90	1.00	30.11	2414.18	-2237.27	1566.86
Saccade R	1	8	3798711628	3798731623	19995	1241.07	890.35	1339.82	889.22	0.60	99.90	1.00	30.11	2414.18	-2237.27	1566.86
Fixation L	1	10	3798731623	3798910734	179111	1341.47	886.17	17	13	-1	12.74	12.74
Fixation R	1	10	3798731623	3798910734	179111	1341.47	886.17	17	13	-1	13.05	13.05
Saccade L	1	10	3798910734	3798950486	39752	1330.10	875.59	1318.24	502.40	3.28	300.66	0.50	82.62	7457.09	-7099.03	4435.14
Saccade R	1	9	3798910734	3798950486	39752	1330.10	875.59	1318.24	502.40	3.28	300.66	0.50	82.62	7457.09	-7099.03	4435.14
Fixation L	1	11	3798950486	3799089856	139370	1311.67	483.29	13	42	-1	13.09	13.09
Fixation R	1	11	3798950486	3799089856	139370	1311.67	483.29	13	42	-1	13.57	13.57
Saccade L	1	11	3799089856	3799109722	19866	1306.81	459.90	1306.50	321.27	0.89	140.21	1.00	44.75	3474.99	-3330.43	2275.05
Saccade R	1	10	3799089856	3799109722	19866	1306.81	459.90	1306.50	321.27	0.89	140.21	1.00	44.75	3474.99	-3330.43	2275.05
Fixation L	1	12	3799109722	3799408338	298616	1316.51	301.26	16	24	-1	12.59	12.59
Fixation R	1	12	3799109722	3799408338	298616	1316.51	301.26	16	24	-1	13.08	13.08
Saccade L	1	12	3799408338	3799428209	19871	1323.04	301.72	1134.92	434.55	1.32	232.84	1.00	66.57	5792.55	-5693.90	4062.66
Saccade R	1	11	3799408338	3799428209	19871	1323.04	301.72	1134.92	434.55	1.32	232.84	1.00	66.57	5792.55	-5693.90	4062.66
Fixation L	1	13	3799428209	3799667074	238865	1104.41	426.37	36	21	-1	12.81	12.81
Fixation R	1	13	3799428209	3799667074	238865	1104.41	426.37	36	21	-1	13.51	13.51
