[BeGaze]
Converted from:	C:\Documents and Settings\iViewX\Desktop\EXPERIMENTATIONS\Experiments\results\finaleart\S01A22542-finaleart-1.idf
Date:	27.03.2019 15:33:19
Version:	BeGaze 2.5.77
Sample Rate:	50
Subject:	S01A22542
Description:	Thibault Seve Minnaert

Table Header for Fixations:
Event Type	Trial	Number	Start	End	Duration	Location X	Location Y	Dispersion X	Dispersion Y	Plane	Avg. Pupil Size X	Avg. Pupil Size Y

Table Header for Saccades:
Event Type	Trial	Number	Start	End	Duration	Start Loc.X	Start Loc.Y	End Loc.X	End Loc.Y	Amplitude	Peak Speed	Peak Speed At	Average Speed	Peak Accel.	Peak Decel.	Average Accel.

Table Header for Blinks:
Event Type	Trial	Number	Start	End	Duration

Table Header for User Events:
Event Type	Trial	Number	Start	Description

UserEvent	1	1	9128748006	# Message: wright-vesuvius-from-posillipo-1774.jpg
Fixation L	1	1	9128758809	9129077293	318484	939.35	605.13	62	19	-1	13.57	13.57
Fixation R	1	1	9128758809	9129077293	318484	939.35	605.13	62	19	-1	14.36	14.36
Saccade L	1	1	9129077293	9129097293	20000	882.72	595.31	870.94	584.47	0.43	48.02	0.00	21.43	46.50	-1021.73	437.58
Saccade R	1	1	9129077293	9129097293	20000	882.72	595.31	870.94	584.47	0.43	48.02	0.00	21.43	46.50	-1021.73	437.58
Fixation L	1	2	9129097293	9129236666	139373	868.81	569.48	9	24	-1	13.57	13.57
Fixation R	1	2	9129097293	9129236666	139373	868.81	569.48	9	24	-1	14.21	14.21
Saccade L	1	2	9129236666	9129256534	19868	864.21	566.99	943.15	569.92	0.54	79.90	1.00	26.98	1907.10	-1624.53	1257.04
Saccade R	1	2	9129236666	9129256534	19868	864.21	566.99	943.15	569.92	0.54	79.90	1.00	26.98	1907.10	-1624.53	1257.04
Fixation L	1	3	9129256534	9129376020	119486	936.88	573.95	20	15	-1	13.48	13.48
Fixation R	1	3	9129256534	9129376020	119486	936.88	573.95	20	15	-1	14.32	14.32
Saccade L	1	3	9129376020	9129395893	19873	924.42	565.42	899.54	345.66	1.35	223.63	1.00	67.83	5479.51	-4844.66	3515.04
Saccade R	1	3	9129376020	9129395893	19873	924.42	565.42	899.54	345.66	1.35	223.63	1.00	67.83	5479.51	-4844.66	3515.04
Fixation L	1	4	9129395893	9129993246	597353	880.01	325.66	31	48	-1	12.32	12.32
Fixation R	1	4	9129395893	9129993246	597353	880.01	325.66	31	48	-1	13.68	13.68
Saccade L	1	4	9129993246	9130052867	59621	871.02	335.85	1286.64	670.23	5.78	338.10	0.67	97.00	8324.66	-8206.07	4766.79
Saccade R	1	4	9129993246	9130052867	59621	871.02	335.85	1286.64	670.23	5.78	338.10	0.67	97.00	8324.66	-8206.07	4766.79
Fixation L	1	5	9130052867	9130291866	238999	1290.00	677.88	12	14	-1	12.34	12.34
Fixation R	1	5	9130052867	9130291866	238999	1290.00	677.88	12	14	-1	13.72	13.72
Saccade L	1	5	9130291866	9130311727	19861	1295.82	676.04	1464.20	672.64	1.34	170.32	1.00	67.23	4128.13	-3769.89	3331.61
Saccade R	1	5	9130291866	9130311727	19861	1295.82	676.04	1464.20	672.64	1.34	170.32	1.00	67.23	4128.13	-3769.89	3331.61
Fixation L	1	6	9130311727	9130550717	238990	1534.80	669.75	87	10	-1	11.97	11.97
Fixation R	1	6	9130311727	9130550717	238990	1534.80	669.75	87	10	-1	13.04	13.04
Saccade L	1	6	9130550717	9130570581	19864	1547.11	667.43	1603.74	661.33	0.38	57.61	1.00	19.35	1383.95	-906.47	865.41
Saccade R	1	6	9130550717	9130570581	19864	1547.11	667.43	1603.74	661.33	0.38	57.61	1.00	19.35	1383.95	-906.47	865.41
Fixation L	1	7	9130570581	9130769703	199122	1618.08	653.77	38	20	-1	11.15	11.15
Fixation R	1	7	9130570581	9130769703	199122	1618.08	653.77	38	20	-1	12.16	12.16
Saccade L	1	7	9130769703	9130809460	39757	1627.41	643.60	1081.69	921.77	5.26	312.33	1.00	132.41	7749.21	-7561.86	7419.26
Saccade R	1	7	9130769703	9130809460	39757	1627.41	643.60	1081.69	921.77	5.26	312.33	1.00	132.41	7749.21	-7561.86	7419.26
Fixation L	1	8	9130809460	9131187805	378345	1052.37	950.10	39	52	-1	10.98	10.98
Fixation R	1	8	9130809460	9131187805	378345	1052.37	950.10	39	52	-1	12.08	12.08
Saccade L	1	8	9131187805	9131207678	19873	1056.90	919.82	1225.06	897.76	1.24	171.52	1.00	62.19	4212.82	-3934.37	3007.37
Saccade R	1	8	9131187805	9131207678	19873	1056.90	919.82	1225.06	897.76	1.24	171.52	1.00	62.19	4212.82	-3934.37	3007.37
Fixation L	1	9	9131207678	9131347049	139371	1219.25	894.35	19	12	-1	12.01	12.01
Fixation R	1	9	9131207678	9131347049	139371	1219.25	894.35	19	12	-1	13.01	13.01
Saccade L	1	9	9131347049	9131386927	39878	1219.96	896.90	1610.27	741.58	3.51	282.11	1.00	88.06	6905.07	-6963.15	5327.31
Saccade R	1	9	9131347049	9131386927	39878	1219.96	896.90	1610.27	741.58	3.51	282.11	1.00	88.06	6905.07	-6963.15	5327.31
Fixation L	1	10	9131386927	9131725416	338489	1622.55	739.45	39	43	-1	13.61	13.61
Fixation R	1	10	9131386927	9131725416	338489	1622.55	739.45	39	43	-1	14.16	14.16
Saccade L	1	10	9131725416	9131745292	19876	1611.52	765.05	1611.85	886.28	0.98	122.61	1.00	49.48	2990.81	-2923.11	2299.96
Saccade R	1	10	9131725416	9131745292	19876	1611.52	765.05	1611.85	886.28	0.98	122.61	1.00	49.48	2990.81	-2923.11	2299.96
Fixation L	1	11	9131745292	9131904524	159232	1615.39	866.08	38	40	-1	13.52	13.52
Fixation R	1	11	9131745292	9131904524	159232	1615.39	866.08	38	40	-1	13.78	13.78
Saccade L	1	11	9131904524	9131964264	59740	1607.90	867.56	800.46	664.16	8.72	365.74	0.67	146.00	8913.56	-9046.56	6873.50
Saccade R	1	11	9131904524	9131964264	59740	1607.90	867.56	800.46	664.16	8.72	365.74	0.67	146.00	8913.56	-9046.56	6873.50
Fixation L	1	12	9131964264	9132183271	219007	793.44	667.21	11	7	-1	13.24	13.24
Fixation R	1	12	9131964264	9132183271	219007	793.44	667.21	11	7	-1	14.10	14.10
Saccade L	1	12	9132183271	9132203257	19986	788.70	666.89	648.59	662.11	1.05	141.79	1.00	52.71	3408.84	-3085.96	2622.64
Saccade R	1	12	9132183271	9132203257	19986	788.70	666.89	648.59	662.11	1.05	141.79	1.00	52.71	3408.84	-3085.96	2622.64
Fixation L	1	13	9132203257	9132422247	218990	594.07	637.06	63	35	-1	12.80	12.80
Fixation R	1	13	9132203257	9132422247	218990	594.07	637.06	63	35	-1	14.20	14.20
Saccade L	1	13	9132422247	9132461996	39749	588.03	634.59	915.17	642.14	2.83	241.22	1.00	71.24	6012.04	-5712.16	3899.62
Saccade R	1	13	9132422247	9132461996	39749	588.03	634.59	915.17	642.14	2.83	241.22	1.00	71.24	6012.04	-5712.16	3899.62
Fixation L	1	14	9132461996	9132740737	278741	950.66	657.60	42	22	-1	13.08	13.08
Fixation R	1	14	9132461996	9132740737	278741	950.66	657.60	42	22	-1	14.50	14.50
