[BeGaze]
Converted from:	C:\Documents and Settings\iViewX\Desktop\EXPERIMENTATIONS\Experiments\results\finaleart\S01A22542-finaleart-1.idf
Date:	27.03.2019 15:33:23
Version:	BeGaze 2.5.77
Sample Rate:	50
Subject:	S01A22542
Description:	Thibault Seve Minnaert

Table Header for Fixations:
Event Type	Trial	Number	Start	End	Duration	Location X	Location Y	Dispersion X	Dispersion Y	Plane	Avg. Pupil Size X	Avg. Pupil Size Y

Table Header for Saccades:
Event Type	Trial	Number	Start	End	Duration	Start Loc.X	Start Loc.Y	End Loc.X	End Loc.Y	Amplitude	Peak Speed	Peak Speed At	Average Speed	Peak Accel.	Peak Decel.	Average Accel.

Table Header for Blinks:
Event Type	Trial	Number	Start	End	Duration

Table Header for User Events:
Event Type	Trial	Number	Start	Description

UserEvent	1	1	9777365917	# Message: morning_in_a_pine_forest_Ivan_Shishkin_1889.jpg
Fixation L	1	1	9777368030	9777785761	417731	896.54	478.88	41	51	-1	13.43	13.43
Fixation R	1	1	9777368030	9777785761	417731	896.54	478.88	41	51	-1	13.16	13.16
Saccade L	1	1	9777785761	9777805670	19909	927.04	517.75	1002.68	549.04	0.63	82.79	1.00	31.87	2002.75	-1813.22	1584.63
Saccade R	1	1	9777785761	9777805670	19909	927.04	517.75	1002.68	549.04	0.63	82.79	1.00	31.87	2002.75	-1813.22	1584.63
Fixation L	1	2	9777805670	9777905023	99353	1005.31	555.41	10	13	-1	13.87	13.87
Fixation R	1	2	9777805670	9777905023	99353	1005.31	555.41	10	13	-1	13.23	13.23
Saccade L	1	2	9777905023	9777925029	20006	999.87	562.27	893.53	521.07	0.83	115.35	1.00	41.26	2655.17	-2561.49	1968.40
Saccade R	1	2	9777905023	9777925029	20006	999.87	562.27	893.53	521.07	0.83	115.35	1.00	41.26	2655.17	-2561.49	1968.40
Fixation L	1	3	9777925029	9778143747	218718	848.12	506.74	56	21	-1	12.92	12.92
Fixation R	1	3	9777925029	9778143747	218718	848.12	506.74	56	21	-1	12.70	12.70
Saccade L	1	3	9778143747	9778183496	39749	837.79	499.65	663.77	553.51	1.83	107.21	1.00	45.98	2608.21	-2201.57	2320.14
Saccade R	1	3	9778143747	9778183496	39749	837.79	499.65	663.77	553.51	1.83	107.21	1.00	45.98	2608.21	-2201.57	2320.14
Fixation L	1	4	9778183496	9778581342	397846	684.35	569.52	53	40	-1	12.88	12.88
Fixation R	1	4	9778183496	9778581342	397846	684.35	569.52	53	40	-1	13.17	13.17
Saccade L	1	4	9778581342	9778601226	19884	717.19	560.16	801.53	533.27	0.81	89.54	1.00	40.65	2135.90	-1913.45	1859.42
Saccade R	1	4	9778581342	9778601226	19884	717.19	560.16	801.53	533.27	0.81	89.54	1.00	40.65	2135.90	-1913.45	1859.42
Fixation L	1	5	9778601226	9778879701	278475	865.63	518.71	71	24	-1	13.71	13.71
Fixation R	1	5	9778601226	9778879701	278475	865.63	518.71	71	24	-1	14.20	14.20
Saccade L	1	5	9778879701	9778899581	19880	872.75	508.47	872.99	502.98	0.08	5.57	1.00	3.96	17.01	-86.98	41.56
Saccade R	1	5	9778879701	9778899581	19880	872.75	508.47	872.99	502.98	0.08	5.57	1.00	3.96	17.01	-86.98	41.56
Fixation L	1	6	9778899581	9779098441	198860	870.38	502.39	3	6	-1	13.56	13.56
Fixation R	1	6	9778899581	9779098441	198860	870.38	502.39	3	6	-1	13.94	13.94
Saccade L	1	6	9779098441	9779138198	39757	870.41	505.67	777.20	757.18	2.39	137.19	0.50	60.14	3367.05	-3321.37	3215.22
Saccade R	1	6	9779098441	9779138198	39757	870.41	505.67	777.20	757.18	2.39	137.19	0.50	60.14	3367.05	-3321.37	3215.22
Fixation L	1	7	9779138198	9779754780	616582	766.36	726.29	23	58	-1	13.83	13.83
Fixation R	1	7	9779138198	9779754780	616582	766.36	726.29	23	58	-1	14.32	14.32
Saccade L	1	7	9779754780	9779794667	39887	758.57	698.97	876.59	450.17	2.68	177.19	0.50	67.13	4380.01	-3574.30	3427.36
Saccade R	1	7	9779754780	9779794667	39887	758.57	698.97	876.59	450.17	2.68	177.19	0.50	67.13	4380.01	-3574.30	3427.36
Fixation L	1	8	9779794667	9780311759	517092	860.31	480.79	33	47	-1	13.71	13.71
Fixation R	1	8	9779794667	9780311759	517092	860.31	480.79	33	47	-1	14.06	14.06
Saccade L	1	8	9780311759	9780351517	39758	843.41	480.36	1291.17	747.83	4.54	325.32	0.50	114.15	8041.73	-7525.28	6425.13
Saccade R	1	8	9780311759	9780351517	39758	843.41	480.36	1291.17	747.83	4.54	325.32	0.50	114.15	8041.73	-7525.28	6425.13
Fixation L	1	9	9780351517	9780749368	397851	1258.11	761.82	67	31	-1	14.09	14.09
Fixation R	1	9	9780351517	9780749368	397851	1258.11	761.82	67	31	-1	13.53	13.53
Saccade L	1	9	9780749368	9780769233	19865	1223.62	756.60	1217.76	757.86	0.05	6.06	1.00	2.75	99.39	-81.15	67.22
Saccade R	1	9	9780749368	9780769233	19865	1223.62	756.60	1217.76	757.86	0.05	6.06	1.00	2.75	99.39	-81.15	67.22
Fixation L	1	10	9780769233	9780968104	198871	1211.00	752.92	10	11	-1	13.68	13.68
Fixation R	1	10	9780769233	9780968104	198871	1211.00	752.92	10	11	-1	13.14	13.14
Saccade L	1	10	9780968104	9781047720	79616	1207.19	747.14	793.21	803.70	5.68	239.08	0.50	71.37	5938.76	-5048.36	3330.71
Saccade R	1	10	9780968104	9781047720	79616	1207.19	747.14	793.21	803.70	5.68	239.08	0.50	71.37	5938.76	-5048.36	3330.71
Fixation L	1	11	9781047720	9781186845	139125	772.29	808.08	33	50	-1	13.13	13.13
Fixation R	1	11	9781047720	9781186845	139125	772.29	808.08	33	50	-1	12.94	12.94
Saccade L	1	11	9781186845	9781206849	20004	759.47	805.63	755.00	669.75	0.87	137.51	1.00	43.45	3037.22	-3319.70	2186.28
Saccade R	1	11	9781186845	9781206849	20004	759.47	805.63	755.00	669.75	0.87	137.51	1.00	43.45	3037.22	-3319.70	2186.28
Fixation L	1	12	9781206849	9781345957	139108	758.81	672.90	5	9	-1	12.41	12.41
Fixation R	1	12	9781206849	9781345957	139108	758.81	672.90	5	9	-1	12.25	12.25
