[BeGaze]
Converted from:	C:\Documents and Settings\iViewX\Desktop\EXPERIMENTATIONS\Experiments\results\finaleart\S19F21442-finaleart-1.idf
Date:	27.03.2019 15:50:05
Version:	BeGaze 2.5.77
Sample Rate:	50
Subject:	S19F21442
Description:	Juliette Veuillez

Table Header for Fixations:
Event Type	Trial	Number	Start	End	Duration	Location X	Location Y	Dispersion X	Dispersion Y	Plane	Avg. Pupil Size X	Avg. Pupil Size Y

Table Header for Saccades:
Event Type	Trial	Number	Start	End	Duration	Start Loc.X	Start Loc.Y	End Loc.X	End Loc.Y	Amplitude	Peak Speed	Peak Speed At	Average Speed	Peak Accel.	Peak Decel.	Average Accel.

Table Header for Blinks:
Event Type	Trial	Number	Start	End	Duration

Table Header for User Events:
Event Type	Trial	Number	Start	Description

UserEvent	1	1	5500580268	# Message: void.jpg
Fixation L	1	1	5500580984	5500680348	99364	1319.17	754.22	41	11	-1	13.13	13.13
Fixation R	1	1	5500580984	5500680348	99364	1319.17	754.22	41	11	-1	13.21	13.21
Saccade L	1	1	5500680348	5500700244	19896	1351.30	761.63	1566.79	793.48	1.53	220.26	1.00	76.72	5378.90	-5321.85	3603.42
Saccade R	1	1	5500680348	5500700244	19896	1351.30	761.63	1566.79	793.48	1.53	220.26	1.00	76.72	5378.90	-5321.85	3603.42
Fixation L	1	2	5500700244	5501078201	377957	1615.18	813.17	57	36	-1	12.78	12.78
Fixation R	1	2	5500700244	5501078201	377957	1615.18	813.17	57	36	-1	12.91	12.91
Saccade L	1	2	5501078201	5501098071	19870	1623.22	825.04	1635.38	821.20	0.13	12.91	1.00	6.48	267.00	-277.05	214.38
Saccade R	1	2	5501078201	5501098071	19870	1623.22	825.04	1635.38	821.20	0.13	12.91	1.00	6.48	267.00	-277.05	214.38
Fixation L	1	3	5501098071	5501595299	497228	1618.19	818.66	40	15	-1	13.53	13.53
Fixation R	1	3	5501098071	5501595299	497228	1618.19	818.66	40	15	-1	13.72	13.72
Saccade L	1	3	5501595299	5501615174	19875	1597.70	817.21	1436.72	715.12	1.14	192.76	1.00	57.16	4700.96	-4577.25	3242.65
Saccade R	1	3	5501595299	5501615174	19875	1597.70	817.21	1436.72	715.12	1.14	192.76	1.00	57.16	4700.96	-4577.25	3242.65
Fixation L	1	4	5501615174	5502072663	457489	1406.17	686.02	39	37	-1	14.67	14.67
Fixation R	1	4	5501615174	5502072663	457489	1406.17	686.02	39	37	-1	15.22	15.22
