[BeGaze]
Converted from:	C:\Documents and Settings\iViewX\Desktop\EXPERIMENTATIONS\Experiments\results\finaleart\S16F14542-finaleart-1.idf
Date:	27.03.2019 15:46:24
Version:	BeGaze 2.5.77
Sample Rate:	50
Subject:	S16F14542
Description:	Diane Dewez

Table Header for Fixations:
Event Type	Trial	Number	Start	End	Duration	Location X	Location Y	Dispersion X	Dispersion Y	Plane	Avg. Pupil Size X	Avg. Pupil Size Y

Table Header for Saccades:
Event Type	Trial	Number	Start	End	Duration	Start Loc.X	Start Loc.Y	End Loc.X	End Loc.Y	Amplitude	Peak Speed	Peak Speed At	Average Speed	Peak Accel.	Peak Decel.	Average Accel.

Table Header for Blinks:
Event Type	Trial	Number	Start	End	Duration

Table Header for User Events:
Event Type	Trial	Number	Start	Description

UserEvent	1	1	6449157047	# Message: void.jpg
Fixation L	1	1	6449175363	6449414094	238731	655.80	663.27	9	20	-1	14.10	14.10
Fixation R	1	1	6449175363	6449414094	238731	655.80	663.27	9	20	-1	15.03	15.03
Saccade L	1	1	6449414094	6449453834	39740	648.60	656.80	906.10	735.78	2.58	180.31	0.50	64.88	4405.71	-3718.25	2978.56
Saccade R	1	1	6449414094	6449453834	39740	648.60	656.80	906.10	735.78	2.58	180.31	0.50	64.88	4405.71	-3718.25	2978.56
Fixation L	1	2	6449453834	6449692470	238636	904.61	744.29	9	52	-1	14.87	14.87
Fixation R	1	2	6449453834	6449692470	238636	904.61	744.29	9	52	-1	15.68	15.68
Blink L	1	1	6449692470	6450149929	457459
Blink R	1	1	6449692470	6450149929	457459
Blink L	1	2	6450149929	6450269299	119370
Blink R	1	2	6450149929	6450269299	119370
Fixation L	1	3	6450269299	6450667157	397858	790.74	641.60	14	65	-1	15.68	15.68
Fixation R	1	3	6450269299	6450667157	397858	790.74	641.60	14	65	-1	15.42	15.42
Saccade L	1	2	6450667157	6450687033	19876	800.14	596.58	801.87	561.39	0.55	51.25	0.00	27.50	711.48	-882.51	764.87
Saccade R	1	2	6450667157	6450687033	19876	800.14	596.58	801.87	561.39	0.55	51.25	0.00	27.50	711.48	-882.51	764.87
Fixation L	1	4	6450687033	6451025148	338115	807.49	572.52	20	33	-1	12.09	12.09
Fixation R	1	4	6450687033	6450985391	298358	807.73	574.27	20	31	-1	10.73	10.73
Saccade R	1	3	6451005271	6451045029	39758	806.79	558.54	766.60	505.66	0.94	65.73	1.00	23.57	1602.99	-1023.52	926.14
Saccade L	1	3	6451025148	6451045029	19881	804.35	558.54	766.60	505.66	0.49	65.73	1.00	24.88	1602.99	-1023.52	1102.51
Fixation L	1	5	6451045029	6451144511	99482	733.88	488.37	49	34	-1	10.48	10.48
Fixation R	1	5	6451045029	6451144511	99482	733.88	488.37	49	34	-1	11.91	11.91
