[BeGaze]
Converted from:	C:\Documents and Settings\iViewX\Desktop\EXPERIMENTATIONS\Experiments\results\finaleart\S11H21112-finaleart-1.idf
Date:	27.03.2019 15:39:12
Version:	BeGaze 2.5.77
Sample Rate:	50
Subject:	S11H21112
Description:	Clement legrand-Duchenne

Table Header for Fixations:
Event Type	Trial	Number	Start	End	Duration	Location X	Location Y	Dispersion X	Dispersion Y	Plane	Avg. Pupil Size X	Avg. Pupil Size Y

Table Header for Saccades:
Event Type	Trial	Number	Start	End	Duration	Start Loc.X	Start Loc.Y	End Loc.X	End Loc.Y	Amplitude	Peak Speed	Peak Speed At	Average Speed	Peak Accel.	Peak Decel.	Average Accel.

Table Header for Blinks:
Event Type	Trial	Number	Start	End	Duration

Table Header for User Events:
Event Type	Trial	Number	Start	Description

UserEvent	1	1	5226103932	# Message: goya-Nature-morte-avec-Bouteilles-et-Pains-1826.jpg
Fixation L	1	1	5226123022	5226481040	358018	968.51	488.32	36	46	-1	13.37	13.37
Fixation R	1	1	5226123022	5226481040	358018	968.51	488.32	36	46	-1	16.48	16.48
Saccade L	1	1	5226481040	5226500944	19904	948.58	486.67	913.64	497.07	0.43	36.88	1.00	21.56	788.55	-705.87	705.65
Saccade R	1	1	5226481040	5226500944	19904	948.58	486.67	913.64	497.07	0.43	36.88	1.00	21.56	788.55	-705.87	705.65
Fixation L	1	2	5226500944	5226620243	119299	916.40	495.83	14	48	-1	13.43	13.43
Fixation R	1	2	5226500944	5226620243	119299	916.40	495.83	14	48	-1	16.37	16.37
Saccade L	1	2	5226620243	5226640110	19867	917.71	532.52	921.28	697.74	1.08	167.13	1.00	54.37	3987.08	-4111.60	3032.31
Saccade R	1	2	5226620243	5226640110	19867	917.71	532.52	921.28	697.74	1.08	167.13	1.00	54.37	3987.08	-4111.60	3032.31
Fixation L	1	3	5226640110	5226998097	357987	917.77	730.64	25	57	-1	13.64	13.64
Fixation R	1	3	5226640110	5226998097	357987	917.77	730.64	25	57	-1	16.23	16.23
Saccade L	1	3	5226998097	5227037993	39896	903.49	754.93	637.25	568.09	3.00	183.18	0.50	75.22	4525.88	-4456.81	4432.08
Saccade R	1	3	5226998097	5227037993	39896	903.49	754.93	637.25	568.09	3.00	183.18	0.50	75.22	4525.88	-4456.81	4432.08
Fixation L	1	4	5227037993	5227296453	258460	631.77	583.96	8	26	-1	12.38	12.38
Fixation R	1	4	5227037993	5227296453	258460	631.77	583.96	8	26	-1	15.32	15.32
Saccade L	1	4	5227296453	5227316334	19881	629.91	590.25	623.84	469.00	0.67	122.80	1.00	33.58	2973.96	-2406.84	1839.60
Saccade R	1	4	5227296453	5227316334	19881	629.91	590.25	623.84	469.00	0.67	122.80	1.00	33.58	2973.96	-2406.84	1839.60
Fixation L	1	5	5227316334	5227753945	437611	608.37	435.91	26	60	-1	12.38	12.38
Fixation R	1	5	5227316334	5227753945	437611	608.37	435.91	26	60	-1	15.08	15.08
Saccade L	1	5	5227753945	5227793696	39751	603.19	419.22	608.46	710.58	2.43	197.00	1.00	61.22	4873.27	-3866.06	3348.17
Saccade R	1	5	5227753945	5227793696	39751	603.19	419.22	608.46	710.58	2.43	197.00	1.00	61.22	4873.27	-3866.06	3348.17
Fixation L	1	6	5227793696	5228072177	278481	607.12	747.13	23	47	-1	13.52	13.52
Fixation R	1	6	5227793696	5228072177	278481	607.12	747.13	23	47	-1	16.31	16.31
Saccade L	1	6	5228072177	5228092047	19870	625.18	753.34	713.26	764.18	0.60	89.77	1.00	30.04	2119.78	-1894.86	1479.94
Saccade R	1	6	5228072177	5228092047	19870	625.18	753.34	713.26	764.18	0.60	89.77	1.00	30.04	2119.78	-1894.86	1479.94
Fixation L	1	7	5228092047	5228469907	377860	716.61	793.32	26	45	-1	14.40	14.40
Fixation R	1	7	5228092047	5228469907	377860	716.61	793.32	26	45	-1	17.28	17.28
Saccade L	1	7	5228469907	5228509783	39876	739.76	809.94	1098.68	804.17	3.13	228.37	0.50	78.51	5671.00	-5689.82	4306.48
Saccade R	1	7	5228469907	5228509783	39876	739.76	809.94	1098.68	804.17	3.13	228.37	0.50	78.51	5671.00	-5689.82	4306.48
Fixation L	1	8	5228509783	5228828017	318234	1099.95	794.82	19	18	-1	14.59	14.59
Fixation R	1	8	5228509783	5228828017	318234	1099.95	794.82	19	18	-1	17.49	17.49
Saccade L	1	8	5228828017	5228867766	39749	1117.29	788.12	1384.37	761.00	2.56	229.19	0.50	64.29	5686.70	-5046.66	3076.46
Saccade R	1	8	5228828017	5228867766	39749	1117.29	788.12	1384.37	761.00	2.56	229.19	0.50	64.29	5686.70	-5046.66	3076.46
Fixation L	1	9	5228867766	5229046761	178995	1389.16	728.05	9	41	-1	13.78	13.78
Fixation R	1	9	5228867766	5229046761	178995	1389.16	728.05	9	41	-1	16.65	16.65
Saccade L	1	9	5229046761	5229066629	19868	1394.12	719.77	1440.96	854.17	1.01	143.95	1.00	50.73	3595.55	-3461.54	2787.23
Saccade R	1	9	5229046761	5229066629	19868	1394.12	719.77	1440.96	854.17	1.01	143.95	1.00	50.73	3595.55	-3461.54	2787.23
Fixation L	1	10	5229066629	5229285370	218741	1463.65	890.65	31	68	-1	13.28	13.28
Fixation R	1	10	5229066629	5229285370	218741	1463.65	890.65	31	68	-1	15.90	15.90
Saccade L	1	10	5229285370	5229305389	20019	1472.40	922.61	1473.73	984.92	0.54	63.05	1.00	26.79	1545.40	-1384.10	1213.08
Saccade R	1	10	5229285370	5229305389	20019	1472.40	922.61	1473.73	984.92	0.54	63.05	1.00	26.79	1545.40	-1384.10	1213.08
Fixation L	1	11	5229305389	5229623606	318217	1495.91	981.69	36	17	-1	12.59	12.59
Fixation R	1	11	5229305389	5229623606	318217	1495.91	981.69	36	17	-1	15.28	15.28
Saccade L	1	11	5229623606	5229643487	19881	1501.99	982.52	1426.21	989.18	0.48	76.94	1.00	23.93	1817.27	-1660.28	1162.46
Saccade R	1	11	5229623606	5229643487	19881	1501.99	982.52	1426.21	989.18	0.48	76.94	1.00	23.93	1817.27	-1660.28	1162.46
Fixation L	1	12	5229643487	5230100831	457344	1429.00	1022.28	23	44	-1	12.17	12.17
Fixation R	1	12	5229643487	5230100831	457344	1429.00	1022.28	23	44	-1	14.51	14.51
