[BeGaze]
Converted from:	C:\Documents and Settings\iViewX\Desktop\EXPERIMENTATIONS\Experiments\results\finaleart\S21F22332-finaleart-1.idf
Date:	27.03.2019 15:56:20
Version:	BeGaze 2.5.77
Sample Rate:	50
Subject:	S21F22332
Description:	Cyrielle Mailart

Table Header for Fixations:
Event Type	Trial	Number	Start	End	Duration	Location X	Location Y	Dispersion X	Dispersion Y	Plane	Avg. Pupil Size X	Avg. Pupil Size Y

Table Header for Saccades:
Event Type	Trial	Number	Start	End	Duration	Start Loc.X	Start Loc.Y	End Loc.X	End Loc.Y	Amplitude	Peak Speed	Peak Speed At	Average Speed	Peak Accel.	Peak Decel.	Average Accel.

Table Header for Blinks:
Event Type	Trial	Number	Start	End	Duration

Table Header for User Events:
Event Type	Trial	Number	Start	Description

UserEvent	1	1	3144256587	# Message: void.jpg
Saccade L	1	1	3144265571	3144365055	99484	839.49	980.74	879.55	479.71	7.45	301.32	0.80	74.93	7455.23	-7176.24	2885.97
Saccade R	1	1	3144265571	3144365055	99484	839.49	980.74	879.55	479.71	7.45	301.32	0.80	74.93	7455.23	-7176.24	2885.97
Fixation L	1	1	3144365055	3144703164	338109	900.51	483.45	27	20	-1	11.61	11.61
Fixation R	1	1	3144365055	3144703164	338109	900.51	483.45	27	20	-1	11.36	11.36
Blink L	1	1	3144703164	3144961652	258488
Blink R	1	1	3144703164	3144961652	258488
Fixation L	1	2	3144961652	3145319756	358104	900.65	371.07	11	61	-1	13.27	13.27
Fixation R	1	2	3144961652	3145319756	358104	900.65	371.07	11	61	-1	12.76	12.76
Saccade L	1	2	3145319756	3145339632	19876	896.40	376.94	824.37	390.98	0.46	74.23	1.00	22.99	1781.72	-1271.14	1050.31
Saccade R	1	2	3145319756	3145339632	19876	896.40	376.94	824.37	390.98	0.46	74.23	1.00	22.99	1781.72	-1271.14	1050.31
Fixation L	1	3	3145339632	3145797105	457473	814.86	432.15	17	56	-1	13.78	13.78
Fixation R	1	3	3145339632	3145797105	457473	814.86	432.15	17	56	-1	13.43	13.43
Saccade L	1	3	3145797105	3145816980	19875	809.96	441.35	937.34	475.57	0.91	133.41	1.00	45.68	3305.08	-2651.89	2212.18
Saccade R	1	3	3145797105	3145816980	19875	809.96	441.35	937.34	475.57	0.91	133.41	1.00	45.68	3305.08	-2651.89	2212.18
Fixation L	1	4	3145816980	3146254584	437604	914.01	503.70	30	36	-1	14.07	14.07
Fixation R	1	4	3145816980	3146254584	437604	914.01	503.70	30	36	-1	13.66	13.66
