[BeGaze]
Converted from:	C:\Documents and Settings\iViewX\Desktop\EXPERIMENTATIONS\Experiments\results\finaleart\S9H29221-finaleart-1.idf
Date:	27.03.2019 16:02:31
Version:	BeGaze 2.5.77
Sample Rate:	50
Subject:	S9H29221
Description:	steven

Table Header for Fixations:
Event Type	Trial	Number	Start	End	Duration	Location X	Location Y	Dispersion X	Dispersion Y	Plane	Avg. Pupil Size X	Avg. Pupil Size Y

Table Header for Saccades:
Event Type	Trial	Number	Start	End	Duration	Start Loc.X	Start Loc.Y	End Loc.X	End Loc.Y	Amplitude	Peak Speed	Peak Speed At	Average Speed	Peak Accel.	Peak Decel.	Average Accel.

Table Header for Blinks:
Event Type	Trial	Number	Start	End	Duration

Table Header for User Events:
Event Type	Trial	Number	Start	Description

UserEvent	1	1	5826136848	# Message: marquet-fruit-knife-and-napkin-1898.jpg
Saccade L	1	1	5826138306	5826158184	19878	1535.63	276.45	1566.68	283.02	0.30	32.11	1.00	15.23	339.49	0.00	146.86
Saccade R	1	1	5826138306	5826158184	19878	1535.63	276.45	1566.68	283.02	0.30	32.11	1.00	15.23	339.49	0.00	146.86
Fixation L	1	1	5826158184	5826345864	187680	1602.59	299.30	55	31	-1	9.76	9.76
Fixation R	1	1	5826158184	5826345864	187680	1602.59	299.30	55	31	-1	9.91	9.91
Saccade L	1	2	5826345864	5826357048	11184	1614.27	313.58	1629.84	333.15	0.19	25.30	1.00	16.55	434.65	-275.52	319.77
Saccade R	1	2	5826345864	5826357048	11184	1614.27	313.58	1629.84	333.15	0.19	25.30	1.00	16.55	434.65	-275.52	319.77
Fixation L	1	2	5826357048	5826496304	139256	1659.51	332.25	70	27	-1	10.29	10.29
Fixation R	1	2	5826357048	5826496304	139256	1659.51	332.25	70	27	-1	10.27	10.27
Saccade L	1	3	5826496304	5826516161	19857	1699.98	319.86	1740.51	319.51	0.58	42.43	1.00	29.38	728.86	-279.27	504.37
Saccade R	1	3	5826496304	5826516161	19857	1699.98	319.86	1740.51	319.51	0.58	42.43	1.00	29.38	728.86	-279.27	504.37
Fixation L	1	3	5826516161	5826834400	318239	1729.62	344.78	40	59	-1	10.32	10.32
Fixation R	1	3	5826516161	5826834400	318239	1729.62	344.78	40	59	-1	10.08	10.08
Saccade L	1	4	5826834400	5826894144	59744	1717.22	379.14	1207.77	464.85	6.05	220.87	0.33	101.28	5206.20	-3926.22	3112.11
Saccade R	1	4	5826834400	5826894144	59744	1717.22	379.14	1207.77	464.85	6.05	220.87	0.33	101.28	5206.20	-3926.22	3112.11
Fixation L	1	4	5826894144	5827252122	357978	1158.32	474.43	71	27	-1	10.75	10.75
Fixation R	1	4	5826894144	5827252122	357978	1158.32	474.43	71	27	-1	10.57	10.57
Saccade L	1	5	5827252122	5827271994	19872	1135.89	471.30	1127.96	472.61	0.12	8.13	1.00	5.84	69.91	-91.33	62.11
Saccade R	1	5	5827252122	5827271994	19872	1135.89	471.30	1127.96	472.61	0.12	8.13	1.00	5.84	69.91	-91.33	62.11
Fixation L	1	5	5827271994	5827431110	159116	1115.88	474.48	21	10	-1	10.43	10.43
Fixation R	1	5	5827271994	5827431110	159116	1115.88	474.48	21	10	-1	10.55	10.55
Saccade L	1	6	5827431110	5827470859	39749	1107.16	472.50	843.28	499.80	2.24	166.59	0.50	56.39	4066.29	-4087.10	3211.89
Saccade R	1	6	5827431110	5827470859	39749	1107.16	472.50	843.28	499.80	2.24	166.59	0.50	56.39	4066.29	-4087.10	3211.89
Fixation L	1	6	5827470859	5827749349	278490	835.49	514.03	61	20	-1	10.78	10.78
Fixation R	1	6	5827470859	5827749349	278490	835.49	514.03	61	20	-1	10.86	10.86
Saccade L	1	7	5827749349	5827789091	39742	889.26	518.37	1234.24	591.65	3.67	211.18	0.50	92.41	5229.89	-4337.75	3800.39
Saccade R	1	7	5827749349	5827789091	39742	889.26	518.37	1234.24	591.65	3.67	211.18	0.50	92.41	5229.89	-4337.75	3800.39
Fixation L	1	7	5827789091	5828147202	358111	1219.34	580.56	20	39	-1	11.59	11.59
Fixation R	1	7	5827789091	5828147202	358111	1219.34	580.56	20	39	-1	11.74	11.74
Saccade L	1	8	5828147202	5828167070	19868	1218.31	589.31	1298.99	605.33	0.51	83.20	1.00	25.53	1999.36	-1942.11	1325.59
Saccade R	1	8	5828147202	5828167070	19868	1218.31	589.31	1298.99	605.33	0.51	83.20	1.00	25.53	1999.36	-1942.11	1325.59
Fixation L	1	8	5828167070	5828365943	198873	1316.17	608.72	24	10	-1	12.07	12.07
Fixation R	1	8	5828167070	5828365943	198873	1316.17	608.72	24	10	-1	12.21	12.21
Blink L	1	1	5828365943	5828584799	218856
Blink R	1	1	5828365943	5828584799	218856
Fixation L	1	9	5828584799	5828783678	198879	1365.98	581.15	23	18	-1	13.81	13.81
Fixation R	1	9	5828584799	5828783678	198879	1365.98	581.15	23	18	-1	13.41	13.41
Saccade L	1	9	5828783678	5828903046	119368	1347.07	592.55	655.34	597.68	10.14	148.96	0.50	84.97	2232.48	-2621.05	1437.29
Saccade R	1	9	5828783678	5828903046	119368	1347.07	592.55	655.34	597.68	10.14	148.96	0.50	84.97	2232.48	-2621.05	1437.29
Fixation L	1	10	5828903046	5829320651	417605	596.42	590.14	76	17	-1	13.17	13.17
Fixation R	1	10	5828903046	5829320651	417605	596.42	590.14	76	17	-1	13.09	13.09
Saccade L	1	10	5829320651	5829340515	19864	578.61	601.59	563.49	592.00	0.19	18.11	1.00	9.67	315.36	-383.38	282.14
Saccade R	1	10	5829320651	5829340515	19864	578.61	601.59	563.49	592.00	0.19	18.11	1.00	9.67	315.36	-383.38	282.14
Fixation L	1	11	5829340515	5829559389	218874	543.58	619.09	29	70	-1	12.83	12.83
Fixation R	1	11	5829340515	5829559389	218874	543.58	619.09	29	70	-1	12.86	12.86
Saccade L	1	11	5829559389	5829698631	139242	534.77	659.05	1038.19	577.53	7.92	162.57	0.86	56.90	3426.11	-3512.10	1609.22
Saccade R	1	11	5829559389	5829698631	139242	534.77	659.05	1038.19	577.53	7.92	162.57	0.86	56.90	3426.11	-3512.10	1609.22
Fixation L	1	12	5829698631	5829957118	258487	1072.04	545.79	44	54	-1	12.93	12.93
Fixation R	1	12	5829698631	5829957118	258487	1072.04	545.79	44	54	-1	13.19	13.19
Saccade L	1	12	5829957118	5829977016	19898	1083.03	523.36	1084.00	521.51	0.05	4.51	0.00	2.55	82.98	-63.79	53.21
Saccade R	1	12	5829957118	5829977016	19898	1083.03	523.36	1084.00	521.51	0.05	4.51	0.00	2.55	82.98	-63.79	53.21
Fixation L	1	13	5829977016	5830175979	198963	1095.11	511.60	25	15	-1	13.00	13.00
Fixation R	1	13	5829977016	5830175979	198963	1095.11	511.60	25	15	-1	12.96	12.96
