[BeGaze]
Converted from:	C:\Documents and Settings\iViewX\Desktop\EXPERIMENTATIONS\Experiments\results\finaleart\S16F14542-finaleart-1.idf
Date:	27.03.2019 15:46:21
Version:	BeGaze 2.5.77
Sample Rate:	50
Subject:	S16F14542
Description:	Diane Dewez

Table Header for Fixations:
Event Type	Trial	Number	Start	End	Duration	Location X	Location Y	Dispersion X	Dispersion Y	Plane	Avg. Pupil Size X	Avg. Pupil Size Y

Table Header for Saccades:
Event Type	Trial	Number	Start	End	Duration	Start Loc.X	Start Loc.Y	End Loc.X	End Loc.Y	Amplitude	Peak Speed	Peak Speed At	Average Speed	Peak Accel.	Peak Decel.	Average Accel.

Table Header for Blinks:
Event Type	Trial	Number	Start	End	Duration

Table Header for User Events:
Event Type	Trial	Number	Start	Description

UserEvent	1	1	6414616866	# Message: resting-bacchante_sorolla_1887.jpg
Fixation L	1	1	6414626382	6415063991	437609	802.33	436.62	33	41	-1	12.87	12.87
Fixation R	1	1	6414626382	6415063991	437609	802.33	436.62	33	41	-1	13.47	13.47
Saccade L	1	1	6415063991	6415103742	39751	803.60	425.30	492.23	508.44	2.85	188.85	1.00	71.81	4680.87	-4422.59	3855.38
Saccade R	1	1	6415063991	6415103742	39751	803.60	425.30	492.23	508.44	2.85	188.85	1.00	71.81	4680.87	-4422.59	3855.38
Fixation L	1	2	6415103742	6415322475	218733	465.54	512.13	43	55	-1	13.82	13.82
Fixation R	1	2	6415103742	6415322475	218733	465.54	512.13	43	55	-1	14.39	14.39
Saccade L	1	2	6415322475	6415421968	99493	448.33	488.44	361.02	427.87	2.65	49.05	0.80	26.65	722.67	-772.35	399.01
Saccade R	1	2	6415322475	6415421968	99493	448.33	488.44	361.02	427.87	2.65	49.05	0.80	26.65	722.67	-772.35	399.01
Fixation L	1	3	6415421968	6415879471	457503	332.41	399.90	40	41	-1	13.23	13.23
Fixation R	1	3	6415421968	6415879471	457503	332.41	399.90	40	41	-1	13.69	13.69
Saccade L	1	3	6415879471	6415919190	39719	336.16	420.74	147.60	479.51	1.83	171.86	1.00	46.05	4161.33	-3913.33	2274.72
Saccade R	1	3	6415879471	6415919190	39719	336.16	420.74	147.60	479.51	1.83	171.86	1.00	46.05	4161.33	-3913.33	2274.72
Fixation L	1	4	6415919190	6416098209	179019	152.70	493.24	10	26	-1	13.66	13.66
Fixation R	1	4	6415919190	6416098209	179019	152.70	493.24	10	26	-1	14.47	14.47
Saccade L	1	4	6416098209	6416118187	19978	151.94	501.51	282.36	397.27	1.05	168.85	1.00	52.71	4150.56	-3961.64	2966.14
Saccade R	1	4	6416098209	6416118187	19978	151.94	501.51	282.36	397.27	1.05	168.85	1.00	52.71	4150.56	-3961.64	2966.14
Fixation L	1	5	6416118187	6416336928	218741	307.19	392.65	33	21	-1	14.11	14.11
Fixation R	1	5	6416118187	6416336928	218741	307.19	392.65	33	21	-1	14.95	14.95
Blink L	1	1	6416336928	6416535791	198863
Blink R	1	1	6416336928	6416535791	198863
Fixation L	1	6	6416535791	6416834147	298356	1490.95	671.16	14	77	-1	16.36	16.36
Fixation R	1	6	6416535791	6416834147	298356	1490.95	671.16	14	77	-1	16.63	16.63
Saccade L	1	5	6416834147	6416874022	39875	1486.49	666.70	1219.52	664.06	2.21	137.22	1.00	55.54	3413.58	-3304.95	3296.21
Saccade R	1	5	6416834147	6416874022	39875	1486.49	666.70	1219.52	664.06	2.21	137.22	1.00	55.54	3413.58	-3304.95	3296.21
Fixation L	1	7	6416874022	6417033145	159123	1215.49	680.32	9	36	-1	15.86	15.86
Fixation R	1	7	6416874022	6417033145	159123	1215.49	680.32	9	36	-1	15.48	15.48
Saccade L	1	6	6417033145	6417092765	59620	1211.67	700.46	1577.92	674.75	4.13	219.74	0.67	69.27	5226.98	-4784.00	2971.56
Saccade R	1	6	6417033145	6417092765	59620	1211.67	700.46	1577.92	674.75	4.13	219.74	0.67	69.27	5226.98	-4784.00	2971.56
Fixation L	1	8	6417092765	6417212130	119365	1606.06	647.14	41	43	-1	15.17	15.17
Fixation R	1	8	6417092765	6417212130	119365	1606.06	647.14	41	43	-1	14.38	14.38
Saccade L	1	7	6417212130	6417232009	19879	1618.95	631.29	1649.92	617.63	0.25	34.24	1.00	12.44	707.93	-839.26	555.42
Saccade R	1	7	6417212130	6417232009	19879	1618.95	631.29	1649.92	617.63	0.25	34.24	1.00	12.44	707.93	-839.26	555.42
Fixation L	1	9	6417232009	6417550247	318238	1660.24	585.95	33	60	-1	14.46	14.46
Fixation R	1	9	6417232009	6417550247	318238	1660.24	585.95	33	60	-1	13.81	13.81
Saccade L	1	8	6417550247	6417570114	19867	1675.52	592.55	1683.31	697.61	0.81	106.56	1.00	40.62	2627.74	-2442.62	1842.17
Saccade R	1	8	6417550247	6417570114	19867	1675.52	592.55	1683.31	697.61	0.81	106.56	1.00	40.62	2627.74	-2442.62	1842.17
Fixation L	1	10	6417570114	6417828738	258624	1723.94	678.25	57	27	-1	14.25	14.25
Fixation R	1	10	6417570114	6417828738	258624	1723.94	678.25	57	27	-1	13.52	13.52
Saccade L	1	9	6417828738	6417888350	59612	1735.36	676.90	1375.23	765.25	3.96	241.50	0.67	66.50	5924.29	-5737.91	3083.16
Saccade R	1	9	6417828738	6417888350	59612	1735.36	676.90	1375.23	765.25	3.96	241.50	0.67	66.50	5924.29	-5737.91	3083.16
Fixation L	1	11	6417888350	6418027598	139248	1359.74	785.85	23	31	-1	13.97	13.97
Fixation R	1	11	6417888350	6418027598	139248	1359.74	785.85	23	31	-1	14.13	14.13
Saccade L	1	10	6418027598	6418067343	39745	1351.47	796.90	882.38	745.20	4.22	263.78	0.50	106.09	6554.43	-5397.86	5495.99
Saccade R	1	10	6418027598	6418067343	39745	1351.47	796.90	882.38	745.20	4.22	263.78	0.50	106.09	6554.43	-5397.86	5495.99
Fixation L	1	12	6418067343	6418286209	218866	849.22	722.78	46	44	-1	14.23	14.23
Fixation R	1	12	6418067343	6418286209	218866	849.22	722.78	46	44	-1	14.22	14.22
Saccade L	1	11	6418286209	6418325956	39747	836.36	718.10	494.00	568.35	3.30	269.88	0.50	83.02	6691.37	-6159.68	4532.31
Saccade R	1	11	6418286209	6418325956	39747	836.36	718.10	494.00	568.35	3.30	269.88	0.50	83.02	6691.37	-6159.68	4532.31
Fixation L	1	13	6418325956	6418465203	139247	478.08	534.58	25	50	-1	13.93	13.93
Fixation R	1	13	6418325956	6418465203	139247	478.08	534.58	25	50	-1	13.85	13.85
Saccade L	1	12	6418465203	6418504948	39745	470.70	524.49	352.29	468.96	1.45	114.84	0.50	36.39	2689.94	-2011.48	1341.56
Saccade R	1	12	6418465203	6418504948	39745	470.70	524.49	352.29	468.96	1.45	114.84	0.50	36.39	2689.94	-2011.48	1341.56
Fixation L	1	14	6418504948	6418604443	99495	327.89	435.33	38	48	-1	13.48	13.48
Fixation R	1	14	6418504948	6418604443	99495	327.89	435.33	38	48	-1	13.67	13.67
