[BeGaze]
Converted from:	C:\Documents and Settings\iViewX\Desktop\EXPERIMENTATIONS\Experiments\results\finaleart\S12H22222-finaleart-1.idf
Date:	27.03.2019 15:41:05
Version:	BeGaze 2.5.77
Sample Rate:	50
Subject:	S12H22222
Description:	aurele barriere

Table Header for Fixations:
Event Type	Trial	Number	Start	End	Duration	Location X	Location Y	Dispersion X	Dispersion Y	Plane	Avg. Pupil Size X	Avg. Pupil Size Y

Table Header for Saccades:
Event Type	Trial	Number	Start	End	Duration	Start Loc.X	Start Loc.Y	End Loc.X	End Loc.Y	Amplitude	Peak Speed	Peak Speed At	Average Speed	Peak Accel.	Peak Decel.	Average Accel.

Table Header for Blinks:
Event Type	Trial	Number	Start	End	Duration

Table Header for User Events:
Event Type	Trial	Number	Start	Description

UserEvent	1	1	24189193628	# Message: kneeling-nude_degas_1888.jpg
Fixation L	1	1	24189213307	24189611172	397865	981.03	483.73	21	52	-1	11.84	11.84
Fixation R	1	1	24189213307	24189611172	397865	981.03	483.73	21	52	-1	11.64	11.64
Saccade L	1	1	24189611172	24189631033	19861	985.61	502.60	877.27	519.97	0.66	110.99	1.00	33.47	2581.26	-2228.35	1617.98
Saccade R	1	1	24189611172	24189631033	19861	985.61	502.60	877.27	519.97	0.66	110.99	1.00	33.47	2581.26	-2228.35	1617.98
Fixation L	1	2	24189631033	24189849768	218735	882.99	543.03	12	40	-1	10.81	10.81
Fixation R	1	2	24189631033	24189849768	218735	882.99	543.03	12	40	-1	10.62	10.62
Saccade L	1	2	24189849768	24189889642	39874	882.21	560.10	1178.25	842.83	3.68	273.66	1.00	92.23	6639.83	-6261.86	5153.32
Saccade R	1	2	24189849768	24189889642	39874	882.21	560.10	1178.25	842.83	3.68	273.66	1.00	92.23	6639.83	-6261.86	5153.32
Fixation L	1	3	24189889642	24190386878	497236	1216.63	840.19	46	34	-1	8.97	8.97
Fixation R	1	3	24189889642	24190386878	497236	1216.63	840.19	46	34	-1	9.08	9.08
Saccade L	1	3	24190386878	24190406747	19869	1224.83	849.66	1248.97	846.79	0.30	33.71	1.00	15.24	797.06	-237.59	542.90
Saccade R	1	3	24190386878	24190406747	19869	1224.83	849.66	1248.97	846.79	0.30	33.71	1.00	15.24	797.06	-237.59	542.90
Fixation L	1	4	24190406747	24190645364	238617	1288.86	864.73	48	29	-1	9.80	9.80
Fixation R	1	4	24190406747	24190645364	238617	1288.86	864.73	48	29	-1	9.66	9.66
Saccade L	1	4	24190645364	24190724984	79620	1297.36	870.05	904.67	331.97	8.32	293.09	0.50	104.52	7169.40	-5277.95	4097.06
Saccade R	1	4	24190645364	24190724984	79620	1297.36	870.05	904.67	331.97	8.32	293.09	0.50	104.52	7169.40	-5277.95	4097.06
Fixation L	1	5	24190724984	24190943725	218741	892.49	347.93	31	28	-1	10.06	10.06
Fixation R	1	5	24190724984	24190943725	218741	892.49	347.93	31	28	-1	9.92	9.92
Saccade L	1	5	24190943725	24190963603	19878	873.53	347.33	706.23	254.02	1.39	193.73	1.00	70.08	4768.63	-4207.31	3377.89
Saccade R	1	5	24190943725	24190963603	19878	873.53	347.33	706.23	254.02	1.39	193.73	1.00	70.08	4768.63	-4207.31	3377.89
Fixation L	1	6	24190963603	24191261959	298356	688.79	224.66	24	63	-1	10.87	10.87
Fixation R	1	6	24190963603	24191261959	298356	688.79	224.66	24	63	-1	10.64	10.64
Saccade L	1	6	24191261959	24191281846	19887	682.70	233.72	686.00	267.58	0.35	34.41	1.00	17.73	620.97	-354.65	351.89
Saccade R	1	6	24191261959	24191281846	19887	682.70	233.72	686.00	267.58	0.35	34.41	1.00	17.73	620.97	-354.65	351.89
Fixation L	1	7	24191281846	24191560326	278480	689.67	270.32	10	51	-1	11.07	11.07
Fixation R	1	7	24191281846	24191560326	278480	689.67	270.32	10	51	-1	11.04	11.04
Saccade L	1	7	24191560326	24191639944	79618	686.85	253.59	1248.94	484.94	8.49	348.41	0.50	106.63	8446.45	-7945.80	4360.64
Saccade R	1	7	24191560326	24191639944	79618	686.85	253.59	1248.94	484.94	8.49	348.41	0.50	106.63	8446.45	-7945.80	4360.64
Fixation L	1	8	24191639944	24191878563	238619	1267.25	486.19	35	62	-1	11.85	11.85
Fixation R	1	8	24191639944	24191878563	238619	1267.25	486.19	35	62	-1	11.54	11.54
Saccade L	1	8	24191878563	24192017807	139244	1283.32	479.53	1267.35	867.87	6.26	197.19	0.86	44.92	4761.50	-4730.47	2003.83
Saccade R	1	8	24191878563	24192017807	139244	1283.32	479.53	1267.35	867.87	6.26	197.19	0.86	44.92	4761.50	-4730.47	2003.83
Fixation L	1	9	24192017807	24192395791	377984	1266.51	868.42	34	21	-1	11.81	11.81
Fixation R	1	9	24192017807	24192395791	377984	1266.51	868.42	34	21	-1	10.90	10.90
Saccade L	1	9	24192395791	24192415671	19880	1293.26	859.78	1354.02	879.77	0.55	64.71	1.00	27.75	1604.44	-981.91	977.66
Saccade R	1	9	24192395791	24192415671	19880	1293.26	859.78	1354.02	879.77	0.55	64.71	1.00	27.75	1604.44	-981.91	977.66
Fixation L	1	10	24192415671	24192753773	338102	1375.12	905.28	28	45	-1	11.69	11.69
Fixation R	1	10	24192415671	24192753773	338102	1375.12	905.28	28	45	-1	10.82	10.82
Saccade L	1	10	24192753773	24192793525	39752	1382.49	914.65	1490.58	1013.78	1.59	92.59	0.50	39.96	2283.24	-1921.22	1970.80
Saccade R	1	10	24192753773	24192793525	39752	1382.49	914.65	1490.58	1013.78	1.59	92.59	0.50	39.96	2283.24	-1921.22	1970.80
Fixation L	1	11	24192793525	24193091877	298352	1515.38	1015.28	50	46	-1	11.55	11.55
Fixation R	1	11	24192793525	24193091877	298352	1515.38	1015.28	50	46	-1	10.62	10.62
Saccade L	1	11	24193091877	24193191377	99500	1481.26	1034.26	1475.68	1074.07	1.19	18.79	1.00	11.97	273.87	-373.05	157.62
Saccade R	1	11	24193091877	24193191377	99500	1481.26	1034.26	1475.68	1074.07	1.19	18.79	1.00	11.97	273.87	-373.05	157.62
