[BeGaze]
Converted from:	C:\Documents and Settings\iViewX\Desktop\EXPERIMENTATIONS\Experiments\results\finaleart\S14F27123-finaleart-1.idf
Date:	27.03.2019 15:43:08
Version:	BeGaze 2.5.77
Sample Rate:	50
Subject:	S14F27123
Description:	Anne-flore Perrin

Table Header for Fixations:
Event Type	Trial	Number	Start	End	Duration	Location X	Location Y	Dispersion X	Dispersion Y	Plane	Avg. Pupil Size X	Avg. Pupil Size Y

Table Header for Saccades:
Event Type	Trial	Number	Start	End	Duration	Start Loc.X	Start Loc.Y	End Loc.X	End Loc.Y	Amplitude	Peak Speed	Peak Speed At	Average Speed	Peak Accel.	Peak Decel.	Average Accel.

Table Header for Blinks:
Event Type	Trial	Number	Start	End	Duration

Table Header for User Events:
Event Type	Trial	Number	Start	Description

UserEvent	1	1	30609882969	# Message: the-banks-of-the-marne-at-dawn_dubois-pillet_1888.jpg
Fixation L	1	1	30609885292	30610402519	517227	798.45	637.98	12	39	-1	12.27	12.27
Fixation R	1	1	30609885292	30610402519	517227	798.45	637.98	12	39	-1	12.61	12.61
Saccade L	1	1	30610402519	30610422376	19857	801.86	661.01	894.23	672.86	0.55	94.20	1.00	27.59	2235.37	-1953.07	1411.08
Saccade R	1	1	30610402519	30610422376	19857	801.86	661.01	894.23	672.86	0.55	94.20	1.00	27.59	2235.37	-1953.07	1411.08
Fixation L	1	2	30610422376	30610641125	218749	891.64	659.06	24	59	-1	9.96	9.96
Fixation R	1	2	30610422376	30610641125	218749	891.64	659.06	24	59	-1	10.39	10.39
Saccade L	1	2	30610641125	30610681011	39886	902.65	652.62	588.58	799.55	3.82	186.75	0.50	95.67	4175.98	-4202.77	3693.51
Saccade R	1	2	30610641125	30610681011	39886	902.65	652.62	588.58	799.55	3.82	186.75	0.50	95.67	4175.98	-4202.77	3693.51
Fixation L	1	3	30610681011	30610820109	139098	584.37	741.69	9	74	-1	8.55	8.55
Fixation R	1	3	30610681011	30610820109	139098	584.37	741.69	9	74	-1	9.45	9.45
Blink L	1	1	30610820109	30611019103	198994
Blink R	1	1	30610820109	30611019103	198994
Blink L	1	2	30611019103	30611237842	218739
Blink R	1	2	30611019103	30611237842	218739
Blink L	1	3	30611217967	30611337337	119370
Blink R	1	3	30611217967	30611337337	119370
Fixation L	1	4	30611337337	30611536203	198866	1330.37	832.60	7	14	-1	21.76	21.76
Fixation R	1	4	30611337337	30611536203	198866	1330.37	832.60	7	14	-1	10.21	10.21
Blink L	1	4	30611536203	30611675446	139243
Blink R	1	4	30611536203	30611675446	139243
Saccade L	1	3	30611675446	30611754950	79504	1443.23	703.10	1438.80	703.01	18.75	1584.40	1.00	235.82	739.62	-39489.97	6850.64
Saccade R	1	3	30611675446	30611754950	79504	1443.23	703.10	1438.80	703.01	18.75	1584.40	1.00	235.82	739.62	-39489.97	6850.64
Blink L	1	5	30611754950	30611894186	139236
Blink R	1	5	30611754950	30611894186	139236
Saccade L	1	4	30611953939	30612013557	59618	1448.61	705.45	1505.19	581.86	17.35	1586.53	1.00	290.96	3153.06	-39549.02	9212.67
Saccade R	1	4	30611953939	30612013557	59618	1448.61	705.45	1505.19	581.86	17.35	1586.53	1.00	290.96	3153.06	-39549.02	9212.67
Fixation L	1	5	30612013557	30612172674	159117	1478.42	590.06	53	21	-1	13.97	11.19
Fixation R	1	5	30612013557	30612172674	159117	1478.42	590.06	53	21	-1	10.28	10.28
Saccade L	1	5	30612172674	30612232417	59743	1471.86	596.94	1560.51	581.88	1.74	60.21	0.33	29.06	1028.09	-1095.21	606.39
Saccade R	1	5	30612172674	30612232417	59743	1471.86	596.94	1560.51	581.88	1.74	60.21	0.33	29.06	1028.09	-1095.21	606.39
Fixation L	1	6	30612232417	30612351673	119256	1561.14	547.78	51	45	-1	10.29	10.29
Fixation R	1	6	30612232417	30612351673	119256	1561.14	547.78	51	45	-1	9.93	9.93
Saccade L	1	6	30612351673	30612371538	19865	1570.52	537.07	1544.98	527.29	0.44	44.96	1.00	22.05	107.80	-432.35	182.65
Saccade R	1	6	30612351673	30612371538	19865	1570.52	537.07	1544.98	527.29	0.44	44.96	1.00	22.05	107.80	-432.35	182.65
Fixation L	1	7	30612371538	30612550671	179133	1561.47	539.99	32	20	-1	9.64	9.64
Fixation R	1	7	30612371538	30612550671	179133	1561.47	539.99	32	20	-1	9.98	9.98
Saccade L	1	7	30612550671	30612709777	159106	1557.44	547.33	1334.09	341.85	30.19	1366.68	1.00	189.75	34235.28	-3776.27	8962.35
Saccade R	1	7	30612550671	30612709777	159106	1557.44	547.33	1334.09	341.85	30.19	1366.68	1.00	189.75	34235.28	-3776.27	8962.35
Fixation L	1	8	30612769401	30612868891	99490	1341.39	356.13	8	19	-1	10.07	10.07
Fixation R	1	8	30612769401	30612868891	99490	1341.39	356.13	8	19	-1	36.05	36.05
Saccade L	1	8	30612868891	30613047892	179001	1343.10	362.28	1178.06	145.19	31.20	923.09	0.67	174.31	22957.27	-20628.21	8487.50
Saccade R	1	8	30612868891	30613047892	179001	1343.10	362.28	1178.06	145.19	31.20	923.09	0.67	174.31	22957.27	-20628.21	8487.50
Fixation L	1	9	30613047892	30613167140	119248	1169.16	108.95	22	55	-1	10.45	10.45
Fixation R	1	9	30613047892	30613167140	119248	1169.16	108.95	22	55	-1	14.37	11.80
Saccade L	1	9	30613167140	30613246752	79612	1155.32	103.64	1187.71	-27.75	2.95	84.73	1.00	37.11	1953.62	-1926.06	1450.91
Saccade R	1	9	30613167140	30613246752	79612	1155.32	103.64	1187.71	-27.75	2.95	84.73	1.00	37.11	1953.62	-1926.06	1450.91
Fixation L	1	10	30613246752	30613445625	198873	1190.05	21.39	16	78	-1	10.36	10.36
Fixation R	1	10	30613246752	30613445625	198873	1190.05	21.39	16	78	-1	11.08	11.08
Saccade L	1	10	30613445625	30613505243	59618	1195.22	41.30	653.75	372.22	6.91	333.69	0.67	115.93	7951.49	-7931.24	6232.51
Saccade R	1	10	30613445625	30613505243	59618	1195.22	41.30	653.75	372.22	6.91	333.69	0.67	115.93	7951.49	-7931.24	6232.51
Fixation L	1	11	30613505243	30613624627	119384	622.92	337.19	43	55	-1	10.62	10.62
Fixation R	1	11	30613505243	30613624627	119384	622.92	337.19	43	55	-1	11.48	11.48
Saccade L	1	11	30613624627	30613724108	99481	611.38	324.95	483.19	402.74	3.44	104.27	1.00	34.56	1659.47	-2393.74	1138.80
Saccade R	1	11	30613624627	30613724108	99481	611.38	324.95	483.19	402.74	3.44	104.27	1.00	34.56	1659.47	-2393.74	1138.80
Fixation L	1	12	30613724108	30613883230	159122	466.92	415.02	22	30	-1	10.73	10.73
Fixation R	1	12	30613724108	30613883230	159122	466.92	415.02	22	30	-1	11.44	11.44
