[BeGaze]
Converted from:	C:\Documents and Settings\iViewX\Desktop\EXPERIMENTATIONS\Experiments\results\finaleart\S4120113-finaleart-1.idf
Date:	27.03.2019 15:34:28
Version:	BeGaze 2.5.77
Sample Rate:	50
Subject:	S4120113
Description:	Vidal Attias

Table Header for Fixations:
Event Type	Trial	Number	Start	End	Duration	Location X	Location Y	Dispersion X	Dispersion Y	Plane	Avg. Pupil Size X	Avg. Pupil Size Y

Table Header for Saccades:
Event Type	Trial	Number	Start	End	Duration	Start Loc.X	Start Loc.Y	End Loc.X	End Loc.Y	Amplitude	Peak Speed	Peak Speed At	Average Speed	Peak Accel.	Peak Decel.	Average Accel.

Table Header for Blinks:
Event Type	Trial	Number	Start	End	Duration

Table Header for User Events:
Event Type	Trial	Number	Start	Description

UserEvent	1	1	6691914618	# Message: the_three_skulls_gericault_1814.jpg
Fixation L	1	1	6691919057	6692356684	437627	1103.37	483.17	6	18	-1	14.93	14.93
Fixation R	1	1	6691919057	6692356684	437627	1103.37	483.17	6	18	-1	15.43	15.43
Saccade L	1	1	6692356684	6692376522	19838	1101.34	492.12	979.55	561.57	0.90	141.80	1.00	45.12	3470.16	-3121.55	2381.45
Saccade R	1	1	6692356684	6692376522	19838	1101.34	492.12	979.55	561.57	0.90	141.80	1.00	45.12	3470.16	-3121.55	2381.45
Fixation L	1	2	6692376522	6692933476	556954	974.27	571.28	14	36	-1	14.75	14.75
Fixation R	1	2	6692376522	6692933476	556954	974.27	571.28	14	36	-1	15.56	15.56
Saccade L	1	2	6692933476	6692973234	39758	979.76	573.31	1398.17	571.02	3.83	252.20	0.50	96.23	5825.28	-5515.22	4832.08
Saccade R	1	2	6692933476	6692973234	39758	979.76	573.31	1398.17	571.02	3.83	252.20	0.50	96.23	5825.28	-5515.22	4832.08
Fixation L	1	3	6692973234	6693450575	477341	1385.04	574.10	18	37	-1	15.00	15.00
Fixation R	1	3	6692973234	6693450575	477341	1385.04	574.10	18	37	-1	15.07	15.07
Saccade L	1	3	6693450575	6693510329	59754	1380.89	579.73	775.30	586.77	6.34	337.59	0.67	106.14	8417.88	-7965.67	5067.24
Saccade R	1	3	6693450575	6693510329	59754	1380.89	579.73	775.30	586.77	6.34	337.59	0.67	106.14	8417.88	-7965.67	5067.24
Fixation L	1	4	6693510329	6693629571	119242	750.37	579.09	38	29	-1	15.12	15.12
Fixation R	1	4	6693510329	6693629571	119242	750.37	579.09	38	29	-1	15.84	15.84
Saccade L	1	4	6693629571	6693669441	39870	737.20	558.94	493.81	502.44	2.39	136.27	0.50	60.06	3161.33	-2961.01	2893.13
Saccade R	1	4	6693629571	6693669441	39870	737.20	558.94	493.81	502.44	2.39	136.27	0.50	60.06	3161.33	-2961.01	2893.13
Fixation L	1	5	6693669441	6694107040	437599	502.77	499.66	31	41	-1	14.00	14.00
Fixation R	1	5	6693669441	6694107040	437599	502.77	499.66	31	41	-1	15.19	15.19
Saccade L	1	5	6694107040	6694146796	39756	522.25	478.35	976.96	534.69	4.12	236.38	0.50	103.63	5571.49	-5301.53	5255.80
Saccade R	1	5	6694107040	6694146796	39756	522.25	478.35	976.96	534.69	4.12	236.38	0.50	103.63	5571.49	-5301.53	5255.80
Fixation L	1	6	6694146796	6694385397	238601	991.10	532.20	22	31	-1	14.18	14.18
Fixation R	1	6	6694146796	6694385397	238601	991.10	532.20	22	31	-1	15.16	15.16
Saccade L	1	6	6694385397	6694445149	59752	999.73	535.71	1443.68	530.87	4.67	208.32	0.67	78.20	5087.55	-4921.33	3368.44
Saccade R	1	6	6694385397	6694445149	59752	999.73	535.71	1443.68	530.87	4.67	208.32	0.67	78.20	5087.55	-4921.33	3368.44
Fixation L	1	7	6694445149	6694763371	318222	1415.79	557.71	40	57	-1	14.36	14.36
Fixation R	1	7	6694445149	6694763371	318222	1415.79	557.71	40	57	-1	14.34	14.34
Saccade L	1	7	6694763371	6694783245	19874	1403.04	584.51	1401.07	585.47	0.08	7.75	1.00	4.20	136.48	-138.36	92.99
Saccade R	1	7	6694763371	6694783245	19874	1403.04	584.51	1401.07	585.47	0.08	7.75	1.00	4.20	136.48	-138.36	92.99
Fixation L	1	8	6694783245	6695200968	417723	1401.04	614.11	18	73	-1	14.87	14.87
Fixation R	1	8	6694783245	6695200968	417723	1401.04	614.11	18	73	-1	14.49	14.49
Saccade L	1	8	6695200968	6695240713	39745	1393.11	646.62	1137.08	656.26	2.24	235.84	1.00	56.37	5852.09	-5811.88	3125.05
Saccade R	1	8	6695200968	6695240713	39745	1393.11	646.62	1137.08	656.26	2.24	235.84	1.00	56.37	5852.09	-5811.88	3125.05
Fixation L	1	9	6695240713	6695519197	278484	1114.87	662.71	36	30	-1	15.16	15.16
Fixation R	1	9	6695240713	6695519197	278484	1114.87	662.71	36	30	-1	15.35	15.35
Saccade L	1	9	6695519197	6695578825	59628	1110.50	670.06	557.68	937.72	6.72	268.27	0.67	112.71	6413.93	-5831.34	4473.88
Saccade R	1	9	6695519197	6695578825	59628	1110.50	670.06	557.68	937.72	6.72	268.27	0.67	112.71	6413.93	-5831.34	4473.88
Fixation L	1	10	6695578825	6695916951	338126	548.70	959.27	12	34	-1	14.23	14.23
Fixation R	1	10	6695578825	6695916951	338126	548.70	959.27	12	34	-1	15.17	15.17
