[BeGaze]
Converted from:	C:\Documents and Settings\iViewX\Desktop\EXPERIMENTATIONS\Experiments\results\finaleart\S01A22542-finaleart-1.idf
Date:	27.03.2019 15:33:24
Version:	BeGaze 2.5.77
Sample Rate:	50
Subject:	S01A22542
Description:	Thibault Seve Minnaert

Table Header for Fixations:
Event Type	Trial	Number	Start	End	Duration	Location X	Location Y	Dispersion X	Dispersion Y	Plane	Avg. Pupil Size X	Avg. Pupil Size Y

Table Header for Saccades:
Event Type	Trial	Number	Start	End	Duration	Start Loc.X	Start Loc.Y	End Loc.X	End Loc.Y	Amplitude	Peak Speed	Peak Speed At	Average Speed	Peak Accel.	Peak Decel.	Average Accel.

Table Header for Blinks:
Event Type	Trial	Number	Start	End	Duration

Table Header for User Events:
Event Type	Trial	Number	Start	Description

UserEvent	1	1	9805880926	# Message: void.jpg
Saccade L	1	1	9805886169	9805965786	79617	400.69	680.98	486.42	670.66	1.64	76.64	1.00	20.61	1876.31	-1687.91	709.87
Saccade R	1	1	9805886169	9805965786	79617	400.69	680.98	486.42	670.66	1.64	76.64	1.00	20.61	1876.31	-1687.91	709.87
Fixation L	1	1	9805965786	9806145024	179238	519.46	655.71	40	26	-1	11.40	11.40
Fixation R	1	1	9805965786	9806145024	179238	519.46	655.71	40	26	-1	12.44	12.44
Saccade L	1	2	9806145024	9806184793	39769	525.85	644.31	915.16	762.30	3.74	276.33	1.00	93.93	6758.20	-6741.28	4748.55
Saccade R	1	2	9806145024	9806184793	39769	525.85	644.31	915.16	762.30	3.74	276.33	1.00	93.93	6758.20	-6741.28	4748.55
Fixation L	1	2	9806184793	9806483406	298613	966.83	765.44	59	11	-1	11.52	11.52
Fixation R	1	2	9806184793	9806483406	298613	966.83	765.44	59	11	-1	12.54	12.54
Blink L	1	1	9806483406	9806702492	219086
Blink R	1	1	9806483406	9806702492	219086
Fixation L	1	3	9806702492	9807040979	338487	1026.16	560.13	13	43	-1	14.29	14.29
Fixation R	1	3	9806702492	9807040979	338487	1026.16	560.13	13	43	-1	13.62	13.62
Saccade L	1	3	9807040979	9807060861	19882	1021.85	575.60	900.10	581.32	0.69	123.28	1.00	34.65	2936.16	-2963.47	2001.48
Saccade R	1	3	9807040979	9807060861	19882	1021.85	575.60	900.10	581.32	0.69	123.28	1.00	34.65	2936.16	-2963.47	2001.48
Fixation L	1	4	9807060861	9807817447	756586	887.10	589.24	47	46	-1	14.53	14.53
Fixation R	1	4	9807060861	9807817447	756586	887.10	589.24	47	46	-1	14.11	14.11
Saccade L	1	4	9807817447	9807877198	59751	852.12	617.68	835.89	622.10	0.79	34.89	1.00	13.25	65.03	-695.32	195.19
Saccade R	1	4	9807817447	9807877198	59751	852.12	617.68	835.89	622.10	0.79	34.89	1.00	13.25	65.03	-695.32	195.19
