[BeGaze]
Converted from:	C:\Documents and Settings\iViewX\Desktop\EXPERIMENTATIONS\Experiments\results\finaleart\S8119532-finaleart-1.idf
Date:	27.03.2019 16:00:40
Version:	BeGaze 2.5.77
Sample Rate:	50
Subject:	S8119532
Description:	Alexandre Drewery

Table Header for Fixations:
Event Type	Trial	Number	Start	End	Duration	Location X	Location Y	Dispersion X	Dispersion Y	Plane	Avg. Pupil Size X	Avg. Pupil Size Y

Table Header for Saccades:
Event Type	Trial	Number	Start	End	Duration	Start Loc.X	Start Loc.Y	End Loc.X	End Loc.Y	Amplitude	Peak Speed	Peak Speed At	Average Speed	Peak Accel.	Peak Decel.	Average Accel.

Table Header for Blinks:
Event Type	Trial	Number	Start	End	Duration

Table Header for User Events:
Event Type	Trial	Number	Start	Description

UserEvent	1	1	3239644359	# Message: Automne_En_France_Carr_1911.jpg
Fixation L	1	1	3239646448	3240203324	556876	1099.72	462.22	58	33	-1	14.90	14.90
Fixation R	1	1	3239646448	3240203324	556876	1099.72	462.22	58	33	-1	15.72	15.72
Saccade L	1	1	3240203324	3240243031	39707	1070.10	481.53	1068.65	493.02	0.29	11.71	1.00	7.20	157.41	-84.29	125.94
Saccade R	1	1	3240203324	3240243031	39707	1070.10	481.53	1068.65	493.02	0.29	11.71	1.00	7.20	157.41	-84.29	125.94
Fixation L	1	2	3240243031	3240501672	258641	1051.72	497.63	41	18	-1	15.28	15.28
Fixation R	1	2	3240243031	3240501672	258641	1051.72	497.63	41	18	-1	15.93	15.93
Saccade L	1	2	3240501672	3240799999	298327	1026.99	499.55	1104.22	605.98	24.31	261.77	0.93	81.48	6366.23	-6194.15	3971.08
Saccade R	1	2	3240501672	3240799999	298327	1026.99	499.55	1104.22	605.98	24.31	261.77	0.93	81.48	6366.23	-6194.15	3971.08
Fixation L	1	3	3240799999	3241018732	218733	1129.10	604.67	49	19	-1	12.15	12.15
Fixation R	1	3	3240799999	3241018732	218733	1129.10	604.67	49	19	-1	12.13	12.13
Saccade L	1	3	3241018732	3241038613	19881	1153.98	603.67	1269.25	590.79	0.88	117.32	1.00	44.02	2901.38	-1789.43	1699.58
Saccade R	1	3	3241018732	3241038613	19881	1153.98	603.67	1269.25	590.79	0.88	117.32	1.00	44.02	2901.38	-1789.43	1699.58
Fixation L	1	4	3241038613	3241277342	238729	1294.85	575.68	33	63	-1	11.90	11.90
Fixation R	1	4	3241038613	3241277342	238729	1294.85	575.68	33	63	-1	11.61	11.61
Blink L	1	1	3241277342	3241436469	159127
Blink R	1	1	3241277342	3241436469	159127
Fixation L	1	5	3241436469	3241635340	198871	764.55	304.18	53	41	-1	10.95	10.95
Fixation R	1	5	3241436469	3241635340	198871	764.55	304.18	53	41	-1	11.80	11.80
Saccade L	1	4	3241635340	3241655208	19868	723.65	334.19	716.10	322.75	0.44	49.90	0.00	22.18	110.78	-872.38	360.23
Saccade R	1	4	3241635340	3241655208	19868	723.65	334.19	716.10	322.75	0.44	49.90	0.00	22.18	110.78	-872.38	360.23
Fixation L	1	6	3241655208	3241794452	139244	700.07	336.35	25	27	-1	10.81	10.81
Fixation R	1	6	3241655208	3241794452	139244	700.07	336.35	25	27	-1	11.22	11.22
Saccade L	1	5	3241794452	3241834317	39865	692.05	336.07	468.31	500.01	2.66	183.43	0.50	66.70	4221.90	-4290.78	3325.59
Saccade R	1	5	3241794452	3241834317	39865	692.05	336.07	468.31	500.01	2.66	183.43	0.50	66.70	4221.90	-4290.78	3325.59
Fixation L	1	7	3241834317	3242092814	258497	461.15	507.77	17	37	-1	10.34	10.34
Fixation R	1	7	3241834317	3242092814	258497	461.15	507.77	17	37	-1	11.42	11.42
Saccade L	1	6	3242092814	3242132688	39874	468.70	527.30	642.29	462.11	1.97	109.32	0.50	49.33	2509.31	-1735.93	1819.55
Saccade R	1	6	3242092814	3242132688	39874	468.70	527.30	642.29	462.11	1.97	109.32	0.50	49.33	2509.31	-1735.93	1819.55
Fixation L	1	8	3242132688	3242291801	159113	644.25	474.18	38	48	-1	10.30	10.30
Fixation R	1	8	3242132688	3242291801	159113	644.25	474.18	38	48	-1	11.34	11.34
Saccade L	1	7	3242291801	3242311670	19869	670.90	504.40	802.87	727.44	1.69	261.99	1.00	85.21	6420.61	-5381.82	4366.58
Saccade R	1	7	3242291801	3242311670	19869	670.90	504.40	802.87	727.44	1.69	261.99	1.00	85.21	6420.61	-5381.82	4366.58
Fixation L	1	9	3242311670	3242530410	218740	839.20	730.58	56	27	-1	10.38	10.38
Fixation R	1	9	3242311670	3242530410	218740	839.20	730.58	56	27	-1	11.33	11.33
Saccade L	1	8	3242530410	3242610042	79632	842.38	734.48	835.34	406.19	5.56	323.24	1.00	69.76	6969.97	-6524.09	2658.54
Saccade R	1	8	3242530410	3242610042	79632	842.38	734.48	835.34	406.19	5.56	323.24	1.00	69.76	6969.97	-6524.09	2658.54
Fixation L	1	10	3242610042	3242769151	159109	820.63	379.11	19	79	-1	10.63	10.63
Fixation R	1	10	3242610042	3242769151	159109	820.63	379.11	19	79	-1	11.31	11.31
Saccade L	1	9	3242769151	3242789027	19876	815.40	392.64	811.92	393.04	0.09	7.13	1.00	4.49	175.70	-54.07	122.93
Saccade R	1	9	3242769151	3242789027	19876	815.40	392.64	811.92	393.04	0.09	7.13	1.00	4.49	175.70	-54.07	122.93
Fixation L	1	11	3242789027	3243326008	536981	783.77	371.60	39	59	-1	10.96	10.96
Fixation R	1	11	3242789027	3243326008	536981	783.77	371.60	39	59	-1	11.86	11.86
Saccade L	1	10	3243326008	3243345873	19865	777.12	336.99	775.86	325.84	0.23	13.59	0.00	11.65	336.11	-53.04	139.35
Saccade R	1	10	3243326008	3243345873	19865	777.12	336.99	775.86	325.84	0.23	13.59	0.00	11.65	336.11	-53.04	139.35
Fixation L	1	12	3243345873	3243683985	338112	774.02	340.65	9	35	-1	11.06	11.06
Fixation R	1	12	3243345873	3243683985	338112	774.02	340.65	9	35	-1	12.10	12.10
