[BeGaze]
Converted from:	C:\Documents and Settings\iViewX\Desktop\EXPERIMENTATIONS\Experiments\results\finaleart\S5121332-finaleart-1.idf
Date:	27.03.2019 15:35:13
Version:	BeGaze 2.5.77
Sample Rate:	50
Subject:	S5121332
Description:	Dylan Marinho

Table Header for Fixations:
Event Type	Trial	Number	Start	End	Duration	Location X	Location Y	Dispersion X	Dispersion Y	Plane	Avg. Pupil Size X	Avg. Pupil Size Y

Table Header for Saccades:
Event Type	Trial	Number	Start	End	Duration	Start Loc.X	Start Loc.Y	End Loc.X	End Loc.Y	Amplitude	Peak Speed	Peak Speed At	Average Speed	Peak Accel.	Peak Decel.	Average Accel.

Table Header for Blinks:
Event Type	Trial	Number	Start	End	Duration

Table Header for User Events:
Event Type	Trial	Number	Start	Description

UserEvent	1	1	9593136598	# Message: Rochers_Sur_La_Cote_A_Agay_Guillaumin_1907.jpg
Fixation L	1	1	9593137604	9593694569	556965	956.08	531.12	28	26	-1	15.80	15.80
Fixation R	1	1	9593137604	9593694569	556965	956.08	531.12	28	26	-1	15.53	15.53
Saccade L	1	1	9593694569	9593714440	19871	930.67	547.00	892.27	658.22	0.98	119.02	1.00	49.18	2931.23	-2471.75	2119.54
Saccade R	1	1	9593694569	9593714440	19871	930.67	547.00	892.27	658.22	0.98	119.02	1.00	49.18	2931.23	-2471.75	2119.54
Fixation L	1	2	9593714440	9594012800	298360	875.08	607.49	33	61	-1	14.71	14.71
Fixation R	1	2	9593714440	9594012800	298360	875.08	607.49	33	61	-1	14.46	14.46
Saccade L	1	2	9594012800	9594052545	39745	859.03	596.80	937.80	448.82	1.51	112.53	1.00	37.95	2736.47	-2662.90	1958.00
Saccade R	1	2	9594012800	9594052545	39745	859.03	596.80	937.80	448.82	1.51	112.53	1.00	37.95	2736.47	-2662.90	1958.00
Fixation L	1	3	9594052545	9594191797	139252	949.35	433.70	14	22	-1	13.27	13.27
Fixation R	1	3	9594052545	9594191797	139252	949.35	433.70	14	22	-1	12.98	12.98
Blink L	1	1	9594191797	9594370778	178981
Blink R	1	1	9594191797	9594370778	178981
Fixation L	1	4	9594370778	9594549759	178981	1070.45	394.55	10	13	-1	13.75	13.75
Fixation R	1	4	9594370778	9594549759	178981	1070.45	394.55	10	13	-1	13.60	13.60
Saccade L	1	3	9594549759	9594589633	39874	1070.94	399.29	1249.27	528.87	2.07	132.98	0.50	51.79	3259.24	-2756.06	2715.19
Saccade R	1	3	9594549759	9594589633	39874	1070.94	399.29	1249.27	528.87	2.07	132.98	0.50	51.79	3259.24	-2756.06	2715.19
Fixation L	1	5	9594589633	9594907870	318237	1256.76	550.82	18	28	-1	14.64	14.64
Fixation R	1	5	9594589633	9594907870	318237	1256.76	550.82	18	28	-1	14.50	14.50
Blink L	1	2	9594907870	9595106736	198866
Blink R	1	2	9594907870	9595106736	198866
Fixation L	1	6	9595106736	9595245975	139239	1184.52	564.07	2	21	-1	14.84	14.84
Fixation R	1	6	9595106736	9595245975	139239	1184.52	564.07	2	21	-1	14.78	14.78
Blink L	1	3	9595245975	9595405081	159106
Blink R	1	3	9595245975	9595405081	159106
Fixation L	1	7	9595405081	9595763072	357991	1241.05	540.94	22	26	-1	15.06	15.06
Fixation R	1	7	9595405081	9595763072	357991	1241.05	540.94	22	26	-1	15.35	15.35
Saccade L	1	4	9595763072	9595783062	19990	1225.44	538.09	1045.04	533.41	1.18	182.50	1.00	58.84	4462.32	-4340.87	3044.66
Saccade R	1	4	9595763072	9595783062	19990	1225.44	538.09	1045.04	533.41	1.18	182.50	1.00	58.84	4462.32	-4340.87	3044.66
Fixation L	1	8	9595783062	9597135482	1352420	1023.06	519.00	30	29	-1	14.63	14.63
Fixation R	1	8	9595783062	9597135482	1352420	1023.06	519.00	30	29	-1	14.47	14.47
