[BeGaze]
Converted from:	C:\Documents and Settings\iViewX\Desktop\EXPERIMENTATIONS\Experiments\results\finaleart\S18F56223-finaleart-1.idf
Date:	27.03.2019 15:49:17
Version:	BeGaze 2.5.77
Sample Rate:	50
Subject:	S18F56223
Description:	Pascale Sebillot

Table Header for Fixations:
Event Type	Trial	Number	Start	End	Duration	Location X	Location Y	Dispersion X	Dispersion Y	Plane	Avg. Pupil Size X	Avg. Pupil Size Y

Table Header for Saccades:
Event Type	Trial	Number	Start	End	Duration	Start Loc.X	Start Loc.Y	End Loc.X	End Loc.Y	Amplitude	Peak Speed	Peak Speed At	Average Speed	Peak Accel.	Peak Decel.	Average Accel.

Table Header for Blinks:
Event Type	Trial	Number	Start	End	Duration

Table Header for User Events:
Event Type	Trial	Number	Start	Description

UserEvent	1	1	2843857235	# Message: delacroix-Reclining-Odalisque-or-Woman-with-a-Parakeet-1827.jpg
Fixation L	1	1	2843872348	2844289939	417591	828.16	657.72	23	29	-1	14.86	14.86
Fixation R	1	1	2843872348	2844289939	417591	828.16	657.72	23	29	-1	14.77	14.77
Saccade L	1	1	2844289939	2844329816	39877	847.84	647.15	1192.88	444.58	3.54	344.30	0.50	88.84	8389.18	-8354.78	4757.65
Saccade R	1	1	2844289939	2844329816	39877	847.84	647.15	1192.88	444.58	3.54	344.30	0.50	88.84	8389.18	-8354.78	4757.65
Fixation L	1	2	2844329816	2844449062	119246	1191.70	437.36	10	24	-1	14.53	14.53
Fixation R	1	2	2844329816	2844449062	119246	1191.70	437.36	10	24	-1	14.40	14.40
Saccade L	1	2	2844449062	2844508815	59753	1192.29	427.26	1401.21	232.55	5.11	252.91	0.33	85.59	6250.87	-3690.06	3800.99
Saccade R	1	2	2844449062	2844508815	59753	1192.29	427.26	1401.21	232.55	5.11	252.91	0.33	85.59	6250.87	-3690.06	3800.99
Fixation L	1	3	2844508815	2844667924	159109	1401.90	254.01	25	64	-1	13.38	13.38
Fixation R	1	3	2844508815	2844667924	159109	1401.90	254.01	25	64	-1	12.97	12.97
Saccade L	1	3	2844667924	2844687801	19877	1402.01	297.04	1383.50	314.02	0.67	41.45	0.00	33.76	-18.27	-500.79	190.04
Saccade R	1	3	2844667924	2844687801	19877	1402.01	297.04	1383.50	314.02	0.67	41.45	0.00	33.76	-18.27	-500.79	190.04
Fixation L	1	4	2844687801	2844886671	198870	1394.50	287.54	22	41	-1	12.85	12.85
Fixation R	1	4	2844687801	2844886671	198870	1394.50	287.54	22	41	-1	12.46	12.46
Saccade L	1	4	2844886671	2844926544	39873	1378.23	310.67	1350.19	755.53	4.14	274.22	0.50	103.94	6763.80	-6205.21	5203.39
Saccade R	1	4	2844886671	2844926544	39873	1378.23	310.67	1350.19	755.53	4.14	274.22	0.50	103.94	6763.80	-6205.21	5203.39
Fixation L	1	5	2844926544	2845085660	159116	1323.12	777.69	40	51	-1	12.90	12.90
Fixation R	1	5	2844926544	2845085660	159116	1323.12	777.69	40	51	-1	12.59	12.59
Saccade L	1	5	2845085660	2845224778	139118	1329.37	788.36	665.71	410.21	13.07	350.35	0.71	93.92	8697.79	-5600.70	3210.74
Saccade R	1	5	2845085660	2845224778	139118	1329.37	788.36	665.71	410.21	13.07	350.35	0.71	93.92	8697.79	-5600.70	3210.74
Fixation L	1	6	2845224778	2845523144	298366	714.46	417.15	82	17	-1	14.05	14.05
Fixation R	1	6	2845224778	2845523144	298366	714.46	417.15	82	17	-1	13.42	13.42
Saccade L	1	6	2845523144	2845543016	19872	694.72	422.26	604.74	390.38	0.58	96.56	1.00	29.25	2261.47	-1859.98	1467.47
Saccade R	1	6	2845523144	2845543016	19872	694.72	422.26	604.74	390.38	0.58	96.56	1.00	29.25	2261.47	-1859.98	1467.47
Fixation L	1	7	2845543016	2845702135	159119	612.57	400.32	13	22	-1	13.53	13.53
Fixation R	1	7	2845543016	2845702135	159119	612.57	400.32	13	22	-1	13.47	13.47
Saccade L	1	7	2845702135	2845781758	79623	618.39	405.05	277.80	558.52	6.56	267.96	0.50	82.35	6522.86	-5808.05	3140.12
Saccade R	1	7	2845702135	2845781758	79623	618.39	405.05	277.80	558.52	6.56	267.96	0.50	82.35	6522.86	-5808.05	3140.12
Fixation L	1	8	2845781758	2845901126	119368	257.19	527.40	39	55	-1	13.04	13.04
Fixation R	1	8	2845781758	2845901126	119368	257.19	527.40	39	55	-1	13.56	13.56
Saccade L	1	8	2845901126	2845980628	79502	246.50	509.39	458.23	871.05	6.38	319.08	1.00	80.29	7642.24	-7464.58	3496.72
Saccade R	1	8	2845901126	2845980628	79502	246.50	509.39	458.23	871.05	6.38	319.08	1.00	80.29	7642.24	-7464.58	3496.72
Fixation L	1	9	2845980628	2846080116	99488	446.83	898.03	30	52	-1	13.13	13.13
Fixation R	1	9	2845980628	2846080116	99488	446.83	898.03	30	52	-1	13.35	13.35
Saccade L	1	9	2846080116	2846099993	19877	447.49	923.55	466.19	965.93	0.61	46.86	1.00	30.65	833.70	-930.07	793.52
Saccade R	1	9	2846080116	2846099993	19877	447.49	923.55	466.19	965.93	0.61	46.86	1.00	30.65	833.70	-930.07	793.52
Fixation L	1	10	2846099993	2846298856	198863	470.77	949.08	31	33	-1	13.96	13.96
Fixation R	1	10	2846099993	2846298856	198863	470.77	949.08	31	33	-1	14.00	14.00
Saccade L	1	10	2846298856	2846318735	19879	458.02	954.13	327.56	952.71	0.89	131.96	1.00	44.61	3176.66	-2734.05	2009.38
Saccade R	1	10	2846298856	2846318735	19879	458.02	954.13	327.56	952.71	0.89	131.96	1.00	44.61	3176.66	-2734.05	2009.38
Fixation L	1	11	2846318735	2846497841	179106	353.34	951.97	47	4	-1	13.94	13.94
Fixation R	1	11	2846318735	2846497841	179106	353.34	951.97	47	4	-1	14.41	14.41
Saccade L	1	11	2846497841	2846557469	59628	344.34	953.82	964.54	475.29	9.10	372.15	0.67	152.56	8856.45	-7547.83	6101.04
Saccade R	1	11	2846497841	2846557469	59628	344.34	953.82	964.54	475.29	9.10	372.15	0.67	152.56	8856.45	-7547.83	6101.04
Fixation L	1	12	2846557469	2846676830	119361	993.04	488.06	69	28	-1	14.79	14.79
Fixation R	1	12	2846557469	2846676830	119361	993.04	488.06	69	28	-1	14.47	14.47
Saccade L	1	12	2846676830	2846696711	19881	999.17	504.08	1006.06	519.39	0.19	16.98	1.00	9.53	268.67	-138.61	168.93
Saccade R	1	12	2846676830	2846696711	19881	999.17	504.08	1006.06	519.39	0.19	16.98	1.00	9.53	268.67	-138.61	168.93
Fixation L	1	13	2846696711	2846796228	99517	1006.17	532.33	4	21	-1	14.39	14.39
Fixation R	1	13	2846696711	2846796228	99517	1006.17	532.33	4	21	-1	14.08	14.08
Saccade L	1	13	2846796228	2846816083	19855	1004.82	539.00	1010.92	653.25	0.98	115.72	1.00	49.18	2800.81	-1206.93	1954.83
Saccade R	1	13	2846796228	2846816083	19855	1004.82	539.00	1010.92	653.25	0.98	115.72	1.00	49.18	2800.81	-1206.93	1954.83
Fixation L	1	14	2846816083	2846955343	139260	1026.32	692.24	25	74	-1	14.29	14.29
Fixation R	1	14	2846816083	2846955343	139260	1026.32	692.24	25	74	-1	13.60	13.60
Saccade L	1	14	2846955343	2847074579	119236	1032.34	711.70	1377.60	337.37	8.33	192.96	0.83	69.84	4362.78	-3678.98	2136.43
Saccade R	1	14	2846955343	2847074579	119236	1032.34	711.70	1377.60	337.37	8.33	192.96	0.83	69.84	4362.78	-3678.98	2136.43
Fixation L	1	15	2847074579	2847631552	556973	1366.61	356.29	50	29	-1	14.15	14.15
Fixation R	1	15	2847074579	2847631552	556973	1366.61	356.29	50	29	-1	13.49	13.49
Saccade L	1	15	2847631552	2847691168	59616	1385.11	347.67	1320.12	458.98	3.26	210.19	0.67	54.69	5140.28	-4729.29	2495.19
Saccade R	1	15	2847631552	2847691168	59616	1385.11	347.67	1320.12	458.98	3.26	210.19	0.67	54.69	5140.28	-4729.29	2495.19
Fixation L	1	16	2847691168	2847850290	159122	1299.16	443.16	29	27	-1	14.22	14.22
Fixation R	1	16	2847691168	2847850290	159122	1299.16	443.16	29	27	-1	13.50	13.50
