[BeGaze]
Converted from:	C:\Documents and Settings\iViewX\Desktop\EXPERIMENTATIONS\Experiments\results\finaleart\S18F56223-finaleart-1.idf
Date:	27.03.2019 15:49:32
Version:	BeGaze 2.5.77
Sample Rate:	50
Subject:	S18F56223
Description:	Pascale Sebillot

Table Header for Fixations:
Event Type	Trial	Number	Start	End	Duration	Location X	Location Y	Dispersion X	Dispersion Y	Plane	Avg. Pupil Size X	Avg. Pupil Size Y

Table Header for Saccades:
Event Type	Trial	Number	Start	End	Duration	Start Loc.X	Start Loc.Y	End Loc.X	End Loc.Y	Amplitude	Peak Speed	Peak Speed At	Average Speed	Peak Accel.	Peak Decel.	Average Accel.

Table Header for Blinks:
Event Type	Trial	Number	Start	End	Duration

Table Header for User Events:
Event Type	Trial	Number	Start	Description

UserEvent	1	1	3001114476	# Message: void.jpg
Fixation L	1	1	3001123479	3001322456	198977	1272.67	582.98	20	55	-1	14.08	14.08
Fixation R	1	1	3001123479	3001322456	198977	1272.67	582.98	20	55	-1	13.31	13.31
Saccade L	1	1	3001322456	3001342317	19861	1281.50	544.21	1278.30	464.86	1.02	80.87	1.00	51.36	1668.30	-1563.76	1495.78
Saccade R	1	1	3001322456	3001342317	19861	1281.50	544.21	1278.30	464.86	1.02	80.87	1.00	51.36	1668.30	-1563.76	1495.78
Fixation L	1	2	3001342317	3001620802	278485	1281.34	507.55	14	79	-1	14.05	14.05
Fixation R	1	2	3001342317	3001620802	278485	1281.34	507.55	14	79	-1	12.66	12.66
Saccade L	1	2	3001620802	3001839548	218746	1290.03	493.81	271.36	461.27	17.55	227.19	0.73	80.25	3868.99	-3266.21	1480.18
Saccade R	1	2	3001620802	3001839548	218746	1290.03	493.81	271.36	461.27	17.55	227.19	0.73	80.25	3868.99	-3266.21	1480.18
Fixation L	1	3	3001839548	3002038409	198861	300.15	486.74	54	45	-1	11.64	11.64
Fixation R	1	3	3001839548	3002038409	198861	300.15	486.74	54	45	-1	10.97	10.97
Saccade L	1	3	3002038409	3002058287	19878	307.77	502.37	317.90	507.09	0.21	17.63	0.00	10.42	180.92	-223.09	185.10
Saccade R	1	3	3002038409	3002058287	19878	307.77	502.37	317.90	507.09	0.21	17.63	0.00	10.42	180.92	-223.09	185.10
Fixation L	1	4	3002058287	3002197532	139245	325.29	518.92	11	21	-1	11.60	11.60
Fixation R	1	4	3002058287	3002197532	139245	325.29	518.92	11	21	-1	11.23	11.23
Saccade L	1	4	3002197532	3002257277	59745	328.50	529.09	737.99	613.89	4.53	164.57	0.67	75.82	4076.37	-3574.17	2816.95
Saccade R	1	4	3002197532	3002257277	59745	328.50	529.09	737.99	613.89	4.53	164.57	0.67	75.82	4076.37	-3574.17	2816.95
Fixation L	1	5	3002257277	3002973245	715968	735.46	624.70	23	46	-1	13.09	13.09
Fixation R	1	5	3002257277	3002973245	715968	735.46	624.70	23	46	-1	12.33	12.33
Saccade L	1	5	3002973245	3002993124	19879	719.29	645.74	728.48	719.72	0.68	75.41	1.00	33.96	1733.90	-1304.88	1139.89
Saccade R	1	5	3002973245	3002993124	19879	719.29	645.74	728.48	719.72	0.68	75.41	1.00	33.96	1733.90	-1304.88	1139.89
Fixation L	1	6	3002993124	3003112487	119363	727.84	713.20	8	22	-1	13.63	13.63
Fixation R	1	6	3002993124	3003112487	119363	727.84	713.20	8	22	-1	12.87	12.87
