[BeGaze]
Converted from:	C:\Documents and Settings\iViewX\Desktop\EXPERIMENTATIONS\Experiments\results\finaleart\S18F56223-finaleart-1.idf
Date:	27.03.2019 15:48:25
Version:	BeGaze 2.5.77
Sample Rate:	50
Subject:	S18F56223
Description:	Pascale Sebillot

Table Header for Fixations:
Event Type	Trial	Number	Start	End	Duration	Location X	Location Y	Dispersion X	Dispersion Y	Plane	Avg. Pupil Size X	Avg. Pupil Size Y

Table Header for Saccades:
Event Type	Trial	Number	Start	End	Duration	Start Loc.X	Start Loc.Y	End Loc.X	End Loc.Y	Amplitude	Peak Speed	Peak Speed At	Average Speed	Peak Accel.	Peak Decel.	Average Accel.

Table Header for Blinks:
Event Type	Trial	Number	Start	End	Duration

Table Header for User Events:
Event Type	Trial	Number	Start	Description

UserEvent	1	1	2350892008	# Message: Nature_morte_a_la_cafetiere_rouge_Vlaminck.jpg
Fixation L	1	1	2350895943	2351214165	318222	655.13	653.04	16	38	-1	16.82	16.82
Fixation R	1	1	2350895943	2351214165	318222	655.13	653.04	16	38	-1	14.80	14.80
Saccade L	1	1	2351214165	2351234055	19890	659.89	654.99	794.30	645.60	0.78	136.28	1.00	39.28	3263.45	-3250.46	2223.49
Saccade R	1	1	2351214165	2351234055	19890	659.89	654.99	794.30	645.60	0.78	136.28	1.00	39.28	3263.45	-3250.46	2223.49
Fixation L	1	2	2351234055	2351452916	218861	814.27	625.65	29	69	-1	17.01	17.01
Fixation R	1	2	2351234055	2351452916	218861	814.27	625.65	29	69	-1	15.03	15.03
Saccade L	1	2	2351452916	2351472793	19877	823.84	575.88	886.55	398.24	1.23	190.50	1.00	62.03	4683.54	-4201.91	3273.18
Saccade R	1	2	2351452916	2351472793	19877	823.84	575.88	886.55	398.24	1.23	190.50	1.00	62.03	4683.54	-4201.91	3273.18
Fixation L	1	3	2351472793	2351671660	198867	890.71	387.94	33	20	-1	14.55	14.55
Fixation R	1	3	2351472793	2351671660	198867	890.71	387.94	33	20	-1	12.60	12.60
Saccade L	1	3	2351671660	2351751282	79622	901.77	399.08	1344.22	505.84	7.75	271.05	0.50	97.36	6630.02	-4404.91	3377.25
Saccade R	1	3	2351671660	2351751282	79622	901.77	399.08	1344.22	505.84	7.75	271.05	0.50	97.36	6630.02	-4404.91	3377.25
Fixation L	1	4	2351751282	2351950139	198857	1342.56	510.96	9	77	-1	12.55	12.55
Fixation R	1	4	2351751282	2351950139	198857	1342.56	510.96	9	77	-1	10.98	10.98
Saccade L	1	4	2351950139	2352069510	119371	1337.27	526.45	1339.07	317.26	6.80	145.59	0.83	56.93	1909.93	-3215.24	1406.91
Saccade R	1	4	2351950139	2352069510	119371	1337.27	526.45	1339.07	317.26	6.80	145.59	0.83	56.93	1909.93	-3215.24	1406.91
Fixation L	1	5	2352069510	2352327996	258486	1329.35	302.85	18	26	-1	12.67	12.67
Fixation R	1	5	2352069510	2352327996	258486	1329.35	302.85	18	26	-1	11.07	11.07
Saccade L	1	5	2352327996	2352367751	39755	1322.39	298.67	958.37	308.63	3.22	265.28	1.00	80.88	6589.45	-6341.47	4305.46
Saccade R	1	5	2352327996	2352367751	39755	1322.39	298.67	958.37	308.63	3.22	265.28	1.00	80.88	6589.45	-6341.47	4305.46
Fixation L	1	6	2352367751	2352705981	338230	926.97	290.76	41	51	-1	12.98	12.98
Fixation R	1	6	2352367751	2352705981	338230	926.97	290.76	41	51	-1	10.98	10.98
Saccade L	1	6	2352705981	2352725859	19878	937.21	319.79	940.04	344.02	0.70	59.90	1.00	35.26	594.82	162.00	432.72
Saccade R	1	6	2352705981	2352725859	19878	937.21	319.79	940.04	344.02	0.70	59.90	1.00	35.26	594.82	162.00	432.72
Fixation L	1	7	2352725859	2352924720	198861	944.96	365.61	13	59	-1	12.68	12.68
Fixation R	1	7	2352725859	2352924720	198861	944.96	365.61	13	59	-1	10.82	10.82
Saccade L	1	7	2352924720	2352964478	39758	950.85	371.32	635.36	545.90	3.19	187.37	1.00	80.25	4352.21	-4547.72	4367.12
Saccade R	1	7	2352924720	2352964478	39758	950.85	371.32	635.36	545.90	3.19	187.37	1.00	80.25	4352.21	-4547.72	4367.12
Fixation L	1	8	2352964478	2353262836	298358	639.61	546.62	54	31	-1	12.25	12.25
Fixation R	1	8	2352964478	2353262836	298358	639.61	546.62	54	31	-1	10.39	10.39
Saccade L	1	8	2353262836	2353362322	99486	594.03	567.24	540.65	817.85	6.48	244.04	0.20	65.11	6011.82	-5483.37	2289.63
Saccade R	1	8	2353262836	2353362322	99486	594.03	567.24	540.65	817.85	6.48	244.04	0.20	65.11	6011.82	-5483.37	2289.63
Fixation L	1	9	2353362322	2353501573	139251	538.57	809.31	26	55	-1	12.50	12.50
Fixation R	1	9	2353362322	2353501573	139251	538.57	809.31	26	55	-1	10.82	10.82
Saccade L	1	9	2353501573	2353521449	19876	538.79	819.11	410.66	1042.71	1.81	260.53	1.00	91.17	6059.65	-6329.00	4459.62
Saccade R	1	9	2353501573	2353521449	19876	538.79	819.11	410.66	1042.71	1.81	260.53	1.00	91.17	6059.65	-6329.00	4459.62
Fixation L	1	10	2353521449	2353959054	437605	395.14	1093.37	30	69	-1	12.92	12.92
Fixation R	1	10	2353521449	2353959054	437605	395.14	1093.37	30	69	-1	11.31	11.31
Saccade L	1	10	2353959054	2354058422	99368	394.93	1094.19	587.44	208.50	11.77	234.71	0.60	118.42	5608.11	-3367.36	3160.18
Saccade R	1	10	2353959054	2354058422	99368	394.93	1094.19	587.44	208.50	11.77	234.71	0.60	118.42	5608.11	-3367.36	3160.18
Fixation L	1	11	2354058422	2354396661	338239	590.10	236.12	13	47	-1	13.08	13.08
Fixation R	1	11	2354058422	2354396661	338239	590.10	236.12	13	47	-1	11.95	11.95
Saccade L	1	11	2354396661	2354436408	39747	592.60	255.28	932.11	428.05	3.40	277.78	1.00	85.65	6777.78	-6710.47	4505.72
Saccade R	1	11	2354396661	2354436408	39747	592.60	255.28	932.11	428.05	3.40	277.78	1.00	85.65	6777.78	-6710.47	4505.72
Fixation L	1	12	2354436408	2354754644	318236	911.79	464.58	27	50	-1	12.71	12.71
Fixation R	1	12	2354436408	2354754644	318236	911.79	464.58	27	50	-1	11.04	11.04
Saccade L	1	12	2354754644	2354794392	39748	917.81	471.96	1091.24	714.11	2.79	277.24	0.50	70.18	6792.05	-6090.01	3389.72
Saccade R	1	12	2354754644	2354794392	39748	917.81	471.96	1091.24	714.11	2.79	277.24	0.50	70.18	6792.05	-6090.01	3389.72
Fixation L	1	13	2354794392	2354893880	99488	1090.97	758.46	7	74	-1	12.58	12.58
Fixation R	1	13	2354794392	2354893880	99488	1090.97	758.46	7	74	-1	11.16	11.16
