[BeGaze]
Converted from:	C:\Documents and Settings\iViewX\Desktop\EXPERIMENTATIONS\Experiments\results\finaleart\S18F56223-finaleart-1.idf
Date:	27.03.2019 15:49:29
Version:	BeGaze 2.5.77
Sample Rate:	50
Subject:	S18F56223
Description:	Pascale Sebillot

Table Header for Fixations:
Event Type	Trial	Number	Start	End	Duration	Location X	Location Y	Dispersion X	Dispersion Y	Plane	Avg. Pupil Size X	Avg. Pupil Size Y

Table Header for Saccades:
Event Type	Trial	Number	Start	End	Duration	Start Loc.X	Start Loc.Y	End Loc.X	End Loc.Y	Amplitude	Peak Speed	Peak Speed At	Average Speed	Peak Accel.	Peak Decel.	Average Accel.

Table Header for Blinks:
Event Type	Trial	Number	Start	End	Duration

Table Header for User Events:
Event Type	Trial	Number	Start	Description

UserEvent	1	1	2972538557	# Message: stilleven-met-vis_dubois-pillet_1885.jpg
Fixation L	1	1	2972541454	2972799943	258489	643.11	597.20	11	40	-1	14.48	14.48
Fixation R	1	1	2972541454	2972799943	258489	643.11	597.20	11	40	-1	13.75	13.75
Saccade L	1	1	2972799943	2972819812	19869	645.16	597.88	781.24	564.69	0.97	141.67	1.00	48.67	3462.17	-3231.10	2300.05
Saccade R	1	1	2972799943	2972819812	19869	645.16	597.88	781.24	564.69	0.97	141.67	1.00	48.67	3462.17	-3231.10	2300.05
Fixation L	1	2	2972819812	2973078434	258622	804.84	580.40	34	40	-1	14.23	14.23
Fixation R	1	2	2972819812	2973078434	258622	804.84	580.40	34	40	-1	13.10	13.10
Saccade L	1	2	2973078434	2973098302	19868	815.32	592.04	662.68	533.17	1.11	165.45	1.00	55.82	4048.59	-3622.99	2875.64
Saccade R	1	2	2973078434	2973098302	19868	815.32	592.04	662.68	533.17	1.11	165.45	1.00	55.82	4048.59	-3622.99	2875.64
Fixation L	1	3	2973098302	2973217673	119371	688.92	509.71	42	35	-1	13.06	13.06
Fixation R	1	3	2973098302	2973217673	119371	688.92	509.71	42	35	-1	12.23	12.23
Saccade L	1	3	2973217673	2973277300	59627	690.47	497.82	1036.29	769.44	5.04	364.13	0.67	84.58	8974.51	-8287.64	3977.12
Saccade R	1	3	2973217673	2973277300	59627	690.47	497.82	1036.29	769.44	5.04	364.13	0.67	84.58	8974.51	-8287.64	3977.12
Fixation L	1	4	2973277300	2973496159	218859	1057.58	819.72	30	59	-1	12.36	12.36
Fixation R	1	4	2973277300	2973496159	218859	1057.58	819.72	30	59	-1	11.22	11.22
Saccade L	1	4	2973496159	2973555803	59644	1067.09	828.76	1246.37	363.90	5.21	264.06	0.67	87.37	6573.40	-6468.90	3852.36
Saccade R	1	4	2973496159	2973555803	59644	1067.09	828.76	1246.37	363.90	5.21	264.06	0.67	87.37	6573.40	-6468.90	3852.36
Fixation L	1	5	2973555803	2974033138	477335	1259.35	330.39	26	72	-1	12.34	12.34
Fixation R	1	5	2973555803	2974033138	477335	1259.35	330.39	26	72	-1	11.06	11.06
Saccade L	1	5	2974033138	2974053010	19872	1271.51	301.79	1332.13	300.93	0.42	61.33	1.00	20.93	1472.60	-857.10	930.65
Saccade R	1	5	2974033138	2974053010	19872	1271.51	301.79	1332.13	300.93	0.42	61.33	1.00	20.93	1472.60	-857.10	930.65
Fixation L	1	6	2974053010	2974291774	238764	1343.13	292.71	44	24	-1	11.87	11.87
Fixation R	1	6	2974053010	2974291774	238764	1343.13	292.71	44	24	-1	10.89	10.89
Saccade L	1	6	2974291774	2974331498	39724	1354.78	285.03	1298.79	556.18	2.56	150.70	0.50	64.55	3645.98	-3051.35	3055.67
Saccade R	1	6	2974291774	2974331498	39724	1354.78	285.03	1298.79	556.18	2.56	150.70	0.50	64.55	3645.98	-3051.35	3055.67
Fixation L	1	7	2974331498	2974609989	278491	1283.47	543.69	32	27	-1	12.35	12.35
Fixation R	1	7	2974331498	2974609989	278491	1283.47	543.69	32	27	-1	11.13	11.13
Saccade L	1	7	2974609989	2974689483	79494	1277.82	551.54	615.68	870.59	9.30	395.94	0.50	116.96	9815.45	-7648.10	5050.33
Saccade R	1	7	2974609989	2974689483	79494	1277.82	551.54	615.68	870.59	9.30	395.94	0.50	116.96	9815.45	-7648.10	5050.33
Fixation L	1	8	2974689483	2975027719	338236	607.78	844.41	45	41	-1	12.68	12.68
Fixation R	1	8	2974689483	2975027719	338236	607.78	844.41	45	41	-1	11.83	11.83
Saccade L	1	8	2975027719	2975067469	39750	643.50	850.95	647.64	833.49	1.25	45.75	0.00	31.35	883.39	-590.84	534.83
Saccade R	1	8	2975027719	2975067469	39750	643.50	850.95	647.64	833.49	1.25	45.75	0.00	31.35	883.39	-590.84	534.83
Fixation L	1	9	2975067469	2975266339	198870	650.84	795.59	14	63	-1	12.23	12.23
Fixation R	1	9	2975067469	2975266339	198870	650.84	795.59	14	63	-1	11.59	11.59
Saccade L	1	9	2975266339	2975286205	19866	656.86	769.72	730.85	760.79	0.58	75.39	1.00	29.02	1830.84	-1853.32	1260.31
Saccade R	1	9	2975266339	2975286205	19866	656.86	769.72	730.85	760.79	0.58	75.39	1.00	29.02	1830.84	-1853.32	1260.31
Fixation L	1	10	2975286205	2975425474	139269	712.30	763.16	28	11	-1	12.64	12.64
Fixation R	1	10	2975286205	2975425474	139269	712.30	763.16	28	11	-1	11.56	11.56
Saccade L	1	10	2975425474	2975465196	39722	716.88	767.89	671.52	385.46	3.50	273.94	0.50	88.21	6766.80	-5920.24	4601.60
Saccade R	1	10	2975425474	2975465196	39722	716.88	767.89	671.52	385.46	3.50	273.94	0.50	88.21	6766.80	-5920.24	4601.60
Fixation L	1	11	2975465196	2975803435	338239	662.56	427.90	17	50	-1	12.38	12.38
Fixation R	1	11	2975465196	2975803435	338239	662.56	427.90	17	50	-1	11.93	11.93
Saccade L	1	11	2975803435	2975863057	59622	655.39	435.71	1194.98	532.28	5.86	351.46	0.67	98.34	8600.05	-8290.38	4522.38
Saccade R	1	11	2975803435	2975863057	59622	655.39	435.71	1194.98	532.28	5.86	351.46	0.67	98.34	8600.05	-8290.38	4522.38
Fixation L	1	12	2975863057	2976161411	298354	1179.74	547.42	24	48	-1	12.86	12.86
Fixation R	1	12	2975863057	2976161411	298354	1179.74	547.42	24	48	-1	11.86	11.86
Saccade L	1	12	2976161411	2976201160	39749	1178.92	557.20	1314.00	244.79	3.21	192.13	1.00	80.78	4711.69	-4186.71	3979.46
Saccade R	1	12	2976161411	2976201160	39749	1178.92	557.20	1314.00	244.79	3.21	192.13	1.00	80.78	4711.69	-4186.71	3979.46
Fixation L	1	13	2976201160	2976519403	318243	1277.16	269.37	52	39	-1	13.27	13.27
Fixation R	1	13	2976201160	2976519403	318243	1277.16	269.37	52	39	-1	12.00	12.00
