[BeGaze]
Converted from:	C:\Documents and Settings\iViewX\Desktop\EXPERIMENTATIONS\Experiments\results\finaleart\S8119532-finaleart-1.idf
Date:	27.03.2019 15:59:26
Version:	BeGaze 2.5.77
Sample Rate:	50
Subject:	S8119532
Description:	Alexandre Drewery

Table Header for Fixations:
Event Type	Trial	Number	Start	End	Duration	Location X	Location Y	Dispersion X	Dispersion Y	Plane	Avg. Pupil Size X	Avg. Pupil Size Y

Table Header for Saccades:
Event Type	Trial	Number	Start	End	Duration	Start Loc.X	Start Loc.Y	End Loc.X	End Loc.Y	Amplitude	Peak Speed	Peak Speed At	Average Speed	Peak Accel.	Peak Decel.	Average Accel.

Table Header for Blinks:
Event Type	Trial	Number	Start	End	Duration

Table Header for User Events:
Event Type	Trial	Number	Start	Description

UserEvent	1	1	2530138859	# Message: L-Heure_Embrasee_Rysselberghe_1897.jpg
Fixation L	1	1	2530150731	2530846925	696194	891.53	495.87	35	63	-1	14.58	14.58
Fixation R	1	1	2530150731	2530846925	696194	891.53	495.87	35	63	-1	15.57	15.57
Saccade L	1	1	2530846925	2530886684	39759	884.64	515.75	905.25	619.45	1.18	105.20	1.00	29.56	2521.30	-2182.71	1367.15
Saccade R	1	1	2530846925	2530886684	39759	884.64	515.75	905.25	619.45	1.18	105.20	1.00	29.56	2521.30	-2182.71	1367.15
Fixation L	1	2	2530886684	2531085536	198852	928.26	590.31	37	49	-1	14.56	14.56
Fixation R	1	2	2530886684	2531085536	198852	928.26	590.31	37	49	-1	15.56	15.56
Saccade L	1	2	2531085536	2531204013	118477	942.34	587.31	506.36	397.25	10.38	311.81	0.34	87.63	7327.73	-6485.81	2611.59
Saccade R	1	2	2531085536	2531204013	118477	942.34	587.31	506.36	397.25	10.38	311.81	0.34	87.63	7327.73	-6485.81	2611.59
Fixation L	1	3	2531204013	2531403905	199892	515.79	365.08	41	53	-1	12.42	12.42
Fixation R	1	3	2531204013	2531403905	199892	515.79	365.08	41	53	-1	12.90	12.90
Saccade L	1	3	2531403905	2531423788	19883	516.97	354.60	468.64	362.05	0.43	49.47	1.00	21.59	1025.82	-1011.14	745.95
Saccade R	1	3	2531403905	2531423788	19883	516.97	354.60	468.64	362.05	0.43	49.47	1.00	21.59	1025.82	-1011.14	745.95
Fixation L	1	4	2531423788	2531563022	139234	456.30	381.87	20	54	-1	11.90	11.90
Fixation R	1	4	2531423788	2531563022	139234	456.30	381.87	20	54	-1	12.74	12.74
Saccade L	1	4	2531563022	2531622642	59620	448.12	369.83	786.04	231.39	4.35	206.98	0.67	72.97	4624.99	-5047.92	2754.45
Saccade R	1	4	2531563022	2531622642	59620	448.12	369.83	786.04	231.39	4.35	206.98	0.67	72.97	4624.99	-5047.92	2754.45
Fixation L	1	5	2531622642	2531821512	198870	799.85	220.89	25	74	-1	11.66	11.66
Fixation R	1	5	2531622642	2531821512	198870	799.85	220.89	25	74	-1	12.00	12.00
Saccade L	1	5	2531821512	2531841380	19868	811.05	166.35	812.23	164.15	0.44	50.66	1.00	22.23	17.75	-1203.33	426.27
Saccade R	1	5	2531821512	2531841380	19868	811.05	166.35	812.23	164.15	0.44	50.66	1.00	22.23	17.75	-1203.33	426.27
Fixation L	1	6	2531841380	2532060258	218878	819.00	174.94	37	25	-1	11.70	11.70
Fixation R	1	6	2531841380	2532060258	218878	819.00	174.94	37	25	-1	12.09	12.09
Saccade L	1	6	2532060258	2532080125	19867	849.18	188.55	1110.14	185.93	1.70	263.83	1.00	85.48	6485.19	-6076.08	4241.76
Saccade R	1	6	2532060258	2532080125	19867	849.18	188.55	1110.14	185.93	1.70	263.83	1.00	85.48	6485.19	-6076.08	4241.76
Fixation L	1	7	2532080125	2532179629	99504	1146.32	194.50	56	41	-1	11.89	11.89
Fixation R	1	7	2532080125	2532179629	99504	1146.32	194.50	56	41	-1	11.87	11.87
Saccade L	1	7	2532179629	2532278994	99365	1166.16	196.08	1391.16	234.24	4.36	159.79	1.00	43.88	3810.25	-3624.23	1786.91
Saccade R	1	7	2532179629	2532278994	99365	1166.16	196.08	1391.16	234.24	4.36	159.79	1.00	43.88	3810.25	-3624.23	1786.91
Fixation L	1	8	2532278994	2532497722	218728	1393.14	239.20	30	36	-1	11.89	11.89
Fixation R	1	8	2532278994	2532497722	218728	1393.14	239.20	30	36	-1	11.53	11.53
Saccade L	1	8	2532497722	2532756335	258613	1374.29	253.58	1548.26	65.36	11.44	175.09	0.46	44.22	4132.56	-3525.79	1407.18
Saccade R	1	8	2532497722	2532756335	258613	1374.29	253.58	1548.26	65.36	11.44	175.09	0.46	44.22	4132.56	-3525.79	1407.18
Fixation L	1	9	2532756335	2532915452	159117	1513.77	74.89	55	17	-1	12.33	12.33
Fixation R	1	9	2532756335	2532915452	159117	1513.77	74.89	55	17	-1	12.04	12.04
Saccade L	1	9	2532915452	2532935345	19893	1496.82	81.79	1312.97	79.41	1.22	185.93	1.00	61.23	4370.80	-4196.80	3182.63
Saccade R	1	9	2532915452	2532935345	19893	1496.82	81.79	1312.97	79.41	1.22	185.93	1.00	61.23	4370.80	-4196.80	3182.63
Fixation L	1	10	2532935345	2533174076	238731	1274.54	49.31	46	53	-1	12.57	12.57
Fixation R	1	10	2532935345	2533174076	238731	1274.54	49.31	46	53	-1	12.69	12.69
Saccade L	1	10	2533174076	2533213838	39762	1269.64	36.31	969.10	60.21	2.84	287.57	1.00	71.48	7140.60	-6625.31	3681.79
Saccade R	1	10	2533174076	2533213838	39762	1269.64	36.31	969.10	60.21	2.84	287.57	1.00	71.48	7140.60	-6625.31	3681.79
Fixation L	1	11	2533213838	2533333194	119356	923.84	65.38	57	40	-1	12.31	12.31
Fixation R	1	11	2533213838	2533333194	119356	923.84	65.38	57	40	-1	12.92	12.92
Saccade L	1	11	2533333194	2533372957	39763	912.42	88.94	595.01	91.56	2.89	190.83	0.50	72.73	4688.96	-4448.74	3793.73
Saccade R	1	11	2533333194	2533372957	39763	912.42	88.94	595.01	91.56	2.89	190.83	0.50	72.73	4688.96	-4448.74	3793.73
Fixation L	1	12	2533372957	2533711043	338086	572.72	105.04	37	23	-1	12.01	12.01
Fixation R	1	12	2533372957	2533711043	338086	572.72	105.04	37	23	-1	12.90	12.90
Saccade L	1	12	2533711043	2534168515	457472	557.62	106.18	793.77	883.48	40.80	341.14	0.09	89.20	8298.54	-4607.03	2371.23
Saccade R	1	12	2533711043	2534168515	457472	557.62	106.18	793.77	883.48	40.80	341.14	0.09	89.20	8298.54	-4607.03	2371.23
