[BeGaze]
Converted from:	C:\Documents and Settings\iViewX\Desktop\EXPERIMENTATIONS\Experiments\results\finaleart\S02123220-finaleart-1.idf
Date:	27.03.2019 15:33:31
Version:	BeGaze 2.5.77
Sample Rate:	50
Subject:	S02123220
Description:	David Xu

Table Header for Fixations:
Event Type	Trial	Number	Start	End	Duration	Location X	Location Y	Dispersion X	Dispersion Y	Plane	Avg. Pupil Size X	Avg. Pupil Size Y

Table Header for Saccades:
Event Type	Trial	Number	Start	End	Duration	Start Loc.X	Start Loc.Y	End Loc.X	End Loc.Y	Amplitude	Peak Speed	Peak Speed At	Average Speed	Peak Accel.	Peak Decel.	Average Accel.

Table Header for Blinks:
Event Type	Trial	Number	Start	End	Duration

Table Header for User Events:
Event Type	Trial	Number	Start	Description

UserEvent	1	1	722730337	# Message: void.jpg
Saccade L	1	1	722736395	722855767	119372	958.92	256.62	1099.29	478.52	4.76	213.32	0.83	39.84	5240.26	-5186.44	1784.69
Saccade R	1	1	722736395	722855767	119372	958.92	256.62	1099.29	478.52	4.76	213.32	0.83	39.84	5240.26	-5186.44	1784.69
Fixation L	1	1	722855767	723492224	636457	1110.61	470.89	16	46	-1	15.08	15.08
Fixation R	1	1	722855767	723492224	636457	1110.61	470.89	16	46	-1	14.37	14.37
Saccade L	1	2	723492224	724029192	536968	1107.97	490.99	986.86	313.43	61.88	328.83	0.37	115.25	5479.38	-6929.05	2208.07
Saccade R	1	2	723492224	724029192	536968	1107.97	490.99	986.86	313.43	61.88	328.83	0.37	115.25	5479.38	-6929.05	2208.07
Fixation L	1	2	724029192	724347545	318353	986.30	321.53	5	56	-1	15.49	15.49
Fixation R	1	2	724029192	724347545	318353	986.30	321.53	5	56	-1	15.16	15.16
Saccade L	1	3	724347545	724446930	99385	989.70	337.69	989.67	335.24	6.01	137.63	0.80	60.49	2263.20	-2418.91	1516.96
Saccade R	1	3	724347545	724446930	99385	989.70	337.69	989.67	335.24	6.01	137.63	0.80	60.49	2263.20	-2418.91	1516.96
Fixation L	1	3	724446930	724546400	99470	989.16	371.09	1	64	-1	15.67	15.67
Fixation R	1	3	724446930	724546400	99470	989.16	371.09	1	64	-1	15.71	15.71
Saccade L	1	4	724546400	724566286	19886	988.51	333.54	988.12	291.17	0.84	60.50	1.00	42.01	581.52	-1041.89	669.56
Saccade R	1	4	724546400	724566286	19886	988.51	333.54	988.12	291.17	0.84	60.50	1.00	42.01	581.52	-1041.89	669.56
Fixation L	1	4	724566286	724725400	159114	984.03	262.21	12	75	-1	16.02	16.02
Fixation R	1	4	724566286	724725400	159114	984.03	262.21	12	75	-1	15.78	15.78
