[BeGaze]
Converted from:	C:\Documents and Settings\iViewX\Desktop\EXPERIMENTATIONS\Experiments\results\finaleart\S15H25531-finaleart-1.idf
Date:	27.03.2019 15:45:36
Version:	BeGaze 2.5.77
Sample Rate:	50
Subject:	S15H25531
Description:	Mikail Demirdelen

Table Header for Fixations:
Event Type	Trial	Number	Start	End	Duration	Location X	Location Y	Dispersion X	Dispersion Y	Plane	Avg. Pupil Size X	Avg. Pupil Size Y

Table Header for Saccades:
Event Type	Trial	Number	Start	End	Duration	Start Loc.X	Start Loc.Y	End Loc.X	End Loc.Y	Amplitude	Peak Speed	Peak Speed At	Average Speed	Peak Accel.	Peak Decel.	Average Accel.

Table Header for Blinks:
Event Type	Trial	Number	Start	End	Duration

Table Header for User Events:
Event Type	Trial	Number	Start	Description

UserEvent	1	1	4510893830	# Message: storm_off_normandy_cost_isabey_1850.jpg
Fixation L	1	1	4510905896	4511403270	497374	992.03	451.50	9	41	-1	15.28	15.28
Fixation R	1	1	4510905896	4511403270	497374	992.03	451.50	9	41	-1	16.07	16.07
Saccade L	1	1	4511403270	4511462867	59597	984.79	478.12	506.60	584.82	5.70	322.13	0.67	95.68	7935.07	-6538.38	4024.71
Saccade R	1	1	4511403270	4511462867	59597	984.79	478.12	506.60	584.82	5.70	322.13	0.67	95.68	7935.07	-6538.38	4024.71
Fixation L	1	2	4511462867	4511661752	198885	483.70	549.90	32	60	-1	15.20	15.20
Fixation R	1	2	4511462867	4511661752	198885	483.70	549.90	32	60	-1	16.32	16.32
Saccade L	1	2	4511661752	4511681601	19849	473.66	570.36	310.63	619.65	1.08	172.25	1.00	54.36	4113.57	-3481.03	2598.09
Saccade R	1	2	4511661752	4511681601	19849	473.66	570.36	310.63	619.65	1.08	172.25	1.00	54.36	4113.57	-3481.03	2598.09
Fixation L	1	3	4511681601	4511800981	119380	335.82	642.74	34	35	-1	15.56	15.56
Fixation R	1	3	4511681601	4511800981	119380	335.82	642.74	34	35	-1	16.77	16.77
Saccade L	1	3	4511800981	4511860726	59745	343.07	655.11	1146.26	490.27	8.61	378.17	0.67	144.11	9302.32	-9138.12	6074.74
Saccade R	1	3	4511800981	4511860726	59745	343.07	655.11	1146.26	490.27	8.61	378.17	0.67	144.11	9302.32	-9138.12	6074.74
Fixation L	1	4	4511860726	4512119210	258484	1140.77	491.91	11	32	-1	16.34	16.34
Fixation R	1	4	4511860726	4512119210	258484	1140.77	491.91	11	32	-1	17.30	17.30
Saccade L	1	4	4512119210	4512139083	19873	1135.91	487.14	1176.80	422.62	0.63	77.26	1.00	31.89	1842.55	-1649.76	1325.27
Saccade R	1	4	4512119210	4512139083	19873	1135.91	487.14	1176.80	422.62	0.63	77.26	1.00	31.89	1842.55	-1649.76	1325.27
Fixation L	1	5	4512139083	4512417568	278485	1208.51	387.27	39	52	-1	16.60	16.60
Fixation R	1	5	4512139083	4512417568	278485	1208.51	387.27	39	52	-1	17.19	17.19
Saccade L	1	5	4512417568	4512437451	19883	1205.84	422.78	1204.82	441.71	0.32	24.43	1.00	16.33	-131.10	-347.59	266.99
Saccade R	1	5	4512417568	4512437451	19883	1205.84	422.78	1204.82	441.71	0.32	24.43	1.00	16.33	-131.10	-347.59	266.99
Fixation L	1	6	4512437451	4513034172	596721	1193.30	455.87	21	20	-1	17.13	17.13
Fixation R	1	6	4512437451	4513034172	596721	1193.30	455.87	21	20	-1	17.35	17.35
Saccade R	1	6	4513034172	4513133660	99488	1187.55	449.15	962.46	364.22	6.87	227.77	0.20	69.06	5663.15	-5498.24	2899.75
Saccade L	1	6	4513093786	4513133660	39874	893.34	451.26	962.46	364.22	2.44	136.49	1.00	61.18	1767.00	-2548.47	1540.98
Fixation L	1	7	4513133660	4513531397	397737	963.13	379.47	10	47	-1	16.49	16.49
Fixation R	1	7	4513133660	4513531397	397737	963.13	379.47	10	47	-1	17.85	17.85
Saccade L	1	7	4513531397	4513551267	19870	970.27	379.09	1230.61	387.01	1.48	263.30	1.00	74.25	6549.86	-6265.74	4402.86
Saccade R	1	7	4513531397	4513551267	19870	970.27	379.09	1230.61	387.01	1.48	263.30	1.00	74.25	6549.86	-6265.74	4402.86
Fixation L	1	8	4513551267	4514883950	1332683	1218.47	416.32	36	42	-1	17.06	17.06
Fixation R	1	8	4513551267	4514883950	1332683	1218.47	416.32	36	42	-1	17.97	17.97
