[BeGaze]
Converted from:	C:\Documents and Settings\iViewX\Desktop\EXPERIMENTATIONS\Experiments\results\finaleart\S12H22222-finaleart-1.idf
Date:	27.03.2019 15:40:11
Version:	BeGaze 2.5.77
Sample Rate:	50
Subject:	S12H22222
Description:	aurele barriere

Table Header for Fixations:
Event Type	Trial	Number	Start	End	Duration	Location X	Location Y	Dispersion X	Dispersion Y	Plane	Avg. Pupil Size X	Avg. Pupil Size Y

Table Header for Saccades:
Event Type	Trial	Number	Start	End	Duration	Start Loc.X	Start Loc.Y	End Loc.X	End Loc.Y	Amplitude	Peak Speed	Peak Speed At	Average Speed	Peak Accel.	Peak Decel.	Average Accel.

Table Header for Blinks:
Event Type	Trial	Number	Start	End	Duration

Table Header for User Events:
Event Type	Trial	Number	Start	Description

UserEvent	1	1	23180747003	# Message: void.jpg
Saccade L	1	1	23180747559	23180767428	19869	819.77	817.16	850.84	875.53	0.63	66.89	1.00	31.94	723.04	-1081.84	601.63
Saccade R	1	1	23180747559	23180767428	19869	819.77	817.16	850.84	875.53	0.63	66.89	1.00	31.94	723.04	-1081.84	601.63
Fixation L	1	1	23180767428	23180946411	178983	887.77	849.84	50	35	-1	13.52	13.52
Fixation R	1	1	23180767428	23180946411	178983	887.77	849.84	50	35	-1	13.25	13.25
Saccade L	1	2	23180946411	23180966290	19879	901.63	842.31	786.02	696.46	1.38	188.21	1.00	69.38	4629.90	-4380.76	3636.20
Saccade R	1	2	23180946411	23180966290	19879	901.63	842.31	786.02	696.46	1.38	188.21	1.00	69.38	4629.90	-4380.76	3636.20
Fixation L	1	2	23180966290	23181085641	119351	770.14	636.19	21	77	-1	13.06	13.06
Fixation R	1	2	23180966290	23181085641	119351	770.14	636.19	21	77	-1	12.95	12.95
Saccade L	1	3	23181085641	23181105531	19890	764.47	628.68	760.51	628.56	0.06	4.00	1.00	3.03	42.26	-64.90	43.11
Saccade R	1	3	23181085641	23181105531	19890	764.47	628.68	760.51	628.56	0.06	4.00	1.00	3.03	42.26	-64.90	43.11
Fixation L	1	3	23181105531	23182517703	1412172	765.24	624.75	31	28	-1	14.22	14.22
Fixation R	1	3	23181105531	23182517703	1412172	765.24	624.75	31	28	-1	14.06	14.06
Saccade L	1	4	23182517703	23182557575	39872	786.25	616.06	906.45	424.22	2.09	158.13	0.50	52.53	3895.17	-3388.83	2743.23
Saccade R	1	4	23182517703	23182557575	39872	786.25	616.06	906.45	424.22	2.09	158.13	0.50	52.53	3895.17	-3388.83	2743.23
Fixation L	1	4	23182557575	23182736566	178991	916.42	400.78	17	36	-1	15.15	15.15
Fixation R	1	4	23182557575	23182736566	178991	916.42	400.78	17	36	-1	14.84	14.84
