[BeGaze]
Converted from:	C:\Documents and Settings\iViewX\Desktop\EXPERIMENTATIONS\Experiments\results\finaleart\S18F56223-finaleart-1.idf
Date:	27.03.2019 15:48:40
Version:	BeGaze 2.5.77
Sample Rate:	50
Subject:	S18F56223
Description:	Pascale Sebillot

Table Header for Fixations:
Event Type	Trial	Number	Start	End	Duration	Location X	Location Y	Dispersion X	Dispersion Y	Plane	Avg. Pupil Size X	Avg. Pupil Size Y

Table Header for Saccades:
Event Type	Trial	Number	Start	End	Duration	Start Loc.X	Start Loc.Y	End Loc.X	End Loc.Y	Amplitude	Peak Speed	Peak Speed At	Average Speed	Peak Accel.	Peak Decel.	Average Accel.

Table Header for Blinks:
Event Type	Trial	Number	Start	End	Duration

Table Header for User Events:
Event Type	Trial	Number	Start	Description

UserEvent	1	1	2505211793	# Message: void.jpg
Saccade L	1	1	2505223312	2505322808	99496	854.59	522.50	1075.36	508.48	3.74	191.13	1.00	37.57	4588.59	-4117.59	1400.32
Saccade R	1	1	2505223312	2505322808	99496	854.59	522.50	1075.36	508.48	3.74	191.13	1.00	37.57	4588.59	-4117.59	1400.32
Fixation L	1	1	2505322808	2505720523	397715	1076.52	461.77	18	76	-1	15.01	15.01
Fixation R	1	1	2505322808	2505720523	397715	1076.52	461.77	18	76	-1	13.83	13.83
Saccade L	1	2	2505720523	2505740402	19879	1073.69	447.68	1068.56	549.52	0.75	103.14	1.00	37.73	2284.38	-2279.98	1539.60
Saccade R	1	2	2505720523	2505740402	19879	1073.69	447.68	1068.56	549.52	0.75	103.14	1.00	37.73	2284.38	-2279.98	1539.60
Fixation L	1	2	2505740402	2505899521	159119	1055.48	573.32	29	43	-1	15.01	15.01
Fixation R	1	2	2505740402	2505899521	159119	1055.48	573.32	29	43	-1	13.48	13.48
Saccade L	1	3	2505899521	2505999047	99526	1043.64	593.27	1001.54	630.68	3.19	85.63	1.00	32.09	1623.45	-1364.89	945.58
Saccade R	1	3	2505899521	2505999047	99526	1043.64	593.27	1001.54	630.68	3.19	85.63	1.00	32.09	1623.45	-1364.89	945.58
Fixation L	1	3	2505999047	2506098508	99461	963.99	640.87	51	36	-1	13.73	13.73
Fixation R	1	3	2505999047	2506098508	99461	963.99	640.87	51	36	-1	12.55	12.55
Saccade L	1	4	2506098508	2506178006	79498	952.66	660.78	569.22	484.13	6.29	165.01	0.75	79.11	3491.07	-2634.27	2150.40
Saccade R	1	4	2506098508	2506178006	79498	952.66	660.78	569.22	484.13	6.29	165.01	0.75	79.11	3491.07	-2634.27	2150.40
Fixation L	1	4	2506178006	2506297381	119375	510.01	481.03	75	23	-1	14.26	14.26
Fixation R	1	4	2506178006	2506297381	119375	510.01	481.03	75	23	-1	13.23	13.23
Saccade L	1	5	2506297381	2506317256	19875	494.90	479.80	492.14	483.85	0.11	13.21	1.00	5.32	9.83	-206.17	98.75
Saccade R	1	5	2506297381	2506317256	19875	494.90	479.80	492.14	483.85	0.11	13.21	1.00	5.32	9.83	-206.17	98.75
Fixation L	1	5	2506317256	2506535985	218729	493.70	476.55	15	20	-1	14.30	14.30
Fixation R	1	5	2506317256	2506535985	218729	493.70	476.55	15	20	-1	13.33	13.33
Saccade L	1	6	2506535985	2506575865	39880	505.63	470.76	920.64	595.98	3.74	333.91	0.50	93.69	8244.41	-7983.61	5239.65
Saccade R	1	6	2506535985	2506575865	39880	505.63	470.76	920.64	595.98	3.74	333.91	0.50	93.69	8244.41	-7983.61	5239.65
Fixation L	1	6	2506575865	2507212368	636503	921.61	632.00	19	66	-1	15.39	15.39
Fixation R	1	6	2506575865	2507212368	636503	921.61	632.00	19	66	-1	14.08	14.08
