[BeGaze]
Converted from:	C:\Documents and Settings\iViewX\Desktop\EXPERIMENTATIONS\Experiments\results\finaleart\S6124332-finaleart-1.idf
Date:	27.03.2019 15:35:54
Version:	BeGaze 2.5.77
Sample Rate:	50
Subject:	S6124332
Description:	Romain Ferrand

Table Header for Fixations:
Event Type	Trial	Number	Start	End	Duration	Location X	Location Y	Dispersion X	Dispersion Y	Plane	Avg. Pupil Size X	Avg. Pupil Size Y

Table Header for Saccades:
Event Type	Trial	Number	Start	End	Duration	Start Loc.X	Start Loc.Y	End Loc.X	End Loc.Y	Amplitude	Peak Speed	Peak Speed At	Average Speed	Peak Accel.	Peak Decel.	Average Accel.

Table Header for Blinks:
Event Type	Trial	Number	Start	End	Duration

Table Header for User Events:
Event Type	Trial	Number	Start	Description

UserEvent	1	1	11846864874	# Message: sisley-still-life-heron-with-spread-wings-1867.jpg
Fixation L	1	1	11846876167	11847373391	497224	913.28	703.95	11	26	-1	17.70	17.70
Fixation R	1	1	11846876167	11847373391	497224	913.28	703.95	11	26	-1	16.91	16.91
Saccade L	1	1	11847373391	11847393388	19997	911.47	703.75	782.61	833.15	1.24	184.68	1.00	62.01	4489.74	-4271.03	3204.34
Saccade R	1	1	11847373391	11847393388	19997	911.47	703.75	782.61	833.15	1.24	184.68	1.00	62.01	4489.74	-4271.03	3204.34
Fixation L	1	2	11847393388	11847572375	178987	737.98	857.68	55	34	-1	18.04	18.04
Fixation R	1	2	11847393388	11847572375	178987	737.98	857.68	55	34	-1	17.38	17.38
Saccade L	1	2	11847572375	11847592247	19872	728.20	863.27	627.97	875.11	0.61	102.09	1.00	30.77	2421.44	-2147.64	1632.20
Saccade R	1	2	11847572375	11847592247	19872	728.20	863.27	627.97	875.11	0.61	102.09	1.00	30.77	2421.44	-2147.64	1632.20
Fixation L	1	3	11847592247	11847970098	377851	622.34	911.89	27	52	-1	17.62	17.62
Fixation R	1	3	11847592247	11847970098	377851	622.34	911.89	27	52	-1	17.47	17.47
Saccade L	1	3	11847970098	11848009974	39876	613.27	921.69	397.09	920.65	2.06	127.03	0.50	51.69	2986.81	-2631.93	2369.92
Saccade R	1	3	11847970098	11848009974	39876	613.27	921.69	397.09	920.65	2.06	127.03	0.50	51.69	2986.81	-2631.93	2369.92
Fixation L	1	4	11848009974	11848248579	238605	404.82	897.66	13	54	-1	16.25	16.25
Fixation R	1	4	11848009974	11848248579	238605	404.82	897.66	13	54	-1	17.86	17.86
Saccade L	1	4	11848248579	11848288324	39745	410.55	893.16	666.13	883.20	2.43	197.69	1.00	61.06	4896.70	-4829.39	3337.63
Saccade R	1	4	11848248579	11848288324	39745	410.55	893.16	666.13	883.20	2.43	197.69	1.00	61.06	4896.70	-4829.39	3337.63
Fixation L	1	5	11848288324	11848487327	199003	689.46	892.74	34	14	-1	17.74	17.74
Fixation R	1	5	11848288324	11848487327	199003	689.46	892.74	34	14	-1	17.63	17.63
Saccade L	1	5	11848487327	11848527065	39738	700.69	888.88	986.03	712.62	3.29	227.01	0.50	82.73	5646.99	-5507.58	4730.40
Saccade R	1	5	11848487327	11848527065	39738	700.69	888.88	986.03	712.62	3.29	227.01	0.50	82.73	5646.99	-5507.58	4730.40
Fixation L	1	6	11848527065	11848686177	159112	1000.33	710.05	43	29	-1	17.14	17.14
Fixation R	1	6	11848527065	11848686177	159112	1000.33	710.05	43	29	-1	13.99	13.99
Saccade L	1	6	11848686177	11848706065	19888	998.00	717.97	957.52	824.91	0.87	115.66	1.00	43.99	2003.78	-2366.60	1603.34
Saccade R	1	6	11848686177	11848706065	19888	998.00	717.97	957.52	824.91	0.87	115.66	1.00	43.99	2003.78	-2366.60	1603.34
Fixation L	1	7	11848706065	11848944790	238725	941.06	856.30	28	55	-1	17.58	17.58
Fixation R	1	7	11848706065	11848944790	238725	941.06	856.30	28	55	-1	15.65	15.65
Saccade L	1	7	11848944790	11848964665	19875	929.02	880.74	933.32	932.39	0.46	52.43	1.00	22.98	752.74	-617.28	500.05
Saccade R	1	7	11848944790	11848964665	19875	929.02	880.74	933.32	932.39	0.46	52.43	1.00	22.98	752.74	-617.28	500.05
Fixation L	1	8	11848964665	11849083900	119235	926.50	914.07	11	40	-1	17.57	17.57
Fixation R	1	8	11848964665	11849083900	119235	926.50	914.07	11	40	-1	16.03	16.03
Saccade L	1	8	11849083900	11849223136	139236	923.30	893.99	1410.89	400.08	13.83	300.76	0.29	99.34	7454.53	-5172.02	2689.40
Blink R	1	1	11849083900	11849223136	139236
Fixation L	1	9	11849223136	11849342520	119384	1377.54	428.45	50	42	-1	14.78	14.78
Fixation R	1	9	11849223136	11849342520	119384	1377.54	428.45	50	42	-1	18.19	18.19
Saccade L	1	9	11849342520	11849402263	59743	1366.53	442.02	825.54	315.25	6.40	256.74	0.67	107.17	5865.11	-5462.69	3629.11
Saccade R	1	8	11849342520	11849402263	59743	1366.53	442.02	825.54	315.25	6.40	256.74	0.67	107.17	5865.11	-5462.69	3629.11
Fixation L	1	10	11849402263	11849621026	218763	782.24	294.13	58	32	-1	16.96	16.96
Fixation R	1	10	11849402263	11849621026	218763	782.24	294.13	58	32	-1	17.94	17.94
Saccade L	1	10	11849621026	11849640867	19841	781.13	283.61	779.58	269.78	0.32	44.79	1.00	16.01	1071.74	271.02	542.86
Saccade R	1	9	11849621026	11849640867	19841	781.13	283.61	779.58	269.78	0.32	44.79	1.00	16.01	1071.74	271.02	542.86
Fixation L	1	11	11849640867	11849760235	119368	781.71	212.16	3	77	-1	16.87	16.87
Fixation R	1	11	11849640867	11849760235	119368	781.71	212.16	3	77	-1	18.17	18.17
Saccade L	1	11	11849760235	11849780119	19884	780.81	194.72	777.61	172.84	0.20	22.37	1.00	10.22	388.70	-505.84	343.45
Saccade R	1	10	11849760235	11849780119	19884	780.81	194.72	777.61	172.84	0.20	22.37	1.00	10.22	388.70	-505.84	343.45
Fixation L	1	12	11849780119	11850018716	238597	776.18	168.66	14	41	-1	16.96	16.96
Fixation R	1	12	11849780119	11850018716	238597	776.18	168.66	14	41	-1	18.33	18.33
Saccade L	1	12	11850018716	11850078469	59753	787.64	139.51	795.72	614.59	5.08	206.74	0.67	85.09	4864.79	-4947.28	3531.82
Saccade R	1	11	11850018716	11850078469	59753	787.64	139.51	795.72	614.59	5.08	206.74	0.67	85.09	4864.79	-4947.28	3531.82
Fixation L	1	13	11850078469	11850376840	298371	802.94	599.56	10	28	-1	18.70	18.70
Fixation R	1	13	11850078469	11850376840	298371	802.94	599.56	10	28	-1	19.64	19.64
Saccade L	1	13	11850376840	11850535953	159113	802.96	601.56	390.33	919.46	11.24	204.96	0.87	70.63	4796.42	-4213.72	2724.22
Saccade R	1	12	11850376840	11850535953	159113	802.96	601.56	390.33	919.46	11.24	204.96	0.87	70.63	4796.42	-4213.72	2724.22
Fixation L	1	14	11850535953	11850695057	159104	389.39	941.67	10	44	-1	15.43	15.43
Fixation R	1	14	11850535953	11850695057	159104	389.39	941.67	10	44	-1	18.76	18.76
Saccade L	1	14	11850695057	11850754686	59629	389.36	934.53	396.08	858.77	3.81	122.79	0.67	63.94	2779.24	-2200.30	1885.90
Saccade R	1	13	11850695057	11850754686	59629	389.36	934.53	396.08	858.77	3.81	122.79	0.67	63.94	2779.24	-2200.30	1885.90
Fixation L	1	15	11850754686	11850854178	99492	398.01	872.61	6	73	-1	14.61	14.61
Fixation R	1	15	11850754686	11850854178	99492	398.01	872.61	6	73	-1	18.50	18.50
