[BeGaze]
Converted from:	C:\Documents and Settings\iViewX\Desktop\EXPERIMENTATIONS\Experiments\results\finaleart\S21F22332-finaleart-1.idf
Date:	27.03.2019 15:55:43
Version:	BeGaze 2.5.77
Sample Rate:	50
Subject:	S21F22332
Description:	Cyrielle Mailart

Table Header for Fixations:
Event Type	Trial	Number	Start	End	Duration	Location X	Location Y	Dispersion X	Dispersion Y	Plane	Avg. Pupil Size X	Avg. Pupil Size Y

Table Header for Saccades:
Event Type	Trial	Number	Start	End	Duration	Start Loc.X	Start Loc.Y	End Loc.X	End Loc.Y	Amplitude	Peak Speed	Peak Speed At	Average Speed	Peak Accel.	Peak Decel.	Average Accel.

Table Header for Blinks:
Event Type	Trial	Number	Start	End	Duration

Table Header for User Events:
Event Type	Trial	Number	Start	Description

UserEvent	1	1	2780350129	# Message: Landscape_at_L-Estaque_Braque-1906.jpg
Fixation L	1	1	2780357390	2780914354	556964	936.12	467.10	7	26	-1	13.56	13.56
Fixation R	1	1	2780357390	2780914354	556964	936.12	467.10	7	26	-1	12.42	12.42
Saccade L	1	1	2780914354	2780954104	39750	934.32	470.29	1110.60	622.95	2.02	133.66	0.50	50.78	3271.62	-3218.01	2949.03
Saccade R	1	1	2780914354	2780954104	39750	934.32	470.29	1110.60	622.95	2.02	133.66	0.50	50.78	3271.62	-3218.01	2949.03
Fixation L	1	2	2780954104	2781113213	159109	1108.60	628.23	13	11	-1	11.51	11.51
Fixation R	1	2	2780954104	2781113213	159109	1108.60	628.23	13	11	-1	10.62	10.62
Saccade L	1	2	2781113213	2781133093	19880	1098.91	626.49	989.61	537.09	0.93	142.82	1.00	46.79	3501.55	-3379.29	2504.62
Saccade R	1	2	2781113213	2781133093	19880	1098.91	626.49	989.61	537.09	0.93	142.82	1.00	46.79	3501.55	-3379.29	2504.62
Fixation L	1	3	2781133093	2781292204	159111	970.65	514.56	68	27	-1	11.01	11.01
Fixation R	1	3	2781133093	2781292204	159111	970.65	514.56	68	27	-1	10.31	10.31
Saccade L	1	3	2781292204	2781312075	19871	1024.19	515.77	1312.78	527.64	2.00	291.94	1.00	100.42	7274.68	-6807.33	4924.14
Saccade R	1	3	2781292204	2781312075	19871	1024.19	515.77	1312.78	527.64	2.00	291.94	1.00	100.42	7274.68	-6807.33	4924.14
Fixation L	1	4	2781312075	2781630327	318252	1366.63	540.77	61	32	-1	11.21	11.21
Fixation R	1	4	2781312075	2781630327	318252	1366.63	540.77	61	32	-1	10.24	10.24
Saccade L	1	4	2781630327	2781650319	19992	1373.81	541.45	1372.59	513.98	0.36	27.82	1.00	17.86	89.00	-383.67	235.84
Saccade R	1	4	2781630327	2781650319	19992	1373.81	541.45	1372.59	513.98	0.36	27.82	1.00	17.86	89.00	-383.67	235.84
Fixation L	1	5	2781650319	2781829302	178983	1366.48	523.04	14	17	-1	11.67	11.67
Fixation R	1	5	2781650319	2781829302	178983	1366.48	523.04	14	17	-1	10.41	10.41
Saccade L	1	5	2781829302	2781849176	19874	1358.24	521.19	1270.30	528.78	0.58	89.28	1.00	28.99	2028.43	-2111.00	1402.76
Saccade R	1	5	2781829302	2781849176	19874	1358.24	521.19	1270.30	528.78	0.58	89.28	1.00	28.99	2028.43	-2111.00	1402.76
Fixation L	1	6	2781849176	2782087800	238624	1261.64	549.22	12	32	-1	11.79	11.79
Fixation R	1	6	2781849176	2782087800	238624	1261.64	549.22	12	32	-1	10.58	10.58
Saccade L	1	6	2782087800	2782107666	19866	1258.36	561.27	1332.93	557.08	0.43	75.55	1.00	21.47	1864.23	-1834.18	1298.20
Saccade R	1	6	2782087800	2782107666	19866	1258.36	561.27	1332.93	557.08	0.43	75.55	1.00	21.47	1864.23	-1834.18	1298.20
Fixation L	1	7	2782107666	2782286776	179110	1323.49	552.62	16	12	-1	12.01	12.01
Fixation R	1	7	2782107666	2782286776	179110	1323.49	552.62	16	12	-1	10.79	10.79
Saccade L	1	7	2782286776	2782326526	39750	1321.69	546.48	1169.09	234.14	3.10	242.85	0.50	77.94	6015.10	-5389.12	4228.32
Saccade R	1	7	2782286776	2782326526	39750	1321.69	546.48	1169.09	234.14	3.10	242.85	0.50	77.94	6015.10	-5389.12	4228.32
Fixation L	1	8	2782326526	2782565145	238619	1136.44	222.49	44	17	-1	11.75	11.75
Fixation R	1	8	2782326526	2782565145	238619	1136.44	222.49	44	17	-1	10.80	10.80
Saccade L	1	8	2782565145	2782605014	39869	1124.36	228.02	824.03	226.96	2.59	231.34	0.50	64.85	5719.75	-5533.32	3659.21
Saccade R	1	8	2782565145	2782605014	39869	1124.36	228.02	824.03	226.96	2.59	231.34	0.50	64.85	5719.75	-5533.32	3659.21
Fixation L	1	9	2782605014	2782823752	218738	810.02	227.30	21	20	-1	11.87	11.87
Fixation R	1	9	2782605014	2782823752	218738	810.02	227.30	21	20	-1	10.99	10.99
Saccade L	1	9	2782823752	2782863502	39750	802.28	229.86	506.18	360.97	3.35	283.60	0.50	84.39	6973.48	-6601.33	4677.27
Saccade R	1	9	2782823752	2782863502	39750	802.28	229.86	506.18	360.97	3.35	283.60	0.50	84.39	6973.48	-6601.33	4677.27
Fixation L	1	10	2782863502	2783122115	258613	499.77	370.04	10	18	-1	12.00	12.00
Fixation R	1	10	2782863502	2783122115	258613	499.77	370.04	10	18	-1	11.56	11.56
Saccade L	1	10	2783122115	2783181734	59619	499.05	367.79	475.23	1047.00	6.99	378.47	0.33	117.24	9344.00	-6874.26	5673.68
Saccade R	1	10	2783122115	2783181734	59619	499.05	367.79	475.23	1047.00	6.99	378.47	0.33	117.24	9344.00	-6874.26	5673.68
Fixation L	1	11	2783181734	2783778457	596723	464.83	1029.55	64	27	-1	11.93	11.93
Fixation R	1	11	2783181734	2783778457	596723	464.83	1029.55	64	27	-1	11.53	11.53
Saccade L	1	11	2783778457	2783818205	39748	500.16	1038.41	499.75	649.27	3.62	356.87	1.00	91.17	8820.57	-8262.35	4600.01
Saccade R	1	11	2783778457	2783818205	39748	500.16	1038.41	499.75	649.27	3.62	356.87	1.00	91.17	8820.57	-8262.35	4600.01
Fixation L	1	12	2783818205	2784017187	198982	512.76	613.18	20	53	-1	11.62	11.62
Fixation R	1	12	2783818205	2784017187	198982	512.76	613.18	20	53	-1	11.41	11.41
Saccade L	1	12	2784017187	2784056939	39752	520.04	611.72	740.91	344.14	2.93	308.74	1.00	73.76	7698.90	-7379.51	4248.99
Saccade R	1	12	2784017187	2784056939	39752	520.04	611.72	740.91	344.14	2.93	308.74	1.00	73.76	7698.90	-7379.51	4248.99
Fixation L	1	13	2784056939	2784196186	139247	768.04	353.19	41	24	-1	11.67	11.67
Fixation R	1	13	2784056939	2784196186	139247	768.04	353.19	41	24	-1	11.36	11.36
Saccade L	1	13	2784196186	2784235934	39748	782.60	351.39	846.84	232.77	1.27	70.18	1.00	32.05	1711.42	-1657.73	1532.55
Saccade R	1	13	2784196186	2784235934	39748	782.60	351.39	846.84	232.77	1.27	70.18	1.00	32.05	1711.42	-1657.73	1532.55
Fixation L	1	14	2784235934	2784335421	99487	856.33	227.26	17	24	-1	11.79	11.79
Fixation R	1	14	2784235934	2784335421	99487	856.33	227.26	17	24	-1	11.10	11.10
