[BeGaze]
Converted from:	C:\Documents and Settings\iViewX\Desktop\EXPERIMENTATIONS\Experiments\results\finaleart\S4120113-finaleart-1.idf
Date:	27.03.2019 15:34:24
Version:	BeGaze 2.5.77
Sample Rate:	50
Subject:	S4120113
Description:	Vidal Attias

Table Header for Fixations:
Event Type	Trial	Number	Start	End	Duration	Location X	Location Y	Dispersion X	Dispersion Y	Plane	Avg. Pupil Size X	Avg. Pupil Size Y

Table Header for Saccades:
Event Type	Trial	Number	Start	End	Duration	Start Loc.X	Start Loc.Y	End Loc.X	End Loc.Y	Amplitude	Peak Speed	Peak Speed At	Average Speed	Peak Accel.	Peak Decel.	Average Accel.

Table Header for Blinks:
Event Type	Trial	Number	Start	End	Duration

Table Header for User Events:
Event Type	Trial	Number	Start	Description

UserEvent	1	1	6581026446	# Message: the_forest_Cross_1907.jpg
Fixation L	1	1	6581033622	6581471234	437612	978.38	504.99	21	70	-1	11.65	11.65
Fixation R	1	1	6581033622	6581471234	437612	978.38	504.99	21	70	-1	11.48	11.48
Saccade L	1	1	6581471234	6581550847	79613	983.19	481.11	990.72	637.06	2.61	89.53	0.25	32.74	1951.38	-1917.06	1130.29
Saccade R	1	1	6581471234	6581550847	79613	983.19	481.11	990.72	637.06	2.61	89.53	0.25	32.74	1951.38	-1917.06	1130.29
Fixation L	1	2	6581550847	6581729822	178975	1004.14	661.13	37	44	-1	9.99	9.99
Fixation R	1	2	6581550847	6581729822	178975	1004.14	661.13	37	44	-1	9.90	9.90
Saccade L	1	2	6581729822	6581749699	19877	1004.87	664.33	967.03	658.24	0.45	38.77	1.00	22.42	403.34	-672.63	416.05
Saccade R	1	2	6581729822	6581749699	19877	1004.87	664.33	967.03	658.24	0.45	38.77	1.00	22.42	403.34	-672.63	416.05
Fixation L	1	3	6581749699	6582087800	338101	946.84	653.99	28	22	-1	9.30	9.30
Fixation R	1	3	6581749699	6582087800	338101	946.84	653.99	28	22	-1	9.08	9.08
Saccade L	1	3	6582087800	6582107673	19873	938.84	667.26	906.06	778.59	0.69	117.39	1.00	34.66	2866.12	-2336.35	1761.77
Saccade R	1	3	6582087800	6582107673	19873	938.84	667.26	906.06	778.59	0.69	117.39	1.00	34.66	2866.12	-2336.35	1761.77
Fixation L	1	4	6582107673	6582306538	198865	899.96	770.11	45	37	-1	9.65	9.65
Fixation R	1	4	6582107673	6582306538	198865	899.96	770.11	45	37	-1	10.12	10.12
Saccade L	1	4	6582306538	6582326408	19870	880.62	769.68	870.91	731.35	0.62	53.93	1.00	31.21	1214.63	-125.69	566.90
Saccade R	1	4	6582306538	6582326408	19870	880.62	769.68	870.91	731.35	0.62	53.93	1.00	31.21	1214.63	-125.69	566.90
Fixation L	1	5	6582326408	6582704395	377987	862.94	748.30	29	65	-1	9.75	9.75
Fixation R	1	5	6582326408	6582704395	377987	862.94	748.30	29	65	-1	10.20	10.20
Saccade L	1	5	6582704395	6582724271	19876	856.46	745.96	810.20	785.34	0.45	61.46	1.00	22.85	1411.50	-969.00	980.37
Saccade R	1	5	6582704395	6582724271	19876	856.46	745.96	810.20	785.34	0.45	61.46	1.00	22.85	1411.50	-969.00	980.37
Fixation L	1	6	6582724271	6582863509	139238	805.81	754.27	45	49	-1	9.37	9.37
Fixation R	1	6	6582724271	6582863509	139238	805.81	754.27	45	49	-1	10.64	10.64
Saccade L	1	6	6582863509	6583122109	258600	798.41	740.15	694.62	711.72	14.05	134.10	0.69	54.35	1678.52	-2888.75	1039.62
Saccade R	1	6	6582863509	6583122109	258600	798.41	740.15	694.62	711.72	14.05	134.10	0.69	54.35	1678.52	-2888.75	1039.62
Fixation L	1	7	6583122109	6583221488	99379	698.26	712.10	8	77	-1	8.98	8.98
Fixation R	1	7	6583122109	6583221488	99379	698.26	712.10	8	77	-1	10.86	10.86
Saccade L	1	7	6583221488	6583400483	178995	698.61	732.26	1161.30	728.93	11.77	296.43	0.89	65.78	6450.82	-6936.19	2164.82
Saccade R	1	7	6583221488	6583400483	178995	698.61	732.26	1161.30	728.93	11.77	296.43	0.89	65.78	6450.82	-6936.19	2164.82
Fixation L	1	8	6583400483	6583758579	358096	1143.89	764.79	36	62	-1	10.74	10.74
Fixation R	1	8	6583400483	6583758579	358096	1143.89	764.79	36	62	-1	10.85	10.85
Saccade L	1	8	6583758579	6583778450	19871	1154.89	783.22	1164.48	766.97	0.28	19.08	1.00	14.20	219.18	-245.85	216.89
Saccade R	1	8	6583758579	6583778450	19871	1154.89	783.22	1164.48	766.97	0.28	19.08	1.00	14.20	219.18	-245.85	216.89
Fixation L	1	9	6583778450	6584534278	755828	1182.30	795.89	34	63	-1	11.34	11.34
Fixation R	1	9	6583778450	6584534278	755828	1182.30	795.89	34	63	-1	11.15	11.15
Saccade L	1	9	6584534278	6584554157	19879	1196.32	801.25	1206.80	788.61	0.50	58.49	1.00	25.17	949.78	147.20	462.01
Saccade R	1	9	6584534278	6584554157	19879	1196.32	801.25	1206.80	788.61	0.50	58.49	1.00	25.17	949.78	147.20	462.01
Fixation L	1	10	6584554157	6584832632	278475	1234.42	773.09	46	50	-1	11.57	11.57
Fixation R	1	10	6584554157	6584832632	278475	1234.42	773.09	46	50	-1	11.20	11.20
Saccade L	1	10	6584832632	6584852507	19875	1242.12	780.51	1248.15	707.57	0.76	74.04	1.00	38.38	1605.97	-1702.87	1514.56
Saccade R	1	10	6584832632	6584852507	19875	1242.12	780.51	1248.15	707.57	0.76	74.04	1.00	38.38	1605.97	-1702.87	1514.56
Fixation L	1	11	6584852507	6584991753	139246	1249.32	751.26	4	68	-1	11.04	11.04
Fixation R	1	11	6584852507	6584991753	139246	1249.32	751.26	4	68	-1	10.95	10.95
Saccade L	1	11	6584991753	6585011619	19866	1247.63	775.67	1362.65	699.71	1.36	139.42	1.00	68.32	3087.55	0.00	1543.77
Saccade R	1	11	6584991753	6585011619	19866	1247.63	775.67	1362.65	699.71	1.36	139.42	1.00	68.32	3087.55	0.00	1543.77
