finaleart	S5121332	00:00:00:000	Calibration	
finaleart	S5121332	00:01:50:781	The deviations of the calibration are DevX = 0,47 DevY = 0,465
finaleart	S5121332	00:01:51:031	Image	REJECTED_landscape_cross_0.jpg
finaleart	S5121332	00:01:55:140	Image	void.png
finaleart	S5121332	00:01:57:218	Image	REJECTED_cezanne-still-life-with-bread-and-eggs-1865.jpg
finaleart	S5121332	00:02:01:281	Image	void.png
finaleart	S5121332	00:02:03:343	Calibration	
finaleart	S5121332	00:02:53:437	The deviations of the calibration are DevX = 0,505 DevY = 0,55
finaleart	S5121332	00:02:53:671	Image	REJECTED_after-the-bath_degas_1885.jpg
finaleart	S5121332	00:02:57:718	Image	void.png
finaleart	S5121332	00:02:59:843	Image	The_Two_Models_Dufy_1930.jpg
finaleart	S5121332	00:03:03:890	Image	void.png
finaleart	S5121332	00:03:05:968	Image	madrazo-y-kuntz-Man-Holding-a-Dagger-1850.jpg
finaleart	S5121332	00:03:10:015	Image	void.png
finaleart	S5121332	00:03:12:093	Image	lying-nude_ury_1889.JPG
finaleart	S5121332	00:03:16:187	Image	void.png
finaleart	S5121332	00:03:18:281	Image	storm_off_normandy_cost_isabey_1850.jpg
finaleart	S5121332	00:03:22:437	Image	void.png
finaleart	S5121332	00:03:24:531	Image	manet-the-salmon-1868.jpg
finaleart	S5121332	00:03:28:593	Image	void.png
finaleart	S5121332	00:03:30:656	Image	courbet-the-sleepers-1866.jpg
finaleart	S5121332	00:03:34:718	Image	void.png
finaleart	S5121332	00:03:36:781	Image	Girtin-Kirkstall-Abbey-Yorkshire-1801.jpg
finaleart	S5121332	00:03:40:859	Image	void.png
finaleart	S5121332	00:03:42:921	Image	landschaft_mit_dem_ondregenbogen_caspar_david_friedrich_1810.jpg
finaleart	S5121332	00:03:47:031	Image	void.png
finaleart	S5121332	00:03:49:078	Image	Nature_Morte_Aux_Raisins_Sur_Un_Plat_Derain_1944.jpg
finaleart	S5121332	00:03:53:125	Image	void.png
finaleart	S5121332	00:03:55:187	Image	flowers-and-fruit-a-melon_fantin-latour_1865.jpg
finaleart	S5121332	00:03:59:250	Image	void.png
finaleart	S5121332	00:04:01:328	Image	still-life-post-bottle-cup-and-fruit_cezanne_1871.jpg
finaleart	S5121332	00:04:05:375	Image	void.png
finaleart	S5121332	00:04:07:453	Image	after_a_rain_country_road_Vasilyev_1869.jpg
finaleart	S5121332	00:04:11:515	Image	void.png
finaleart	S5121332	00:04:13:562	Image	Hayet-Nature-morte-1888.jpg
finaleart	S5121332	00:04:17:640	Image	void.png
finaleart	S5121332	00:04:19:734	Image	wright-vesuvius-from-posillipo-1774.jpg
finaleart	S5121332	00:04:23:765	Image	void.png
finaleart	S5121332	00:04:25:828	Image	parrot-tulips-(II)_matisse_1905.jpg
finaleart	S5121332	00:04:29:906	Image	void.png
finaleart	S5121332	00:04:32:046	Image	Georges-braque-still-life-with-jugs-and-pipe-1906.png
finaleart	S5121332	00:04:36:156	Image	void.png
finaleart	S5121332	00:04:38:250	Image	still-life_pissarro_1867.Jpg
finaleart	S5121332	00:04:42:296	Image	void.png
finaleart	S5121332	00:04:44:359	Image	goya-Nature-morte-avec-Bouteilles-et-Pains-1826.jpg
finaleart	S5121332	00:04:48:406	Image	void.png
finaleart	S5121332	00:04:50:468	Image	L-Heure_Embrasee_Rysselberghe_1897.jpg
finaleart	S5121332	00:04:54:578	Image	void.png
finaleart	S5121332	00:04:56:640	Image	chase-a-study-in-curves-1890.jpg
finaleart	S5121332	00:05:00:703	Image	void.png
finaleart	S5121332	00:05:02:750	Image	nasturtiums-dahlias-in-a-basket_gauguin_1884.jpg
finaleart	S5121332	00:05:06:890	Image	void.png
finaleart	S5121332	00:05:08:984	Image	stilleven-met-vis_dubois-pillet_1885.jpg
finaleart	S5121332	00:05:13:031	Image	void.png
finaleart	S5121332	00:05:15:109	Image	metzinger-nature-morte-1905.png
finaleart	S5121332	00:05:19:156	Image	void.png
finaleart	S5121332	00:05:21:218	Image	Automne_En_France_Carr_1911.jpg
finaleart	S5121332	00:05:25:265	Image	void.png
finaleart	S5121332	00:05:27:343	Image	naked-woman-lying-on-a-couch_caillebotte_1873.jpg
finaleart	S5121332	00:05:31:453	Image	void.png
finaleart	S5121332	00:05:33:578	Calibration	
finaleart	S5121332	00:07:24:421	The deviations of the calibration are DevX = 0,4325 DevY = 1,07
finaleart	S5121332	00:07:24:640	Image	REJECTED_rose_in_a_bowl_fantin_latour_1883.jpg
finaleart	S5121332	00:07:28:687	Image	void.png
finaleart	S5121332	00:07:30:750	Image	lair_of_the_sea_serpent_vedder_1899.jpg
finaleart	S5121332	00:07:34:796	Image	void.png
finaleart	S5121332	00:07:36:890	Image	goya-Bodegones-con-pargos-dorados-1812.jpg
finaleart	S5121332	00:07:40:937	Image	void.png
finaleart	S5121332	00:07:43:000	Image	Le_port_d-Anvers_Braque_1906.jpg
finaleart	S5121332	00:07:47:156	Image	void.png
finaleart	S5121332	00:07:49:250	Image	Naked_man_reversed_on_the_ground_Gericault_1817.jpg
finaleart	S5121332	00:07:53:296	Image	void.png
finaleart	S5121332	00:07:55:437	Image	Delacroix-odalisque-1825.jpg
finaleart	S5121332	00:07:59:531	Image	void.png
finaleart	S5121332	00:08:01:625	Image	The_Augustan_Bridge_at_Narni_Corot_1826.jpg
finaleart	S5121332	00:08:05:687	Image	void.png
finaleart	S5121332	00:08:07:750	Image	millet-the-bather-1848.jpg
finaleart	S5121332	00:08:11:796	Image	void.png
finaleart	S5121332	00:08:13:875	Image	red-mullets_monet_1869.jpg
finaleart	S5121332	00:08:17:906	Image	void.png
finaleart	S5121332	00:08:19:953	Image	Matejko-Akt-meski.jpg
finaleart	S5121332	00:08:24:015	Image	void.png
finaleart	S5121332	00:08:26:078	Image	Les_Bords_De_Seine_A_Neuilly_Dubois_Pillet_1886.jpg
finaleart	S5121332	00:08:30:140	Image	void.png
finaleart	S5121332	00:08:32:234	Image	morning_in_a_pine_forest_Ivan_Shishkin_1889.jpg
finaleart	S5121332	00:08:36:312	Image	void.png
finaleart	S5121332	00:08:38:359	Image	Odalisque_Matisse.jpg
finaleart	S5121332	00:08:42:484	Image	void.png
finaleart	S5121332	00:08:44:546	Image	reclining-nude_bazille_1860.png
finaleart	S5121332	00:08:48:593	Image	void.png
finaleart	S5121332	00:08:50:734	Image	the-reclining-shepherdess_morisot_1891.jpg
finaleart	S5121332	00:08:54:781	Image	void.png
finaleart	S5121332	00:08:56:906	Image	Turner-snow-storm-boat-off-a-harbours-mouth-1842.jpg
finaleart	S5121332	00:09:00:953	Image	void.png
finaleart	S5121332	00:09:03:015	Image	dead_hare_ward.jpg
finaleart	S5121332	00:09:07:046	Image	void.png
finaleart	S5121332	00:09:09:140	Image	garlic-cloves-and-knife-on-the-corner-of-a-table_caillebotte_1871.jpg
finaleart	S5121332	00:09:13:203	Image	void.png
finaleart	S5121332	00:09:15:250	Image	still-life-with-a-puro-(II)_matisse_1904.jpg
finaleart	S5121332	00:09:19:375	Image	void.png
finaleart	S5121332	00:09:21:437	Image	the-large-bathers_renoir_1887.jpg
finaleart	S5121332	00:09:25:484	Image	void.png
finaleart	S5121332	00:09:27:562	Image	turner-waves-breaking-against-the-wind-1830.jpg
finaleart	S5121332	00:09:31:640	Image	void.png
finaleart	S5121332	00:09:33:671	Image	the-banks-of-the-marne-at-dawn_dubois-pillet_1888.jpg
finaleart	S5121332	00:09:37:734	Image	void.png
finaleart	S5121332	00:09:39:781	Image	A_Highland_Landscape_Landseer_1830.jpg
finaleart	S5121332	00:09:43:906	Image	void.png
finaleart	S5121332	00:09:45:953	Image	the-pointe-de-per-kiridec-at-roscoff_Rysselberghe_0.jpg
finaleart	S5121332	00:09:49:984	Image	void.png
finaleart	S5121332	00:09:52:062	Image	mother_and_child_by_the_sea_dahl_1830.jpg
finaleart	S5121332	00:09:56:187	Image	void.png
finaleart	S5121332	00:09:58:250	Image	courbet-the-bathers-1858.jpg
finaleart	S5121332	00:10:02:296	Image	void.png
finaleart	S5121332	00:10:04:421	Calibration	
finaleart	S5121332	00:11:45:984	The deviations of the calibration are DevX = 0,49 DevY = 0,5325
finaleart	S5121332	00:11:46:218	Image	REJECTED_olympia_manet_1863.jpg
finaleart	S5121332	00:11:50:265	Image	void.png
finaleart	S5121332	00:11:52:375	Image	sargent-male-model-resting.jpg
finaleart	S5121332	00:11:56:468	Image	void.png
finaleart	S5121332	00:11:58:515	Image	La_Ferme_des_Collettes_Renoir_1908.jpg
finaleart	S5121332	00:12:02:578	Image	void.png
finaleart	S5121332	00:12:04:625	Image	delacroix-still-life-with-lobsters-1827.jpg
finaleart	S5121332	00:12:08:671	Image	void.png
finaleart	S5121332	00:12:10:765	Image	oysters_manet_1862.jpg
finaleart	S5121332	00:12:14:828	Image	void.png
finaleart	S5121332	00:12:16:890	Image	marquet-fruit-knife-and-napkin-1898.jpg
finaleart	S5121332	00:12:20:921	Image	void.png
finaleart	S5121332	00:12:22:984	Image	still-life-with-fish_bazille_1866.jpg
finaleart	S5121332	00:12:27:015	Image	void.png
finaleart	S5121332	00:12:29:109	Image	still-life-with-pumpkin-plums-cherries-figs-and-jug-Ribot-1860.jpg
finaleart	S5121332	00:12:33:203	Image	void.png
finaleart	S5121332	00:12:35:265	Image	Paysage_a_La_Ciotat_(La_Pointe_du-Capucin)_friesz_1907.jpg
finaleart	S5121332	00:12:39:312	Image	void.png
finaleart	S5121332	00:12:41:453	Image	Kiprensky-two-sitters-1800.jpg
finaleart	S5121332	00:12:45:593	Image	void.png
finaleart	S5121332	00:12:47:640	Image	The_Girl_From_Rat_Mort_Vlaminck_1905.jpg
finaleart	S5121332	00:12:51:687	Image	void.png
finaleart	S5121332	00:12:53:765	Image	Kiprensky-standing-sitter-with-a-stick-sitter-on-a-rock-1801.jpg
finaleart	S5121332	00:12:57:859	Image	void.png
finaleart	S5121332	00:12:59:968	Image	renoir-still-life-with-peaches-and-grapes-1881.jpg
finaleart	S5121332	00:13:04:031	Image	void.png
finaleart	S5121332	00:13:06:078	Image	basket-of-fruits-Manet-1864.jpg
finaleart	S5121332	00:13:10:140	Image	void.png
finaleart	S5121332	00:13:12:281	Image	Upper_Mississippi_Kensett_1855.jpg
finaleart	S5121332	00:13:16:328	Image	void.png
finaleart	S5121332	00:13:18:390	Image	Le-Restaurant-de-la-machine-a-Bougival-vlaminck-1905.jpg
finaleart	S5121332	00:13:22:468	Image	void.png
finaleart	S5121332	00:13:24:546	Image	Nature_morte_a_la_cafetiere_rouge_Vlaminck.png
finaleart	S5121332	00:13:28:609	Image	void.png
finaleart	S5121332	00:13:30:718	Image	Rochers_Sur_La_Cote_A_Agay_Guillaumin_1907.jpg
finaleart	S5121332	00:13:34:859	Image	void.png
finaleart	S5121332	00:13:36:984	Image	goya-Bodegón-con-salmón-1812.jpg
finaleart	S5121332	00:13:41:031	Image	void.png
finaleart	S5121332	00:13:43:109	Image	Trouville_Black_Rocks_Boudin_1863.jpg
finaleart	S5121332	00:13:47:140	Image	void.png
finaleart	S5121332	00:13:49:281	Image	Young_Girls_Playing_With_A_Lion_Club_Valtat_1905.jpg
finaleart	S5121332	00:13:53:375	Image	void.png
finaleart	S5121332	00:13:55:453	Image	the_forest_Cross_1907.jpg
finaleart	S5121332	00:13:59:640	Image	void.png
finaleart	S5121332	00:14:01:703	Image	nature_morte_aux_oranges_Vlaminck_1909.jpg
finaleart	S5121332	00:14:05:765	Image	void.png
finaleart	S5121332	00:14:07:828	Image	still-life-with-skate_Boudin_1861.jpg
finaleart	S5121332	00:14:11:937	Image	void.png
finaleart	S5121332	00:14:13:984	Image	avenue_of_trees_in_a_small_town_sisley_1866.jpg
finaleart	S5121332	00:14:18:031	Image	void.png
finaleart	S5121332	00:14:20:109	Image	Pots_Et_Fruits_Matisse_1901.jpg
finaleart	S5121332	00:14:24:203	Image	void.png
finaleart	S5121332	00:14:26:312	Calibration	
finaleart	S5121332	00:16:29:390	The deviations of the calibration are DevX = 0,52 DevY = 0,825
finaleart	S5121332	00:16:29:609	Image	REJECTED_rose_in_a_bowl_fantin_latour_1883.jpg
finaleart	S5121332	00:16:33:718	Image	void.png
finaleart	S5121332	00:16:35:750	Image	bowl_of_fruits_Fantin-Latour_1857.jpg
finaleart	S5121332	00:16:39:796	Image	void.png
finaleart	S5121332	00:16:41:875	Image	resting-bacchante_sorolla_1887.jpg
finaleart	S5121332	00:16:45:921	Image	void.png
finaleart	S5121332	00:16:47:968	Image	Turner-chichester-canal-1828.jpg
finaleart	S5121332	00:16:52:031	Image	void.png
finaleart	S5121332	00:16:54:078	Image	cows_at_a_pond_Bilders_1856.jpg
finaleart	S5121332	00:16:58:156	Image	void.png
finaleart	S5121332	00:17:00:234	Image	Nature_Morte_Au_Citron_Matisse_1917.jpg
finaleart	S5121332	00:17:04:281	Image	void.png
finaleart	S5121332	00:17:06:343	Image	The_Gardener_Vlaminck_1904.jpg
finaleart	S5121332	00:17:10:421	Image	void.png
finaleart	S5121332	00:17:12:484	Image	Nature-morte-Maurice-de-Vlaminck.jpg
finaleart	S5121332	00:17:16:515	Image	void.png
finaleart	S5121332	00:17:18:562	Image	The_Orchard_Vlaminck_1905.jpg
finaleart	S5121332	00:17:22:609	Image	void.png
finaleart	S5121332	00:17:24:671	Image	Bank_Of_A_Lake_Pechstein_1910.jpg
finaleart	S5121332	00:17:28:734	Image	void.png
finaleart	S5121332	00:17:30:781	Image	martin-vase-of-flowers-in-a-window.jpg
finaleart	S5121332	00:17:34:843	Image	void.png
finaleart	S5121332	00:17:36:937	Image	still-life_matisse_0.jpg
finaleart	S5121332	00:17:40:968	Image	void.png
finaleart	S5121332	00:17:43:031	Image	bacchante_sorolla_1886.Jpg
finaleart	S5121332	00:17:47:125	Image	void.png
finaleart	S5121332	00:17:49:187	Image	The_Lying_Nude_Matisse_1906.png
finaleart	S5121332	00:17:53:234	Image	void.png
finaleart	S5121332	00:17:55:281	Image	Alfalfa_St-Denis_Seurat_1886.jpg
finaleart	S5121332	00:17:59:375	Image	void.png
finaleart	S5121332	00:18:01:406	Image	cross-La-fuite-des-nymphes-1906.jpg
finaleart	S5121332	00:18:05:453	Image	void.png
finaleart	S5121332	00:18:07:578	Image	woman-at-her-toilette_degas_1877.jpg
finaleart	S5121332	00:18:11:734	Image	void.png
finaleart	S5121332	00:18:13:906	Image	still-life-with-bottle-of-wind_cross_1904.Jpg
finaleart	S5121332	00:18:17:968	Image	void.png
finaleart	S5121332	00:18:20:031	Image	Still-life-of-Sheep-s-Ribs-and-Head-The-Butchers-conter_Goya_1812.jpg
finaleart	S5121332	00:18:24:078	Image	void.png
finaleart	S5121332	00:18:26:140	Image	study_of_a_reclining_nude_Delacroix_1824.jpg
finaleart	S5121332	00:18:30:203	Image	void.png
finaleart	S5121332	00:18:32:265	Image	the_kiss_gericault_1816.jpg
finaleart	S5121332	00:18:36:437	Image	void.png
finaleart	S5121332	00:18:38:578	Image	Courbet-Femme-nue-couchee-1862.jpg
finaleart	S5121332	00:18:42:640	Image	void.png
finaleart	S5121332	00:18:44:703	Image	goya-Pavo-muerto-1812.jpg
finaleart	S5121332	00:18:48:765	Image	void.png
finaleart	S5121332	00:18:50:828	Image	delacroix-Reclining-Odalisque-or-Woman-with-a-Parakeet-1827.jpg
finaleart	S5121332	00:18:54:875	Image	void.png
finaleart	S5121332	00:18:56:937	Image	les_poseuses_seurat_1888.Jpg
finaleart	S5121332	00:19:00:984	Image	void.png
finaleart	S5121332	00:19:03:093	Image	monticelli-still-life-with-white-pitcher-1822.jpg
finaleart	S5121332	00:19:07:125	Image	void.png
finaleart	S5121332	00:19:09:250	Calibration	
finaleart	S5121332	00:21:20:484	The deviations of the calibration are DevX = 0,5375 DevY = 0,59
finaleart	S5121332	00:21:20:703	Image	REJECTED_Volga_Lagoon_Vassiliev_1870.jpg
finaleart	S5121332	00:21:24:750	Image	void.png
finaleart	S5121332	00:21:26:812	Image	Ma_Maison_Martin_XXXX.jpg
finaleart	S5121332	00:21:30:859	Image	void.png
finaleart	S5121332	00:21:32:968	Image	Le_Pin_A_St-Tropez_Signac_1909.jpg
finaleart	S5121332	00:21:37:015	Image	void.png
finaleart	S5121332	00:21:39:078	Image	kneeling-nude_degas_1888.jpg
finaleart	S5121332	00:21:43:140	Image	void.png
finaleart	S5121332	00:21:45:187	Image	the-wood_cross_907.jpg
finaleart	S5121332	00:21:49:218	Image	void.png
finaleart	S5121332	00:21:51:265	Image	still-life-fruits-on-a-table_manet_1864.jpg
finaleart	S5121332	00:21:55:312	Image	void.png
finaleart	S5121332	00:21:57:437	Image	luxe-calme-et-volupté_matisse_1905.jpg
finaleart	S5121332	00:22:01:468	Image	void.png
finaleart	S5121332	00:22:03:531	Image	Rysselberghe-Vase-of-flowers-1907.Jpg
finaleart	S5121332	00:22:07:578	Image	void.png
finaleart	S5121332	00:22:09:640	Image	bathers_cross_1902.jpg
finaleart	S5121332	00:22:13:703	Image	void.png
finaleart	S5121332	00:22:15:750	Image	plage-de-la-vignassa_cross_1892.jpg
finaleart	S5121332	00:22:19:781	Image	void.png
finaleart	S5121332	00:22:21:843	Image	Niagara_Falls_Hale_1902.jpg
finaleart	S5121332	00:22:25:906	Image	void.png
finaleart	S5121332	00:22:27:953	Image	The_Luxembourg_Gardens_Matisse_1901.jpg
finaleart	S5121332	00:22:32:015	Image	void.png
finaleart	S5121332	00:22:34:062	Image	Fleurs_et_fruits_camoin_1942.jpg
finaleart	S5121332	00:22:38:140	Image	void.png
finaleart	S5121332	00:22:40:218	Image	the_three_skulls_gericault_1814.jpg
finaleart	S5121332	00:22:44:265	Image	void.png
finaleart	S5121332	00:22:46:359	Image	the_rainbow__moore_henry_1865.jpg
finaleart	S5121332	00:22:50:390	Image	void.png
finaleart	S5121332	00:22:52:437	Image	La_Danse_Matisse_1909.jpg
finaleart	S5121332	00:22:56:484	Image	void.png
finaleart	S5121332	00:22:58:546	Image	plate-of-peaches-Fantin-Latour-1862.jpg
finaleart	S5121332	00:23:02:609	Image	void.png
finaleart	S5121332	00:23:04:687	Image	Poppy_Fields_near_Argenteuil_Monet_1875.jpg
finaleart	S5121332	00:23:08:781	Image	void.png
finaleart	S5121332	00:23:10:828	Image	sisley-still-life-heron-with-spread-wings-1867.jpg
finaleart	S5121332	00:23:14:875	Image	void.png
finaleart	S5121332	00:23:17:015	Image	huisje_aan_een_sloot_mauve_1888.jpg
finaleart	S5121332	00:23:21:046	Image	void.png
finaleart	S5121332	00:23:23:125	Image	sargent-reclining-nude.JPG
finaleart	S5121332	00:23:27:234	Image	void.png
finaleart	S5121332	00:23:29:265	Image	courbet-female-nude-with-a-dog-portrait-of-leotine-renaude-1866.jpg
finaleart	S5121332	00:23:33:328	Image	void.png
finaleart	S5121332	00:23:35:375	Image	morning_Daubigny_1858.jpg
finaleart	S5121332	00:23:39:421	Image	void.png
finaleart	S5121332	00:23:41:484	Image	Sailboats_On_The_River_Sheldt_van_Rysselberghe_1892.jpg
finaleart	S5121332	00:23:45:609	Image	void.png
finaleart	S5121332	00:23:47:671	Image	pears-and-grapes_gauguin_1875.jpg
finaleart	S5121332	00:23:51:734	Image	void.png
finaleart	S5121332	00:23:53:812	Image	Le_Chemin_De_Fer_Berlin_Potsdam_Menzel_1847.jpg
finaleart	S5121332	00:23:57:859	Image	void.png
finaleart	S5121332	00:23:59:906	Calibration	
finaleart	S5121332	00:26:13:171	The deviations of the calibration are DevX = 0,5725 DevY = 0,5125
finaleart	S5121332	00:26:13:437	Image	REJECTED_cezanne-still-life-with-green-pot-and-pewter-1870.jpg
finaleart	S5121332	00:26:17:500	Image	void.png
finaleart	S5121332	00:26:19:531	Image	reclining-nude_renoir_1883.jpg
finaleart	S5121332	00:26:23:609	Image	void.png
finaleart	S5121332	00:26:25:656	Image	Nature_morte_au_panier_Derain_1927.jpg
finaleart	S5121332	00:26:29:734	Image	void.png
finaleart	S5121332	00:26:31:796	Image	still-life-with-red-mullet-and-jug_gaugain_1876.jpg
finaleart	S5121332	00:26:35:843	Image	void.png
finaleart	S5121332	00:26:37:906	Image	courbet_Femme_nue_et_dormant_1858.jpg
finaleart	S5121332	00:26:41:968	Image	void.png
finaleart	S5121332	00:26:44:031	Image	Morning,_An_Overcast_Day_Rouen_Pissaro_1896.jpg
finaleart	S5121332	00:26:48:093	Image	void.png
finaleart	S5121332	00:26:50:140	Image	les-deux-amies_marevna_0.jpg
finaleart	S5121332	00:26:54:218	Image	void.png
finaleart	S5121332	00:26:56:281	Image	goya-still-life-plucked-turkey-and-pan-with-fish-1812.jpg
finaleart	S5121332	00:27:00:328	Image	void.png
finaleart	S5121332	00:27:02:406	Image	Rapids_on_the_Petite_Creuse_at_Fresselines_Monet_1889.jpg
finaleart	S5121332	00:27:06:453	Image	void.png
finaleart	S5121332	00:27:08:515	Image	chestnut_avenue_in_la_celle_saint_cloud_sisley_1865.jpg
finaleart	S5121332	00:27:12:687	Image	void.png
finaleart	S5121332	00:27:14:828	Image	the_model's_siesta_Rysselberghe_1920.jpg
finaleart	S5121332	00:27:18:859	Image	void.png
finaleart	S5121332	00:27:20:906	Image	courbet-woman-with-a-parrot-1866.jpg
finaleart	S5121332	00:27:25:031	Image	void.png
finaleart	S5121332	00:27:27:109	Image	the-tea-set_monet_1871.jpg
finaleart	S5121332	00:27:31:156	Image	void.png
finaleart	S5121332	00:27:33:218	Image	L'Ile_de_La_Grande_Jatte_Seurat_1884.jpg
finaleart	S5121332	00:27:37:265	Image	void.png
finaleart	S5121332	00:27:39:328	Image	female_nude_reclining_on-a_divan_delacroix_1826.jpg
finaleart	S5121332	00:27:43:437	Image	void.png
finaleart	S5121332	00:27:45:531	Image	Le_Puy_In_The_Snow_Dubois-Pillet_1889.jpg
finaleart	S5121332	00:27:49:562	Image	void.png
finaleart	S5121332	00:27:51:703	Image	Un_Jardin_Maison_Baptiste_Butler_1895.jpg
finaleart	S5121332	00:27:55:734	Image	void.png
finaleart	S5121332	00:27:57:843	Image	venice_from_porche_of_madonna_turner_1835.jpg
finaleart	S5121332	00:28:01:890	Image	void.png
finaleart	S5121332	00:28:04:046	Image	Houses_at_Chatou_Vlaminck_1905.jpg
finaleart	S5121332	00:28:08:093	Image	void.png
finaleart	S5121332	00:28:10:156	Image	Nu_Couche_Vlaminck_1905.jpg
finaleart	S5121332	00:28:14:312	Image	void.png
finaleart	S5121332	00:28:16:421	Image	The_Blue_Nude_Souvenir_of_Biskra_Matisse_1907.png
finaleart	S5121332	00:28:20:484	Image	void.png
finaleart	S5121332	00:28:22:531	Image	paysage_avec_du_betail_au_limousin_jules-dupre_1837.jpg
finaleart	S5121332	00:28:26:609	Image	void.png
finaleart	S5121332	00:28:28:687	Image	Landscape_at_L-Estaque_Braque-1906.jpg
finaleart	S5121332	00:28:32:734	Image	void.png
finaleart	S5121332	00:28:34:828	Image	ronde_cross_1905.jpg
finaleart	S5121332	00:28:38:937	Image	void.png
finaleart	S5121332	00:28:41:015	Image	The_Joy_Of_Life_Matisse_1906.jpg
finaleart	S5121332	00:28:45:109	Image	void.png
finaleart	S5121332	00:28:47:171	Image	Matisse-Nature-morte-a-la-cruche-bleue.jpg
finaleart	S5121332	00:28:51:328	Image	void.png
finaleart	S5121332	00:28:53:625	End of Experiment
