[BeGaze]
Converted from:	C:\Documents and Settings\iViewX\Desktop\EXPERIMENTATIONS\Experiments\results\finaleart\S13H22431-finaleart-1.idf
Date:	27.03.2019 15:41:45
Version:	BeGaze 2.5.77
Sample Rate:	50
Subject:	S13H22431
Description:	Jimmy Petit

Table Header for Fixations:
Event Type	Trial	Number	Start	End	Duration	Location X	Location Y	Dispersion X	Dispersion Y	Plane	Avg. Pupil Size X	Avg. Pupil Size Y

Table Header for Saccades:
Event Type	Trial	Number	Start	End	Duration	Start Loc.X	Start Loc.Y	End Loc.X	End Loc.Y	Amplitude	Peak Speed	Peak Speed At	Average Speed	Peak Accel.	Peak Decel.	Average Accel.

Table Header for Blinks:
Event Type	Trial	Number	Start	End	Duration

Table Header for User Events:
Event Type	Trial	Number	Start	Description

UserEvent	1	1	27790362154	# Message: void.jpg
Fixation L	1	1	27790366652	27790565529	198877	1375.57	887.08	14	11	-1	13.88	13.88
Fixation R	1	1	27790366652	27790565529	198877	1375.57	887.08	14	11	-1	13.48	13.48
Saccade L	1	1	27790565529	27790605232	39703	1371.37	891.12	1205.91	724.18	2.22	183.11	0.50	56.03	4563.31	-3822.50	2705.19
Saccade R	1	1	27790565529	27790605232	39703	1371.37	891.12	1205.91	724.18	2.22	183.11	0.50	56.03	4563.31	-3822.50	2705.19
Fixation L	1	2	27790605232	27790804102	198870	1185.25	708.12	32	25	-1	14.26	14.26
Fixation R	1	2	27790605232	27790804102	198870	1185.25	708.12	32	25	-1	13.93	13.93
Saccade L	1	2	27790804102	27790943380	139278	1173.28	698.56	1452.75	-50.15	12.83	222.85	0.57	92.10	5011.95	-4601.80	2299.38
Saccade R	1	2	27790804102	27790943380	139278	1173.28	698.56	1452.75	-50.15	12.83	222.85	0.57	92.10	5011.95	-4601.80	2299.38
Fixation L	1	3	27790943380	27791221843	278463	1442.77	-7.07	33	66	-1	13.75	13.75
Fixation R	1	3	27790943380	27791221843	278463	1442.77	-7.07	33	66	-1	13.58	13.58
Saccade L	1	3	27791221843	27791460573	238730	1439.05	7.83	2019.84	-41.87	15.18	225.54	0.25	63.60	5242.19	-2947.60	1486.30
Saccade R	1	3	27791221843	27791241730	19887	1439.05	7.83	1427.10	17.97	0.45	60.79	1.00	22.82	5242.19	130.21	2263.99
Blink R	1	1	27791241730	27791420706	178976
Saccade R	1	4	27791420706	27791460573	39867	2026.48	-37.52	2019.84	-41.87	1.27	61.94	0.50	31.84	1316.46	-1466.97	1197.00
Fixation L	1	4	27791460573	27791758940	298367	2018.54	-33.29	41	51	-1	14.78	14.78
Fixation R	1	4	27791460573	27791758940	298367	2018.54	-33.29	41	51	-1	15.43	15.43
Saccade L	1	4	27791758940	27791898179	139239	1989.52	-12.09	710.26	281.77	23.26	660.83	0.57	167.03	15401.36	-9524.70	5355.72
Saccade R	1	5	27791758940	27791898179	139239	1989.52	-12.09	710.26	281.77	23.26	660.83	0.57	167.03	15401.36	-9524.70	5355.72
Fixation L	1	5	27791898179	27792156682	258503	723.25	243.70	20	56	-1	15.56	15.56
Fixation R	1	5	27791898179	27792156682	258503	723.25	243.70	20	56	-1	16.10	16.10
Saccade L	1	5	27792156682	27792176558	19876	731.19	250.68	788.32	360.83	0.93	125.51	1.00	46.84	3027.50	-2301.93	1783.22
Saccade R	1	6	27792156682	27792176558	19876	731.19	250.68	788.32	360.83	0.93	125.51	1.00	46.84	3027.50	-2301.93	1783.22
Fixation L	1	6	27792176558	27792355537	178979	800.74	368.15	22	28	-1	14.72	14.72
Fixation R	1	6	27792176558	27792355537	178979	800.74	368.15	22	28	-1	15.56	15.56
