[BeGaze]
Converted from:	C:\Documents and Settings\iViewX\Desktop\EXPERIMENTATIONS\Experiments\results\finaleart\S19F21442-finaleart-1.idf
Date:	27.03.2019 15:49:58
Version:	BeGaze 2.5.77
Sample Rate:	50
Subject:	S19F21442
Description:	Juliette Veuillez

Table Header for Fixations:
Event Type	Trial	Number	Start	End	Duration	Location X	Location Y	Dispersion X	Dispersion Y	Plane	Avg. Pupil Size X	Avg. Pupil Size Y

Table Header for Saccades:
Event Type	Trial	Number	Start	End	Duration	Start Loc.X	Start Loc.Y	End Loc.X	End Loc.Y	Amplitude	Peak Speed	Peak Speed At	Average Speed	Peak Accel.	Peak Decel.	Average Accel.

Table Header for Blinks:
Event Type	Trial	Number	Start	End	Duration

Table Header for User Events:
Event Type	Trial	Number	Start	Description

UserEvent	1	1	5409189020	# Message: void.jpg
Fixation L	1	1	5409189848	5409527968	338120	1082.92	263.62	50	48	-1	14.37	14.37
Fixation R	1	1	5409189848	5409527968	338120	1082.92	263.62	50	48	-1	17.57	17.57
Saccade L	1	1	5409527968	5409547846	19878	1095.85	261.64	1093.68	239.69	0.23	22.31	1.00	11.44	115.44	-278.72	158.89
Saccade R	1	1	5409527968	5409547846	19878	1095.85	261.64	1093.68	239.69	0.23	22.31	1.00	11.44	115.44	-278.72	158.89
Fixation L	1	2	5409547846	5409687072	139226	1090.91	238.57	33	26	-1	14.10	14.10
Fixation R	1	2	5409547846	5409687072	139226	1090.91	238.57	33	26	-1	17.47	17.47
Saccade L	1	2	5409687072	5409706945	19873	1064.28	255.11	999.03	364.12	0.97	128.50	1.00	48.88	3026.27	-2857.01	2061.07
Saccade R	1	2	5409687072	5409706945	19873	1064.28	255.11	999.03	364.12	0.97	128.50	1.00	48.88	3026.27	-2857.01	2061.07
Fixation L	1	3	5409706945	5410164443	457498	972.43	361.43	57	38	-1	13.47	13.47
Fixation R	1	3	5409706945	5410164443	457498	972.43	361.43	57	38	-1	16.19	16.19
Saccade L	1	3	5410164443	5410184298	19855	941.50	378.34	853.59	402.00	0.87	92.09	1.00	43.83	1953.23	-1649.38	1327.29
Saccade R	1	3	5410164443	5410184298	19855	941.50	378.34	853.59	402.00	0.87	92.09	1.00	43.83	1953.23	-1649.38	1327.29
Fixation L	1	4	5410184298	5410403036	218738	841.63	409.21	20	50	-1	13.77	13.77
Fixation R	1	4	5410184298	5410403036	218738	841.63	409.21	20	50	-1	16.30	16.30
Saccade L	1	4	5410403036	5410442915	39879	836.01	399.34	835.06	414.64	1.82	100.24	1.00	45.55	2294.26	-2430.76	2026.02
Saccade R	1	4	5410403036	5410442915	39879	836.01	399.34	835.06	414.64	1.82	100.24	1.00	45.55	2294.26	-2430.76	2026.02
Fixation L	1	5	5410442915	5410820777	377862	842.02	432.96	15	39	-1	14.12	14.12
Fixation R	1	5	5410442915	5410820777	377862	842.02	432.96	15	39	-1	16.94	16.94
Saccade L	1	5	5410820777	5410920267	99490	845.65	450.19	855.44	475.71	5.05	140.04	1.00	50.74	3109.37	-3230.24	2134.23
Saccade R	1	5	5410820777	5410920267	99490	845.65	450.19	855.44	475.71	5.05	140.04	1.00	50.74	3109.37	-3230.24	2134.23
Fixation L	1	6	5410920267	5411198773	278506	860.55	486.36	8	42	-1	15.54	15.54
Fixation R	1	6	5410920267	5411198773	278506	860.55	486.36	8	42	-1	17.49	17.49
