[BeGaze]
Converted from:	C:\Documents and Settings\iViewX\Desktop\EXPERIMENTATIONS\Experiments\results\finaleart\S13H22431-finaleart-1.idf
Date:	27.03.2019 15:41:25
Version:	BeGaze 2.5.77
Sample Rate:	50
Subject:	S13H22431
Description:	Jimmy Petit

Table Header for Fixations:
Event Type	Trial	Number	Start	End	Duration	Location X	Location Y	Dispersion X	Dispersion Y	Plane	Avg. Pupil Size X	Avg. Pupil Size Y

Table Header for Saccades:
Event Type	Trial	Number	Start	End	Duration	Start Loc.X	Start Loc.Y	End Loc.X	End Loc.Y	Amplitude	Peak Speed	Peak Speed At	Average Speed	Peak Accel.	Peak Decel.	Average Accel.

Table Header for Blinks:
Event Type	Trial	Number	Start	End	Duration

Table Header for User Events:
Event Type	Trial	Number	Start	Description

UserEvent	1	1	27295378049	# Message: void.jpg
Saccade L	1	1	27295394403	27295513861	119458	1101.10	646.24	1106.14	344.21	4.89	199.33	0.83	40.93	4943.48	-4789.97	1793.54
Saccade R	1	1	27295394403	27295513861	119458	1101.10	646.24	1106.14	344.21	4.89	199.33	0.83	40.93	4943.48	-4789.97	1793.54
Fixation L	1	1	27295513861	27295931494	417633	1124.94	330.17	27	25	-1	14.38	14.38
Fixation R	1	1	27295513861	27295931494	417633	1124.94	330.17	27	25	-1	14.56	14.56
Blink L	1	1	27295931494	27296090608	159114
Blink R	1	1	27295931494	27296090608	159114
Saccade L	1	2	27296090608	27296189984	99376	522.70	550.85	390.86	818.69	4.86	149.27	0.80	48.88	3600.48	-3496.04	1771.75
Saccade R	1	2	27296090608	27296189984	99376	522.70	550.85	390.86	818.69	4.86	149.27	0.80	48.88	3600.48	-3496.04	1771.75
Fixation L	1	2	27296189984	27296428722	238738	382.49	809.14	13	16	-1	15.80	15.80
Fixation R	1	2	27296189984	27296428722	238738	382.49	809.14	13	16	-1	16.20	16.20
Saccade L	1	3	27296428722	27296468471	39749	378.70	802.43	429.84	1096.18	2.63	168.81	0.50	66.09	4174.29	-3641.51	3479.01
Saccade R	1	3	27296428722	27296468471	39749	378.70	802.43	429.84	1096.18	2.63	168.81	0.50	66.09	4174.29	-3641.51	3479.01
Fixation L	1	3	27296468471	27296667345	198874	443.26	1095.57	42	8	-1	15.96	15.96
Fixation R	1	3	27296468471	27296667345	198874	443.26	1095.57	42	8	-1	16.65	16.65
Saccade L	1	4	27296667345	27296687338	19993	445.91	1101.01	449.63	1233.56	0.75	134.12	1.00	37.38	3170.67	-2613.84	1940.41
Saccade R	1	4	27296667345	27296687338	19993	445.91	1101.01	449.63	1233.56	0.75	134.12	1.00	37.38	3170.67	-2613.84	1940.41
Fixation L	1	4	27296687338	27296945836	258498	450.21	1263.65	19	44	-1	15.82	15.82
Fixation R	1	4	27296687338	27296945836	258498	450.21	1263.65	19	44	-1	16.83	16.83
