[BeGaze]
Converted from:	C:\Documents and Settings\iViewX\Desktop\EXPERIMENTATIONS\Experiments\results\finaleart\S21F22332-finaleart-1.idf
Date:	27.03.2019 15:55:53
Version:	BeGaze 2.5.77
Sample Rate:	50
Subject:	S21F22332
Description:	Cyrielle Mailart

Table Header for Fixations:
Event Type	Trial	Number	Start	End	Duration	Location X	Location Y	Dispersion X	Dispersion Y	Plane	Avg. Pupil Size X	Avg. Pupil Size Y

Table Header for Saccades:
Event Type	Trial	Number	Start	End	Duration	Start Loc.X	Start Loc.Y	End Loc.X	End Loc.Y	Amplitude	Peak Speed	Peak Speed At	Average Speed	Peak Accel.	Peak Decel.	Average Accel.

Table Header for Blinks:
Event Type	Trial	Number	Start	End	Duration

Table Header for User Events:
Event Type	Trial	Number	Start	Description

UserEvent	1	1	2851696065	# Message: void.jpg
Fixation L	1	1	2851705672	2852143279	437607	1418.06	85.46	16	60	-1	11.71	11.71
Fixation R	1	1	2851705672	2852143279	437607	1418.06	85.46	16	60	-1	10.73	10.73
Saccade L	1	1	2852183022	2852222888	39866	0.00	6.20	0.00	1.08	11.26	1400.22	1.00	282.53	-34.37	-34921.84	8786.64
Saccade R	1	1	2852202889	2852242764	39875	0.00	2.89	0.00	0.51	0.10	6.68	1.00	2.58	-13.45	-121.14	59.55
Blink L	1	1	2852222888	2852481380	258492
Blink R	1	1	2852282513	2852461514	179001
Fixation R	1	2	2852461514	2852958730	497216	932.81	385.84	36	58	-1	12.14	12.14
Fixation L	1	2	2852481380	2852958730	477350	932.35	385.25	36	58	-1	13.04	13.04
Saccade L	1	2	2852958730	2852978593	19863	960.10	391.71	974.17	413.48	0.65	52.56	0.00	32.89	574.30	-533.53	394.54
Saccade R	1	2	2852958730	2852978593	19863	960.10	391.71	974.17	413.48	0.65	52.56	0.00	32.89	574.30	-533.53	394.54
Fixation L	1	3	2852978593	2853276961	298368	993.78	470.12	25	73	-1	13.00	13.00
Fixation R	1	3	2852978593	2853276961	298368	993.78	470.12	25	73	-1	12.04	12.04
Saccade L	1	3	2853276961	2853296835	19874	996.92	487.00	996.74	491.60	0.05	4.66	1.00	2.44	81.95	-83.28	59.88
Saccade R	1	3	2853276961	2853296835	19874	996.92	487.00	996.74	491.60	0.05	4.66	1.00	2.44	81.95	-83.28	59.88
Fixation L	1	4	2853296835	2853396333	99498	996.80	490.90	1	7	-1	13.06	13.06
Fixation R	1	4	2853296835	2853396333	99498	996.80	490.90	1	7	-1	12.31	12.31
Saccade L	1	4	2853396333	2853436081	39748	996.95	486.29	990.77	523.61	2.24	128.68	0.50	56.34	3153.85	-2830.90	2824.13
Saccade R	1	4	2853396333	2853436081	39748	996.95	486.29	990.77	523.61	2.24	128.68	0.50	56.34	3153.85	-2830.90	2824.13
Fixation L	1	5	2853436081	2853694694	258613	951.64	519.41	48	8	-1	13.27	13.27
Fixation R	1	5	2853436081	2853694694	258613	951.64	519.41	48	8	-1	12.54	12.54
