[BeGaze]
Converted from:	C:\Documents and Settings\iViewX\Desktop\EXPERIMENTATIONS\Experiments\results\finaleart\S18F56223-finaleart-1.idf
Date:	27.03.2019 15:49:50
Version:	BeGaze 2.5.77
Sample Rate:	50
Subject:	S18F56223
Description:	Pascale Sebillot

Table Header for Fixations:
Event Type	Trial	Number	Start	End	Duration	Location X	Location Y	Dispersion X	Dispersion Y	Plane	Avg. Pupil Size X	Avg. Pupil Size Y

Table Header for Saccades:
Event Type	Trial	Number	Start	End	Duration	Start Loc.X	Start Loc.Y	End Loc.X	End Loc.Y	Amplitude	Peak Speed	Peak Speed At	Average Speed	Peak Accel.	Peak Decel.	Average Accel.

Table Header for Blinks:
Event Type	Trial	Number	Start	End	Duration

Table Header for User Events:
Event Type	Trial	Number	Start	Description

UserEvent	1	1	3190396218	# Message: void.jpg
Fixation L	1	1	3190410673	3191146501	735828	1493.50	423.70	19	63	-1	13.49	13.49
Fixation R	1	1	3190410673	3191146501	735828	1493.50	423.70	19	63	-1	11.85	11.85
Saccade L	1	1	3191146501	3191166386	19885	1506.14	448.81	1506.56	469.84	0.25	21.75	1.00	12.77	483.79	-211.64	362.08
Saccade R	1	1	3191146501	3191166386	19885	1506.14	448.81	1506.56	469.84	0.25	21.75	1.00	12.77	483.79	-211.64	362.08
Fixation L	1	2	3191166386	3191444867	278481	1509.60	453.14	14	26	-1	13.63	13.63
Fixation R	1	2	3191166386	3191444867	278481	1509.60	453.14	14	26	-1	12.12	12.12
Saccade L	1	2	3191444867	3191484619	39752	1499.46	463.40	1180.08	537.72	3.23	218.97	1.00	81.23	4927.24	-4953.46	3552.92
Saccade R	1	2	3191444867	3191484619	39752	1499.46	463.40	1180.08	537.72	3.23	218.97	1.00	81.23	4927.24	-4953.46	3552.92
Fixation L	1	3	3191484619	3191842726	358107	1152.18	517.70	40	39	-1	14.54	14.54
Fixation R	1	3	3191484619	3191842726	358107	1152.18	517.70	40	39	-1	12.96	12.96
Saccade L	1	3	3191842726	3191862605	19879	1139.87	513.26	969.37	561.02	1.30	179.06	1.00	65.46	4383.41	-3946.72	3086.69
Saccade R	1	3	3191842726	3191862605	19879	1139.87	513.26	969.37	561.02	1.30	179.06	1.00	65.46	4383.41	-3946.72	3086.69
Fixation L	1	4	3191862605	3192180859	318254	971.96	616.96	13	82	-1	14.81	14.81
Fixation R	1	4	3191862605	3192180859	318254	971.96	616.96	13	82	-1	13.32	13.32
Saccade L	1	4	3192180859	3192200712	19853	964.50	643.03	856.37	651.63	0.92	109.72	1.00	46.49	2191.83	-2455.59	1754.56
Saccade R	1	4	3192180859	3192200712	19853	964.50	643.03	856.37	651.63	0.92	109.72	1.00	46.49	2191.83	-2455.59	1754.56
Fixation L	1	5	3192200712	3192379705	178993	873.96	659.66	38	25	-1	14.89	14.89
Fixation R	1	5	3192200712	3192379705	178993	873.96	659.66	38	25	-1	13.34	13.34
