[BeGaze]
Converted from:	C:\Documents and Settings\iViewX\Desktop\EXPERIMENTATIONS\Experiments\results\finaleart\S9H29221-finaleart-1.idf
Date:	27.03.2019 16:01:56
Version:	BeGaze 2.5.77
Sample Rate:	50
Subject:	S9H29221
Description:	steven

Table Header for Fixations:
Event Type	Trial	Number	Start	End	Duration	Location X	Location Y	Dispersion X	Dispersion Y	Plane	Avg. Pupil Size X	Avg. Pupil Size Y

Table Header for Saccades:
Event Type	Trial	Number	Start	End	Duration	Start Loc.X	Start Loc.Y	End Loc.X	End Loc.Y	Amplitude	Peak Speed	Peak Speed At	Average Speed	Peak Accel.	Peak Decel.	Average Accel.

Table Header for Blinks:
Event Type	Trial	Number	Start	End	Duration

Table Header for User Events:
Event Type	Trial	Number	Start	Description

UserEvent	1	1	5535491573	# Message: paysage_avec_du_betail_au_limousin_jules-dupre_1837.jpg
Fixation L	1	1	5535501608	5536098197	596589	1109.12	370.42	54	9	-1	14.71	14.71
Fixation R	1	1	5535501608	5536098197	596589	1109.12	370.42	54	9	-1	14.16	14.16
Saccade L	1	1	5536098197	5536118192	19995	1129.23	373.94	1164.07	380.57	0.38	35.88	1.00	19.21	630.78	-761.36	604.27
Saccade R	1	1	5536098197	5536118192	19995	1129.23	373.94	1164.07	380.57	0.38	35.88	1.00	19.21	630.78	-761.36	604.27
Fixation L	1	2	5536118192	5536404020	285828	1174.01	384.66	15	15	-1	13.73	13.73
Fixation R	1	2	5536118192	5536404020	285828	1174.01	384.66	15	15	-1	13.63	13.63
Saccade L	1	2	5536404020	5536436443	32423	1179.87	392.32	1059.76	440.96	1.23	131.06	1.00	37.86	3159.41	-2729.92	2054.85
Saccade R	1	2	5536404020	5536436443	32423	1179.87	392.32	1059.76	440.96	1.23	131.06	1.00	37.86	3159.41	-2729.92	2054.85
Fixation L	1	3	5536436443	5536575541	139098	1059.72	444.33	6	24	-1	13.32	13.32
Fixation R	1	3	5536436443	5536575541	139098	1059.72	444.33	6	24	-1	12.87	12.87
Saccade L	1	3	5536575541	5536615424	39883	1063.30	448.72	1169.90	669.69	2.10	150.97	1.00	52.63	3710.98	-3655.10	2999.57
Saccade R	1	3	5536575541	5536615424	39883	1063.30	448.72	1169.90	669.69	2.10	150.97	1.00	52.63	3710.98	-3655.10	2999.57
Fixation L	1	4	5536615424	5536854030	238606	1171.79	686.34	4	22	-1	13.24	13.24
Fixation R	1	4	5536615424	5536854030	238606	1171.79	686.34	4	22	-1	12.77	12.77
Saccade L	1	4	5536854030	5536893900	39870	1173.59	692.21	1352.75	948.65	2.63	206.22	1.00	65.92	5140.57	-5013.30	3895.43
Saccade R	1	4	5536854030	5536893900	39870	1173.59	692.21	1352.75	948.65	2.63	206.22	1.00	65.92	5140.57	-5013.30	3895.43
Fixation L	1	5	5536893900	5537251897	357997	1362.72	955.77	25	30	-1	13.15	13.15
Fixation R	1	5	5536893900	5537251897	357997	1362.72	955.77	25	30	-1	12.59	12.59
Saccade L	1	5	5537251897	5537291633	39736	1373.82	937.25	1034.12	885.37	3.21	194.16	1.00	80.79	4802.45	-4745.12	3977.77
Saccade R	1	5	5537251897	5537291633	39736	1373.82	937.25	1034.12	885.37	3.21	194.16	1.00	80.79	4802.45	-4745.12	3977.77
Fixation L	1	6	5537291633	5537510372	218739	988.57	855.69	51	41	-1	13.08	13.08
Fixation R	1	6	5537291633	5537510372	218739	988.57	855.69	51	41	-1	12.59	12.59
Saccade L	1	6	5537510372	5537530378	20006	984.69	844.97	972.79	835.61	0.45	70.95	1.00	22.29	1735.95	-315.25	800.13
Saccade R	1	6	5537510372	5537530378	20006	984.69	844.97	972.79	835.61	0.45	70.95	1.00	22.29	1735.95	-315.25	800.13
Fixation L	1	7	5537530378	5537629747	99369	908.96	829.24	83	15	-1	12.64	12.64
Fixation R	1	7	5537530378	5537629747	99369	908.96	829.24	83	15	-1	12.35	12.35
Saccade L	1	7	5537629747	5537649625	19878	888.93	819.68	891.25	814.05	0.12	7.43	1.00	6.11	193.30	13.81	87.45
Saccade R	1	7	5537629747	5537649625	19878	888.93	819.68	891.25	814.05	0.12	7.43	1.00	6.11	193.30	13.81	87.45
Fixation L	1	8	5537649625	5537749117	99492	884.85	811.53	30	13	-1	12.50	12.50
Fixation R	1	8	5537649625	5537749117	99492	884.85	811.53	30	13	-1	11.92	11.92
Saccade L	1	8	5537749117	5537768987	19870	860.55	809.41	783.24	818.22	0.67	78.70	1.00	33.88	1919.13	-1760.60	1230.24
Saccade R	1	8	5537749117	5537768987	19870	860.55	809.41	783.24	818.22	0.67	78.70	1.00	33.88	1919.13	-1760.60	1230.24
Fixation L	1	9	5537768987	5538206585	437598	763.90	865.65	29	68	-1	12.26	12.26
Fixation R	1	9	5537768987	5538206585	437598	763.90	865.65	29	68	-1	11.99	11.99
Saccade L	1	9	5538206585	5538246339	39754	768.16	843.48	777.60	550.21	2.79	197.42	0.50	70.15	4786.56	-4667.02	3314.74
Saccade R	1	9	5538206585	5538246339	39754	768.16	843.48	777.60	550.21	2.79	197.42	0.50	70.15	4786.56	-4667.02	3314.74
Fixation L	1	10	5538246339	5538425326	178987	797.01	532.89	39	28	-1	11.56	11.56
Fixation R	1	10	5538246339	5538425326	178987	797.01	532.89	39	28	-1	11.38	11.38
Saccade L	1	10	5538425326	5538445346	20020	817.59	521.88	909.59	379.41	0.99	171.51	1.00	49.46	4271.94	-4074.48	2788.34
Saccade R	1	10	5538425326	5538445346	20020	817.59	521.88	909.59	379.41	0.99	171.51	1.00	49.46	4271.94	-4074.48	2788.34
Fixation L	1	11	5538445346	5538783439	338093	927.52	359.26	48	47	-1	11.10	11.10
Fixation R	1	11	5538445346	5538783439	338093	927.52	359.26	48	47	-1	10.71	10.71
Saccade L	1	11	5538783439	5538803311	19872	958.18	331.49	964.42	332.51	0.13	10.21	1.00	6.53	-0.92	-95.24	47.48
Saccade R	1	11	5538783439	5538803311	19872	958.18	331.49	964.42	332.51	0.13	10.21	1.00	6.53	-0.92	-95.24	47.48
Fixation L	1	12	5538803311	5538982312	179001	964.19	338.23	15	34	-1	11.01	11.01
Fixation R	1	12	5538803311	5538982312	179001	964.19	338.23	15	34	-1	10.50	10.50
Saccade L	1	12	5538982312	5539061798	79486	952.54	364.47	647.78	881.51	7.39	212.70	0.25	93.01	5203.97	-2956.72	3146.82
Saccade R	1	12	5538982312	5539061798	79486	952.54	364.47	647.78	881.51	7.39	212.70	0.25	93.01	5203.97	-2956.72	3146.82
Fixation L	1	13	5539061798	5539479530	417732	645.36	887.82	26	13	-1	11.52	11.52
Fixation R	1	13	5539061798	5539479530	417732	645.36	887.82	26	13	-1	11.36	11.36
