[BeGaze]
Converted from:	C:\Documents and Settings\iViewX\Desktop\EXPERIMENTATIONS\Experiments\results\finaleart\S12H22222-finaleart-1.idf
Date:	27.03.2019 15:39:59
Version:	BeGaze 2.5.77
Sample Rate:	50
Subject:	S12H22222
Description:	aurele barriere

Table Header for Fixations:
Event Type	Trial	Number	Start	End	Duration	Location X	Location Y	Dispersion X	Dispersion Y	Plane	Avg. Pupil Size X	Avg. Pupil Size Y

Table Header for Saccades:
Event Type	Trial	Number	Start	End	Duration	Start Loc.X	Start Loc.Y	End Loc.X	End Loc.Y	Amplitude	Peak Speed	Peak Speed At	Average Speed	Peak Accel.	Peak Decel.	Average Accel.

Table Header for Blinks:
Event Type	Trial	Number	Start	End	Duration

Table Header for User Events:
Event Type	Trial	Number	Start	Description

UserEvent	1	1	22951090910	# Message: void.jpg
Saccade L	1	1	22951104900	22951124762	19862	1575.66	768.86	1528.52	613.43	1.27	164.27	1.00	64.17	706.13	-4074.66	1593.59
Saccade R	1	1	22951104900	22951124762	19862	1575.66	768.86	1528.52	613.43	1.27	164.27	1.00	64.17	706.13	-4074.66	1593.59
Fixation L	1	1	22951124762	22951363381	238619	1518.90	640.59	21	35	-1	18.40	18.40
Fixation R	1	1	22951124762	22951363381	238619	1518.90	640.59	21	35	-1	16.85	16.85
Saccade L	1	2	22951363381	22951403247	39866	1509.61	647.85	1517.96	309.79	2.87	192.50	1.00	71.92	4621.19	-4434.00	4071.70
Saccade R	1	2	22951363381	22951403247	39866	1509.61	647.85	1517.96	309.79	2.87	192.50	1.00	71.92	4621.19	-4434.00	4071.70
Fixation L	1	2	22951403247	22951641865	238618	1528.42	317.81	19	28	-1	18.69	18.69
Fixation R	1	2	22951403247	22951641865	238618	1528.42	317.81	19	28	-1	17.11	17.11
Saccade L	1	3	22951641865	22951721498	79633	1530.70	335.38	942.46	405.12	7.47	210.44	0.25	93.85	5002.46	-2404.66	2568.91
Saccade R	1	3	22951641865	22951721498	79633	1530.70	335.38	942.46	405.12	7.47	210.44	0.25	93.85	5002.46	-2404.66	2568.91
Fixation L	1	3	22951721498	22951960118	238620	917.54	429.11	44	55	-1	17.77	17.77
Fixation R	1	3	22951721498	22951960118	238620	917.54	429.11	44	55	-1	16.85	16.85
Saccade L	1	4	22951960118	22951979977	19859	903.85	435.61	901.86	436.14	0.08	6.40	0.00	4.26	21.87	-46.85	37.88
Saccade R	1	4	22951960118	22951979977	19859	903.85	435.61	901.86	436.14	0.08	6.40	0.00	4.26	21.87	-46.85	37.88
Fixation L	1	4	22951979977	22953073945	1093968	919.16	442.06	37	19	-1	18.73	18.73
Fixation R	1	4	22951979977	22953073945	1093968	919.16	442.06	37	19	-1	17.75	17.75
