[BeGaze]
Converted from:	C:\Documents and Settings\iViewX\Desktop\EXPERIMENTATIONS\Experiments\results\finaleart\S8119532-finaleart-1.idf
Date:	27.03.2019 16:01:36
Version:	BeGaze 2.5.77
Sample Rate:	50
Subject:	S8119532
Description:	Alexandre Drewery

Table Header for Fixations:
Event Type	Trial	Number	Start	End	Duration	Location X	Location Y	Dispersion X	Dispersion Y	Plane	Avg. Pupil Size X	Avg. Pupil Size Y

Table Header for Saccades:
Event Type	Trial	Number	Start	End	Duration	Start Loc.X	Start Loc.Y	End Loc.X	End Loc.Y	Amplitude	Peak Speed	Peak Speed At	Average Speed	Peak Accel.	Peak Decel.	Average Accel.

Table Header for Blinks:
Event Type	Trial	Number	Start	End	Duration

Table Header for User Events:
Event Type	Trial	Number	Start	Description

UserEvent	1	1	3762051823	# Message: Fleurs_et_fruits_camoin_1942.jpg
Fixation L	1	1	3762066271	3762742612	676341	846.49	567.59	18	73	-1	14.12	14.12
Fixation R	1	1	3762066271	3762742612	676341	846.49	567.59	18	73	-1	14.56	14.56
Saccade L	1	1	3762742612	3762782359	39747	855.75	529.04	890.59	314.09	2.19	180.70	0.50	55.09	4315.84	-3535.50	2207.32
Saccade R	1	1	3762742612	3762782359	39747	855.75	529.04	890.59	314.09	2.19	180.70	0.50	55.09	4315.84	-3535.50	2207.32
Fixation L	1	2	3762782359	3763140347	357988	915.40	292.65	36	62	-1	13.17	13.17
Fixation R	1	2	3762782359	3763140347	357988	915.40	292.65	36	62	-1	13.32	13.32
Saccade L	1	2	3763140347	3763160219	19872	920.14	312.82	909.47	505.41	1.29	195.06	1.00	65.13	4724.52	-4163.96	3213.85
Saccade R	1	2	3763140347	3763160219	19872	920.14	312.82	909.47	505.41	1.29	195.06	1.00	65.13	4724.52	-4163.96	3213.85
Fixation L	1	3	3763160219	3763319335	159116	898.83	525.36	16	41	-1	13.01	13.01
Fixation R	1	3	3763160219	3763319335	159116	898.83	525.36	16	41	-1	13.03	13.03
Saccade L	1	3	3763319335	3763438709	119374	895.74	535.28	863.41	618.70	5.02	111.18	0.17	42.02	2214.26	-1181.50	935.51
Saccade R	1	3	3763319335	3763438709	119374	895.74	535.28	863.41	618.70	5.02	111.18	0.17	42.02	2214.26	-1181.50	935.51
Fixation L	1	4	3763438709	3763558066	119357	865.33	614.38	7	88	-1	12.82	12.82
Fixation R	1	4	3763438709	3763558066	119357	865.33	614.38	7	88	-1	13.15	13.15
Saccade L	1	4	3763558066	3763657571	99505	865.32	644.10	894.47	170.12	6.81	315.38	0.80	68.44	7620.46	-7326.32	3177.40
Saccade R	1	4	3763558066	3763657571	99505	865.32	644.10	894.47	170.12	6.81	315.38	0.80	68.44	7620.46	-7326.32	3177.40
Fixation L	1	5	3763657571	3764095046	437475	936.65	176.30	52	21	-1	12.45	12.45
Fixation R	1	5	3763657571	3764095046	437475	936.65	176.30	52	21	-1	12.73	12.73
Blink L	1	1	3764095046	3764313911	218865
Blink R	1	1	3764095046	3764313911	218865
Fixation L	1	6	3764313911	3764572395	258484	894.47	225.99	36	57	-1	14.40	14.40
Fixation R	1	6	3764313911	3764572395	258484	894.47	225.99	36	57	-1	16.33	16.33
Saccade L	1	5	3764572395	3764612272	39877	918.23	202.18	925.42	205.74	1.38	80.54	1.00	34.51	1898.05	-1980.61	1835.94
Saccade R	1	5	3764572395	3764612272	39877	918.23	202.18	925.42	205.74	1.38	80.54	1.00	34.51	1898.05	-1980.61	1835.94
Fixation L	1	7	3764612272	3765029875	417603	914.80	210.13	32	13	-1	14.42	14.42
Fixation R	1	7	3764612272	3765029875	417603	914.80	210.13	32	13	-1	16.45	16.45
Saccade L	1	6	3765029875	3765049750	19875	901.18	212.00	694.00	336.01	1.53	244.12	1.00	76.87	5986.36	-5489.84	4221.38
Saccade R	1	6	3765029875	3765049750	19875	901.18	212.00	694.00	336.01	1.53	244.12	1.00	76.87	5986.36	-5489.84	4221.38
Fixation L	1	8	3765049750	3765228869	179119	669.05	384.48	31	66	-1	14.44	14.44
Fixation R	1	8	3765049750	3765228869	179119	669.05	384.48	31	66	-1	16.85	16.85
Saccade L	1	7	3765228869	3765248742	19873	663.69	402.05	663.17	404.89	0.12	12.71	1.00	5.91	180.50	-45.83	78.61
Saccade R	1	7	3765228869	3765248742	19873	663.69	402.05	663.17	404.89	0.12	12.71	1.00	5.91	180.50	-45.83	78.61
Fixation L	1	9	3765248742	3765387982	139240	658.37	400.48	6	11	-1	14.54	14.54
Fixation R	1	9	3765248742	3765387982	139240	658.37	400.48	6	11	-1	16.90	16.90
Saccade L	1	8	3765387982	3765427736	39754	658.54	404.35	937.77	263.99	2.81	196.38	0.50	70.60	4841.21	-4118.10	3709.76
Saccade R	1	8	3765387982	3765427736	39754	658.54	404.35	937.77	263.99	2.81	196.38	0.50	70.60	4841.21	-4118.10	3709.76
Fixation L	1	10	3765427736	3766064216	636480	927.09	238.68	35	38	-1	14.85	14.85
Fixation R	1	10	3765427736	3766064216	636480	927.09	238.68	35	38	-1	16.86	16.86
