[BeGaze]
Converted from:	C:\Documents and Settings\iViewX\Desktop\EXPERIMENTATIONS\Experiments\results\finaleart\S5121332-finaleart-1.idf
Date:	27.03.2019 15:35:26
Version:	BeGaze 2.5.77
Sample Rate:	50
Subject:	S5121332
Description:	Dylan Marinho

Table Header for Fixations:
Event Type	Trial	Number	Start	End	Duration	Location X	Location Y	Dispersion X	Dispersion Y	Plane	Avg. Pupil Size X	Avg. Pupil Size Y

Table Header for Saccades:
Event Type	Trial	Number	Start	End	Duration	Start Loc.X	Start Loc.Y	End Loc.X	End Loc.Y	Amplitude	Peak Speed	Peak Speed At	Average Speed	Peak Accel.	Peak Decel.	Average Accel.

Table Header for Blinks:
Event Type	Trial	Number	Start	End	Duration

Table Header for User Events:
Event Type	Trial	Number	Start	Description

UserEvent	1	1	10124389711	# Message: Niagara_Falls_Hale_1902.jpg
Fixation L	1	1	10124405686	10124743830	338144	948.92	539.39	72	23	-1	15.28	15.28
Fixation R	1	1	10124405686	10124743830	338144	948.92	539.39	72	23	-1	14.86	14.86
Saccade L	1	1	10124743830	10124763657	19827	893.81	545.30	887.09	540.94	0.09	8.11	1.00	4.57	122.63	-83.83	75.31
Saccade R	1	1	10124743830	10124763657	19827	893.81	545.30	887.09	540.94	0.09	8.11	1.00	4.57	122.63	-83.83	75.31
Fixation L	1	2	10124763657	10125439977	676320	892.29	531.14	24	52	-1	14.71	14.71
Fixation R	1	2	10124763657	10125439977	676320	892.29	531.14	24	52	-1	14.29	14.29
Saccade L	1	2	10125439977	10125459862	19885	906.96	488.03	908.58	421.88	0.65	66.93	1.00	32.84	1632.91	-1592.04	1430.87
Saccade R	1	2	10125439977	10125459862	19885	906.96	488.03	908.58	421.88	0.65	66.93	1.00	32.84	1632.91	-1592.04	1430.87
Fixation L	1	3	10125459862	10125678597	218735	928.08	415.89	42	12	-1	13.62	13.62
Fixation R	1	3	10125459862	10125678597	218735	928.08	415.89	42	12	-1	13.25	13.25
Saccade L	1	3	10125678597	10125698466	19869	951.55	409.47	1077.61	312.92	1.08	160.59	1.00	54.44	3944.85	-3930.00	2806.76
Saccade R	1	3	10125678597	10125698466	19869	951.55	409.47	1077.61	312.92	1.08	160.59	1.00	54.44	3944.85	-3930.00	2806.76
Fixation L	1	4	10125698466	10126096324	397858	1098.55	291.17	27	57	-1	13.43	13.43
Fixation R	1	4	10125698466	10126096324	397858	1098.55	291.17	27	57	-1	13.00	13.00
Saccade L	1	4	10126096324	10126116196	19872	1095.01	255.57	1093.49	227.67	0.42	32.90	0.00	21.32	428.09	-627.91	518.01
Saccade R	1	4	10126096324	10126116196	19872	1095.01	255.57	1093.49	227.67	0.42	32.90	0.00	21.32	428.09	-627.91	518.01
Fixation L	1	5	10126116196	10126553793	437597	1094.66	214.50	43	21	-1	12.93	12.93
Fixation R	1	5	10126116196	10126553793	437597	1094.66	214.50	43	21	-1	12.65	12.65
Saccade L	1	5	10126553793	10126573671	19878	1122.98	213.18	1186.97	209.29	0.44	64.85	1.00	22.06	1578.30	-1472.57	1138.90
Saccade R	1	5	10126553793	10126573671	19878	1122.98	213.18	1186.97	209.29	0.44	64.85	1.00	22.06	1578.30	-1472.57	1138.90
Fixation L	1	6	10126573671	10126712915	139244	1195.30	194.06	14	41	-1	13.44	13.44
Fixation R	1	6	10126573671	10126712915	139244	1195.30	194.06	14	41	-1	12.99	12.99
Saccade L	1	6	10126712915	10126732781	19866	1201.01	168.09	1200.56	116.48	0.54	52.22	1.00	27.40	1107.97	-1250.40	988.34
Saccade R	1	6	10126712915	10126732781	19866	1201.01	168.09	1200.56	116.48	0.54	52.22	1.00	27.40	1107.97	-1250.40	988.34
Fixation L	1	7	10126732781	10126872030	139249	1196.25	155.61	13	83	-1	13.73	13.73
Fixation R	1	7	10126732781	10126872030	139249	1196.25	155.61	13	83	-1	13.46	13.46
Saccade L	1	7	10126872030	10126931638	59608	1186.94	199.60	737.38	626.63	6.98	268.95	0.33	117.12	6646.00	-4885.63	4435.03
Saccade R	1	7	10126872030	10126931638	59608	1186.94	199.60	737.38	626.63	6.98	268.95	0.33	117.12	6646.00	-4885.63	4435.03
Fixation L	1	8	10126931638	10127249875	318237	747.34	631.49	18	40	-1	14.77	14.77
Fixation R	1	8	10126931638	10127249875	318237	747.34	631.49	18	40	-1	14.19	14.19
Saccade L	1	8	10127249875	10127269756	19881	748.41	648.65	694.66	662.31	0.51	56.11	1.00	25.51	1324.96	-897.03	974.98
Saccade R	1	8	10127249875	10127269756	19881	748.41	648.65	694.66	662.31	0.51	56.11	1.00	25.51	1324.96	-897.03	974.98
Fixation L	1	9	10127269756	10128244436	974680	674.71	723.12	26	71	-1	14.28	14.28
Fixation R	1	9	10127269756	10128244436	974680	674.71	723.12	26	71	-1	14.12	14.12
Saccade L	1	9	10128244436	10128343807	99371	684.62	728.36	736.62	718.19	0.98	30.84	0.20	9.83	752.94	-670.28	309.98
Saccade R	1	9	10128244436	10128343807	99371	684.62	728.36	736.62	718.19	0.98	30.84	0.20	9.83	752.94	-670.28	309.98
