[BeGaze]
Converted from:	C:\Documents and Settings\iViewX\Desktop\EXPERIMENTATIONS\Experiments\results\finaleart\S8119532-finaleart-1.idf
Date:	27.03.2019 16:00:30
Version:	BeGaze 2.5.77
Sample Rate:	50
Subject:	S8119532
Description:	Alexandre Drewery

Table Header for Fixations:
Event Type	Trial	Number	Start	End	Duration	Location X	Location Y	Dispersion X	Dispersion Y	Plane	Avg. Pupil Size X	Avg. Pupil Size Y

Table Header for Saccades:
Event Type	Trial	Number	Start	End	Duration	Start Loc.X	Start Loc.Y	End Loc.X	End Loc.Y	Amplitude	Peak Speed	Peak Speed At	Average Speed	Peak Accel.	Peak Decel.	Average Accel.

Table Header for Blinks:
Event Type	Trial	Number	Start	End	Duration

Table Header for User Events:
Event Type	Trial	Number	Start	Description

UserEvent	1	1	3182083534	# Message: void.jpg
Fixation L	1	1	3182084707	3182323329	238622	403.19	177.35	73	12	-1	15.67	15.67
Fixation R	1	1	3182084707	3182323329	238622	403.19	177.35	73	12	-1	16.37	16.37
Saccade L	1	1	3182323329	3182343183	19854	347.02	172.66	335.06	169.19	0.52	37.01	1.00	26.05	748.76	-274.85	391.39
Saccade R	1	1	3182323329	3182343183	19854	347.02	172.66	335.06	169.19	0.52	37.01	1.00	26.05	748.76	-274.85	391.39
Fixation L	1	2	3182343183	3182502287	159104	332.55	150.37	46	43	-1	15.23	15.23
Fixation R	1	2	3182343183	3182502287	159104	332.55	150.37	46	43	-1	16.01	16.01
Saccade L	1	2	3182502287	3182523136	20849	307.07	141.99	297.58	127.81	0.57	54.68	1.00	27.53	44.59	-935.54	378.70
Saccade R	1	2	3182502287	3182523136	20849	307.07	141.99	297.58	127.81	0.57	54.68	1.00	27.53	44.59	-935.54	378.70
Fixation L	1	3	3182523136	3182760902	237766	311.41	132.27	18	16	-1	15.17	15.17
Fixation R	1	3	3182523136	3182760902	237766	311.41	132.27	18	16	-1	16.14	16.14
Saccade L	1	3	3182760902	3182820524	59622	311.84	135.74	950.83	432.88	7.51	283.04	0.33	125.99	7036.06	-5661.91	5213.82
Saccade R	1	3	3182760902	3182820524	59622	311.84	135.74	950.83	432.88	7.51	283.04	0.33	125.99	7036.06	-5661.91	5213.82
Fixation L	1	4	3182820524	3182999519	178995	990.92	430.21	51	32	-1	16.26	16.26
Fixation R	1	4	3182820524	3182999519	178995	990.92	430.21	51	32	-1	16.35	16.35
Saccade L	1	4	3182999519	3183019393	19874	1002.39	430.39	1003.37	378.51	0.51	52.49	1.00	25.65	726.83	-1202.42	780.66
Saccade R	1	4	3182999519	3183019393	19874	1002.39	430.39	1003.37	378.51	0.51	52.49	1.00	25.65	726.83	-1202.42	780.66
Fixation L	1	5	3183019393	3183198508	179115	1005.27	378.34	36	54	-1	15.17	15.17
Fixation R	1	5	3183019393	3183198508	179115	1005.27	378.34	36	54	-1	15.09	15.09
Saccade L	1	5	3183198508	3183218374	19866	1011.60	357.69	1001.99	334.06	0.66	41.39	0.00	33.31	-58.86	-298.33	208.83
Saccade R	1	5	3183198508	3183218374	19866	1011.60	357.69	1001.99	334.06	0.66	41.39	0.00	33.31	-58.86	-298.33	208.83
Fixation L	1	6	3183218374	3183635994	417620	1018.91	373.47	39	50	-1	15.22	15.22
Fixation R	1	6	3183218374	3183635994	417620	1018.91	373.47	39	50	-1	15.28	15.28
Saccade L	1	6	3183635994	3183655862	19868	1041.37	383.54	905.11	471.24	1.29	163.88	1.00	64.75	3973.86	-3879.02	3183.41
Saccade R	1	6	3183635994	3183655862	19868	1041.37	383.54	905.11	471.24	1.29	163.88	1.00	64.75	3973.86	-3879.02	3183.41
Fixation L	1	7	3183655862	3183755352	99490	901.99	528.01	6	77	-1	15.83	15.83
Fixation R	1	7	3183655862	3183755352	99490	901.99	528.01	6	77	-1	16.20	16.20
Saccade L	1	7	3183755352	3183775254	19902	900.44	540.85	897.71	581.14	0.60	42.60	1.00	30.24	592.98	-913.55	687.43
Saccade R	1	7	3183755352	3183775254	19902	900.44	540.85	897.71	581.14	0.60	42.60	1.00	30.24	592.98	-913.55	687.43
Fixation L	1	8	3183775254	3184093468	318214	887.95	534.91	15	59	-1	15.66	15.66
Fixation R	1	8	3183775254	3184093468	318214	887.95	534.91	15	59	-1	16.44	16.44
