[BeGaze]
Converted from:	C:\Documents and Settings\iViewX\Desktop\EXPERIMENTATIONS\Experiments\results\finaleart\S3121421-finaleart-1.idf
Date:	27.03.2019 15:33:49
Version:	BeGaze 2.5.77
Sample Rate:	50
Subject:	S3121421
Description:	Jean Jouve

Table Header for Fixations:
Event Type	Trial	Number	Start	End	Duration	Location X	Location Y	Dispersion X	Dispersion Y	Plane	Avg. Pupil Size X	Avg. Pupil Size Y

Table Header for Saccades:
Event Type	Trial	Number	Start	End	Duration	Start Loc.X	Start Loc.Y	End Loc.X	End Loc.Y	Amplitude	Peak Speed	Peak Speed At	Average Speed	Peak Accel.	Peak Decel.	Average Accel.

Table Header for Blinks:
Event Type	Trial	Number	Start	End	Duration

Table Header for User Events:
Event Type	Trial	Number	Start	Description

UserEvent	1	1	3944867647	# Message: void.jpg
Fixation L	1	1	3944877851	3945176451	298600	1478.44	588.35	12	78	-1	11.25	11.25
Fixation R	1	1	3944877851	3945176451	298600	1478.44	588.35	12	78	-1	11.17	11.17
Saccade L	1	1	3945176451	3945196451	20000	1468.75	520.37	1421.25	406.40	1.05	124.89	1.00	52.35	3085.95	-2855.27	2545.15
Saccade R	1	1	3945176451	3945196451	20000	1468.75	520.37	1421.25	406.40	1.05	124.89	1.00	52.35	3085.95	-2855.27	2545.15
Fixation L	1	2	3945196451	3945495053	298602	1411.88	363.39	19	80	-1	11.08	11.08
Fixation R	1	2	3945196451	3945495053	298602	1411.88	363.39	19	80	-1	10.85	10.85
Blink L	1	1	3945495053	3945714185	219132
Blink R	1	1	3945495053	3945714185	219132
Fixation L	1	3	3945714185	3945893423	179238	931.48	657.63	10	65	-1	11.51	11.51
Fixation R	1	3	3945714185	3945893423	179238	931.48	657.63	10	65	-1	13.51	13.51
Saccade L	1	2	3945893423	3945913291	19868	930.25	640.56	942.48	566.90	0.71	75.54	1.00	35.76	1797.42	-1681.67	1217.36
Saccade R	1	2	3945893423	3945913291	19868	930.25	640.56	942.48	566.90	0.71	75.54	1.00	35.76	1797.42	-1681.67	1217.36
Fixation L	1	4	3945913291	3946032778	119487	965.88	560.91	39	9	-1	11.62	11.62
Fixation R	1	4	3945913291	3946032778	119487	965.88	560.91	39	9	-1	13.30	13.30
Saccade L	1	3	3946032778	3946052656	19878	982.22	557.56	924.05	641.05	0.64	102.93	1.00	32.36	2447.60	-2169.35	1575.44
Saccade R	1	3	3946032778	3946052656	19878	982.22	557.56	924.05	641.05	0.64	102.93	1.00	32.36	2447.60	-2169.35	1575.44
Fixation L	1	5	3946052656	3946291645	238989	914.97	632.54	15	49	-1	11.69	11.69
Fixation R	1	5	3946052656	3946291645	238989	914.97	632.54	15	49	-1	13.50	13.50
Saccade L	1	4	3946291645	3946331394	39749	921.69	602.16	1023.24	422.13	2.26	121.18	0.50	56.89	2794.07	-2468.48	2211.13
Saccade R	1	4	3946291645	3946331394	39749	921.69	602.16	1023.24	422.13	2.26	121.18	0.50	56.89	2794.07	-2468.48	2211.13
Fixation L	1	6	3946331394	3946869102	537708	1040.02	449.65	25	39	-1	11.80	11.80
Fixation R	1	6	3946331394	3946869102	537708	1040.02	449.65	25	39	-1	13.78	13.78
