[BeGaze]
Converted from:	C:\Documents and Settings\iViewX\Desktop\EXPERIMENTATIONS\Experiments\results\finaleart\S18F56223-finaleart-1.idf
Date:	27.03.2019 15:48:03
Version:	BeGaze 2.5.77
Sample Rate:	50
Subject:	S18F56223
Description:	Pascale Sebillot

Table Header for Fixations:
Event Type	Trial	Number	Start	End	Duration	Location X	Location Y	Dispersion X	Dispersion Y	Plane	Avg. Pupil Size X	Avg. Pupil Size Y

Table Header for Saccades:
Event Type	Trial	Number	Start	End	Duration	Start Loc.X	Start Loc.Y	End Loc.X	End Loc.Y	Amplitude	Peak Speed	Peak Speed At	Average Speed	Peak Accel.	Peak Decel.	Average Accel.

Table Header for Blinks:
Event Type	Trial	Number	Start	End	Duration

Table Header for User Events:
Event Type	Trial	Number	Start	Description

UserEvent	1	1	2143930466	# Message: the-wood_cross_907.jpg
Saccade L	1	1	2143939401	2144217866	278465	673.08	623.56	685.61	674.74	55.80	451.05	0.14	200.38	11276.13	-9655.33	4412.13
Saccade R	1	1	2143939401	2144217866	278465	673.08	623.56	685.61	674.74	55.80	451.05	0.14	200.38	11276.13	-9655.33	4412.13
Fixation L	1	1	2144217866	2144337265	119399	679.51	674.39	30	38	-1	14.09	14.09
Fixation R	1	1	2144217866	2144337265	119399	679.51	674.39	30	38	-1	14.47	14.47
Saccade L	1	2	2144337265	2144536102	198837	693.32	684.35	1119.34	786.21	19.63	255.69	0.60	98.71	6383.16	-5410.81	3767.38
Saccade R	1	2	2144337265	2144536102	198837	693.32	684.35	1119.34	786.21	19.63	255.69	0.60	98.71	6383.16	-5410.81	3767.38
Fixation L	1	2	2144536102	2144834467	298365	1115.85	767.96	37	46	-1	11.63	11.63
Fixation R	1	2	2144536102	2144834467	298365	1115.85	767.96	37	46	-1	13.16	13.16
Saccade L	1	3	2144834467	2144874211	39744	1115.20	770.38	988.35	778.93	1.65	140.84	0.50	41.39	3411.86	-2650.33	1686.93
Saccade R	1	3	2144834467	2144874211	39744	1115.20	770.38	988.35	778.93	1.65	140.84	0.50	41.39	3411.86	-2650.33	1686.93
Fixation L	1	3	2144874211	2145053198	178987	1011.45	805.81	45	50	-1	11.68	11.68
Fixation R	1	3	2144874211	2145053198	178987	1011.45	805.81	45	50	-1	12.66	12.66
Saccade L	1	4	2145053198	2145152722	99524	1020.62	819.37	1487.75	796.54	19.44	474.71	0.80	195.38	9213.90	-11730.45	7628.84
Saccade R	1	4	2145053198	2145152722	99524	1020.62	819.37	1487.75	796.54	19.44	474.71	0.80	195.38	9213.90	-11730.45	7628.84
Fixation L	1	4	2145152722	2145331685	178963	1462.75	791.30	42	26	-1	13.08	13.08
Fixation R	1	4	2145152722	2145331685	178963	1462.75	791.30	42	26	-1	13.38	13.38
Saccade L	1	5	2145331685	2145351568	19883	1463.31	780.32	1478.44	649.30	0.79	133.39	1.00	39.74	2982.77	-3169.98	2083.63
Saccade R	1	5	2145331685	2145351568	19883	1463.31	780.32	1478.44	649.30	0.79	133.39	1.00	39.74	2982.77	-3169.98	2083.63
Fixation L	1	5	2145351568	2145530568	179000	1486.97	653.13	17	9	-1	13.22	13.22
Fixation R	1	5	2145351568	2145530568	179000	1486.97	653.13	17	9	-1	12.96	12.96
Saccade L	1	6	2145530568	2146485261	954693	1492.67	659.18	1466.02	1063.38	154.88	619.07	0.21	162.23	13092.91	-11257.33	3917.40
Saccade R	1	6	2145530568	2146485261	954693	1492.67	659.18	1466.02	1063.38	154.88	619.07	0.21	162.23	13092.91	-11257.33	3917.40
Fixation L	1	6	2146485261	2146763754	278493	1456.68	1081.83	36	25	-1	13.43	13.43
Fixation R	1	6	2146485261	2146763754	278493	1456.68	1081.83	36	25	-1	14.50	14.50
Saccade L	1	7	2146763754	2146843375	79621	1461.82	1080.56	887.08	731.00	11.13	313.36	0.50	139.83	7756.64	-5151.25	4373.53
Saccade R	1	7	2146763754	2146843375	79621	1461.82	1080.56	887.08	731.00	11.13	313.36	0.50	139.83	7756.64	-5151.25	4373.53
Fixation L	1	7	2146843375	2146962614	119239	883.25	695.87	13	86	-1	13.82	13.82
Fixation R	1	7	2146843375	2146962614	119239	883.25	695.87	13	86	-1	13.84	13.84
Saccade L	1	8	2146962614	2147320733	358119	889.26	648.24	1003.94	317.95	73.49	611.24	1.00	205.20	15161.53	-14562.97	6922.32
Saccade R	1	8	2146962614	2147320733	358119	889.26	648.24	1003.94	317.95	73.49	611.24	1.00	205.20	15161.53	-14562.97	6922.32
Fixation L	1	8	2147320733	2147440093	119360	1008.50	345.61	9	69	-1	12.82	12.82
Fixation R	1	8	2147320733	2147440093	119360	1008.50	345.61	9	69	-1	13.13	13.13
Saccade L	1	9	2147440093	2147519593	79500	1005.73	369.95	634.99	309.81	18.92	616.05	0.50	238.04	15262.54	-10381.74	9626.30
Saccade R	1	9	2147440093	2147519593	79500	1005.73	369.95	634.99	309.81	18.92	616.05	0.50	238.04	15262.54	-10381.74	9626.30
Fixation L	1	9	2147519593	2147638968	119375	637.52	334.42	18	56	-1	13.20	13.20
Fixation R	1	9	2147519593	2147638968	119375	637.52	334.42	18	56	-1	13.56	13.56
Saccade L	1	10	2147638968	2147658841	19873	639.85	355.60	637.28	403.12	0.64	48.15	1.00	32.18	783.83	302.59	526.97
Saccade R	1	10	2147638968	2147658841	19873	639.85	355.60	637.28	403.12	0.64	48.15	1.00	32.18	783.83	302.59	526.97
Fixation L	1	10	2147658841	2147917448	258607	641.40	420.11	14	70	-1	13.48	13.48
Fixation R	1	10	2147658841	2147917448	258607	641.40	420.11	14	70	-1	14.04	14.04
