[BeGaze]
Converted from:	C:\Documents and Settings\iViewX\Desktop\EXPERIMENTATIONS\Experiments\results\finaleart\S01A22542-finaleart-1.idf
Date:	27.03.2019 15:33:26
Version:	BeGaze 2.5.77
Sample Rate:	50
Subject:	S01A22542
Description:	Thibault Seve Minnaert

Table Header for Fixations:
Event Type	Trial	Number	Start	End	Duration	Location X	Location Y	Dispersion X	Dispersion Y	Plane	Avg. Pupil Size X	Avg. Pupil Size Y

Table Header for Saccades:
Event Type	Trial	Number	Start	End	Duration	Start Loc.X	Start Loc.Y	End Loc.X	End Loc.Y	Amplitude	Peak Speed	Peak Speed At	Average Speed	Peak Accel.	Peak Decel.	Average Accel.

Table Header for Blinks:
Event Type	Trial	Number	Start	End	Duration

Table Header for User Events:
Event Type	Trial	Number	Start	Description

UserEvent	1	1	10056072646	# Message: void.jpg
Fixation L	1	1	10056077205	10056435176	357971	876.30	728.92	17	80	-1	13.22	13.22
Fixation R	1	1	10056077205	10056435176	357971	876.30	728.92	17	80	-1	13.56	13.56
Saccade L	1	1	10056435176	10056455056	19880	888.86	703.80	898.24	695.49	0.19	12.68	1.00	9.50	213.84	-13.12	91.62
Saccade R	1	1	10056435176	10056455056	19880	888.86	703.80	898.24	695.49	0.19	12.68	1.00	9.50	213.84	-13.12	91.62
Fixation L	1	2	10056455056	10056614167	159111	906.78	689.44	14	18	-1	12.98	12.98
Fixation R	1	2	10056455056	10056614167	159111	906.78	689.44	14	18	-1	13.80	13.80
Blink L	1	1	10056614167	10056872791	258624
Blink R	1	1	10056614167	10056872791	258624
Fixation L	1	3	10056872791	10057012021	139230	897.80	511.66	16	33	-1	12.78	12.78
Fixation R	1	3	10056872791	10057012021	139230	897.80	511.66	16	33	-1	13.43	13.43
Saccade L	1	2	10057012021	10057031903	19882	903.11	519.68	881.05	386.38	0.84	136.66	1.00	42.00	3269.09	-3083.84	2314.00
Saccade R	1	2	10057012021	10057031903	19882	903.11	519.68	881.05	386.38	0.84	136.66	1.00	42.00	3269.09	-3083.84	2314.00
Fixation L	1	4	10057031903	10057191014	159111	859.35	356.72	39	41	-1	12.99	12.99
Fixation R	1	4	10057031903	10057191014	159111	859.35	356.72	39	41	-1	13.79	13.79
Saccade L	1	3	10057191014	10057250771	59757	841.94	344.41	1036.20	591.17	3.51	174.01	0.67	58.73	4273.00	-3922.24	2446.04
Saccade R	1	3	10057191014	10057250771	59757	841.94	344.41	1036.20	591.17	3.51	174.01	0.67	58.73	4273.00	-3922.24	2446.04
Fixation L	1	5	10057250771	10057389881	139110	1054.37	581.15	25	16	-1	13.52	13.52
Fixation R	1	5	10057250771	10057389881	139110	1054.37	581.15	25	16	-1	13.97	13.97
Saccade L	1	4	10057389881	10057409887	20006	1062.18	574.19	954.03	572.40	0.95	109.42	1.00	47.50	2730.66	-2680.22	2385.23
Saccade R	1	4	10057389881	10057409887	20006	1062.18	574.19	954.03	572.40	0.95	109.42	1.00	47.50	2730.66	-2680.22	2385.23
Fixation L	1	6	10057409887	10057648493	238606	883.48	561.53	79	19	-1	13.48	13.48
Fixation R	1	6	10057409887	10057648493	238606	883.48	561.53	79	19	-1	13.85	13.85
Saccade L	1	5	10057648493	10057708242	59749	874.94	553.23	897.28	548.44	0.94	60.79	1.00	15.80	1439.58	-242.39	462.75
Saccade R	1	5	10057648493	10057708242	59749	874.94	553.23	897.28	548.44	0.94	60.79	1.00	15.80	1439.58	-242.39	462.75
Fixation L	1	7	10057708242	10057847370	139128	968.08	548.71	90	8	-1	13.78	13.78
Fixation R	1	7	10057708242	10057847370	139128	968.08	548.71	90	8	-1	13.81	13.81
Saccade L	1	6	10057847370	10057867359	19989	987.16	554.66	984.74	561.75	0.10	7.58	1.00	5.09	139.71	-92.63	96.79
Saccade R	1	6	10057847370	10057867359	19989	987.16	554.66	984.74	561.75	0.10	7.58	1.00	5.09	139.71	-92.63	96.79
Fixation L	1	8	10057867359	10058066218	198859	983.84	575.93	8	31	-1	14.30	14.30
Fixation R	1	8	10057867359	10058066218	198859	983.84	575.93	8	31	-1	14.38	14.38
