[BeGaze]
Converted from:	C:\Documents and Settings\iViewX\Desktop\EXPERIMENTATIONS\Experiments\results\finaleart\S11H21112-finaleart-1.idf
Date:	27.03.2019 15:38:40
Version:	BeGaze 2.5.77
Sample Rate:	50
Subject:	S11H21112
Description:	Clement legrand-Duchenne

Table Header for Fixations:
Event Type	Trial	Number	Start	End	Duration	Location X	Location Y	Dispersion X	Dispersion Y	Plane	Avg. Pupil Size X	Avg. Pupil Size Y

Table Header for Saccades:
Event Type	Trial	Number	Start	End	Duration	Start Loc.X	Start Loc.Y	End Loc.X	End Loc.Y	Amplitude	Peak Speed	Peak Speed At	Average Speed	Peak Accel.	Peak Decel.	Average Accel.

Table Header for Blinks:
Event Type	Trial	Number	Start	End	Duration

Table Header for User Events:
Event Type	Trial	Number	Start	Description

UserEvent	1	1	4013176203	# Message: sisley-still-life-heron-with-spread-wings-1867.jpg
Fixation L	1	1	4013182804	4013461282	278478	491.43	994.59	16	29	-1	15.57	15.57
Fixation R	1	1	4013182804	4013461282	278478	491.43	994.59	16	29	-1	18.71	18.71
Saccade L	1	1	4013461282	4013520909	59627	496.82	989.48	875.80	867.83	4.23	193.76	0.67	70.91	4827.57	-4627.05	3073.38
Saccade R	1	1	4013461282	4013520909	59627	496.82	989.48	875.80	867.83	4.23	193.76	0.67	70.91	4827.57	-4627.05	3073.38
Fixation L	1	2	4013520909	4013680138	159229	859.84	861.83	21	10	-1	16.51	16.51
Fixation R	1	2	4013520909	4013680138	159229	859.84	861.83	21	10	-1	19.37	19.37
Saccade L	1	2	4013680138	4013700021	19883	855.49	860.58	940.03	819.96	0.53	94.88	1.00	26.53	2290.94	-1932.30	1431.94
Saccade R	1	2	4013680138	4013700021	19883	855.49	860.58	940.03	819.96	0.53	94.88	1.00	26.53	2290.94	-1932.30	1431.94
Fixation L	1	3	4013700021	4013859136	159115	945.11	806.60	12	35	-1	16.13	16.13
Fixation R	1	3	4013700021	4013859136	159115	945.11	806.60	12	35	-1	18.92	18.92
Saccade L	1	3	4013859136	4013879012	19876	945.41	788.89	843.46	643.40	1.31	179.66	1.00	66.14	4272.29	-4442.86	3425.86
Saccade R	1	3	4013859136	4013879012	19876	945.41	788.89	843.46	643.40	1.31	179.66	1.00	66.14	4272.29	-4442.86	3425.86
Fixation L	1	4	4013879012	4014058005	178993	832.14	582.65	15	77	-1	15.08	15.08
Fixation R	1	4	4013879012	4014058005	178993	832.14	582.65	15	77	-1	17.91	17.91
Saccade L	1	4	4014058005	4014097754	39749	828.13	579.12	694.62	856.82	2.72	217.96	0.50	68.40	5336.14	-5287.01	3878.85
Saccade R	1	4	4014058005	4014097754	39749	828.13	579.12	694.62	856.82	2.72	217.96	0.50	68.40	5336.14	-5287.01	3878.85
Fixation L	1	5	4014097754	4014296619	198865	684.93	849.10	20	46	-1	15.07	15.07
Fixation R	1	5	4014097754	4014296619	198865	684.93	849.10	20	46	-1	17.65	17.65
Saccade L	1	5	4014296619	4014316625	20006	674.43	871.40	674.38	908.19	0.46	37.21	1.00	22.94	386.60	-840.92	441.27
Saccade R	1	5	4014296619	4014316625	20006	674.43	871.40	674.38	908.19	0.46	37.21	1.00	22.94	386.60	-840.92	441.27
Fixation L	1	6	4014316625	4014515477	198852	660.50	903.93	28	23	-1	15.11	15.11
Fixation R	1	6	4014316625	4014515477	198852	660.50	903.93	28	23	-1	17.51	17.51
Saccade L	1	6	4014515477	4014535375	19898	646.07	915.58	571.73	916.76	0.53	75.21	1.00	26.84	1804.52	-1750.15	1217.18
Saccade R	1	6	4014515477	4014535375	19898	646.07	915.58	571.73	916.76	0.53	75.21	1.00	26.84	1804.52	-1750.15	1217.18
Fixation L	1	7	4014535375	4014953087	417712	581.01	948.32	18	50	-1	15.83	15.83
Fixation R	1	7	4014535375	4014953087	417712	581.01	948.32	18	50	-1	18.20	18.20
Saccade L	1	7	4014953087	4014972966	19879	589.26	967.21	481.01	957.74	0.65	109.91	1.00	32.56	2715.11	-2731.04	1858.79
Saccade R	1	7	4014953087	4014972966	19879	589.26	967.21	481.01	957.74	0.65	109.91	1.00	32.56	2715.11	-2731.04	1858.79
Fixation L	1	8	4014972966	4015529812	556846	447.66	948.16	76	15	-1	16.13	16.13
Fixation R	1	8	4014972966	4015529812	556846	447.66	948.16	76	15	-1	19.25	19.25
Saccade L	1	8	4015529812	4015549821	20009	485.23	952.44	691.16	953.45	1.53	208.23	1.00	76.66	5168.48	-4912.07	3837.10
Saccade R	1	8	4015529812	4015549821	20009	485.23	952.44	691.16	953.45	1.53	208.23	1.00	76.66	5168.48	-4912.07	3837.10
Fixation L	1	9	4015549821	4015907814	357993	717.30	959.09	30	10	-1	17.31	17.31
Fixation R	1	9	4015549821	4015907814	357993	717.30	959.09	30	10	-1	20.02	20.02
Saccade L	1	9	4015907814	4015947544	39730	716.71	955.80	1013.33	761.24	3.11	247.99	1.00	78.26	6150.91	-5965.04	4386.34
Saccade R	1	9	4015907814	4015947544	39730	716.71	955.80	1013.33	761.24	3.11	247.99	1.00	78.26	6150.91	-5965.04	4386.34
Fixation L	1	10	4015947544	4016265782	318238	1043.34	758.72	56	41	-1	16.80	16.80
Fixation R	1	10	4015947544	4016265782	318238	1043.34	758.72	56	41	-1	19.52	19.52
Saccade L	1	10	4016265782	4016405026	139244	1069.80	742.48	807.62	526.33	6.17	204.64	0.86	44.29	5010.80	-4782.94	1996.55
Saccade R	1	10	4016265782	4016405026	139244	1069.80	742.48	807.62	526.33	6.17	204.64	0.86	44.29	5010.80	-4782.94	1996.55
Fixation L	1	11	4016405026	4016623767	218741	812.69	537.71	8	18	-1	15.59	15.59
Fixation R	1	11	4016405026	4016623767	218741	812.69	537.71	8	18	-1	18.37	18.37
Saccade L	1	11	4016623767	4016643775	20008	813.98	539.09	812.38	324.82	1.26	216.67	1.00	63.10	5332.83	-5094.62	3650.71
Saccade R	1	11	4016623767	4016643775	20008	813.98	539.09	812.38	324.82	1.26	216.67	1.00	63.10	5332.83	-5094.62	3650.71
Fixation L	1	12	4016643775	4017021639	377864	812.73	323.41	13	34	-1	15.18	15.18
Fixation R	1	12	4016643775	4017021639	377864	812.73	323.41	13	34	-1	17.24	17.24
Saccade L	1	12	4017021639	4017041497	19858	811.76	330.69	808.33	399.51	0.61	69.70	1.00	30.89	1574.00	-1277.40	1231.68
Saccade R	1	12	4017021639	4017041497	19858	811.76	330.69	808.33	399.51	0.61	69.70	1.00	30.89	1574.00	-1277.40	1231.68
Fixation L	1	13	4017041497	4017180750	139253	793.14	446.82	25	64	-1	14.98	14.98
Fixation R	1	13	4017041497	4017180750	139253	793.14	446.82	25	64	-1	17.68	17.68
