[BeGaze]
Converted from:	C:\Documents and Settings\iViewX\Desktop\EXPERIMENTATIONS\Experiments\results\finaleart\S02123220-finaleart-1.idf
Date:	27.03.2019 15:33:29
Version:	BeGaze 2.5.77
Sample Rate:	50
Subject:	S02123220
Description:	David Xu

Table Header for Fixations:
Event Type	Trial	Number	Start	End	Duration	Location X	Location Y	Dispersion X	Dispersion Y	Plane	Avg. Pupil Size X	Avg. Pupil Size Y

Table Header for Saccades:
Event Type	Trial	Number	Start	End	Duration	Start Loc.X	Start Loc.Y	End Loc.X	End Loc.Y	Amplitude	Peak Speed	Peak Speed At	Average Speed	Peak Accel.	Peak Decel.	Average Accel.

Table Header for Blinks:
Event Type	Trial	Number	Start	End	Duration

Table Header for User Events:
Event Type	Trial	Number	Start	Description

UserEvent	1	1	452447662	# Message: Sailboats_On_The_River_Sheldt_van_Rysselberghe_1892.jpg
Fixation L	1	1	452459400	452877004	417604	839.92	526.43	63	16	-1	16.62	16.62
Fixation R	1	1	452459400	452877004	417604	839.92	526.43	63	16	-1	16.53	16.53
Saccade L	1	1	452877004	452897001	19997	892.98	529.08	1036.47	528.08	0.99	145.13	1.00	49.75	3506.26	-3531.03	2728.23
Saccade R	1	1	452877004	452897001	19997	892.98	529.08	1036.47	528.08	0.99	145.13	1.00	49.75	3506.26	-3531.03	2728.23
Fixation L	1	2	452897001	453095863	198862	1034.57	521.79	15	59	-1	14.99	14.99
Fixation R	1	2	452897001	453095863	198862	1034.57	521.79	15	59	-1	14.41	14.41
Saccade L	1	2	453095863	453115737	19874	1041.76	472.21	1164.02	389.83	1.13	149.11	1.00	56.99	3495.90	-3417.26	2443.05
Saccade R	1	2	453095863	453115737	19874	1041.76	472.21	1164.02	389.83	1.13	149.11	1.00	56.99	3495.90	-3417.26	2443.05
Fixation L	1	3	453115737	453215222	99485	1163.54	404.37	20	23	-1	12.61	12.61
Fixation R	1	3	453115737	453215222	99485	1163.54	404.37	20	23	-1	11.90	11.90
Saccade L	1	3	453215222	453254985	39763	1168.24	399.58	966.08	466.86	2.07	159.83	0.50	51.95	3828.81	-3710.23	2691.23
Saccade R	1	3	453215222	453254985	39763	1168.24	399.58	966.08	466.86	2.07	159.83	0.50	51.95	3828.81	-3710.23	2691.23
Fixation L	1	4	453254985	453453841	198856	949.60	459.61	22	27	-1	11.20	11.20
Fixation R	1	4	453254985	453453841	198856	949.60	459.61	22	27	-1	11.10	11.10
Saccade L	1	4	453453841	453493590	39749	948.10	465.11	1188.07	366.56	2.35	138.60	1.00	59.18	3410.85	-3397.19	3318.69
Saccade R	1	4	453453841	453493590	39749	948.10	465.11	1188.07	366.56	2.35	138.60	1.00	59.18	3410.85	-3397.19	3318.69
Fixation L	1	5	453493590	453851694	358104	1202.92	370.17	21	20	-1	11.34	11.34
Fixation R	1	5	453493590	453851694	358104	1202.92	370.17	21	20	-1	10.91	10.91
Saccade L	1	5	453851694	453871570	19876	1196.88	380.62	1303.97	492.24	0.88	156.45	1.00	44.07	3853.66	-3802.01	2603.34
Saccade R	1	5	453851694	453871570	19876	1196.88	380.62	1303.97	492.24	0.88	156.45	1.00	44.07	3853.66	-3802.01	2603.34
Fixation L	1	6	453871570	454488149	616579	1306.79	519.27	49	47	-1	13.37	13.37
Fixation R	1	6	453871570	454488149	616579	1306.79	519.27	49	47	-1	12.31	12.31
Saccade L	1	6	454488149	454508041	19892	1270.54	510.66	1074.28	506.07	1.29	198.52	1.00	65.03	4758.67	-4889.01	3609.49
Saccade R	1	6	454488149	454508041	19892	1270.54	510.66	1074.28	506.07	1.29	198.52	1.00	65.03	4758.67	-4889.01	3609.49
Fixation L	1	7	454508041	454687016	178975	1070.25	498.90	5	12	-1	14.04	14.04
Fixation R	1	7	454508041	454687016	178975	1070.25	498.90	5	12	-1	13.05	13.05
Saccade L	1	7	454687016	454726755	39739	1069.42	493.93	1264.85	355.74	2.30	146.37	1.00	57.91	3635.14	-3608.87	2802.55
Saccade R	1	7	454687016	454726755	39739	1069.42	493.93	1264.85	355.74	2.30	146.37	1.00	57.91	3635.14	-3608.87	2802.55
Fixation L	1	8	454726755	455144480	417725	1228.03	359.49	54	39	-1	14.18	14.18
Fixation R	1	8	454726755	455144480	417725	1228.03	359.49	54	39	-1	13.08	13.08
Saccade L	1	8	455144480	455164356	19876	1272.11	389.32	1376.60	473.56	1.09	135.76	1.00	54.82	3321.35	-2698.17	2291.83
Saccade R	1	8	455144480	455164356	19876	1272.11	389.32	1376.60	473.56	1.09	135.76	1.00	54.82	3321.35	-2698.17	2291.83
Fixation L	1	9	455164356	455502465	338109	1367.38	531.65	28	71	-1	15.01	15.01
Fixation R	1	9	455164356	455502465	338109	1367.38	531.65	28	71	-1	13.39	13.39
Saccade L	1	9	455502465	455601958	99493	1374.42	545.11	1309.77	695.48	2.43	106.08	1.00	24.44	2626.28	-2443.46	1125.53
Saccade R	1	9	455502465	455601958	99493	1374.42	545.11	1309.77	695.48	2.43	106.08	1.00	24.44	2626.28	-2443.46	1125.53
Fixation L	1	10	455601958	455761072	159114	1296.85	710.29	18	19	-1	15.19	15.19
Fixation R	1	10	455601958	455761072	159114	1296.85	710.29	18	19	-1	13.01	13.01
Saccade L	1	10	455761072	455860571	99499	1291.32	714.53	1239.03	1016.13	6.12	189.36	0.20	61.55	4711.97	-3692.30	2337.70
Saccade R	1	10	455761072	455860571	99499	1291.32	714.53	1239.03	1016.13	6.12	189.36	0.20	61.55	4711.97	-3692.30	2337.70
Fixation L	1	11	455860571	455979808	119237	1241.52	1036.61	7	42	-1	15.29	15.29
Fixation R	1	11	455860571	455979808	119237	1241.52	1036.61	7	42	-1	12.18	12.18
Saccade L	1	11	455979808	456039562	59754	1238.38	1042.31	1246.99	373.44	7.20	330.48	0.67	120.46	7846.27	-7964.71	4810.70
Saccade R	1	11	455979808	456039562	59754	1238.38	1042.31	1246.99	373.44	7.20	330.48	0.67	120.46	7846.27	-7964.71	4810.70
Fixation L	1	12	456039562	456437278	397716	1250.32	372.98	13	28	-1	13.67	13.67
Fixation R	1	12	456039562	456437278	397716	1250.32	372.98	13	28	-1	12.43	12.43
