[BeGaze]
Converted from:	C:\Documents and Settings\iViewX\Desktop\EXPERIMENTATIONS\Experiments\results\finaleart\S13H22431-finaleart-1.idf
Date:	27.03.2019 15:42:05
Version:	BeGaze 2.5.77
Sample Rate:	50
Subject:	S13H22431
Description:	Jimmy Petit

Table Header for Fixations:
Event Type	Trial	Number	Start	End	Duration	Location X	Location Y	Dispersion X	Dispersion Y	Plane	Avg. Pupil Size X	Avg. Pupil Size Y

Table Header for Saccades:
Event Type	Trial	Number	Start	End	Duration	Start Loc.X	Start Loc.Y	End Loc.X	End Loc.Y	Amplitude	Peak Speed	Peak Speed At	Average Speed	Peak Accel.	Peak Decel.	Average Accel.

Table Header for Blinks:
Event Type	Trial	Number	Start	End	Duration

Table Header for User Events:
Event Type	Trial	Number	Start	Description

UserEvent	1	1	28036367491	# Message: void.jpg
Fixation L	1	1	28036387331	28036884538	497207	507.28	419.56	36	34	-1	15.63	15.63
Fixation R	1	1	28036387331	28036884538	497207	507.28	419.56	36	34	-1	17.20	17.20
Saccade L	1	1	28036884538	28036904407	19869	529.59	443.60	552.48	594.62	1.10	154.48	1.00	55.45	3774.29	-3083.62	2725.76
Saccade R	1	1	28036884538	28036904407	19869	529.59	443.60	552.48	594.62	1.10	154.48	1.00	55.45	3774.29	-3083.62	2725.76
Fixation L	1	2	28036904407	28037282394	377987	553.74	600.40	18	81	-1	13.83	13.83
Fixation R	1	2	28036904407	28037282394	377987	553.74	600.40	18	81	-1	16.11	16.11
Saccade L	1	2	28037282394	28037342020	59626	544.05	574.40	673.70	582.35	2.03	118.61	1.00	34.10	2842.87	-2893.89	1366.43
Saccade R	1	2	28037282394	28037342020	59626	544.05	574.40	673.70	582.35	2.03	118.61	1.00	34.10	2842.87	-2893.89	1366.43
Fixation L	1	3	28037342020	28037481261	139241	711.05	601.92	46	36	-1	13.29	13.29
Fixation R	1	3	28037342020	28037481261	139241	711.05	601.92	46	36	-1	15.69	15.69
Saccade L	1	3	28037481261	28037501133	19872	717.13	618.63	726.06	635.36	0.17	19.18	1.00	8.61	371.46	28.04	173.81
Saccade R	1	3	28037481261	28037501133	19872	717.13	618.63	726.06	635.36	0.17	19.18	1.00	8.61	371.46	28.04	173.81
Fixation L	1	4	28037501133	28037898871	397738	726.77	643.57	31	26	-1	14.68	14.68
Fixation R	1	4	28037501133	28037898871	397738	726.77	643.57	31	26	-1	16.71	16.71
Saccade L	1	4	28037898871	28037918867	19996	708.89	634.35	596.49	644.13	0.76	114.12	1.00	37.91	2796.78	-2273.14	1909.58
Saccade R	1	4	28037898871	28037918867	19996	708.89	634.35	596.49	644.13	0.76	114.12	1.00	37.91	2796.78	-2273.14	1909.58
Fixation L	1	5	28037918867	28038197233	278366	585.33	684.14	25	58	-1	15.25	15.25
Fixation R	1	5	28037918867	28038197233	278366	585.33	684.14	25	58	-1	17.22	17.22
Saccade L	1	5	28038197233	28038217228	19995	593.84	702.94	588.32	742.63	0.48	47.40	1.00	24.20	1114.82	-990.08	988.74
Saccade R	1	5	28038197233	28038217228	19995	593.84	702.94	588.32	742.63	0.48	47.40	1.00	24.20	1114.82	-990.08	988.74
Fixation L	1	6	28038217228	28038356349	139121	594.74	783.38	13	74	-1	15.39	15.39
Fixation R	1	6	28038217228	28038356349	139121	594.74	783.38	13	74	-1	17.29	17.29
