[BeGaze]
Converted from:	C:\Documents and Settings\iViewX\Desktop\EXPERIMENTATIONS\Experiments\results\finaleart\S6124332-finaleart-1.idf
Date:	27.03.2019 15:35:47
Version:	BeGaze 2.5.77
Sample Rate:	50
Subject:	S6124332
Description:	Romain Ferrand

Table Header for Fixations:
Event Type	Trial	Number	Start	End	Duration	Location X	Location Y	Dispersion X	Dispersion Y	Plane	Avg. Pupil Size X	Avg. Pupil Size Y

Table Header for Saccades:
Event Type	Trial	Number	Start	End	Duration	Start Loc.X	Start Loc.Y	End Loc.X	End Loc.Y	Amplitude	Peak Speed	Peak Speed At	Average Speed	Peak Accel.	Peak Decel.	Average Accel.

Table Header for Blinks:
Event Type	Trial	Number	Start	End	Duration

Table Header for User Events:
Event Type	Trial	Number	Start	Description

UserEvent	1	1	11727892285	# Message: void.jpg
Saccade L	1	1	11727908716	11728167318	258602	1079.94	521.49	1316.74	842.08	26.54	364.28	0.08	102.64	4251.82	-6823.07	2625.73
Blink R	1	1	11727908716	11728028084	119368
Saccade R	1	1	11728028084	11728167318	139234	1503.59	756.95	1316.74	842.08	11.96	176.90	0.30	85.88	4251.82	-4335.55	2484.34
Fixation L	1	1	11728167318	11728923153	755835	1313.22	848.30	15	22	-1	19.28	19.28
Fixation R	1	1	11728167318	11728923153	755835	1313.22	848.30	15	22	-1	18.41	18.41
Saccade L	1	2	11728923153	11728962904	39751	1318.21	839.42	1342.47	1149.66	2.86	164.39	0.50	71.99	4090.23	-3157.07	3501.81
Saccade R	1	2	11728923153	11728962904	39751	1318.21	839.42	1342.47	1149.66	2.86	164.39	0.50	71.99	4090.23	-3157.07	3501.81
Fixation L	1	2	11728962904	11729241382	278478	1351.31	1203.33	28	68	-1	18.39	18.39
Fixation R	1	2	11728962904	11729241382	278478	1351.31	1203.33	28	68	-1	17.47	17.47
Saccade L	1	3	11729241382	11729440259	198877	1363.47	1200.07	1285.22	640.24	9.68	211.96	0.80	48.67	3705.32	-3470.21	1517.37
Saccade R	1	3	11729241382	11729440259	198877	1363.47	1200.07	1285.22	640.24	9.68	211.96	0.80	48.67	3705.32	-3470.21	1517.37
Fixation L	1	3	11729440259	11729738605	298346	1270.09	643.39	21	19	-1	17.77	17.77
Fixation R	1	3	11729440259	11729738605	298346	1270.09	643.39	21	19	-1	17.36	17.36
Saccade L	1	4	11729738605	11729778346	39741	1269.64	641.85	1077.18	662.98	1.78	111.42	1.00	44.77	2483.98	-2731.53	2263.05
Saccade R	1	4	11729738605	11729778346	39741	1269.64	641.85	1077.18	662.98	1.78	111.42	1.00	44.77	2483.98	-2731.53	2263.05
Fixation L	1	4	11729778346	11729917590	139244	1089.32	662.64	18	7	-1	17.66	17.66
Fixation R	1	4	11729778346	11729917590	139244	1089.32	662.64	18	7	-1	16.72	16.72
