[BeGaze]
Converted from:	C:\Documents and Settings\iViewX\Desktop\EXPERIMENTATIONS\Experiments\results\finaleart\S5121332-finaleart-1.idf
Date:	27.03.2019 15:35:24
Version:	BeGaze 2.5.77
Sample Rate:	50
Subject:	S5121332
Description:	Dylan Marinho

Table Header for Fixations:
Event Type	Trial	Number	Start	End	Duration	Location X	Location Y	Dispersion X	Dispersion Y	Plane	Avg. Pupil Size X	Avg. Pupil Size Y

Table Header for Saccades:
Event Type	Trial	Number	Start	End	Duration	Start Loc.X	Start Loc.Y	End Loc.X	End Loc.Y	Amplitude	Peak Speed	Peak Speed At	Average Speed	Peak Accel.	Peak Decel.	Average Accel.

Table Header for Blinks:
Event Type	Trial	Number	Start	End	Duration

Table Header for User Events:
Event Type	Trial	Number	Start	Description

UserEvent	1	1	10097843866	# Message: void.jpg
Fixation L	1	1	10097852909	10098171150	318241	389.38	709.90	10	28	-1	15.34	15.34
Fixation R	1	1	10097852909	10098171150	318241	389.38	709.90	10	28	-1	14.79	14.79
Blink L	1	1	10098171150	10098290374	119224
Blink R	1	1	10098171150	10098290374	119224
Saccade L	1	1	10098290374	10098310241	19867	642.31	715.49	644.43	709.15	4.31	456.00	1.00	217.06	34220.58	-9516.24	18228.51
Saccade R	1	1	10098290374	10098310241	19867	642.31	715.49	644.43	709.15	4.31	456.00	1.00	217.06	34220.58	-9516.24	18228.51
Blink L	1	2	10098310241	10098548981	238740
Blink R	1	2	10098310241	10098548981	238740
Fixation L	1	2	10098548981	10098688229	139248	1082.18	423.93	8	3	-1	14.23	14.23
Fixation R	1	2	10098548981	10098688229	139248	1082.18	423.93	8	3	-1	14.36	14.36
Blink L	1	3	10098688229	10098807609	119380
Blink R	1	3	10098688229	10098807609	119380
Fixation L	1	3	10098807609	10099284943	477334	1053.45	430.23	32	39	-1	14.78	14.78
Fixation R	1	3	10098807609	10099284943	477334	1053.45	430.23	32	39	-1	14.77	14.77
Saccade L	1	2	10099284943	10099304814	19871	1047.92	429.43	969.13	438.76	0.59	80.26	1.00	29.76	1883.51	-1610.27	1347.86
Saccade R	1	2	10099284943	10099304814	19871	1047.92	429.43	969.13	438.76	0.59	80.26	1.00	29.76	1883.51	-1610.27	1347.86
Fixation L	1	4	10099304814	10099901535	596721	939.20	480.92	34	57	-1	15.26	15.26
Fixation R	1	4	10099304814	10099901535	596721	939.20	480.92	34	57	-1	14.60	14.60
