[BeGaze]
Converted from:	C:\Documents and Settings\iViewX\Desktop\EXPERIMENTATIONS\Experiments\results\finaleart\S14F27123-finaleart-1.idf
Date:	27.03.2019 15:43:57
Version:	BeGaze 2.5.77
Sample Rate:	50
Subject:	S14F27123
Description:	Anne-flore Perrin

Table Header for Fixations:
Event Type	Trial	Number	Start	End	Duration	Location X	Location Y	Dispersion X	Dispersion Y	Plane	Avg. Pupil Size X	Avg. Pupil Size Y

Table Header for Saccades:
Event Type	Trial	Number	Start	End	Duration	Start Loc.X	Start Loc.Y	End Loc.X	End Loc.Y	Amplitude	Peak Speed	Peak Speed At	Average Speed	Peak Accel.	Peak Decel.	Average Accel.

Table Header for Blinks:
Event Type	Trial	Number	Start	End	Duration

Table Header for User Events:
Event Type	Trial	Number	Start	Description

UserEvent	1	1	31553466217	# Message: les_poseuses_seurat_1888.jpg
Saccade L	1	1	31553476910	31553496774	19864	819.52	742.31	817.90	736.90	7.32	1099.98	1.00	368.56	27499.58	-142.71	9214.10
Saccade R	1	1	31553476910	31553496774	19864	819.52	742.31	817.90	736.90	7.32	1099.98	1.00	368.56	27499.58	-142.71	9214.10
Blink L	1	1	31553496774	31553675777	179003
Blink R	1	1	31553496774	31553675777	179003
Blink L	1	2	31553775265	31554053630	278365
Blink R	1	2	31553775265	31554053630	278365
Blink L	1	3	31554073629	31554173000	99371
Blink R	1	3	31554073629	31554173000	99371
Saccade L	1	2	31554232742	31554252617	19875	599.72	662.24	598.54	667.14	8.96	899.25	1.00	450.58	23115.42	-22019.19	22437.64
Saccade R	1	2	31554232742	31554252617	19875	599.72	662.24	598.54	667.14	8.96	899.25	1.00	450.58	23115.42	-22019.19	22437.64
Saccade L	1	3	31554312249	31554371862	59613	348.08	849.53	335.57	839.47	18.54	929.71	1.00	310.98	22554.53	-22955.81	13676.52
Saccade R	1	3	31554312249	31554371862	59613	348.08	849.53	335.57	839.47	18.54	929.71	1.00	310.98	22554.53	-22955.81	13676.52
Blink L	1	4	31554371862	31554451509	79647
Blink R	1	4	31554371862	31554451509	79647
Blink L	1	5	31554471363	31554570861	99498
Blink R	1	5	31554471363	31554570861	99498
Fixation L	1	1	31554570861	31554789596	218735	400.95	392.31	9	61	-1	10.34	10.34
Fixation R	1	1	31554570861	31554789596	218735	400.95	392.31	9	61	-1	10.85	10.85
Saccade L	1	4	31554789596	31554908967	119371	401.27	343.38	600.26	169.72	5.57	189.08	0.83	46.64	4541.40	-3783.67	1730.84
Saccade R	1	4	31554789596	31554908967	119371	401.27	343.38	600.26	169.72	5.57	189.08	0.83	46.64	4541.40	-3783.67	1730.84
Fixation L	1	2	31554908967	31555068100	159133	618.71	186.05	29	34	-1	10.72	10.72
Fixation R	1	2	31554908967	31555068100	159133	618.71	186.05	29	34	-1	11.12	11.12
Saccade L	1	5	31555068100	31555087958	19858	629.70	176.24	627.67	67.68	0.78	109.83	1.00	39.26	2692.57	-1958.18	1730.76
Saccade R	1	5	31555068100	31555087958	19858	629.70	176.24	627.67	67.68	0.78	109.83	1.00	39.26	2692.57	-1958.18	1730.76
Fixation L	1	3	31555087958	31555286825	198867	618.02	76.56	20	34	-1	11.05	11.05
Fixation R	1	3	31555087958	31555286825	198867	618.02	76.56	20	34	-1	11.27	11.27
Saccade L	1	6	31555286825	31555306706	19881	607.15	95.84	444.94	73.55	1.13	165.59	1.00	56.68	4033.81	-3830.23	2740.38
Saccade R	1	6	31555286825	31555306706	19881	607.15	95.84	444.94	73.55	1.13	165.59	1.00	56.68	4033.81	-3830.23	2740.38
Fixation L	1	4	31555306706	31555465822	159116	467.32	94.46	34	43	-1	11.60	11.60
Fixation R	1	4	31555306706	31555465822	159116	467.32	94.46	34	43	-1	11.60	11.60
Saccade L	1	7	31555465822	31555505693	39871	474.01	116.78	975.08	285.49	4.72	300.92	1.00	118.30	7283.54	-7293.28	6284.70
Saccade R	1	7	31555465822	31555505693	39871	474.01	116.78	975.08	285.49	4.72	300.92	1.00	118.30	7283.54	-7293.28	6284.70
Fixation L	1	5	31555505693	31555724433	218740	993.21	256.57	31	40	-1	12.09	12.09
Fixation R	1	5	31555505693	31555724433	218740	993.21	256.57	31	40	-1	12.24	12.24
Saccade L	1	8	31555724433	31555764181	39748	989.84	247.20	980.50	439.91	1.72	98.80	1.00	43.31	2343.08	-2370.26	2281.02
Saccade R	1	8	31555724433	31555764181	39748	989.84	247.20	980.50	439.91	1.72	98.80	1.00	43.31	2343.08	-2370.26	2281.02
Fixation L	1	6	31555764181	31555863692	99511	973.45	448.32	10	13	-1	12.39	12.39
Fixation R	1	6	31555764181	31555863692	99511	973.45	448.32	10	13	-1	12.26	12.26
Saccade L	1	9	31555863692	31555903425	39733	969.77	448.17	1424.25	460.86	3.77	261.65	0.50	94.79	6488.95	-6378.71	5575.15
Saccade R	1	9	31555863692	31555903425	39733	969.77	448.17	1424.25	460.86	3.77	261.65	0.50	94.79	6488.95	-6378.71	5575.15
Fixation L	1	7	31555903425	31556082424	178999	1412.52	479.24	27	37	-1	11.85	11.85
Fixation R	1	7	31555903425	31556082424	178999	1412.52	479.24	27	37	-1	11.96	11.96
Saccade L	1	10	31556082424	31556122168	39744	1404.72	485.52	1418.14	841.55	3.26	288.89	0.50	81.93	7045.13	-6648.63	4194.41
Saccade R	1	10	31556082424	31556122168	39744	1404.72	485.52	1418.14	841.55	3.26	288.89	0.50	81.93	7045.13	-6648.63	4194.41
Fixation L	1	8	31556122168	31556400658	278490	1413.57	865.58	18	31	-1	12.10	12.10
Fixation R	1	8	31556122168	31556400658	278490	1413.57	865.58	18	31	-1	11.60	11.60
Saccade L	1	11	31556400658	31556460404	59746	1412.90	856.38	1416.74	282.35	5.92	260.94	0.67	99.02	6382.56	-6433.75	4366.70
Saccade R	1	11	31556400658	31556460404	59746	1412.90	856.38	1416.74	282.35	5.92	260.94	0.67	99.02	6382.56	-6433.75	4366.70
Fixation L	1	9	31556460404	31556599646	139242	1419.07	277.60	19	26	-1	11.96	11.96
Fixation R	1	9	31556460404	31556599646	139242	1419.07	277.60	19	26	-1	11.79	11.79
Saccade L	1	12	31556599646	31556619519	19873	1406.05	276.91	1269.79	162.61	1.29	179.86	1.00	65.16	3950.68	-4071.05	2694.22
Saccade R	1	12	31556599646	31556619519	19873	1406.05	276.91	1269.79	162.61	1.29	179.86	1.00	65.16	3950.68	-4071.05	2694.22
Fixation L	1	10	31556619519	31556838257	218738	1303.60	135.41	49	45	-1	12.10	12.10
Fixation R	1	10	31556619519	31556838257	218738	1303.60	135.41	49	45	-1	11.75	11.75
Saccade L	1	13	31556838257	31556878014	39757	1274.99	136.88	570.28	131.59	6.05	469.81	0.50	152.25	11650.98	-11485.94	8577.67
Saccade R	1	13	31556838257	31556878014	39757	1274.99	136.88	570.28	131.59	6.05	469.81	0.50	152.25	11650.98	-11485.94	8577.67
Fixation L	1	11	31556878014	31557017253	139239	559.52	110.63	59	38	-1	12.17	12.17
Fixation R	1	11	31556878014	31557017253	139239	559.52	110.63	59	38	-1	12.28	12.28
Saccade L	1	14	31557017253	31557037130	19877	510.30	116.81	454.52	94.76	0.61	60.68	1.00	30.69	1407.96	-1372.13	1353.83
Saccade R	1	14	31557017253	31557037130	19877	510.30	116.81	454.52	94.76	0.61	60.68	1.00	30.69	1407.96	-1372.13	1353.83
Fixation L	1	12	31557037130	31557454859	417729	450.03	123.91	17	66	-1	12.61	12.61
Fixation R	1	12	31557037130	31557454859	417729	450.03	123.91	17	66	-1	12.45	12.45
