[BeGaze]
Converted from:	C:\Documents and Settings\iViewX\Desktop\EXPERIMENTATIONS\Experiments\results\finaleart\S20H24222-finaleart-1.idf
Date:	27.03.2019 15:52:46
Version:	BeGaze 2.5.77
Sample Rate:	50
Subject:	S20H24222
Description:	Hugo Brument

Table Header for Fixations:
Event Type	Trial	Number	Start	End	Duration	Location X	Location Y	Dispersion X	Dispersion Y	Plane	Avg. Pupil Size X	Avg. Pupil Size Y

Table Header for Saccades:
Event Type	Trial	Number	Start	End	Duration	Start Loc.X	Start Loc.Y	End Loc.X	End Loc.Y	Amplitude	Peak Speed	Peak Speed At	Average Speed	Peak Accel.	Peak Decel.	Average Accel.

Table Header for Blinks:
Event Type	Trial	Number	Start	End	Duration

Table Header for User Events:
Event Type	Trial	Number	Start	Description

UserEvent	1	1	11400792585	# Message: void.jpg
Fixation L	1	1	11400803817	11400962933	159116	365.16	179.74	64	17	-1	8.60	8.60
Fixation R	1	1	11400803817	11400962933	159116	365.16	179.74	64	17	-1	9.95	9.95
Saccade L	1	1	11400962933	11401062304	99371	314.94	171.99	269.17	151.45	5.77	115.07	0.20	58.10	2354.73	-1605.69	1233.03
Saccade R	1	1	11400962933	11401062304	99371	314.94	171.99	269.17	151.45	5.77	115.07	0.20	58.10	2354.73	-1605.69	1233.03
Fixation L	1	2	11401062304	11401181659	119355	270.06	150.81	14	41	-1	8.92	8.92
Fixation R	1	2	11401062304	11401181659	119355	270.06	150.81	14	41	-1	10.32	10.32
Blink L	1	1	11401181659	11401301032	119373
Blink R	1	1	11401181659	11401440276	258617
Blink L	1	2	11401320920	11401440276	119356
Fixation L	1	3	11401440276	11401858014	417738	741.69	875.23	46	52	-1	12.18	12.18
Fixation R	1	3	11401440276	11401858014	417738	741.69	875.23	46	52	-1	12.85	12.85
Saccade L	1	2	11401858014	11401877891	19877	761.33	878.78	764.83	879.07	0.06	3.80	0.00	2.97	0.19	-71.09	28.03
Saccade R	1	2	11401858014	11401877891	19877	761.33	878.78	764.83	879.07	0.06	3.80	0.00	2.97	0.19	-71.09	28.03
Fixation L	1	4	11401877891	11401977277	99386	764.02	880.19	1	4	-1	12.86	12.86
Fixation R	1	4	11401877891	11401977277	99386	764.02	880.19	1	4	-1	13.36	13.36
Saccade L	1	3	11401977277	11401997137	19860	764.34	878.71	646.91	750.84	1.17	175.57	1.00	58.82	4286.29	-3947.51	3142.82
Saccade R	1	3	11401977277	11401997137	19860	764.34	878.71	646.91	750.84	1.17	175.57	1.00	58.82	4286.29	-3947.51	3142.82
Fixation L	1	5	11401997137	11402275622	278485	627.81	715.27	41	51	-1	12.64	12.64
Fixation R	1	5	11401997137	11402275622	278485	627.81	715.27	41	51	-1	13.17	13.17
Saccade L	1	4	11402275622	11402295502	19880	653.39	701.15	761.08	543.94	1.27	192.70	1.00	63.88	4715.61	-4505.36	3081.99
Saccade R	1	4	11402275622	11402295502	19880	653.39	701.15	761.08	543.94	1.27	192.70	1.00	63.88	4715.61	-4505.36	3081.99
Fixation L	1	6	11402295502	11402772851	477349	773.75	519.57	24	36	-1	12.42	12.42
Fixation R	1	6	11402295502	11402772851	477349	773.75	519.57	24	36	-1	13.31	13.31
