[BeGaze]
Converted from:	C:\Documents and Settings\iViewX\Desktop\EXPERIMENTATIONS\Experiments\results\finaleart\S15H25531-finaleart-1.idf
Date:	27.03.2019 15:45:52
Version:	BeGaze 2.5.77
Sample Rate:	50
Subject:	S15H25531
Description:	Mikail Demirdelen

Table Header for Fixations:
Event Type	Trial	Number	Start	End	Duration	Location X	Location Y	Dispersion X	Dispersion Y	Plane	Avg. Pupil Size X	Avg. Pupil Size Y

Table Header for Saccades:
Event Type	Trial	Number	Start	End	Duration	Start Loc.X	Start Loc.Y	End Loc.X	End Loc.Y	Amplitude	Peak Speed	Peak Speed At	Average Speed	Peak Accel.	Peak Decel.	Average Accel.

Table Header for Blinks:
Event Type	Trial	Number	Start	End	Duration

Table Header for User Events:
Event Type	Trial	Number	Start	Description

UserEvent	1	1	4704902058	# Message: void.jpg
Fixation L	1	1	4704918385	4705017875	99490	516.35	668.77	83	7	-1	15.63	15.63
Fixation R	1	1	4704918385	4705017875	99490	516.35	668.77	83	7	-1	16.18	16.18
Saccade L	1	1	4705017875	4705037748	19873	448.47	665.00	437.56	638.91	0.65	79.39	0.00	32.66	643.82	-1489.18	759.33
Saccade R	1	1	4705017875	4705037748	19873	448.47	665.00	437.56	638.91	0.65	79.39	0.00	32.66	643.82	-1489.18	759.33
Fixation L	1	2	4705037748	4705375846	338098	468.18	649.37	38	18	-1	15.07	15.07
Fixation R	1	2	4705037748	4705375846	338098	468.18	649.37	38	18	-1	15.86	15.86
Blink L	1	1	4705375846	4705773713	397867
Blink R	1	1	4705375846	4705773713	397867
Fixation L	1	3	4705773713	4706171439	397726	716.47	624.50	27	55	-1	14.41	14.41
Fixation R	1	3	4705773713	4706171439	397726	716.47	624.50	27	55	-1	14.92	14.92
Saccade L	1	2	4706171439	4706231187	59748	724.26	638.67	1212.54	669.83	5.17	180.15	0.67	86.54	4373.59	-4189.17	3460.02
Saccade R	1	2	4706171439	4706231187	59748	724.26	638.67	1212.54	669.83	5.17	180.15	0.67	86.54	4373.59	-4189.17	3460.02
Fixation L	1	4	4706231187	4706549418	318231	1223.70	684.43	21	26	-1	14.61	14.61
Fixation R	1	4	4706231187	4706549418	318231	1223.70	684.43	21	26	-1	15.12	15.12
Saccade L	1	3	4706549418	4706589173	39755	1234.17	675.64	907.43	626.47	3.01	185.58	1.00	75.73	4560.50	-4000.31	3778.97
Saccade R	1	3	4706549418	4706589173	39755	1234.17	675.64	907.43	626.47	3.01	185.58	1.00	75.73	4560.50	-4000.31	3778.97
Fixation L	1	5	4706589173	4706887531	298358	918.74	616.20	24	58	-1	14.17	14.17
Fixation R	1	5	4706589173	4706887531	298358	918.74	616.20	24	58	-1	14.63	14.63
