[BeGaze]
Converted from:	C:\Documents and Settings\iViewX\Desktop\EXPERIMENTATIONS\Experiments\results\finaleart\S3121421-finaleart-1.idf
Date:	27.03.2019 15:33:51
Version:	BeGaze 2.5.77
Sample Rate:	50
Subject:	S3121421
Description:	Jean Jouve

Table Header for Fixations:
Event Type	Trial	Number	Start	End	Duration	Location X	Location Y	Dispersion X	Dispersion Y	Plane	Avg. Pupil Size X	Avg. Pupil Size Y

Table Header for Saccades:
Event Type	Trial	Number	Start	End	Duration	Start Loc.X	Start Loc.Y	End Loc.X	End Loc.Y	Amplitude	Peak Speed	Peak Speed At	Average Speed	Peak Accel.	Peak Decel.	Average Accel.

Table Header for Blinks:
Event Type	Trial	Number	Start	End	Duration

Table Header for User Events:
Event Type	Trial	Number	Start	Description

UserEvent	1	1	4014497354	# Message: sargent-male-model-resting.jpg
Fixation L	1	1	4014508392	4014926485	418093	1143.08	580.20	17	26	-1	13.13	13.13
Fixation R	1	1	4014508392	4014926485	418093	1143.08	580.20	17	26	-1	11.87	11.87
Saccade L	1	1	4014926485	4014946486	20001	1157.73	572.19	1416.53	441.57	1.65	293.01	1.00	82.63	7264.21	-6986.10	4798.77
Saccade R	1	1	4014926485	4014946486	20001	1157.73	572.19	1416.53	441.57	1.65	293.01	1.00	82.63	7264.21	-6986.10	4798.77
Fixation L	1	2	4014946486	4015324841	378355	1440.20	485.20	36	62	-1	12.88	12.88
Fixation R	1	2	4014946486	4015324841	378355	1440.20	485.20	36	62	-1	11.68	11.68
Saccade L	1	2	4015324841	4015364582	39741	1434.01	503.08	1201.55	677.52	2.57	230.34	0.50	64.57	5728.82	-5226.20	3334.57
Saccade R	1	2	4015324841	4015364582	39741	1434.01	503.08	1201.55	677.52	2.57	230.34	0.50	64.57	5728.82	-5226.20	3334.57
Fixation L	1	3	4015364582	4015623443	258861	1199.15	681.36	26	23	-1	12.59	12.59
Fixation R	1	3	4015364582	4015623443	258861	1199.15	681.36	26	23	-1	10.93	10.93
Saccade L	1	3	4015623443	4015683198	59755	1199.33	669.17	691.18	624.76	5.51	256.40	0.67	92.13	6356.51	-5873.43	3909.43
Saccade R	1	3	4015623443	4015683198	59755	1199.33	669.17	691.18	624.76	5.51	256.40	0.67	92.13	6356.51	-5873.43	3909.43
Fixation L	1	4	4015683198	4016061541	378343	686.45	595.06	10	43	-1	11.58	11.58
Fixation R	1	4	4015683198	4016061541	378343	686.45	595.06	10	43	-1	10.87	10.87
Saccade L	1	4	4016061541	4016101423	39882	684.46	602.30	839.43	395.56	2.37	191.20	0.50	59.38	4723.21	-4510.45	3005.43
Saccade R	1	4	4016061541	4016101423	39882	684.46	602.30	839.43	395.56	2.37	191.20	0.50	59.38	4723.21	-4510.45	3005.43
Fixation L	1	5	4016101423	4016360277	258854	842.46	382.31	14	17	-1	11.53	11.53
Fixation R	1	5	4016101423	4016360277	258854	842.46	382.31	14	17	-1	10.95	10.95
Saccade L	1	5	4016360277	4016420012	59735	846.77	384.92	1438.50	433.01	6.14	251.37	0.67	102.79	6221.17	-6025.18	4629.37
Saccade R	1	5	4016360277	4016420012	59735	846.77	384.92	1438.50	433.01	6.14	251.37	0.67	102.79	6221.17	-6025.18	4629.37
Fixation L	1	6	4016420012	4016957616	537604	1450.85	457.63	39	47	-1	12.21	12.21
Fixation R	1	6	4016420012	4016957616	537604	1450.85	457.63	39	47	-1	11.02	11.02
Saccade L	1	6	4016957616	4016997499	39883	1461.66	467.96	1372.49	567.02	1.32	81.20	1.00	33.07	1945.18	-1623.46	1470.37
Saccade R	1	6	4016957616	4016997499	39883	1461.66	467.96	1372.49	567.02	1.32	81.20	1.00	33.07	1945.18	-1623.46	1470.37
Fixation L	1	7	4016997499	4017395710	398211	1352.51	577.48	34	45	-1	12.33	12.33
Fixation R	1	7	4016997499	4017395710	398211	1352.51	577.48	34	45	-1	10.72	10.72
Saccade L	1	7	4017395710	4017455473	59763	1359.45	570.91	1060.22	332.44	4.59	183.73	0.33	76.80	4179.54	-3284.96	3057.65
Saccade R	1	7	4017395710	4017455473	59763	1359.45	570.91	1060.22	332.44	4.59	183.73	0.33	76.80	4179.54	-3284.96	3057.65
Fixation L	1	8	4017455473	4017634570	179097	1076.03	322.41	31	56	-1	11.97	11.97
Fixation R	1	8	4017455473	4017634570	179097	1076.03	322.41	31	56	-1	10.80	10.80
Saccade L	1	8	4017634570	4017654565	19995	1056.96	363.65	1062.62	419.59	0.59	56.88	1.00	29.64	1280.72	-1409.97	1320.59
Saccade R	1	8	4017634570	4017654565	19995	1056.96	363.65	1062.62	419.59	0.59	56.88	1.00	29.64	1280.72	-1409.97	1320.59
Fixation L	1	9	4017654565	4018012921	358356	1051.40	420.76	20	8	-1	12.10	12.10
Fixation R	1	9	4017654565	4018012921	358356	1051.40	420.76	20	8	-1	10.98	10.98
Saccade L	1	9	4018012921	4018052793	39872	1049.45	419.13	1197.03	198.49	2.30	162.21	1.00	57.66	3983.87	-3810.93	3216.71
Saccade R	1	9	4018012921	4018052793	39872	1049.45	419.13	1197.03	198.49	2.30	162.21	1.00	57.66	3983.87	-3810.93	3216.71
Fixation L	1	10	4018052793	4018411145	358352	1210.68	178.77	19	27	-1	12.32	12.32
Fixation R	1	10	4018052793	4018411145	358352	1210.68	178.77	19	27	-1	11.08	11.08
Saccade L	1	10	4018411145	4018490908	79763	1213.75	186.12	1044.43	167.63	2.70	130.79	0.25	33.85	3143.78	-2595.90	1309.35
Saccade R	1	10	4018411145	4018490908	79763	1213.75	186.12	1044.43	167.63	2.70	130.79	0.25	33.85	3143.78	-2595.90	1309.35
