[BeGaze]
Converted from:	C:\Documents and Settings\iViewX\Desktop\EXPERIMENTATIONS\Experiments\results\finaleart\S11H21112-finaleart-1.idf
Date:	27.03.2019 15:38:38
Version:	BeGaze 2.5.77
Sample Rate:	50
Subject:	S11H21112
Description:	Clement legrand-Duchenne

Table Header for Fixations:
Event Type	Trial	Number	Start	End	Duration	Location X	Location Y	Dispersion X	Dispersion Y	Plane	Avg. Pupil Size X	Avg. Pupil Size Y

Table Header for Saccades:
Event Type	Trial	Number	Start	End	Duration	Start Loc.X	Start Loc.Y	End Loc.X	End Loc.Y	Amplitude	Peak Speed	Peak Speed At	Average Speed	Peak Accel.	Peak Decel.	Average Accel.

Table Header for Blinks:
Event Type	Trial	Number	Start	End	Duration

Table Header for User Events:
Event Type	Trial	Number	Start	Description

UserEvent	1	1	3982496877	# Message: stilleven-met-vis_dubois-pillet_1885.jpg
Fixation L	1	1	3982512271	3982810626	298355	768.37	715.86	6	25	-1	16.25	16.25
Fixation R	1	1	3982512271	3982810626	298355	768.37	715.86	6	25	-1	19.65	19.65
Saccade L	1	1	3982810626	3982850379	39753	772.14	710.12	892.61	547.70	1.73	142.85	1.00	43.60	3538.78	-3428.54	2515.09
Saccade R	1	1	3982810626	3982850379	39753	772.14	710.12	892.61	547.70	1.73	142.85	1.00	43.60	3538.78	-3428.54	2515.09
Fixation L	1	2	3982850379	3983089112	238733	888.90	554.39	9	15	-1	15.40	15.40
Fixation R	1	2	3982850379	3983089112	238733	888.90	554.39	9	15	-1	18.62	18.62
Saccade L	1	2	3983089112	3983108994	19882	882.80	548.30	708.95	466.41	1.21	194.33	1.00	60.74	4746.77	-4660.29	3233.40
Saccade R	1	2	3983089112	3983108994	19882	882.80	548.30	708.95	466.41	1.21	194.33	1.00	60.74	4746.77	-4660.29	3233.40
Fixation L	1	3	3983108994	3983566464	457470	682.05	456.75	33	27	-1	13.44	13.44
Fixation R	1	3	3983108994	3983566464	457470	682.05	456.75	33	27	-1	17.02	17.02
Saccade L	1	3	3983566464	3983626090	59626	682.17	461.48	1018.22	707.84	4.49	290.05	0.67	75.26	7203.49	-6967.18	3572.77
Saccade R	1	3	3983566464	3983626090	59626	682.17	461.48	1018.22	707.84	4.49	290.05	0.67	75.26	7203.49	-6967.18	3572.77
Fixation L	1	4	3983626090	3983805209	179119	1001.73	731.03	23	73	-1	13.95	13.95
Fixation R	1	4	3983626090	3983805209	179119	1001.73	731.03	23	73	-1	16.67	16.67
Saccade L	1	4	3983805209	3983825076	19867	994.44	781.12	997.94	806.88	0.45	44.76	1.00	22.72	-309.82	-591.09	454.15
Saccade R	1	4	3983805209	3983825076	19867	994.44	781.12	997.94	806.88	0.45	44.76	1.00	22.72	-309.82	-591.09	454.15
Fixation L	1	5	3983825076	3984381931	556855	999.64	809.73	29	30	-1	14.32	14.32
Fixation R	1	5	3983825076	3984381931	556855	999.64	809.73	29	30	-1	17.33	17.33
Saccade L	1	5	3984381931	3984401801	19870	1015.93	830.53	1100.86	840.90	0.64	86.55	1.00	32.22	2094.85	-2068.28	1627.44
Saccade R	1	5	3984381931	3984401801	19870	1015.93	830.53	1100.86	840.90	0.64	86.55	1.00	32.22	2094.85	-2068.28	1627.44
Fixation L	1	6	3984401801	3984958775	556974	1132.57	854.01	39	18	-1	15.09	15.09
Fixation R	1	6	3984401801	3984958775	556974	1132.57	854.01	39	18	-1	17.73	17.73
Saccade L	1	6	3984958775	3984978658	19883	1129.85	856.18	991.03	855.72	0.86	140.41	1.00	43.26	3470.13	-3401.06	2474.75
Saccade R	1	6	3984958775	3984978658	19883	1129.85	856.18	991.03	855.72	0.86	140.41	1.00	43.26	3470.13	-3401.06	2474.75
Fixation L	1	7	3984978658	3985217389	238731	961.70	853.71	36	7	-1	15.34	15.34
Fixation R	1	7	3984978658	3985217389	238731	961.70	853.71	36	7	-1	17.88	17.88
Saccade L	1	7	3985217389	3985257141	39752	955.57	856.01	1134.70	500.17	3.39	231.08	0.50	85.39	5696.76	-5349.53	4855.05
Saccade R	1	7	3985217389	3985257141	39752	955.57	856.01	1134.70	500.17	3.39	231.08	0.50	85.39	5696.76	-5349.53	4855.05
Fixation L	1	8	3985257141	3985634999	377858	1141.61	537.10	25	48	-1	14.84	14.84
Fixation R	1	8	3985257141	3985634999	377858	1141.61	537.10	25	48	-1	17.33	17.33
Saccade L	1	8	3985634999	3985654869	19870	1157.16	547.55	1184.17	545.83	0.26	27.37	1.00	13.15	537.48	-440.49	361.20
Saccade R	1	8	3985634999	3985654869	19870	1157.16	547.55	1184.17	545.83	0.26	27.37	1.00	13.15	537.48	-440.49	361.20
Fixation L	1	9	3985654869	3986152229	497360	1184.40	544.01	26	24	-1	14.23	14.23
Fixation R	1	9	3985654869	3986152229	497360	1184.40	544.01	26	24	-1	16.43	16.43
Saccade L	1	9	3986152229	3986172105	19876	1164.09	532.87	1090.93	531.77	0.52	74.02	1.00	26.09	1685.58	-1619.76	1245.06
Saccade R	1	9	3986152229	3986172105	19876	1164.09	532.87	1090.93	531.77	0.52	74.02	1.00	26.09	1685.58	-1619.76	1245.06
Fixation L	1	10	3986172105	3986490354	318249	1079.86	524.71	15	17	-1	14.06	14.06
Fixation R	1	10	3986172105	3986490354	318249	1079.86	524.71	15	17	-1	16.72	16.72
