[BeGaze]
Converted from:	C:\Documents and Settings\iViewX\Desktop\EXPERIMENTATIONS\Experiments\results\finaleart\S20H24222-finaleart-1.idf
Date:	27.03.2019 15:52:35
Version:	BeGaze 2.5.77
Sample Rate:	50
Subject:	S20H24222
Description:	Hugo Brument

Table Header for Fixations:
Event Type	Trial	Number	Start	End	Duration	Location X	Location Y	Dispersion X	Dispersion Y	Plane	Avg. Pupil Size X	Avg. Pupil Size Y

Table Header for Saccades:
Event Type	Trial	Number	Start	End	Duration	Start Loc.X	Start Loc.Y	End Loc.X	End Loc.Y	Amplitude	Peak Speed	Peak Speed At	Average Speed	Peak Accel.	Peak Decel.	Average Accel.

Table Header for Blinks:
Event Type	Trial	Number	Start	End	Duration

Table Header for User Events:
Event Type	Trial	Number	Start	Description

UserEvent	1	1	11317249751	# Message: Paysage_a_La_Ciotat_(La_Pointe_du-Capucin)_friesz_1907.jpg
Fixation L	1	1	11317265333	11317961567	696234	887.58	481.71	17	37	-1	12.68	12.68
Fixation R	1	1	11317265333	11317961567	696234	887.58	481.71	17	37	-1	13.86	13.86
Saccade L	1	1	11317961567	11317981431	19864	888.19	462.30	802.85	473.63	0.63	87.09	1.00	31.95	1956.04	-1925.14	1470.79
Saccade R	1	1	11317961567	11317981431	19864	888.19	462.30	802.85	473.63	0.63	87.09	1.00	31.95	1956.04	-1925.14	1470.79
Fixation L	1	2	11317981431	11318259911	278480	773.14	485.33	54	23	-1	9.62	9.62
Fixation R	1	2	11317981431	11318259911	278480	773.14	485.33	54	23	-1	10.44	10.44
Saccade L	1	2	11318259911	11318279787	19876	748.02	471.75	718.70	456.47	0.43	34.35	0.00	21.66	816.20	-523.20	582.24
Saccade R	1	2	11318259911	11318279787	19876	748.02	471.75	718.70	456.47	0.43	34.35	0.00	21.66	816.20	-523.20	582.24
Fixation L	1	3	11318279787	11319234498	954711	691.75	450.18	36	58	-1	9.10	9.10
Fixation R	1	3	11318279787	11319234498	954711	691.75	450.18	36	58	-1	9.95	9.95
Saccade L	1	3	11319234498	11319254370	19872	708.90	487.40	733.21	660.81	1.37	177.08	1.00	68.81	4352.33	-4205.24	2932.05
Saccade R	1	3	11319234498	11319254370	19872	708.90	487.40	733.21	660.81	1.37	177.08	1.00	68.81	4352.33	-4205.24	2932.05
Fixation L	1	4	11319254370	11319453239	198869	747.41	705.14	27	59	-1	9.69	9.69
Fixation R	1	4	11319254370	11319453239	198869	747.41	705.14	27	59	-1	10.14	10.14
Saccade L	1	4	11319453239	11319493108	39869	758.87	718.10	928.88	640.83	1.73	129.18	0.50	43.43	3118.71	-2941.46	2094.94
Saccade R	1	4	11319453239	11319493108	39869	758.87	718.10	928.88	640.83	1.73	129.18	0.50	43.43	3118.71	-2941.46	2094.94
Fixation L	1	5	11319493108	11319711852	218744	940.85	646.34	19	25	-1	10.07	10.07
Fixation R	1	5	11319493108	11319711852	218744	940.85	646.34	19	25	-1	10.46	10.46
Saccade L	1	5	11319711852	11319731722	19870	948.07	643.12	1025.01	637.55	0.46	78.03	1.00	23.02	1813.90	-1915.20	1267.29
Saccade R	1	5	11319711852	11319731722	19870	948.07	643.12	1025.01	637.55	0.46	78.03	1.00	23.02	1813.90	-1915.20	1267.29
Fixation L	1	6	11319731722	11319950595	218873	1024.56	623.90	15	26	-1	9.80	9.80
Fixation R	1	6	11319731722	11319950595	218873	1024.56	623.90	15	26	-1	10.42	10.42
Saccade L	1	6	11319950595	11319990341	39746	1028.15	617.23	1291.35	471.30	2.68	186.05	1.00	67.45	4588.05	-4629.08	3987.05
Saccade R	1	6	11319950595	11319990341	39746	1028.15	617.23	1291.35	471.30	2.68	186.05	1.00	67.45	4588.05	-4629.08	3987.05
Fixation L	1	7	11319990341	11320228952	238611	1304.67	451.86	23	40	-1	9.79	9.79
Fixation R	1	7	11319990341	11320228952	238611	1304.67	451.86	23	40	-1	10.11	10.11
Saccade L	1	7	11320228952	11320248827	19875	1314.64	430.83	1426.76	352.44	0.85	138.36	1.00	42.56	3294.01	-3136.33	2246.16
Saccade R	1	7	11320228952	11320248827	19875	1314.64	430.83	1426.76	352.44	0.85	138.36	1.00	42.56	3294.01	-3136.33	2246.16
Fixation L	1	8	11320248827	11320527314	278487	1423.74	334.70	54	32	-1	9.82	9.82
Fixation R	1	8	11320248827	11320527314	278487	1423.74	334.70	54	32	-1	9.95	9.95
Saccade L	1	8	11320527314	11320547188	19874	1386.90	339.68	1372.54	350.43	0.18	18.14	1.00	8.99	342.49	-304.50	294.91
Saccade R	1	8	11320527314	11320547188	19874	1386.90	339.68	1372.54	350.43	0.18	18.14	1.00	8.99	342.49	-304.50	294.91
Fixation L	1	9	11320547188	11320945047	397859	1353.55	369.90	47	44	-1	10.40	10.40
Fixation R	1	9	11320547188	11320945047	397859	1353.55	369.90	47	44	-1	10.58	10.58
Saccade L	1	9	11320945047	11321024561	79514	1324.81	394.39	1364.55	508.89	2.09	102.55	1.00	26.25	2404.38	-2354.91	876.01
Saccade R	1	9	11320945047	11321024561	79514	1324.81	394.39	1364.55	508.89	2.09	102.55	1.00	26.25	2404.38	-2354.91	876.01
Fixation L	1	10	11321024561	11321243409	218848	1370.25	532.78	10	44	-1	11.01	11.01
Fixation R	1	10	11321024561	11321243409	218848	1370.25	532.78	10	44	-1	11.06	11.06
