[BeGaze]
Converted from:	C:\Documents and Settings\iViewX\Desktop\EXPERIMENTATIONS\Experiments\results\finaleart\S12H22222-finaleart-1.idf
Date:	27.03.2019 15:40:58
Version:	BeGaze 2.5.77
Sample Rate:	50
Subject:	S12H22222
Description:	aurele barriere

Table Header for Fixations:
Event Type	Trial	Number	Start	End	Duration	Location X	Location Y	Dispersion X	Dispersion Y	Plane	Avg. Pupil Size X	Avg. Pupil Size Y

Table Header for Saccades:
Event Type	Trial	Number	Start	End	Duration	Start Loc.X	Start Loc.Y	End Loc.X	End Loc.Y	Amplitude	Peak Speed	Peak Speed At	Average Speed	Peak Accel.	Peak Decel.	Average Accel.

Table Header for Blinks:
Event Type	Trial	Number	Start	End	Duration

Table Header for User Events:
Event Type	Trial	Number	Start	Description

UserEvent	1	1	24107625052	# Message: void.jpg
Saccade L	1	1	24107643980	24107723481	79501	995.86	1071.31	1151.62	813.72	4.49	169.20	1.00	56.48	4120.94	-3986.65	2388.10
Saccade R	1	1	24107643980	24107723481	79501	995.86	1071.31	1151.62	813.72	4.49	169.20	1.00	56.48	4120.94	-3986.65	2388.10
Fixation L	1	1	24107723481	24108141196	417715	1139.03	852.74	21	70	-1	16.14	16.14
Fixation R	1	1	24107723481	24108141196	417715	1139.03	852.74	21	70	-1	14.73	14.73
Saccade L	1	2	24108141196	24108240696	99500	1145.59	838.63	905.65	375.55	8.24	149.69	0.60	82.84	3376.60	-2797.50	1926.91
Saccade R	1	2	24108141196	24108240696	99500	1145.59	838.63	905.65	375.55	8.24	149.69	0.60	82.84	3376.60	-2797.50	1926.91
Fixation L	1	2	24108240696	24108678301	437605	903.27	366.82	15	53	-1	13.51	13.51
Fixation R	1	2	24108240696	24108678301	437605	903.27	366.82	15	53	-1	12.80	12.80
Saccade L	1	3	24108678301	24108698201	19900	909.05	386.03	922.66	515.38	1.01	131.55	1.00	50.81	3223.72	-1736.95	2213.41
Saccade R	1	3	24108678301	24108698201	19900	909.05	386.03	922.66	515.38	1.01	131.55	1.00	50.81	3223.72	-1736.95	2213.41
Fixation L	1	3	24108698201	24108797542	99341	935.25	502.07	22	71	-1	14.26	14.26
Fixation R	1	3	24108698201	24108797542	99341	935.25	502.07	22	71	-1	13.33	13.33
Saccade L	1	4	24108797542	24108817434	19892	945.61	520.38	945.78	528.79	0.22	18.19	1.00	11.12	271.58	-48.35	140.47
Saccade R	1	4	24108797542	24108817434	19892	945.61	520.38	945.78	528.79	0.22	18.19	1.00	11.12	271.58	-48.35	140.47
Fixation L	1	4	24108817434	24109434022	616588	962.15	504.10	25	72	-1	14.61	14.61
Fixation R	1	4	24108817434	24109434022	616588	962.15	504.10	25	72	-1	13.96	13.96
Saccade L	1	5	24109434022	24109454022	20000	969.51	473.30	971.95	461.71	0.10	11.98	1.00	5.06	261.32	-157.22	173.69
Saccade R	1	5	24109434022	24109454022	20000	969.51	473.30	971.95	461.71	0.10	11.98	1.00	5.06	261.32	-157.22	173.69
Fixation L	1	5	24109454022	24109613157	159135	970.54	455.60	3	17	-1	14.14	14.14
Fixation R	1	5	24109454022	24109613157	159135	970.54	455.60	3	17	-1	13.65	13.65
