[BeGaze]
Converted from:	C:\Documents and Settings\iViewX\Desktop\EXPERIMENTATIONS\Experiments\results\finaleart\S7121223-finaleart-1.idf
Date:	27.03.2019 15:36:46
Version:	BeGaze 2.5.77
Sample Rate:	50
Subject:	S7121223
Description:	Gregoire pacreau

Table Header for Fixations:
Event Type	Trial	Number	Start	End	Duration	Location X	Location Y	Dispersion X	Dispersion Y	Plane	Avg. Pupil Size X	Avg. Pupil Size Y

Table Header for Saccades:
Event Type	Trial	Number	Start	End	Duration	Start Loc.X	Start Loc.Y	End Loc.X	End Loc.Y	Amplitude	Peak Speed	Peak Speed At	Average Speed	Peak Accel.	Peak Decel.	Average Accel.

Table Header for Blinks:
Event Type	Trial	Number	Start	End	Duration

Table Header for User Events:
Event Type	Trial	Number	Start	Description

UserEvent	1	1	4094518171	# Message: Georges-braque-still-life-with-jugs-and-pipe-1906.jpg
Fixation L	1	1	4094519136	4094897245	378109	656.76	524.72	14	7	-1	14.62	14.62
Fixation R	1	1	4094519136	4094897245	378109	656.76	524.72	14	7	-1	15.47	15.47
Saccade L	1	1	4094897245	4094937144	39899	664.18	528.14	895.77	516.09	1.91	126.68	0.50	47.81	3153.49	-3113.06	2799.85
Saccade R	1	1	4094897245	4094937144	39899	664.18	528.14	895.77	516.09	1.91	126.68	0.50	47.81	3153.49	-3113.06	2799.85
Fixation L	1	2	4094937144	4095414820	477676	897.97	468.99	7	70	-1	12.28	12.28
Fixation R	1	2	4094937144	4095414820	477676	897.97	468.99	7	70	-1	12.57	12.57
Saccade L	1	2	4095414820	4095454573	39753	898.41	446.50	1122.33	513.88	2.14	163.09	0.50	53.95	4061.85	-3618.12	2921.16
Saccade R	1	2	4095414820	4095454573	39753	898.41	446.50	1122.33	513.88	2.14	163.09	0.50	53.95	4061.85	-3618.12	2921.16
Fixation L	1	3	4095454573	4096131288	676715	1131.36	534.00	16	41	-1	11.35	11.35
Fixation R	1	3	4095454573	4096131288	676715	1131.36	534.00	16	41	-1	11.09	11.09
Saccade L	1	3	4096131288	4096191026	59738	1125.77	555.00	1231.34	867.46	3.62	176.86	0.67	60.65	4286.18	-3998.27	2485.61
Saccade R	1	3	4096131288	4096191026	59738	1125.77	555.00	1231.34	867.46	3.62	176.86	0.67	60.65	4286.18	-3998.27	2485.61
Fixation L	1	4	4096191026	4096569266	378240	1235.10	885.72	17	31	-1	13.55	13.55
Fixation R	1	4	4096191026	4096569266	378240	1235.10	885.72	17	31	-1	13.16	13.16
Saccade L	1	4	4096569266	4096609019	39753	1237.51	887.02	1444.34	854.24	1.82	114.92	1.00	45.69	2814.35	-2727.68	2526.52
Saccade R	1	4	4096569266	4096609019	39753	1237.51	887.02	1444.34	854.24	1.82	114.92	1.00	45.69	2814.35	-2727.68	2526.52
Fixation L	1	5	4096609019	4096748377	139358	1433.18	841.71	14	20	-1	13.70	13.70
Fixation R	1	5	4096609019	4096748377	139358	1433.18	841.71	14	20	-1	13.05	13.05
Saccade L	1	5	4096748377	4096788137	39760	1430.72	833.74	1487.17	501.07	3.14	188.36	1.00	78.94	4505.79	-4609.49	3960.30
Saccade R	1	5	4096748377	4096788137	39760	1430.72	833.74	1487.17	501.07	3.14	188.36	1.00	78.94	4505.79	-4609.49	3960.30
Fixation L	1	6	4096788137	4096967238	179101	1477.33	475.32	19	64	-1	13.13	13.13
Fixation R	1	6	4096788137	4096967238	179101	1477.33	475.32	19	64	-1	12.87	12.87
Saccade L	1	6	4096967238	4096987269	20031	1470.68	437.04	1452.62	348.51	0.84	91.39	1.00	41.81	2142.34	-2133.44	1684.12
Saccade R	1	6	4096967238	4096987269	20031	1470.68	437.04	1452.62	348.51	0.84	91.39	1.00	41.81	2142.34	-2133.44	1684.12
Fixation L	1	7	4096987269	4097464840	477571	1417.37	360.07	54	25	-1	13.10	13.10
Fixation R	1	7	4096987269	4097464840	477571	1417.37	360.07	54	25	-1	12.81	12.81
Saccade L	1	7	4097464840	4097504718	39878	1397.99	373.83	917.21	374.59	4.09	309.01	0.50	102.44	7662.76	-7422.42	5888.16
Saccade R	1	7	4097464840	4097504718	39878	1397.99	373.83	917.21	374.59	4.09	309.01	0.50	102.44	7662.76	-7422.42	5888.16
Fixation L	1	8	4097504718	4097723702	218984	925.57	366.84	12	12	-1	14.37	14.37
Fixation R	1	8	4097504718	4097723702	218984	925.57	366.84	12	12	-1	14.17	14.17
Saccade L	1	8	4097723702	4097763452	39750	924.55	361.70	724.19	346.43	1.91	110.29	1.00	47.95	2738.70	-2667.87	2460.29
Saccade R	1	8	4097723702	4097763452	39750	924.55	361.70	724.19	346.43	1.91	110.29	1.00	47.95	2738.70	-2667.87	2460.29
Fixation L	1	9	4097763452	4097942564	179112	700.97	307.33	32	65	-1	13.84	13.84
Fixation R	1	9	4097763452	4097942564	179112	700.97	307.33	32	65	-1	14.02	14.02
Saccade L	1	9	4097942564	4097962441	19877	691.94	281.36	691.35	276.88	0.05	4.57	1.00	2.38	80.23	-49.74	52.47
Saccade R	1	9	4097942564	4097962441	19877	691.94	281.36	691.35	276.88	0.05	4.57	1.00	2.38	80.23	-49.74	52.47
Fixation L	1	10	4097962441	4098121680	159239	689.06	277.43	29	23	-1	13.28	13.28
Fixation R	1	10	4097962441	4098121680	159239	689.06	277.43	29	23	-1	13.60	13.60
Saccade L	1	10	4098121680	4098141676	19996	664.11	293.99	681.67	350.45	0.54	59.81	1.00	27.01	1423.79	-1284.70	1153.77
Saccade R	1	10	4098121680	4098141676	19996	664.11	293.99	681.67	350.45	0.54	59.81	1.00	27.01	1423.79	-1284.70	1153.77
Fixation L	1	11	4098141676	4098499912	358236	669.40	372.10	20	39	-1	13.81	13.81
Fixation R	1	11	4098141676	4098499912	358236	669.40	372.10	20	39	-1	14.28	14.28
