[BeGaze]
Converted from:	C:\Documents and Settings\iViewX\Desktop\EXPERIMENTATIONS\Experiments\results\finaleart\S7121223-finaleart-1.idf
Date:	27.03.2019 15:37:07
Version:	BeGaze 2.5.77
Sample Rate:	50
Subject:	S7121223
Description:	Gregoire pacreau

Table Header for Fixations:
Event Type	Trial	Number	Start	End	Duration	Location X	Location Y	Dispersion X	Dispersion Y	Plane	Avg. Pupil Size X	Avg. Pupil Size Y

Table Header for Saccades:
Event Type	Trial	Number	Start	End	Duration	Start Loc.X	Start Loc.Y	End Loc.X	End Loc.Y	Amplitude	Peak Speed	Peak Speed At	Average Speed	Peak Accel.	Peak Decel.	Average Accel.

Table Header for Blinks:
Event Type	Trial	Number	Start	End	Duration

Table Header for User Events:
Event Type	Trial	Number	Start	Description

UserEvent	1	1	4883252369	# Message: the-large-bathers_renoir_1887.jpg
Fixation L	1	1	4883255762	4883634119	378357	601.69	589.32	39	20	-1	13.70	13.70
Fixation R	1	1	4883255762	4883634119	378357	601.69	589.32	39	20	-1	15.05	15.05
Saccade L	1	1	4883634119	4883654009	19890	635.50	577.18	796.37	565.37	1.15	163.13	1.00	57.69	3968.65	-3592.25	2563.92
Saccade R	1	1	4883634119	4883654009	19890	635.50	577.18	796.37	565.37	1.15	163.13	1.00	57.69	3968.65	-3592.25	2563.92
Fixation L	1	2	4883654009	4883773500	119491	807.20	544.90	16	36	-1	13.32	13.32
Fixation R	1	2	4883654009	4883773500	119491	807.20	544.90	16	36	-1	14.47	14.47
Saccade L	1	2	4883773500	4883813358	39858	812.38	528.66	810.17	248.05	2.60	152.41	0.50	65.28	3584.68	-3378.26	3223.05
Saccade R	1	2	4883773500	4883813358	39858	812.38	528.66	810.17	248.05	2.60	152.41	0.50	65.28	3584.68	-3378.26	3223.05
Fixation L	1	3	4883813358	4883952716	139358	817.06	231.48	21	66	-1	11.40	11.40
Fixation R	1	3	4883813358	4883952716	139358	817.06	231.48	21	66	-1	12.02	12.02
Saccade L	1	3	4883952716	4883972607	19891	831.44	198.38	844.48	194.07	0.25	15.24	0.00	12.37	-28.73	-248.59	152.30
Saccade R	1	3	4883952716	4883972607	19891	831.44	198.38	844.48	194.07	0.25	15.24	0.00	12.37	-28.73	-248.59	152.30
Fixation L	1	4	4883972607	4884868665	896058	831.08	194.52	31	49	-1	9.70	9.70
Fixation R	1	4	4883972607	4884868665	896058	831.08	194.52	31	49	-1	10.12	10.12
Saccade L	1	4	4884868665	4884928416	59751	829.12	165.08	412.50	462.51	5.73	284.86	0.67	95.86	7059.97	-6253.06	4195.23
Saccade R	1	4	4884868665	4884928416	59751	829.12	165.08	412.50	462.51	5.73	284.86	0.67	95.86	7059.97	-6253.06	4195.23
Fixation L	1	5	4884928416	4885366514	438098	422.64	463.95	26	68	-1	10.81	10.81
Fixation R	1	5	4884928416	4885366514	438098	422.64	463.95	26	68	-1	11.21	11.21
Saccade L	1	5	4885366514	4885386397	19883	438.69	491.27	447.23	491.25	0.10	8.64	1.00	5.27	144.09	-97.06	103.28
Saccade R	1	5	4885366514	4885386397	19883	438.69	491.27	447.23	491.25	0.10	8.64	1.00	5.27	144.09	-97.06	103.28
Fixation L	1	6	4885386397	4885864363	477966	435.34	488.58	30	27	-1	10.95	10.95
Fixation R	1	6	4885386397	4885864363	477966	435.34	488.58	30	27	-1	11.54	11.54
Saccade L	1	6	4885864363	4885943986	79623	416.95	487.74	1406.25	571.08	11.56	347.53	0.50	145.17	8632.54	-7999.99	5551.18
Saccade R	1	6	4885864363	4885943986	79623	416.95	487.74	1406.25	571.08	11.56	347.53	0.50	145.17	8632.54	-7999.99	5551.18
Fixation L	1	7	4885943986	4886919689	975703	1367.99	572.31	57	41	-1	10.83	10.83
Fixation R	1	7	4885943986	4886919689	975703	1367.99	572.31	57	41	-1	11.12	11.12
Saccade L	1	7	4886919689	4886939562	19873	1361.92	588.33	1368.32	617.79	0.39	30.49	1.00	19.60	565.86	-456.43	413.33
Saccade R	1	7	4886919689	4886939562	19873	1361.92	588.33	1368.32	617.79	0.39	30.49	1.00	19.60	565.86	-456.43	413.33
Fixation L	1	8	4886939562	4887118806	179244	1391.78	616.20	34	23	-1	10.94	10.94
Fixation R	1	8	4886939562	4887118806	179244	1391.78	616.20	34	23	-1	11.26	11.26
Saccade L	1	8	4887118806	4887138682	19876	1402.69	620.60	1499.24	619.80	0.54	97.67	1.00	26.96	2384.69	-2322.39	1575.52
Saccade R	1	8	4887118806	4887138682	19876	1402.69	620.60	1499.24	619.80	0.54	97.67	1.00	26.96	2384.69	-2322.39	1575.52
Fixation L	1	9	4887138682	4887238292	99610	1506.73	614.47	12	10	-1	11.21	11.21
Fixation R	1	9	4887138682	4887238292	99610	1506.73	614.47	12	10	-1	11.64	11.64
