[BeGaze]
Converted from:	C:\Documents and Settings\iViewX\Desktop\EXPERIMENTATIONS\Experiments\results\finaleart\S13H22431-finaleart-1.idf
Date:	27.03.2019 15:41:35
Version:	BeGaze 2.5.77
Sample Rate:	50
Subject:	S13H22431
Description:	Jimmy Petit

Table Header for Fixations:
Event Type	Trial	Number	Start	End	Duration	Location X	Location Y	Dispersion X	Dispersion Y	Plane	Avg. Pupil Size X	Avg. Pupil Size Y

Table Header for Saccades:
Event Type	Trial	Number	Start	End	Duration	Start Loc.X	Start Loc.Y	End Loc.X	End Loc.Y	Amplitude	Peak Speed	Peak Speed At	Average Speed	Peak Accel.	Peak Decel.	Average Accel.

Table Header for Blinks:
Event Type	Trial	Number	Start	End	Duration

Table Header for User Events:
Event Type	Trial	Number	Start	Description

UserEvent	1	1	27432323339	# Message: cross-La-fuite-des-nymphes-1906.jpg
Saccade L	1	1	27432337319	27432476591	139272	664.47	950.60	911.23	250.10	12.30	282.31	0.57	88.29	6984.82	-3638.78	2359.08
Saccade R	1	1	27432337319	27432476591	139272	664.47	950.60	911.23	250.10	12.30	282.31	0.57	88.29	6984.82	-3638.78	2359.08
Fixation L	1	1	27432476591	27432774926	298335	906.10	289.26	37	51	-1	13.64	13.64
Fixation R	1	1	27432476591	27432774926	298335	906.10	289.26	37	51	-1	14.87	14.87
Saccade L	1	2	27432774926	27432794794	19868	928.93	295.83	1044.38	351.83	0.94	129.79	1.00	47.33	3023.65	-2995.94	2146.21
Saccade R	1	2	27432774926	27432794794	19868	928.93	295.83	1044.38	351.83	0.94	129.79	1.00	47.33	3023.65	-2995.94	2146.21
Fixation L	1	2	27432794794	27432973934	179140	1028.20	394.46	32	62	-1	13.74	13.74
Fixation R	1	2	27432794794	27432973934	179140	1028.20	394.46	32	62	-1	15.12	15.12
Saccade L	1	3	27432973934	27432993788	19854	1029.85	414.44	1057.06	412.51	0.24	27.59	1.00	12.01	550.44	-622.53	418.44
Saccade R	1	3	27432973934	27432993788	19854	1029.85	414.44	1057.06	412.51	0.24	27.59	1.00	12.01	550.44	-622.53	418.44
Fixation L	1	3	27432993788	27433411391	417603	1089.87	396.86	51	31	-1	12.81	12.81
Fixation R	1	3	27432993788	27433411391	417603	1089.87	396.86	51	31	-1	13.63	13.63
Saccade L	1	4	27433411391	27433471140	59749	1108.78	384.14	1319.00	575.76	3.12	191.42	0.67	52.27	4772.65	-4451.92	2691.85
Saccade R	1	4	27433411391	27433471140	59749	1108.78	384.14	1319.00	575.76	3.12	191.42	0.67	52.27	4772.65	-4451.92	2691.85
Fixation L	1	4	27433471140	27434087740	616600	1308.73	581.76	20	44	-1	12.55	12.55
Fixation R	1	4	27433471140	27434087740	616600	1308.73	581.76	20	44	-1	13.02	13.02
Saccade L	1	5	27434087740	27434147364	59624	1304.09	608.12	996.02	595.70	3.55	122.56	0.33	59.52	3034.03	-1872.58	2130.54
Saccade R	1	5	27434087740	27434147364	59624	1304.09	608.12	996.02	595.70	3.55	122.56	0.33	59.52	3034.03	-1872.58	2130.54
Fixation L	1	5	27434147364	27434386098	238734	955.79	569.16	55	40	-1	12.81	12.81
Fixation R	1	5	27434147364	27434386098	238734	955.79	569.16	55	40	-1	13.31	13.31
Saccade L	1	6	27434386098	27434405981	19883	940.03	571.07	917.80	566.09	0.32	23.05	1.00	15.98	351.30	-413.50	271.75
Saccade R	1	6	27434386098	27434405981	19883	940.03	571.07	917.80	566.09	0.32	23.05	1.00	15.98	351.30	-413.50	271.75
Fixation L	1	6	27434405981	27434704332	298351	903.74	537.21	29	52	-1	12.63	12.63
Fixation R	1	6	27434405981	27434704332	298351	903.74	537.21	29	52	-1	13.04	13.04
Saccade L	1	7	27434704332	27434724215	19883	888.62	566.14	867.64	569.55	0.26	21.50	1.00	12.99	380.08	-266.66	250.78
Saccade R	1	7	27434704332	27434724215	19883	888.62	566.14	867.64	569.55	0.26	21.50	1.00	12.99	380.08	-266.66	250.78
Fixation L	1	7	27434724215	27434903204	178989	845.96	563.79	38	31	-1	12.36	12.36
Fixation R	1	7	27434724215	27434903204	178989	845.96	563.79	38	31	-1	13.16	13.16
Saccade L	1	8	27434903204	27434962836	59632	829.61	538.29	658.80	167.54	4.61	196.75	0.33	77.22	4878.84	-2699.63	2913.16
Saccade R	1	8	27434903204	27434962836	59632	829.61	538.29	658.80	167.54	4.61	196.75	0.33	77.22	4878.84	-2699.63	2913.16
Fixation L	1	8	27434962836	27435301060	338224	641.29	167.20	56	25	-1	12.15	12.15
Fixation R	1	8	27434962836	27435301060	338224	641.29	167.20	56	25	-1	12.90	12.90
Saccade L	1	9	27435301060	27435320942	19882	610.91	159.27	591.03	145.42	0.50	47.10	1.00	25.32	220.67	-564.64	352.51
Saccade R	1	9	27435301060	27435320942	19882	610.91	159.27	591.03	145.42	0.50	47.10	1.00	25.32	220.67	-564.64	352.51
Fixation L	1	9	27435320942	27435579427	258485	598.74	135.56	21	48	-1	12.34	12.34
Fixation R	1	9	27435320942	27435579427	258485	598.74	135.56	21	48	-1	13.19	13.19
Saccade L	1	10	27435579427	27435639176	59749	598.98	156.70	549.29	545.60	4.49	194.32	0.33	75.15	4702.81	-2983.84	2924.71
Saccade R	1	10	27435579427	27435639176	59749	598.98	156.70	549.29	545.60	4.49	194.32	0.33	75.15	4702.81	-2983.84	2924.71
Fixation L	1	10	27435639176	27435877787	238611	532.86	548.97	67	9	-1	13.12	13.12
Fixation R	1	10	27435639176	27435877787	238611	532.86	548.97	67	9	-1	13.73	13.73
Saccade L	1	11	27435877787	27435897656	19869	481.99	554.94	463.13	687.33	1.03	135.25	1.00	51.93	3332.45	-3296.89	2464.45
Saccade R	1	11	27435877787	27435897656	19869	481.99	554.94	463.13	687.33	1.03	135.25	1.00	51.93	3332.45	-3296.89	2464.45
Fixation L	1	11	27435897656	27436215893	318237	445.49	697.78	74	21	-1	13.79	13.79
Fixation R	1	11	27435897656	27436215893	318237	445.49	697.78	74	21	-1	14.40	14.40
Saccade L	1	12	27436215893	27436315429	99536	509.78	684.76	688.01	471.86	5.44	207.21	0.20	54.61	5021.21	-4912.40	2006.30
Saccade R	1	12	27436215893	27436315429	99536	509.78	684.76	688.01	471.86	5.44	207.21	0.20	54.61	5021.21	-4912.40	2006.30
