[BeGaze]
Converted from:	C:\Documents and Settings\iViewX\Desktop\EXPERIMENTATIONS\Experiments\results\finaleart\S11H21112-finaleart-1.idf
Date:	27.03.2019 15:39:19
Version:	BeGaze 2.5.77
Sample Rate:	50
Subject:	S11H21112
Description:	Clement legrand-Duchenne

Table Header for Fixations:
Event Type	Trial	Number	Start	End	Duration	Location X	Location Y	Dispersion X	Dispersion Y	Plane	Avg. Pupil Size X	Avg. Pupil Size Y

Table Header for Saccades:
Event Type	Trial	Number	Start	End	Duration	Start Loc.X	Start Loc.Y	End Loc.X	End Loc.Y	Amplitude	Peak Speed	Peak Speed At	Average Speed	Peak Accel.	Peak Decel.	Average Accel.

Table Header for Blinks:
Event Type	Trial	Number	Start	End	Duration

Table Header for User Events:
Event Type	Trial	Number	Start	Description

UserEvent	1	1	5323790170	# Message: Pots_Et_Fruits_Matisse_1901.jpg
Fixation L	1	1	5323796002	5324114602	318600	1050.01	205.32	8	47	-1	14.07	14.07
Fixation R	1	1	5323796002	5324114602	318600	1050.01	205.32	8	47	-1	16.09	16.09
Saccade L	1	1	5324114602	5324134479	19877	1047.59	242.15	1037.23	343.44	0.85	102.98	1.00	42.60	2212.73	-2477.67	1631.97
Saccade R	1	1	5324114602	5324134479	19877	1047.59	242.15	1037.23	343.44	0.85	102.98	1.00	42.60	2212.73	-2477.67	1631.97
Fixation L	1	2	5324134479	5324293867	159388	1004.64	347.32	45	48	-1	14.43	14.43
Fixation R	1	2	5324134479	5324293867	159388	1004.64	347.32	45	48	-1	16.58	16.58
Saccade L	1	2	5324293867	5324413337	119470	991.46	369.00	885.86	466.92	3.70	81.30	0.83	30.96	1859.24	-1362.90	866.96
Saccade R	1	2	5324293867	5324413337	119470	991.46	369.00	885.86	466.92	3.70	81.30	0.83	30.96	1859.24	-1362.90	866.96
Fixation L	1	3	5324413337	5324612449	199112	883.31	409.99	13	73	-1	14.09	14.09
Fixation R	1	3	5324413337	5324612449	199112	883.31	409.99	13	73	-1	16.27	16.27
Saccade L	1	3	5324612449	5324672199	59750	882.74	419.46	637.33	698.73	4.45	209.55	0.67	74.47	5024.27	-4422.28	2945.68
Saccade R	1	3	5324612449	5324672199	59750	882.74	419.46	637.33	698.73	4.45	209.55	0.67	74.47	5024.27	-4422.28	2945.68
Fixation L	1	4	5324672199	5324970810	298611	633.23	737.47	11	58	-1	14.87	14.87
Fixation R	1	4	5324672199	5324970810	298611	633.23	737.47	11	58	-1	16.79	16.79
Saccade L	1	4	5324970810	5325010688	39878	630.63	728.21	886.57	731.99	2.29	159.68	0.50	57.54	3874.96	-3465.27	3019.31
Saccade R	1	4	5324970810	5325010688	39878	630.63	728.21	886.57	731.99	2.29	159.68	0.50	57.54	3874.96	-3465.27	3019.31
Fixation L	1	5	5325010688	5325269549	258861	879.36	719.42	9	20	-1	14.70	14.70
Fixation R	1	5	5325010688	5325269549	258861	879.36	719.42	9	20	-1	16.96	16.96
Saccade L	1	5	5325269549	5325289438	19889	878.78	714.20	878.89	567.71	0.81	148.16	1.00	40.55	3586.54	-3309.15	2342.71
Saccade R	1	5	5325269549	5325289438	19889	878.78	714.20	878.89	567.71	0.81	148.16	1.00	40.55	3586.54	-3309.15	2342.71
Fixation L	1	6	5325289438	5325687657	398219	867.78	575.56	33	60	-1	13.92	13.92
Fixation R	1	6	5325289438	5325687657	398219	867.78	575.56	33	60	-1	16.09	16.09
Saccade L	1	6	5325687657	5325707667	20010	845.84	551.04	840.11	525.30	0.24	26.68	1.00	11.90	508.30	-488.14	385.27
Saccade R	1	6	5325687657	5325707667	20010	845.84	551.04	840.11	525.30	0.24	26.68	1.00	11.90	508.30	-488.14	385.27
Fixation L	1	7	5325707667	5325986398	278731	832.42	507.23	12	66	-1	13.18	13.18
Fixation R	1	7	5325707667	5325986398	278731	832.42	507.23	12	66	-1	15.08	15.08
Saccade L	1	7	5325986398	5326006274	19876	827.20	462.22	825.93	438.95	0.22	23.58	1.00	11.15	188.81	-423.16	206.67
Saccade R	1	7	5325986398	5326006274	19876	827.20	462.22	825.93	438.95	0.22	23.58	1.00	11.15	188.81	-423.16	206.67
Fixation L	1	8	5326006274	5326305017	298743	802.23	443.73	36	11	-1	12.89	12.89
Fixation R	1	8	5326006274	5326305017	298743	802.23	443.73	36	11	-1	14.95	14.95
Saccade L	1	8	5326305017	5326344877	39860	790.60	448.75	1024.50	528.63	2.36	133.66	1.00	59.29	3317.69	-3132.46	2972.41
Saccade R	1	8	5326305017	5326344877	39860	790.60	448.75	1024.50	528.63	2.36	133.66	1.00	59.29	3317.69	-3132.46	2972.41
Fixation L	1	9	5326344877	5326723115	378238	1016.69	550.66	16	32	-1	13.32	13.32
Fixation R	1	9	5326344877	5326723115	378238	1016.69	550.66	16	32	-1	15.21	15.21
Saccade L	1	9	5326723115	5326762994	39879	1007.66	547.86	788.98	325.62	2.62	196.21	0.50	65.72	4814.26	-4739.35	3853.25
Saccade R	1	9	5326723115	5326762994	39879	1007.66	547.86	788.98	325.62	2.62	196.21	0.50	65.72	4814.26	-4739.35	3853.25
Fixation L	1	10	5326762994	5327360329	597335	796.72	327.83	17	81	-1	13.12	13.12
Fixation R	1	10	5326762994	5327360329	597335	796.72	327.83	17	81	-1	14.81	14.81
Saccade L	1	10	5327360329	5327380341	20012	806.18	383.01	808.68	372.60	0.25	19.18	0.00	12.37	2.38	-394.18	175.77
Saccade R	1	10	5327360329	5327380341	20012	806.18	383.01	808.68	372.60	0.25	19.18	0.00	12.37	2.38	-394.18	175.77
Fixation L	1	11	5327380341	5327718821	338480	819.19	421.94	17	75	-1	13.08	13.08
Fixation R	1	11	5327380341	5327718821	338480	819.19	421.94	17	75	-1	14.86	14.86
Saccade L	1	11	5327718821	5327778570	59749	818.46	448.39	1133.63	534.74	4.26	214.69	0.33	71.37	5295.14	-5207.38	3340.28
Saccade R	1	11	5327718821	5327778570	59749	818.46	448.39	1133.63	534.74	4.26	214.69	0.33	71.37	5295.14	-5207.38	3340.28
