[BeGaze]
Converted from:	C:\Documents and Settings\iViewX\Desktop\EXPERIMENTATIONS\Experiments\results\finaleart\S1022551-finaleart-1.idf
Date:	27.03.2019 15:37:35
Version:	BeGaze 2.5.77
Sample Rate:	50
Subject:	S1022551
Description:	Alexis Nebout

Table Header for Fixations:
Event Type	Trial	Number	Start	End	Duration	Location X	Location Y	Dispersion X	Dispersion Y	Plane	Avg. Pupil Size X	Avg. Pupil Size Y

Table Header for Saccades:
Event Type	Trial	Number	Start	End	Duration	Start Loc.X	Start Loc.Y	End Loc.X	End Loc.Y	Amplitude	Peak Speed	Peak Speed At	Average Speed	Peak Accel.	Peak Decel.	Average Accel.

Table Header for Blinks:
Event Type	Trial	Number	Start	End	Duration

Table Header for User Events:
Event Type	Trial	Number	Start	Description

UserEvent	1	1	7696921320	# Message: void.jpg
Fixation L	1	1	7696940693	7697079947	139254	1046.96	625.41	17	31	-1	16.19	16.19
Fixation R	1	1	7696940693	7697079947	139254	1046.96	625.41	17	31	-1	14.43	14.43
Saccade L	1	1	7697079947	7697159437	79490	1037.93	606.14	1349.43	620.33	5.47	174.01	1.00	68.84	4284.53	-3639.93	3644.06
Saccade R	1	1	7697079947	7697159437	79490	1037.93	606.14	1349.43	620.33	5.47	174.01	1.00	68.84	4284.53	-3639.93	3644.06
Fixation L	1	2	7697159437	7697318550	159113	1340.71	643.29	14	51	-1	15.91	15.91
Fixation R	1	2	7697159437	7697318550	159113	1340.71	643.29	14	51	-1	13.95	13.95
Saccade L	1	2	7697318550	7697367075	48525	1335.25	671.54	1611.07	1000.87	4.64	382.32	1.00	95.53	8883.77	-9371.92	5159.87
Saccade R	1	2	7697318550	7697367075	48525	1335.25	671.54	1611.07	1000.87	4.64	382.32	1.00	95.53	8883.77	-9371.92	5159.87
Fixation L	1	3	7697367075	7697676654	309579	1616.88	1009.04	20	14	-1	15.66	15.66
Fixation R	1	3	7697367075	7697676654	309579	1616.88	1009.04	20	14	-1	13.40	13.40
Saccade L	1	3	7697676654	7697975056	298402	1625.69	1015.04	777.52	533.70	33.98	310.28	0.13	113.86	7725.10	-6775.13	4221.73
Saccade R	1	3	7697676654	7697975056	298402	1625.69	1015.04	777.52	533.70	33.98	310.28	0.13	113.86	7725.10	-6775.13	4221.73
Fixation L	1	4	7697975056	7698929710	954654	797.65	513.19	46	44	-1	15.19	15.19
Fixation R	1	4	7697975056	7698929710	954654	797.65	513.19	46	44	-1	14.04	14.04
