[BeGaze]
Converted from:	C:\Documents and Settings\iViewX\Desktop\EXPERIMENTATIONS\Experiments\results\finaleart\S4120113-finaleart-1.idf
Date:	27.03.2019 15:34:17
Version:	BeGaze 2.5.77
Sample Rate:	50
Subject:	S4120113
Description:	Vidal Attias

Table Header for Fixations:
Event Type	Trial	Number	Start	End	Duration	Location X	Location Y	Dispersion X	Dispersion Y	Plane	Avg. Pupil Size X	Avg. Pupil Size Y

Table Header for Saccades:
Event Type	Trial	Number	Start	End	Duration	Start Loc.X	Start Loc.Y	End Loc.X	End Loc.Y	Amplitude	Peak Speed	Peak Speed At	Average Speed	Peak Accel.	Peak Decel.	Average Accel.

Table Header for Blinks:
Event Type	Trial	Number	Start	End	Duration

Table Header for User Events:
Event Type	Trial	Number	Start	Description

UserEvent	1	1	6250934895	# Message: void.jpg
Fixation L	1	1	6250945428	6251204038	258610	402.90	617.67	12	18	-1	10.94	10.94
Fixation R	1	1	6250945428	6251204038	258610	402.90	617.67	12	18	-1	11.38	11.38
Saccade L	1	1	6251204038	6251223908	19870	394.59	611.98	453.89	535.01	0.61	98.28	1.00	30.65	2296.68	-2209.59	1599.44
Saccade R	1	1	6251204038	6251223908	19870	394.59	611.98	453.89	535.01	0.61	98.28	1.00	30.65	2296.68	-2209.59	1599.44
Fixation L	1	2	6251223908	6251482391	258483	458.30	513.89	26	45	-1	11.42	11.42
Fixation R	1	2	6251223908	6251482391	258483	458.30	513.89	26	45	-1	11.70	11.70
Saccade L	1	2	6251482391	6251601756	119365	465.30	493.47	1080.92	369.34	10.12	202.99	0.17	84.76	4620.14	-3761.90	2341.50
Saccade R	1	2	6251482391	6251601756	119365	465.30	493.47	1080.92	369.34	10.12	202.99	0.17	84.76	4620.14	-3761.90	2341.50
Fixation L	1	3	6251601756	6251800627	198871	1141.17	360.68	71	25	-1	12.24	12.24
Fixation R	1	3	6251601756	6251800627	198871	1141.17	360.68	71	25	-1	11.84	11.84
Saccade L	1	3	6251800627	6251820630	20003	1146.23	371.30	1156.12	351.32	0.33	23.50	1.00	16.35	339.31	-332.35	333.63
Saccade R	1	3	6251800627	6251820630	20003	1146.23	371.30	1156.12	351.32	0.33	23.50	1.00	16.35	339.31	-332.35	333.63
Fixation L	1	4	6251820630	6252735438	914808	1165.41	371.06	24	37	-1	13.33	13.33
Fixation R	1	4	6251820630	6252735438	914808	1165.41	371.06	24	37	-1	12.87	12.87
Saccade L	1	4	6252735438	6252755432	19994	1174.32	381.02	1086.98	394.47	0.60	89.39	1.00	29.80	2106.65	-1832.46	1434.29
Saccade R	1	4	6252735438	6252755432	19994	1174.32	381.02	1086.98	394.47	0.60	89.39	1.00	29.80	2106.65	-1832.46	1434.29
Fixation L	1	5	6252755432	6252934531	179099	1061.63	394.83	32	19	-1	13.89	13.89
Fixation R	1	5	6252755432	6252934531	179099	1061.63	394.83	32	19	-1	13.11	13.11
