[BeGaze]
Converted from:	C:\Documents and Settings\iViewX\Desktop\EXPERIMENTATIONS\Experiments\results\finaleart\S18F56223-finaleart-1.idf
Date:	27.03.2019 15:49:53
Version:	BeGaze 2.5.77
Sample Rate:	50
Subject:	S18F56223
Description:	Pascale Sebillot

Table Header for Fixations:
Event Type	Trial	Number	Start	End	Duration	Location X	Location Y	Dispersion X	Dispersion Y	Plane	Avg. Pupil Size X	Avg. Pupil Size Y

Table Header for Saccades:
Event Type	Trial	Number	Start	End	Duration	Start Loc.X	Start Loc.Y	End Loc.X	End Loc.Y	Amplitude	Peak Speed	Peak Speed At	Average Speed	Peak Accel.	Peak Decel.	Average Accel.

Table Header for Blinks:
Event Type	Trial	Number	Start	End	Duration

Table Header for User Events:
Event Type	Trial	Number	Start	Description

UserEvent	1	1	3220907072	# Message: void.jpg
Fixation L	1	1	3220922101	3221160688	238587	726.62	280.36	10	26	-1	16.99	16.99
Fixation R	1	1	3220922101	3221160688	238587	726.62	280.36	10	26	-1	15.80	15.80
Saccade L	1	1	3221160688	3221200432	39744	725.69	296.95	867.06	177.90	1.72	102.95	1.00	43.16	2247.74	-2487.16	2146.82
Saccade R	1	1	3221160688	3221200432	39744	725.69	296.95	867.06	177.90	1.72	102.95	1.00	43.16	2247.74	-2487.16	2146.82
Fixation L	1	2	3221200432	3221538675	338243	880.49	186.45	28	67	-1	16.65	16.65
Fixation R	1	2	3221200432	3221538675	338243	880.49	186.45	28	67	-1	15.65	15.65
Saccade L	1	2	3221538675	3221558564	19889	866.19	244.26	865.08	274.08	0.64	54.44	0.00	32.09	419.72	-602.00	349.31
Saccade R	1	2	3221538675	3221558564	19889	866.19	244.26	865.08	274.08	0.64	54.44	0.00	32.09	419.72	-602.00	349.31
Blink L	1	1	3221558564	3221757429	198865
Blink R	1	1	3221558564	3221757429	198865
Fixation L	1	3	3221757429	3221856916	99487	815.07	690.12	19	78	-1	16.20	16.20
Fixation R	1	3	3221757429	3221856916	99487	815.07	690.12	19	78	-1	15.17	15.17
Saccade L	1	3	3221856916	3221996038	139122	810.89	678.39	648.25	357.21	6.23	190.90	0.86	44.75	4719.24	-4384.36	1855.38
Saccade R	1	3	3221856916	3221996038	139122	810.89	678.39	648.25	357.21	6.23	190.90	0.86	44.75	4719.24	-4384.36	1855.38
Fixation L	1	4	3221996038	3222433642	437604	656.05	353.94	29	17	-1	15.72	15.72
Fixation R	1	4	3221996038	3222433642	437604	656.05	353.94	29	17	-1	15.30	15.30
Saccade L	1	4	3222433642	3222473514	39872	669.53	347.64	776.68	606.10	2.42	153.65	0.50	60.78	3791.36	-3464.42	3320.07
Saccade R	1	4	3222433642	3222473514	39872	669.53	347.64	776.68	606.10	2.42	153.65	0.50	60.78	3791.36	-3464.42	3320.07
Fixation L	1	5	3222473514	3222811628	338114	793.07	603.10	24	14	-1	15.34	15.34
Fixation R	1	5	3222473514	3222811628	338114	793.07	603.10	24	14	-1	15.06	15.06
Saccade L	1	5	3222811628	3222891117	79489	801.02	606.52	802.49	456.55	2.10	131.71	0.25	26.47	3254.71	-3182.25	1326.00
Saccade R	1	5	3222811628	3222891117	79489	801.02	606.52	802.49	456.55	2.10	131.71	0.25	26.47	3254.71	-3182.25	1326.00
