[BeGaze]
Converted from:	C:\Documents and Settings\iViewX\Desktop\EXPERIMENTATIONS\Experiments\results\finaleart\S12H22222-finaleart-1.idf
Date:	27.03.2019 15:40:53
Version:	BeGaze 2.5.77
Sample Rate:	50
Subject:	S12H22222
Description:	aurele barriere

Table Header for Fixations:
Event Type	Trial	Number	Start	End	Duration	Location X	Location Y	Dispersion X	Dispersion Y	Plane	Avg. Pupil Size X	Avg. Pupil Size Y

Table Header for Saccades:
Event Type	Trial	Number	Start	End	Duration	Start Loc.X	Start Loc.Y	End Loc.X	End Loc.Y	Amplitude	Peak Speed	Peak Speed At	Average Speed	Peak Accel.	Peak Decel.	Average Accel.

Table Header for Blinks:
Event Type	Trial	Number	Start	End	Duration

Table Header for User Events:
Event Type	Trial	Number	Start	Description

UserEvent	1	1	23877576848	# Message: void.jpg
Saccade L	1	1	23877578611	23877598499	19888	1068.00	507.81	1059.44	532.47	0.28	26.40	1.00	13.83	377.26	-18.57	131.95
Saccade R	1	1	23877578611	23877598499	19888	1068.00	507.81	1059.44	532.47	0.28	26.40	1.00	13.83	377.26	-18.57	131.95
Fixation L	1	1	23877598499	23877976469	377970	1026.30	572.19	41	52	-1	11.52	11.52
Fixation R	1	1	23877598499	23877976469	377970	1026.30	572.19	41	52	-1	11.12	11.12
Saccade L	1	2	23877976469	23878433817	457348	1018.05	582.32	958.41	463.24	25.40	195.50	0.65	55.53	2916.79	-4436.33	1206.53
Saccade R	1	2	23877976469	23878075823	99354	1018.05	582.32	997.86	577.78	1.52	78.19	1.00	15.28	1859.13	-93.58	385.92
Blink R	1	1	23878075823	23878314660	238837
Saccade R	1	3	23878314660	23878334449	19789	748.50	475.79	752.33	479.20	1.00	105.95	1.00	50.31	2916.79	-2519.03	2262.13
Blink R	1	2	23878334449	23878453819	119370
Fixation L	1	2	23878433817	23878573075	139258	994.08	469.30	51	46	-1	12.26	12.26
Fixation R	1	2	23878453819	23878573075	119256	999.18	470.17	36	46	-1	12.52	12.52
Saccade L	1	3	23878573075	23878592929	19854	1009.75	447.90	997.81	528.54	0.83	82.46	1.00	41.95	1536.19	-1725.89	1532.95
Saccade R	1	4	23878573075	23878592929	19854	1009.75	447.90	997.81	528.54	0.83	82.46	1.00	41.95	1536.19	-1725.89	1532.95
Fixation L	1	3	23878592929	23878831675	238746	1002.52	490.37	32	67	-1	13.12	13.12
Fixation R	1	3	23878592929	23878831675	238746	1002.52	490.37	32	67	-1	12.60	12.60
Saccade L	1	4	23878831675	23878851539	19864	987.88	497.53	987.29	497.83	0.06	4.48	1.00	3.02	52.09	-49.65	35.56
Saccade R	1	5	23878831675	23878851539	19864	987.88	497.53	987.29	497.83	0.06	4.48	1.00	3.02	52.09	-49.65	35.56
Fixation L	1	4	23878851539	23879567636	716097	943.64	486.79	57	40	-1	13.03	13.03
Fixation R	1	4	23878851539	23879567636	716097	943.64	486.79	57	40	-1	12.54	12.54
