[BeGaze]
Converted from:	C:\Documents and Settings\iViewX\Desktop\EXPERIMENTATIONS\Experiments\results\finaleart\S22H22551-finaleart-1.idf
Date:	27.03.2019 15:57:43
Version:	BeGaze 2.5.77
Sample Rate:	50
Subject:	S22H22551
Description:	Mathieu Chambre

Table Header for Fixations:
Event Type	Trial	Number	Start	End	Duration	Location X	Location Y	Dispersion X	Dispersion Y	Plane	Avg. Pupil Size X	Avg. Pupil Size Y

Table Header for Saccades:
Event Type	Trial	Number	Start	End	Duration	Start Loc.X	Start Loc.Y	End Loc.X	End Loc.Y	Amplitude	Peak Speed	Peak Speed At	Average Speed	Peak Accel.	Peak Decel.	Average Accel.

Table Header for Blinks:
Event Type	Trial	Number	Start	End	Duration

Table Header for User Events:
Event Type	Trial	Number	Start	Description

UserEvent	1	1	5160057291	# Message: void.jpg
Fixation L	1	1	5160059441	5160158934	99493	755.17	936.24	8	10	-1	15.12	15.12
Fixation R	1	1	5160059441	5160158934	99493	755.17	936.24	8	10	-1	16.00	16.00
Saccade L	1	1	5160158934	5160178814	19880	758.97	932.44	920.12	936.68	0.89	163.03	1.00	44.88	3986.31	-3596.52	2553.98
Saccade R	1	1	5160158934	5160178814	19880	758.97	932.44	920.12	936.68	0.89	163.03	1.00	44.88	3986.31	-3596.52	2553.98
Fixation L	1	2	5160178814	5160497038	318224	918.43	964.12	4	49	-1	15.27	15.27
Fixation R	1	2	5160178814	5160497038	318224	918.43	964.12	4	49	-1	15.42	15.42
Blink L	1	1	5160497038	5160715768	218730
Blink R	1	1	5160497038	5160715768	218730
Saccade L	1	2	5160715768	5160795391	79623	1116.41	381.97	1128.45	371.59	1.79	40.80	1.00	22.51	28975.86	-459.50	5034.02
Saccade R	1	2	5160715768	5160795391	79623	1116.41	381.97	1128.45	371.59	1.79	40.80	1.00	22.51	28975.86	-459.50	5034.02
Blink L	1	2	5160795391	5161054013	258622
Blink R	1	2	5160795391	5161054013	258622
Fixation L	1	3	5161054013	5161392115	338102	1158.88	410.66	33	65	-1	18.05	18.05
Fixation R	1	3	5161054013	5161392115	338102	1158.88	410.66	33	65	-1	17.43	17.43
Saccade L	1	3	5161392115	5161411994	19879	1184.65	420.19	1188.11	418.91	0.07	6.84	1.00	3.64	7.58	-77.80	45.55
Saccade R	1	3	5161392115	5161411994	19879	1184.65	420.19	1188.11	418.91	0.07	6.84	1.00	3.64	7.58	-77.80	45.55
Fixation L	1	4	5161411994	5161789845	377851	1187.15	422.67	23	20	-1	17.92	17.92
Fixation R	1	4	5161411994	5161789845	377851	1187.15	422.67	23	20	-1	17.33	17.33
Saccade L	1	4	5161789845	5161809715	19870	1173.26	433.34	1091.05	428.16	0.48	83.32	1.00	24.38	2014.64	-2020.99	1366.56
Saccade R	1	4	5161789845	5161809715	19870	1173.26	433.34	1091.05	428.16	0.48	83.32	1.00	24.38	2014.64	-2020.99	1366.56
Fixation L	1	5	5161809715	5162048473	238758	1081.41	430.37	11	11	-1	17.82	17.82
Fixation R	1	5	5161809715	5162048473	238758	1081.41	430.37	11	11	-1	16.93	16.93
