[BeGaze]
Converted from:	C:\Documents and Settings\iViewX\Desktop\EXPERIMENTATIONS\Experiments\results\finaleart\S01A22542-finaleart-1.idf
Date:	27.03.2019 15:33:25
Version:	BeGaze 2.5.77
Sample Rate:	50
Subject:	S01A22542
Description:	Thibault Seve Minnaert

Table Header for Fixations:
Event Type	Trial	Number	Start	End	Duration	Location X	Location Y	Dispersion X	Dispersion Y	Plane	Avg. Pupil Size X	Avg. Pupil Size Y

Table Header for Saccades:
Event Type	Trial	Number	Start	End	Duration	Start Loc.X	Start Loc.Y	End Loc.X	End Loc.Y	Amplitude	Peak Speed	Peak Speed At	Average Speed	Peak Accel.	Peak Decel.	Average Accel.

Table Header for Blinks:
Event Type	Trial	Number	Start	End	Duration

Table Header for User Events:
Event Type	Trial	Number	Start	Description

UserEvent	1	1	10019468696	# Message: void.jpg
Fixation L	1	1	10019473832	10019752310	278478	768.96	325.26	6	3	-1	13.04	13.04
Fixation R	1	1	10019473832	10019752310	278478	768.96	325.26	6	3	-1	13.88	13.88
Saccade L	1	1	10019752310	10019831941	79631	764.78	327.38	970.48	809.62	6.25	183.32	0.50	78.54	4527.41	-3064.94	2553.06
Saccade R	1	1	10019752310	10019831941	79631	764.78	327.38	970.48	809.62	6.25	183.32	0.50	78.54	4527.41	-3064.94	2553.06
Fixation L	1	2	10019831941	10019991043	159102	983.33	798.47	20	23	-1	13.32	13.32
Fixation R	1	2	10019831941	10019991043	159102	983.33	798.47	20	23	-1	13.76	13.76
Blink L	1	1	10019991043	10020269546	278503
Blink R	1	1	10019991043	10020269546	278503
Fixation L	1	3	10020329158	10020468396	139238	1277.94	605.81	77	13	-1	12.95	12.95
Fixation R	1	3	10020329158	10020468396	139238	1277.94	605.81	77	13	-1	13.58	13.58
Saccade L	1	2	10020468396	10020508140	39744	1341.49	611.28	1722.94	648.55	4.10	252.66	0.50	103.09	6229.03	-5171.90	3936.07
Saccade R	1	2	10020468396	10020508140	39744	1341.49	611.28	1722.94	648.55	4.10	252.66	0.50	103.09	6229.03	-5171.90	3936.07
Fixation L	1	4	10020508140	10020647397	139257	1720.50	701.04	19	70	-1	13.65	13.65
Fixation R	1	4	10020508140	10020647397	139257	1720.50	701.04	19	70	-1	13.50	13.50
Saccade L	1	3	10020647397	10020766777	119380	1708.65	718.67	1934.06	729.75	4.97	176.92	0.67	41.60	4203.45	-3711.28	1564.92
Saccade R	1	3	10020647397	10020766777	119380	1708.65	718.67	1934.06	729.75	4.97	176.92	0.67	41.60	4203.45	-3711.28	1564.92
Fixation L	1	5	10020766777	10020886134	119357	1896.63	747.41	57	29	-1	12.76	12.76
Fixation R	1	5	10020766777	10020886134	119357	1896.63	747.41	57	29	-1	12.69	12.69
Saccade L	1	4	10020886134	10020905998	19864	1877.09	758.71	1858.76	769.54	0.24	22.04	1.00	11.91	39.15	-386.28	146.00
Saccade R	1	4	10020886134	10020905998	19864	1877.09	758.71	1858.76	769.54	0.24	22.04	1.00	11.91	39.15	-386.28	146.00
Fixation L	1	6	10020905998	10021005369	99371	1854.32	772.79	12	12	-1	12.68	12.68
Fixation R	1	6	10020905998	10021005369	99371	1854.32	772.79	12	12	-1	12.43	12.43
Saccade L	1	5	10021005369	10021085000	79631	1846.95	779.00	1313.10	765.26	6.67	279.11	0.50	83.77	6861.27	-6605.17	3614.21
Saccade R	1	5	10021005369	10021085000	79631	1846.95	779.00	1313.10	765.26	6.67	279.11	0.50	83.77	6861.27	-6605.17	3614.21
Fixation L	1	7	10021085000	10021184359	99359	1308.96	712.52	12	83	-1	12.89	12.89
Fixation R	1	7	10021085000	10021184359	99359	1308.96	712.52	12	83	-1	12.38	12.38
Saccade L	1	6	10021184359	10021283855	99496	1301.47	681.32	1145.14	560.76	3.25	190.30	1.00	32.70	4707.50	-4368.85	1489.58
Saccade R	1	6	10021184359	10021283855	99496	1301.47	681.32	1145.14	560.76	3.25	190.30	1.00	32.70	4707.50	-4368.85	1489.58
Fixation L	1	8	10021283855	10021462860	179005	1108.89	537.46	46	33	-1	12.05	12.05
Fixation R	1	8	10021283855	10021462860	179005	1108.89	537.46	46	33	-1	11.76	11.76
