[BeGaze]
Converted from:	C:\Documents and Settings\iViewX\Desktop\EXPERIMENTATIONS\Experiments\results\finaleart\S16F14542-finaleart-1.idf
Date:	27.03.2019 15:47:17
Version:	BeGaze 2.5.77
Sample Rate:	50
Subject:	S16F14542
Description:	Diane Dewez

Table Header for Fixations:
Event Type	Trial	Number	Start	End	Duration	Location X	Location Y	Dispersion X	Dispersion Y	Plane	Avg. Pupil Size X	Avg. Pupil Size Y

Table Header for Saccades:
Event Type	Trial	Number	Start	End	Duration	Start Loc.X	Start Loc.Y	End Loc.X	End Loc.Y	Amplitude	Peak Speed	Peak Speed At	Average Speed	Peak Accel.	Peak Decel.	Average Accel.

Table Header for Blinks:
Event Type	Trial	Number	Start	End	Duration

Table Header for User Events:
Event Type	Trial	Number	Start	Description

UserEvent	1	1	7070136846	# Message: Rapids_on_the_Petite_Creuse_at_Fresselines_Monet_1889.jpg
Fixation L	1	1	7070137193	7070713912	576719	886.93	518.48	15	25	-1	12.44	12.44
Fixation R	1	1	7070137193	7070713912	576719	886.93	518.48	15	25	-1	13.15	13.15
Saccade L	1	1	7070713912	7070733927	20015	886.01	511.94	758.25	569.66	0.80	141.79	1.00	40.17	3503.74	-3011.38	2209.43
Saccade R	1	1	7070713912	7070733927	20015	886.01	511.94	758.25	569.66	0.80	141.79	1.00	40.17	3503.74	-3011.38	2209.43
Fixation L	1	2	7070733927	7071032153	298226	733.91	536.39	33	46	-1	12.56	12.56
Fixation R	1	2	7070733927	7071032153	298226	733.91	536.39	33	46	-1	13.06	13.06
Saccade L	1	2	7071032153	7071091894	59741	724.97	536.93	426.38	941.30	5.63	252.51	0.33	94.29	6269.22	-4158.11	4079.57
Saccade R	1	2	7071032153	7071091894	59741	724.97	536.93	426.38	941.30	5.63	252.51	0.33	94.29	6269.22	-4158.11	4079.57
Fixation L	1	3	7071091894	7071231143	139249	405.79	928.41	32	20	-1	12.54	12.54
Fixation R	1	3	7071091894	7071231143	139249	405.79	928.41	32	20	-1	13.08	13.08
Saccade L	1	3	7071231143	7071251017	19874	405.49	936.13	343.72	1064.93	0.93	144.48	1.00	46.79	3561.82	-3362.32	2537.17
Saccade R	1	3	7071231143	7071251017	19874	405.49	936.13	343.72	1064.93	0.93	144.48	1.00	46.79	3561.82	-3362.32	2537.17
Fixation L	1	4	7071251017	7071529503	278486	318.77	1097.25	29	38	-1	12.61	12.61
Fixation R	1	4	7071251017	7071529503	278486	318.77	1097.25	29	38	-1	13.86	13.86
Saccade L	1	4	7071529503	7071549384	19881	314.30	1102.82	382.82	1107.86	0.43	69.50	1.00	21.67	1713.33	-1525.46	1209.95
Saccade R	1	4	7071529503	7071549384	19881	314.30	1102.82	382.82	1107.86	0.43	69.50	1.00	21.67	1713.33	-1525.46	1209.95
Fixation L	1	5	7071549384	7071887488	338104	407.05	1132.14	39	33	-1	12.99	12.99
Fixation R	1	5	7071549384	7071887488	338104	407.05	1132.14	39	33	-1	13.85	13.85
Blink L	1	1	7071887488	7072046604	159116
Blink R	1	1	7071887488	7072046604	159116
Fixation L	1	6	7072046604	7072882058	835454	884.62	509.15	40	53	-1	12.87	12.87
Fixation R	1	6	7072046604	7072882058	835454	884.62	509.15	40	53	-1	13.09	13.09
Saccade L	1	5	7072882058	7072921813	39755	889.41	525.14	1199.00	468.05	2.64	177.13	0.50	66.39	4411.89	-4124.99	3856.05
Saccade R	1	5	7072882058	7072921813	39755	889.41	525.14	1199.00	468.05	2.64	177.13	0.50	66.39	4411.89	-4124.99	3856.05
Fixation L	1	7	7072921813	7073598039	676226	1204.28	474.10	17	30	-1	12.48	12.48
Fixation R	1	7	7072921813	7073598039	676226	1204.28	474.10	17	30	-1	12.15	12.15
Saccade L	1	6	7073598039	7073697520	99481	1206.24	463.45	406.28	1089.09	13.14	299.21	0.60	132.06	6192.73	-6180.66	3879.55
Saccade R	1	6	7073598039	7073697520	99481	1206.24	463.45	406.28	1089.09	13.14	299.21	0.60	132.06	6192.73	-6180.66	3879.55
Fixation L	1	8	7073697520	7074135130	437610	392.79	1120.22	16	47	-1	12.67	12.67
Fixation R	1	8	7073697520	7074135130	437610	392.79	1120.22	16	47	-1	13.19	13.19
