[BeGaze]
Converted from:	C:\Documents and Settings\iViewX\Desktop\EXPERIMENTATIONS\Experiments\results\finaleart\S3121421-finaleart-1.idf
Date:	27.03.2019 15:34:16
Version:	BeGaze 2.5.77
Sample Rate:	50
Subject:	S3121421
Description:	Jean Jouve

Table Header for Fixations:
Event Type	Trial	Number	Start	End	Duration	Location X	Location Y	Dispersion X	Dispersion Y	Plane	Avg. Pupil Size X	Avg. Pupil Size Y

Table Header for Saccades:
Event Type	Trial	Number	Start	End	Duration	Start Loc.X	Start Loc.Y	End Loc.X	End Loc.Y	Amplitude	Peak Speed	Peak Speed At	Average Speed	Peak Accel.	Peak Decel.	Average Accel.

Table Header for Blinks:
Event Type	Trial	Number	Start	End	Duration

Table Header for User Events:
Event Type	Trial	Number	Start	Description

UserEvent	1	1	5630185239	# Message: void.jpg
Fixation L	1	1	5630198537	5630516753	318216	1102.09	198.87	25	33	-1	9.78	9.78
Fixation R	1	1	5630198537	5630516753	318216	1102.09	198.87	25	33	-1	11.86	11.86
Saccade L	1	1	5630516753	5630815109	298356	1083.38	185.33	871.00	1086.73	18.22	166.72	0.87	61.08	3131.60	-2574.46	1308.25
Saccade R	1	1	5630516753	5630815109	298356	1083.38	185.33	871.00	1086.73	18.22	166.72	0.87	61.08	3131.60	-2574.46	1308.25
Fixation L	1	2	5630815109	5630914607	99498	902.27	1084.47	44	12	-1	9.77	9.77
Fixation R	1	2	5630815109	5630914607	99498	902.27	1084.47	44	12	-1	12.67	12.67
Saccade L	1	2	5630914607	5630934471	19864	915.88	1079.07	895.94	1026.51	0.49	56.87	1.00	24.79	1389.56	-908.97	1008.67
Saccade R	1	2	5630914607	5630934471	19864	915.88	1079.07	895.94	1026.51	0.49	56.87	1.00	24.79	1389.56	-908.97	1008.67
Fixation L	1	3	5630934471	5631212962	278491	913.04	1065.90	22	67	-1	9.50	9.50
Fixation R	1	3	5630934471	5631212962	278491	913.04	1065.90	22	67	-1	12.65	12.65
Saccade L	1	3	5631212962	5631272583	59621	909.27	1061.60	385.16	1206.75	6.02	309.90	0.33	100.96	7701.94	-7438.97	5458.65
Saccade R	1	3	5631212962	5631272583	59621	909.27	1061.60	385.16	1206.75	6.02	309.90	0.33	100.96	7701.94	-7438.97	5458.65
Blink L	1	1	5631272583	5631431698	159115
Blink R	1	1	5631272583	5631431698	159115
Fixation L	1	4	5631431698	5632167654	735956	517.30	1234.31	39	20	-1	10.81	10.81
Fixation R	1	4	5631431698	5632167654	735956	517.30	1234.31	39	20	-1	12.54	12.54
