[BeGaze]
Converted from:	C:\Documents and Settings\iViewX\Desktop\EXPERIMENTATIONS\Experiments\results\finaleart\S9H29221-finaleart-1.idf
Date:	27.03.2019 16:04:16
Version:	BeGaze 2.5.77
Sample Rate:	50
Subject:	S9H29221
Description:	steven

Table Header for Fixations:
Event Type	Trial	Number	Start	End	Duration	Location X	Location Y	Dispersion X	Dispersion Y	Plane	Avg. Pupil Size X	Avg. Pupil Size Y

Table Header for Saccades:
Event Type	Trial	Number	Start	End	Duration	Start Loc.X	Start Loc.Y	End Loc.X	End Loc.Y	Amplitude	Peak Speed	Peak Speed At	Average Speed	Peak Accel.	Peak Decel.	Average Accel.

Table Header for Blinks:
Event Type	Trial	Number	Start	End	Duration

Table Header for User Events:
Event Type	Trial	Number	Start	Description

UserEvent	1	1	6898486647	# Message: void.jpg
Fixation L	1	1	6898499124	6898598624	99500	992.79	414.72	7	7	-1	11.45	11.45
Fixation R	1	1	6898499124	6898598624	99500	992.79	414.72	7	7	-1	10.62	10.62
Saccade L	1	1	6898598624	6898679155	80531	993.54	413.47	862.32	398.90	3.61	133.54	1.00	44.80	3182.05	-2911.65	2288.85
Saccade R	1	1	6898598624	6898679155	80531	993.54	413.47	862.32	398.90	3.61	133.54	1.00	44.80	3182.05	-2911.65	2288.85
Fixation L	1	2	6898679155	6898917187	238032	837.09	372.00	32	41	-1	12.16	12.16
Fixation R	1	2	6898679155	6898917187	238032	837.09	372.00	32	41	-1	11.34	11.34
Saccade L	1	2	6898917187	6898978482	61295	831.86	357.16	700.45	349.30	2.61	133.16	1.00	42.52	3155.50	-3100.16	2284.66
Saccade R	1	2	6898917187	6898978482	61295	831.86	357.16	700.45	349.30	2.61	133.16	1.00	42.52	3155.50	-3100.16	2284.66
Fixation L	1	3	6898978482	6899274837	296355	668.14	334.20	39	28	-1	13.31	13.31
Fixation R	1	3	6898978482	6899274837	296355	668.14	334.20	39	28	-1	12.38	12.38
Saccade L	1	3	6899274837	6899314575	39738	666.82	333.23	948.76	364.91	2.47	155.57	0.50	62.23	3753.37	-3597.69	3394.86
Saccade R	1	3	6899274837	6899314575	39738	666.82	333.23	948.76	364.91	2.47	155.57	0.50	62.23	3753.37	-3597.69	3394.86
Fixation L	1	4	6899314575	6899593052	278477	974.23	391.10	53	44	-1	13.58	13.58
Fixation R	1	4	6899314575	6899593052	278477	974.23	391.10	53	44	-1	12.74	12.74
Saccade L	1	4	6899593052	6899632805	39753	1002.74	409.77	1301.59	535.98	3.24	188.62	0.50	81.48	4657.22	-3564.69	3746.73
Saccade R	1	4	6899593052	6899632805	39753	1002.74	409.77	1301.59	535.98	3.24	188.62	0.50	81.48	4657.22	-3564.69	3746.73
Fixation L	1	5	6899632805	6900150037	517232	1330.03	554.93	41	25	-1	14.45	14.45
Fixation R	1	5	6899632805	6900150037	517232	1330.03	554.93	41	25	-1	13.69	13.69
Saccade L	1	5	6900150037	6900169907	19870	1336.12	550.35	1430.03	552.60	0.54	95.02	1.00	27.36	2261.80	-2270.18	1533.41
Saccade R	1	5	6900150037	6900169907	19870	1336.12	550.35	1430.03	552.60	0.54	95.02	1.00	27.36	2261.80	-2270.18	1533.41
Fixation L	1	6	6900169907	6900508023	338116	1441.37	553.75	14	16	-1	15.43	15.43
Fixation R	1	6	6900169907	6900508023	338116	1441.37	553.75	14	16	-1	14.43	14.43
