[BeGaze]
Converted from:	C:\Documents and Settings\iViewX\Desktop\EXPERIMENTATIONS\Experiments\results\finaleart\S20H24222-finaleart-1.idf
Date:	27.03.2019 15:53:09
Version:	BeGaze 2.5.77
Sample Rate:	50
Subject:	S20H24222
Description:	Hugo Brument

Table Header for Fixations:
Event Type	Trial	Number	Start	End	Duration	Location X	Location Y	Dispersion X	Dispersion Y	Plane	Avg. Pupil Size X	Avg. Pupil Size Y

Table Header for Saccades:
Event Type	Trial	Number	Start	End	Duration	Start Loc.X	Start Loc.Y	End Loc.X	End Loc.Y	Amplitude	Peak Speed	Peak Speed At	Average Speed	Peak Accel.	Peak Decel.	Average Accel.

Table Header for Blinks:
Event Type	Trial	Number	Start	End	Duration

Table Header for User Events:
Event Type	Trial	Number	Start	Description

UserEvent	1	1	11729648790	# Message: void.jpg
Fixation L	1	1	11729652375	11729791597	139222	1172.62	304.02	5	4	-1	11.35	11.35
Fixation R	1	1	11729652375	11729791597	139222	1172.62	304.02	5	4	-1	11.61	11.61
Saccade L	1	1	11729791597	11729811507	19910	1171.76	301.98	1054.91	294.65	0.69	118.43	1.00	34.56	2924.63	-2253.00	1857.33
Saccade R	1	1	11729791597	11729811507	19910	1171.76	301.98	1054.91	294.65	0.69	118.43	1.00	34.56	2924.63	-2253.00	1857.33
Fixation L	1	2	11729811507	11729950717	139210	1018.95	271.80	53	40	-1	11.39	11.39
Fixation R	1	2	11729811507	11729950717	139210	1018.95	271.80	53	40	-1	11.65	11.65
Saccade L	1	2	11729950717	11729970609	19892	1001.43	253.80	1004.66	248.10	0.14	11.91	1.00	7.08	0.49	-132.14	68.25
Saccade R	1	2	11729950717	11729970609	19892	1001.43	253.80	1004.66	248.10	0.14	11.91	1.00	7.08	0.49	-132.14	68.25
Fixation L	1	3	11729970609	11730109833	139224	1003.05	239.55	9	19	-1	11.63	11.63
Fixation R	1	3	11729970609	11730109833	139224	1003.05	239.55	9	19	-1	12.09	12.09
Blink L	1	1	11730109833	11730348581	238748
Blink R	1	1	11730109833	11730348581	238748
Fixation L	1	4	11730348581	11731124296	775715	766.70	431.65	44	54	-1	12.43	12.43
Fixation R	1	4	11730348581	11731124296	775715	766.70	431.65	44	54	-1	14.05	14.05
Saccade L	1	3	11731124296	11731144170	19874	801.21	446.31	812.62	443.40	0.26	24.24	1.00	12.97	126.84	-308.11	215.53
Saccade R	1	3	11731124296	11731144170	19874	801.21	446.31	812.62	443.40	0.26	24.24	1.00	12.97	126.84	-308.11	215.53
Fixation L	1	5	11731144170	11731422524	278354	835.11	450.18	56	39	-1	12.44	12.44
Fixation R	1	5	11731144170	11731422524	278354	835.11	450.18	56	39	-1	14.17	14.17
Saccade L	1	4	11731422524	11731442533	20009	867.77	480.71	887.46	483.39	0.38	39.96	1.00	18.88	37.73	-496.64	327.58
Saccade R	1	4	11731422524	11731442533	20009	867.77	480.71	887.46	483.39	0.38	39.96	1.00	18.88	37.73	-496.64	327.58
Fixation L	1	6	11731442533	11731641391	198858	891.72	491.21	17	12	-1	12.38	12.38
Fixation R	1	6	11731442533	11731641391	198858	891.72	491.21	17	12	-1	14.04	14.04
