[BeGaze]
Converted from:	C:\Documents and Settings\iViewX\Desktop\EXPERIMENTATIONS\Experiments\results\finaleart\S8119532-finaleart-1.idf
Date:	27.03.2019 15:59:14
Version:	BeGaze 2.5.77
Sample Rate:	50
Subject:	S8119532
Description:	Alexandre Drewery

Table Header for Fixations:
Event Type	Trial	Number	Start	End	Duration	Location X	Location Y	Dispersion X	Dispersion Y	Plane	Avg. Pupil Size X	Avg. Pupil Size Y

Table Header for Saccades:
Event Type	Trial	Number	Start	End	Duration	Start Loc.X	Start Loc.Y	End Loc.X	End Loc.Y	Amplitude	Peak Speed	Peak Speed At	Average Speed	Peak Accel.	Peak Decel.	Average Accel.

Table Header for Blinks:
Event Type	Trial	Number	Start	End	Duration

Table Header for User Events:
Event Type	Trial	Number	Start	Description

UserEvent	1	1	2449883445	# Message: the_forest_Cross_1907.jpg
Fixation L	1	1	2449894455	2450690029	795574	857.92	404.09	22	55	-1	14.27	14.27
Fixation R	1	1	2449894455	2450690029	795574	857.92	404.09	22	55	-1	15.56	15.56
Saccade L	1	1	2450690029	2450930439	240410	861.18	436.33	900.45	629.12	10.69	166.03	0.08	44.47	4117.68	-2826.53	1473.43
Saccade R	1	1	2450690029	2450930439	240410	861.18	436.33	900.45	629.12	10.69	166.03	0.08	44.47	4117.68	-2826.53	1473.43
Fixation L	1	2	2450930439	2451127654	197215	905.17	680.97	14	77	-1	14.04	14.04
Fixation R	1	2	2450930439	2451127654	197215	905.17	680.97	14	77	-1	15.20	15.20
Saccade L	1	2	2451127654	2451167378	39724	908.02	656.74	679.91	295.81	4.35	261.01	0.50	109.42	5933.96	-5780.08	4796.33
Saccade R	1	2	2451127654	2451167378	39724	908.02	656.74	679.91	295.81	4.35	261.01	0.50	109.42	5933.96	-5780.08	4796.33
Fixation L	1	3	2451167378	2451485617	318239	661.98	325.81	33	66	-1	12.83	12.83
Fixation R	1	3	2451167378	2451485617	318239	661.98	325.81	33	66	-1	14.08	14.08
Saccade L	1	3	2451485617	2451505641	20024	646.56	281.14	633.43	257.60	0.53	51.12	0.00	26.28	310.38	-980.45	551.01
Saccade R	1	3	2451485617	2451505641	20024	646.56	281.14	633.43	257.60	0.53	51.12	0.00	26.28	310.38	-980.45	551.01
Fixation L	1	4	2451505641	2451684608	178967	635.26	268.46	31	22	-1	12.73	12.73
Fixation R	1	4	2451505641	2451684608	178967	635.26	268.46	31	22	-1	14.17	14.17
Saccade L	1	4	2451684608	2451724384	39776	637.27	261.79	956.41	237.03	3.10	185.45	1.00	77.88	4299.84	-4170.43	3557.34
Saccade R	1	4	2451684608	2451724384	39776	637.27	261.79	956.41	237.03	3.10	185.45	1.00	77.88	4299.84	-4170.43	3557.34
Fixation L	1	5	2451724384	2451863594	139210	941.55	255.84	25	32	-1	13.04	13.04
Fixation R	1	5	2451724384	2451863594	139210	941.55	255.84	25	32	-1	14.24	14.24
Saccade L	1	5	2451863594	2451903348	39754	941.32	256.91	1252.56	287.80	2.69	201.27	0.50	67.74	4851.61	-4835.54	3756.33
Saccade R	1	5	2451863594	2451903348	39754	941.32	256.91	1252.56	287.80	2.69	201.27	0.50	67.74	4851.61	-4835.54	3756.33
Fixation L	1	6	2451903348	2452142085	238737	1244.85	297.31	25	49	-1	13.71	13.71
Fixation R	1	6	2451903348	2452142085	238737	1244.85	297.31	25	49	-1	14.55	14.55
Saccade L	1	6	2452142085	2452181833	39748	1248.93	305.00	1195.10	205.80	1.48	92.27	1.00	37.35	2218.22	-2070.08	1336.15
Saccade R	1	6	2452142085	2452181833	39748	1248.93	305.00	1195.10	205.80	1.48	92.27	1.00	37.35	2218.22	-2070.08	1336.15
Fixation L	1	7	2452181833	2452400585	218752	1165.14	236.09	38	57	-1	13.76	13.76
Fixation R	1	7	2452181833	2452400585	218752	1165.14	236.09	38	57	-1	14.50	14.50
Saccade L	1	7	2452400585	2452460313	59728	1160.94	232.24	1496.23	513.90	5.55	222.50	0.67	92.94	5489.22	-4458.89	3759.26
Saccade R	1	7	2452400585	2452460313	59728	1160.94	232.24	1496.23	513.90	5.55	222.50	0.67	92.94	5489.22	-4458.89	3759.26
Fixation L	1	8	2452460313	2452679059	218746	1486.86	548.86	34	61	-1	14.01	14.01
Fixation R	1	8	2452460313	2452679059	218746	1486.86	548.86	34	61	-1	14.34	14.34
Saccade L	1	8	2452679059	2452778550	99491	1487.41	562.64	1481.26	858.54	5.59	288.79	1.00	56.17	6624.57	-6620.70	2231.10
Saccade R	1	8	2452679059	2452778550	99491	1487.41	562.64	1481.26	858.54	5.59	288.79	1.00	56.17	6624.57	-6620.70	2231.10
Fixation L	1	9	2452778550	2453037050	258500	1483.76	876.12	36	35	-1	14.13	14.13
Fixation R	1	9	2452778550	2453037050	258500	1483.76	876.12	36	35	-1	14.11	14.11
Saccade L	1	9	2453037050	2453076924	39874	1482.03	876.81	1037.25	812.62	3.85	293.39	1.00	96.53	7102.02	-7268.03	5522.45
Saccade R	1	9	2453037050	2453076924	39874	1482.03	876.81	1037.25	812.62	3.85	293.39	1.00	96.53	7102.02	-7268.03	5522.45
Fixation L	1	10	2453076924	2453236043	159119	1044.37	805.72	17	53	-1	14.45	14.45
Fixation R	1	10	2453076924	2453236043	159119	1044.37	805.72	17	53	-1	15.09	15.09
Saccade L	1	10	2453236043	2453255908	19865	1053.57	769.80	938.75	736.12	0.80	121.03	1.00	40.26	2901.69	-2373.48	1866.17
Saccade R	1	10	2453236043	2453255908	19865	1053.57	769.80	938.75	736.12	0.80	121.03	1.00	40.26	2901.69	-2373.48	1866.17
Fixation L	1	11	2453255908	2453555513	299605	950.85	727.28	19	48	-1	14.27	14.27
Fixation R	1	11	2453255908	2453555513	299605	950.85	727.28	19	48	-1	15.40	15.40
Saccade L	1	11	2453555513	2453594025	38512	958.28	738.36	756.88	725.36	2.33	204.07	1.00	60.56	4738.28	-4815.05	3257.84
Saccade R	1	11	2453555513	2453594025	38512	958.28	738.36	756.88	725.36	2.33	204.07	1.00	60.56	4738.28	-4815.05	3257.84
Fixation L	1	12	2453594025	2453872511	278486	738.62	760.53	24	61	-1	13.61	13.61
Fixation R	1	12	2453594025	2453872511	278486	738.62	760.53	24	61	-1	15.82	15.82
