[BeGaze]
Converted from:	C:\Documents and Settings\iViewX\Desktop\EXPERIMENTATIONS\Experiments\results\finaleart\S01A22542-finaleart-1.idf
Date:	27.03.2019 15:33:16
Version:	BeGaze 2.5.77
Sample Rate:	50
Subject:	S01A22542
Description:	Thibault Seve Minnaert

Table Header for Fixations:
Event Type	Trial	Number	Start	End	Duration	Location X	Location Y	Dispersion X	Dispersion Y	Plane	Avg. Pupil Size X	Avg. Pupil Size Y

Table Header for Saccades:
Event Type	Trial	Number	Start	End	Duration	Start Loc.X	Start Loc.Y	End Loc.X	End Loc.Y	Amplitude	Peak Speed	Peak Speed At	Average Speed	Peak Accel.	Peak Decel.	Average Accel.

Table Header for Blinks:
Event Type	Trial	Number	Start	End	Duration

Table Header for User Events:
Event Type	Trial	Number	Start	Description

UserEvent	1	1	8732500018	# Message: venice_from_porche_of_madonna_turner_1835.jpg
Fixation L	1	1	8732506648	8732904903	398255	877.78	471.05	30	57	-1	14.79	14.79
Fixation R	1	1	8732506648	8732904903	398255	877.78	471.05	30	57	-1	15.39	15.39
Saccade L	1	1	8732904903	8732944770	39867	865.03	493.81	976.54	646.31	1.80	158.46	1.00	45.15	3884.94	-3348.36	2172.01
Saccade R	1	1	8732904903	8732944770	39867	865.03	493.81	976.54	646.31	1.80	158.46	1.00	45.15	3884.94	-3348.36	2172.01
Fixation L	1	2	8732944770	8733123860	179090	979.81	673.12	9	40	-1	14.47	14.47
Fixation R	1	2	8732944770	8733123860	179090	979.81	673.12	9	40	-1	15.06	15.06
Saccade L	1	2	8733123860	8733143748	19888	973.51	677.95	910.73	766.67	0.78	109.94	1.00	39.45	2573.29	-2114.43	1777.52
Saccade R	1	2	8733123860	8733143748	19888	973.51	677.95	910.73	766.67	0.78	109.94	1.00	39.45	2573.29	-2114.43	1777.52
Fixation L	1	3	8733143748	8733342851	199103	911.03	750.99	40	27	-1	12.24	12.24
Fixation R	1	3	8733143748	8733342851	199103	911.03	750.99	40	27	-1	12.87	12.87
Saccade L	1	3	8733342851	8733382728	39877	901.76	752.12	1205.72	847.71	2.77	168.95	0.50	69.40	4144.44	-3869.35	3948.55
Saccade R	1	3	8733342851	8733382728	39877	901.76	752.12	1205.72	847.71	2.77	168.95	0.50	69.40	4144.44	-3869.35	3948.55
Fixation L	1	4	8733382728	8733721208	338480	1214.39	851.57	50	44	-1	11.75	11.75
Fixation R	1	4	8733382728	8733721208	338480	1214.39	851.57	50	44	-1	11.79	11.79
Saccade L	1	4	8733721208	8733741088	19880	1175.15	829.51	1167.16	811.82	0.22	19.64	1.00	11.30	363.20	-350.55	281.11
Saccade R	1	4	8733721208	8733741088	19880	1175.15	829.51	1167.16	811.82	0.22	19.64	1.00	11.30	363.20	-350.55	281.11
Fixation L	1	5	8733741088	8733999948	258860	1151.14	796.78	46	52	-1	11.59	11.59
Fixation R	1	5	8733741088	8733999948	258860	1151.14	796.78	46	52	-1	11.82	11.82
Saccade L	1	5	8733999948	8734019817	19869	1131.18	765.99	1121.15	777.09	0.20	15.13	1.00	10.10	129.68	-322.08	163.01
Saccade R	1	5	8733999948	8734019817	19869	1131.18	765.99	1121.15	777.09	0.20	15.13	1.00	10.10	129.68	-322.08	163.01
Fixation L	1	6	8734019817	8734139321	119504	1121.21	767.33	3	13	-1	11.81	11.81
Fixation R	1	6	8734019817	8734139321	119504	1121.21	767.33	3	13	-1	11.98	11.98
Saccade L	1	6	8734139321	8734159194	19873	1123.50	764.37	1293.66	746.33	0.99	173.06	1.00	49.59	4311.22	-4209.56	3005.73
Saccade R	1	6	8734139321	8734159194	19873	1123.50	764.37	1293.66	746.33	0.99	173.06	1.00	49.59	4311.22	-4209.56	3005.73
Fixation L	1	7	8734159194	8734418049	258855	1316.87	746.30	31	11	-1	11.89	11.89
Fixation R	1	7	8734159194	8734418049	258855	1316.87	746.30	31	11	-1	11.85	11.85
Saccade L	1	7	8734418049	8734457799	39750	1318.28	746.79	1521.65	610.67	2.04	151.43	0.50	51.21	3707.26	-3744.26	3057.73
Saccade R	1	7	8734418049	8734457799	39750	1318.28	746.79	1521.65	610.67	2.04	151.43	0.50	51.21	3707.26	-3744.26	3057.73
Fixation L	1	8	8734457799	8735154762	696963	1547.44	607.94	44	20	-1	11.91	11.91
Fixation R	1	8	8734457799	8735154762	696963	1547.44	607.94	44	20	-1	11.50	11.50
Saccade L	1	8	8735154762	8735194510	39748	1563.61	607.19	1300.55	712.52	2.56	178.16	1.00	64.33	4437.31	-4251.47	3465.84
Saccade R	1	8	8735154762	8735194510	39748	1563.61	607.19	1300.55	712.52	2.56	178.16	1.00	64.33	4437.31	-4251.47	3465.84
Fixation L	1	9	8735194510	8735393625	199115	1278.60	727.31	29	23	-1	12.09	12.09
Fixation R	1	9	8735194510	8735393625	199115	1278.60	727.31	29	23	-1	11.66	11.66
Saccade L	1	9	8735393625	8735453369	59744	1271.64	725.96	755.52	743.85	5.27	291.78	0.67	88.27	7276.32	-7144.48	4564.34
Saccade R	1	9	8735393625	8735453369	59744	1271.64	725.96	755.52	743.85	5.27	291.78	0.67	88.27	7276.32	-7144.48	4564.34
Fixation L	1	10	8735453369	8735632618	179249	747.25	753.10	13	15	-1	11.89	11.89
Fixation R	1	10	8735453369	8735632618	179249	747.25	753.10	13	15	-1	11.98	11.98
Saccade L	1	10	8735632618	8735652491	19873	746.69	758.92	796.84	657.99	0.92	114.00	1.00	46.54	2787.05	-2802.88	2404.36
Saccade R	1	10	8735632618	8735652491	19873	746.69	758.92	796.84	657.99	0.92	114.00	1.00	46.54	2787.05	-2802.88	2404.36
Fixation L	1	11	8735652491	8735931241	278750	862.68	642.71	76	23	-1	11.46	11.46
Fixation R	1	11	8735652491	8735931241	278750	862.68	642.71	76	23	-1	11.51	11.51
Saccade L	1	11	8735931241	8735951102	19861	863.19	639.11	860.28	617.76	0.19	21.80	1.00	9.73	487.30	-239.91	335.89
Saccade R	1	11	8735931241	8735951102	19861	863.19	639.11	860.28	617.76	0.19	21.80	1.00	9.73	487.30	-239.91	335.89
Fixation L	1	12	8735951102	8736070592	119490	859.79	590.22	6	46	-1	11.36	11.36
Fixation R	1	12	8735951102	8736070592	119490	859.79	590.22	6	46	-1	11.41	11.41
Saccade L	1	12	8736070592	8736130348	59756	862.99	571.59	547.47	819.38	4.24	218.35	0.67	71.01	5415.91	-5320.29	3058.30
Saccade R	1	12	8736070592	8736130348	59756	862.99	571.59	547.47	819.38	4.24	218.35	0.67	71.01	5415.91	-5320.29	3058.30
Fixation L	1	13	8736130348	8736488706	358358	532.32	828.52	51	14	-1	11.36	11.36
Fixation R	1	13	8736130348	8736488706	358358	532.32	828.52	51	14	-1	11.83	11.83
