[BeGaze]
Converted from:	C:\Documents and Settings\iViewX\Desktop\EXPERIMENTATIONS\Experiments\results\finaleart\S16F14542-finaleart-1.idf
Date:	27.03.2019 15:47:42
Version:	BeGaze 2.5.77
Sample Rate:	50
Subject:	S16F14542
Description:	Diane Dewez

Table Header for Fixations:
Event Type	Trial	Number	Start	End	Duration	Location X	Location Y	Dispersion X	Dispersion Y	Plane	Avg. Pupil Size X	Avg. Pupil Size Y

Table Header for Saccades:
Event Type	Trial	Number	Start	End	Duration	Start Loc.X	Start Loc.Y	End Loc.X	End Loc.Y	Amplitude	Peak Speed	Peak Speed At	Average Speed	Peak Accel.	Peak Decel.	Average Accel.

Table Header for Blinks:
Event Type	Trial	Number	Start	End	Duration

Table Header for User Events:
Event Type	Trial	Number	Start	Description

UserEvent	1	1	7371397554	# Message: bathers_cross_1902.jpg
Fixation L	1	1	7371397944	7371557056	159112	942.43	443.43	35	13	-1	12.58	12.58
Fixation R	1	1	7371397944	7371557056	159112	942.43	443.43	35	13	-1	12.73	12.73
Saccade L	1	1	7371557056	7371577054	19998	913.30	446.85	834.89	450.09	0.61	79.39	1.00	30.48	1868.52	-1752.25	1464.36
Saccade R	1	1	7371557056	7371577054	19998	913.30	446.85	834.89	450.09	0.61	79.39	1.00	30.48	1868.52	-1752.25	1464.36
Fixation L	1	2	7371577054	7371835463	258409	831.32	467.46	12	24	-1	12.37	12.37
Fixation R	1	2	7371577054	7371835463	258409	831.32	467.46	12	24	-1	12.83	12.83
Saccade L	1	2	7371835463	7371855428	19965	828.52	474.53	833.29	314.88	1.17	161.53	1.00	58.82	3935.27	-3999.66	3217.31
Saccade R	1	2	7371835463	7371855428	19965	828.52	474.53	833.29	314.88	1.17	161.53	1.00	58.82	3935.27	-3999.66	3217.31
Fixation L	1	3	7371855428	7371954787	99359	847.99	259.51	25	72	-1	12.83	12.83
Fixation R	1	3	7371855428	7371954787	99359	847.99	259.51	25	72	-1	13.29	13.29
Saccade L	1	3	7371954787	7371974651	19864	858.56	251.23	866.10	245.16	0.19	14.25	1.00	9.45	121.59	-210.60	147.80
Saccade R	1	3	7371954787	7371974651	19864	858.56	251.23	866.10	245.16	0.19	14.25	1.00	9.45	121.59	-210.60	147.80
Fixation L	1	4	7371974651	7372253147	278496	883.77	212.97	26	71	-1	12.24	12.24
Fixation R	1	4	7371974651	7372253147	278496	883.77	212.97	26	71	-1	12.45	12.45
Saccade L	1	4	7372253147	7372273014	19867	890.66	174.86	889.36	171.44	0.09	6.34	0.00	4.66	84.71	-59.20	55.58
Saccade R	1	4	7372253147	7372273014	19867	890.66	174.86	889.36	171.44	0.09	6.34	0.00	4.66	84.71	-59.20	55.58
Fixation L	1	5	7372273014	7372412251	139237	880.47	148.91	33	50	-1	11.86	11.86
Fixation R	1	5	7372273014	7372412251	139237	880.47	148.91	33	50	-1	12.11	12.11
Saccade L	1	5	7372412251	7372432135	19884	855.45	142.85	836.63	166.94	0.52	34.88	0.00	26.26	548.24	-357.77	340.90
Saccade R	1	5	7372412251	7372432135	19884	855.45	142.85	836.63	166.94	0.52	34.88	0.00	26.26	548.24	-357.77	340.90
Fixation L	1	6	7372432135	7372770239	338104	809.08	167.42	45	54	-1	11.87	11.87
Fixation R	1	6	7372432135	7372770239	338104	809.08	167.42	45	54	-1	12.25	12.25
Saccade L	1	6	7372770239	7372790237	19998	790.95	181.15	808.23	275.31	0.61	96.83	1.00	30.64	2307.73	-2191.45	1636.51
Saccade R	1	6	7372770239	7372790237	19998	790.95	181.15	808.23	275.31	0.61	96.83	1.00	30.64	2307.73	-2191.45	1636.51
Fixation L	1	7	7372790237	7372909500	119263	831.90	304.17	43	53	-1	12.50	12.50
Fixation R	1	7	7372790237	7372909500	119263	831.90	304.17	43	53	-1	13.29	13.29
Saccade L	1	7	7372909500	7373008978	99478	852.09	328.83	859.75	336.26	1.42	67.37	1.00	14.28	24078.19	-163.61	3705.60
Saccade R	1	7	7372909500	7373008978	99478	852.09	328.83	859.75	336.26	1.42	67.37	1.00	14.28	24078.19	-163.61	3705.60
Blink L	1	1	7373008978	7373227723	218745
Blink R	1	1	7373008978	7373227723	218745
Fixation L	1	8	7373227723	7373545956	318233	1327.53	477.54	24	31	-1	14.14	14.14
Fixation R	1	8	7373227723	7373545956	318233	1327.53	477.54	24	31	-1	14.54	14.54
Saccade L	1	8	7373545956	7373565948	19992	1335.14	473.38	1330.67	565.67	0.62	93.46	1.00	30.95	2178.64	-2099.32	1472.82
Saccade R	1	8	7373545956	7373565948	19992	1335.14	473.38	1330.67	565.67	0.62	93.46	1.00	30.95	2178.64	-2099.32	1472.82
Fixation L	1	9	7373565948	7373904062	338114	1309.08	552.35	31	22	-1	14.11	14.11
Fixation R	1	9	7373565948	7373904062	338114	1309.08	552.35	31	22	-1	14.05	14.05
Saccade L	1	9	7373904062	7373943813	39751	1299.12	548.93	907.05	381.26	3.59	227.58	1.00	90.26	5536.04	-5525.19	5377.07
Saccade R	1	9	7373904062	7373943813	39751	1299.12	548.93	907.05	381.26	3.59	227.58	1.00	90.26	5536.04	-5525.19	5377.07
Fixation L	1	10	7373943813	7374441036	497223	911.85	403.25	10	29	-1	13.79	13.79
Fixation R	1	10	7373943813	7374441036	497223	911.85	403.25	10	29	-1	13.98	13.98
Saccade L	1	10	7374441036	7374460903	19867	908.43	408.53	822.04	589.90	1.20	203.14	1.00	60.54	5025.52	-4803.72	3496.58
Saccade R	1	10	7374441036	7374460903	19867	908.43	408.53	822.04	589.90	1.20	203.14	1.00	60.54	5025.52	-4803.72	3496.58
Fixation L	1	11	7374460903	7374858767	397864	816.31	630.26	16	69	-1	13.88	13.88
Fixation R	1	11	7374460903	7374858767	397864	816.31	630.26	16	69	-1	14.79	14.79
Saccade L	1	11	7374858767	7374898518	39751	819.68	659.44	589.84	987.69	3.44	290.88	0.50	86.54	7238.59	-6841.20	4817.32
Saccade R	1	11	7374858767	7374898518	39751	819.68	659.44	589.84	987.69	3.44	290.88	0.50	86.54	7238.59	-6841.20	4817.32
Fixation L	1	12	7374898518	7375017888	119370	571.89	1002.48	22	21	-1	13.92	13.92
Fixation R	1	12	7374898518	7375017888	119370	571.89	1002.48	22	21	-1	15.17	15.17
Saccade L	1	12	7375017888	7375037755	19867	568.65	1006.53	551.67	1057.59	0.59	59.83	1.00	29.92	1443.92	-1169.66	1296.88
Saccade R	1	12	7375017888	7375037755	19867	568.65	1006.53	551.67	1057.59	0.59	59.83	1.00	29.92	1443.92	-1169.66	1296.88
Fixation L	1	13	7375037755	7375395743	357988	529.12	1121.41	28	69	-1	14.10	14.10
Fixation R	1	13	7375037755	7375395743	357988	529.12	1121.41	28	69	-1	15.01	15.01
