[BeGaze]
Converted from:	C:\Documents and Settings\iViewX\Desktop\EXPERIMENTATIONS\Experiments\results\finaleart\S02123220-finaleart-1.idf
Date:	27.03.2019 15:33:40
Version:	BeGaze 2.5.77
Sample Rate:	50
Subject:	S02123220
Description:	David Xu

Table Header for Fixations:
Event Type	Trial	Number	Start	End	Duration	Location X	Location Y	Dispersion X	Dispersion Y	Plane	Avg. Pupil Size X	Avg. Pupil Size Y

Table Header for Saccades:
Event Type	Trial	Number	Start	End	Duration	Start Loc.X	Start Loc.Y	End Loc.X	End Loc.Y	Amplitude	Peak Speed	Peak Speed At	Average Speed	Peak Accel.	Peak Decel.	Average Accel.

Table Header for Blinks:
Event Type	Trial	Number	Start	End	Duration

Table Header for User Events:
Event Type	Trial	Number	Start	Description

UserEvent	1	1	1536969307	# Message: void.jpg
Fixation L	1	1	1536985339	1537084842	99503	1023.67	473.64	7	20	-1	16.11	16.11
Fixation R	1	1	1536985339	1537084842	99503	1023.67	473.64	7	20	-1	16.48	16.48
Saccade L	1	1	1537084842	1537224073	139231	1027.24	474.37	1004.77	462.71	9.98	231.54	0.14	71.69	5570.69	-4082.32	2907.02
Saccade R	1	1	1537084842	1537224073	139231	1027.24	474.37	1004.77	462.71	9.98	231.54	0.14	71.69	5570.69	-4082.32	2907.02
Fixation L	1	2	1537224073	1537343430	119357	1035.95	500.51	40	56	-1	16.31	16.31
Fixation R	1	2	1537224073	1537343430	119357	1035.95	500.51	40	56	-1	15.95	15.95
Saccade L	1	2	1537343430	1537363308	19878	1045.15	519.29	1052.11	525.48	0.16	9.42	1.00	7.97	81.03	-204.84	114.32
Saccade R	1	2	1537343430	1537363308	19878	1045.15	519.29	1052.11	525.48	0.16	9.42	1.00	7.97	81.03	-204.84	114.32
Fixation L	1	3	1537363308	1537482677	119369	1059.24	538.35	44	22	-1	15.93	15.93
Fixation R	1	3	1537363308	1537482677	119369	1059.24	538.35	44	22	-1	15.67	15.67
Saccade L	1	3	1537482677	1537502549	19872	1094.64	548.23	1197.74	546.85	0.81	104.30	1.00	40.77	2434.58	-1753.21	1544.75
Saccade R	1	3	1537482677	1537502549	19872	1094.64	548.23	1197.74	546.85	0.81	104.30	1.00	40.77	2434.58	-1753.21	1544.75
Fixation L	1	4	1537502549	1537601910	99361	1229.24	526.26	45	32	-1	14.36	14.36
Fixation R	1	4	1537502549	1537601910	99361	1229.24	526.26	45	32	-1	13.99	13.99
Blink L	1	1	1537601910	1537880413	278503
Blink R	1	1	1537601910	1537880413	278503
Fixation L	1	5	1537880413	1538139014	258601	880.30	451.37	21	78	-1	14.32	14.32
Fixation R	1	5	1537880413	1538139014	258601	880.30	451.37	21	78	-1	12.18	12.18
Saccade L	1	4	1538139014	1538158895	19881	888.37	473.79	889.19	474.68	0.08	9.40	0.00	4.27	96.40	-166.92	108.41
Saccade R	1	4	1538139014	1538158895	19881	888.37	473.79	889.19	474.68	0.08	9.40	0.00	4.27	96.40	-166.92	108.41
Fixation L	1	6	1538158895	1538954461	795566	919.86	483.95	43	22	-1	15.32	15.32
Fixation R	1	6	1538158895	1538954461	795566	919.86	483.95	43	22	-1	12.84	12.84
