[BeGaze]
Converted from:	C:\Documents and Settings\iViewX\Desktop\EXPERIMENTATIONS\Experiments\results\finaleart\S12H22222-finaleart-1.idf
Date:	27.03.2019 15:40:06
Version:	BeGaze 2.5.77
Sample Rate:	50
Subject:	S12H22222
Description:	aurele barriere

Table Header for Fixations:
Event Type	Trial	Number	Start	End	Duration	Location X	Location Y	Dispersion X	Dispersion Y	Plane	Avg. Pupil Size X	Avg. Pupil Size Y

Table Header for Saccades:
Event Type	Trial	Number	Start	End	Duration	Start Loc.X	Start Loc.Y	End Loc.X	End Loc.Y	Amplitude	Peak Speed	Peak Speed At	Average Speed	Peak Accel.	Peak Decel.	Average Accel.

Table Header for Blinks:
Event Type	Trial	Number	Start	End	Duration

Table Header for User Events:
Event Type	Trial	Number	Start	Description

UserEvent	1	1	23127825900	# Message: courbet-woman-with-a-parrot-1866.jpg
Fixation L	1	1	23127839841	23128277440	437599	940.40	467.85	14	44	-1	16.31	16.31
Fixation R	1	1	23127839841	23128277440	437599	940.40	467.85	14	44	-1	16.25	16.25
Saccade L	1	1	23128277440	23128317191	39751	948.27	492.80	598.74	654.34	3.37	229.45	0.50	84.87	5540.58	-5321.20	4671.54
Saccade R	1	1	23128277440	23128317191	39751	948.27	492.80	598.74	654.34	3.37	229.45	0.50	84.87	5540.58	-5321.20	4671.54
Fixation L	1	2	23128317191	23128456431	139240	585.07	657.90	19	7	-1	15.61	15.61
Fixation R	1	2	23128317191	23128456431	139240	585.07	657.90	19	7	-1	15.56	15.56
Saccade L	1	2	23128456431	23128476306	19875	584.67	660.68	492.94	660.09	0.67	92.79	1.00	33.52	2279.85	-2135.98	1723.21
Saccade R	1	2	23128456431	23128476306	19875	584.67	660.68	492.94	660.09	0.67	92.79	1.00	33.52	2279.85	-2135.98	1723.21
Fixation L	1	3	23128476306	23128675292	198986	456.18	648.41	44	30	-1	14.88	14.88
Fixation R	1	3	23128476306	23128675292	198986	456.18	648.41	44	30	-1	14.84	14.84
Saccade L	1	3	23128675292	23128734912	59620	453.21	629.12	623.37	174.78	5.38	277.97	0.67	90.32	6679.26	-6545.24	3959.58
Saccade R	1	3	23128675292	23128734912	59620	453.21	629.12	623.37	174.78	5.38	277.97	0.67	90.32	6679.26	-6545.24	3959.58
Fixation L	1	4	23128734912	23129192394	457482	619.79	210.89	35	63	-1	13.81	13.81
Fixation R	1	4	23128734912	23129192394	457482	619.79	210.89	35	63	-1	13.95	13.95
Saccade L	1	4	23129192394	23129271900	79506	603.41	226.05	443.85	713.26	6.33	341.06	1.00	79.62	8326.84	-8121.86	3978.27
Saccade R	1	4	23129192394	23129271900	79506	603.41	226.05	443.85	713.26	6.33	341.06	1.00	79.62	8326.84	-8121.86	3978.27
Fixation L	1	5	23129271900	23129630000	358100	426.10	713.70	26	70	-1	15.61	15.61
Fixation R	1	5	23129271900	23129630000	358100	426.10	713.70	26	70	-1	15.74	15.74
Saccade L	1	5	23129630000	23129649883	19883	419.66	675.70	421.65	646.84	0.23	29.27	1.00	11.39	682.60	-383.04	375.70
Saccade R	1	5	23129630000	23129649883	19883	419.66	675.70	421.65	646.84	0.23	29.27	1.00	11.39	682.60	-383.04	375.70
Fixation L	1	6	23129649883	23130027739	377856	420.34	629.53	10	30	-1	14.91	14.91
Fixation R	1	6	23129649883	23130027739	377856	420.34	629.53	10	30	-1	15.06	15.06
Saccade L	1	6	23130027739	23130067622	39883	421.38	623.31	734.04	486.40	2.94	282.10	0.50	73.66	6975.14	-6745.13	4135.86
Saccade R	1	6	23130027739	23130067622	39883	421.38	623.31	734.04	486.40	2.94	282.10	0.50	73.66	6975.14	-6745.13	4135.86
Fixation L	1	7	23130067622	23130246606	178984	743.79	491.70	15	46	-1	15.10	15.10
Fixation R	1	7	23130067622	23130246606	178984	743.79	491.70	15	46	-1	14.93	14.93
Saccade L	1	7	23130246606	23130266476	19870	750.00	526.02	754.24	575.39	0.50	50.12	1.00	25.41	1157.20	-1103.87	999.12
Saccade R	1	7	23130246606	23130266476	19870	750.00	526.02	754.24	575.39	0.50	50.12	1.00	25.41	1157.20	-1103.87	999.12
Fixation L	1	8	23130266476	23130425595	159119	764.99	577.81	17	14	-1	14.83	14.83
Fixation R	1	8	23130266476	23130425595	159119	764.99	577.81	17	14	-1	15.13	15.13
Saccade L	1	8	23130425595	23130445477	19882	769.87	573.90	630.93	625.49	0.87	149.90	1.00	43.85	3659.82	-3539.24	2559.69
Saccade R	1	8	23130425595	23130445477	19882	769.87	573.90	630.93	625.49	0.87	149.90	1.00	43.85	3659.82	-3539.24	2559.69
Fixation L	1	9	23130445477	23130922818	477341	650.56	643.65	58	32	-1	14.67	14.67
Fixation R	1	9	23130445477	23130922818	477341	650.56	643.65	58	32	-1	14.58	14.58
Saccade L	1	9	23130922818	23130982449	59631	689.31	641.88	931.73	538.53	3.45	224.62	0.67	57.93	5533.11	-5081.45	2748.97
Saccade R	1	9	23130922818	23130982449	59631	689.31	641.88	931.73	538.53	3.45	224.62	0.67	57.93	5533.11	-5081.45	2748.97
Fixation L	1	10	23130982449	23131121683	139234	956.71	540.43	33	14	-1	13.91	13.91
Fixation R	1	10	23130982449	23131121683	139234	956.71	540.43	33	14	-1	14.09	14.09
Saccade L	1	10	23131121683	23131161561	39878	963.77	546.21	1323.23	733.80	3.78	332.43	1.00	94.76	8240.11	-7349.94	4658.55
Saccade R	1	10	23131121683	23131161561	39878	963.77	546.21	1323.23	733.80	3.78	332.43	1.00	94.76	8240.11	-7349.94	4658.55
Fixation L	1	11	23131161561	23131380305	218744	1380.59	732.99	78	16	-1	14.25	14.25
Fixation R	1	11	23131161561	23131380305	218744	1380.59	732.99	78	16	-1	13.86	13.86
Saccade L	1	11	23131380305	23131420067	39762	1390.54	742.87	1594.15	273.35	4.76	351.50	0.50	119.75	8305.05	-8602.41	6696.05
Saccade R	1	11	23131380305	23131420067	39762	1390.54	742.87	1594.15	273.35	4.76	351.50	0.50	119.75	8305.05	-8602.41	6696.05
Fixation L	1	12	23131420067	23131539418	119351	1597.04	255.53	33	48	-1	14.08	14.08
Fixation R	1	12	23131420067	23131539418	119351	1597.04	255.53	33	48	-1	13.96	13.96
Saccade L	1	12	23131539418	23131698541	159123	1616.10	224.76	1588.24	200.59	20.44	563.84	0.88	128.43	13513.93	-13953.29	5808.78
Saccade R	1	12	23131539418	23131698541	159123	1616.10	224.76	1588.24	200.59	20.44	563.84	0.88	128.43	13513.93	-13953.29	5808.78
Fixation L	1	13	23131698541	23131817908	119367	1582.53	208.57	14	13	-1	14.66	14.66
Fixation R	1	13	23131698541	23131817908	119367	1582.53	208.57	14	13	-1	14.22	14.22
