[BeGaze]
Converted from:	C:\Documents and Settings\iViewX\Desktop\EXPERIMENTATIONS\Experiments\results\finaleart\S9H29221-finaleart-1.idf
Date:	27.03.2019 16:04:17
Version:	BeGaze 2.5.77
Sample Rate:	50
Subject:	S9H29221
Description:	steven

Table Header for Fixations:
Event Type	Trial	Number	Start	End	Duration	Location X	Location Y	Dispersion X	Dispersion Y	Plane	Avg. Pupil Size X	Avg. Pupil Size Y

Table Header for Saccades:
Event Type	Trial	Number	Start	End	Duration	Start Loc.X	Start Loc.Y	End Loc.X	End Loc.Y	Amplitude	Peak Speed	Peak Speed At	Average Speed	Peak Accel.	Peak Decel.	Average Accel.

Table Header for Blinks:
Event Type	Trial	Number	Start	End	Duration

Table Header for User Events:
Event Type	Trial	Number	Start	Description

UserEvent	1	1	6904664650	# Message: void.jpg
Fixation L	1	1	6904665081	6904895551	230470	1036.68	611.09	4	20	-1	12.04	12.04
Fixation R	1	1	6904665081	6904895551	230470	1036.68	611.09	4	20	-1	11.05	11.05
Saccade L	1	1	6904895551	6904923562	28011	1038.67	602.17	795.35	607.63	1.77	246.06	1.00	63.30	6095.00	-5954.86	4036.57
Saccade R	1	1	6904895551	6904923562	28011	1038.67	602.17	795.35	607.63	1.77	246.06	1.00	63.30	6095.00	-5954.86	4036.57
Fixation L	1	2	6904923562	6905082752	159190	788.63	613.73	59	13	-1	11.72	11.72
Fixation R	1	2	6904923562	6905082752	159190	788.63	613.73	59	13	-1	10.81	10.81
Saccade L	1	2	6905082752	6905102682	19930	740.26	615.14	555.93	619.73	1.65	186.46	1.00	82.61	4495.36	-4521.34	3157.33
Saccade R	1	2	6905082752	6905102682	19930	740.26	615.14	555.93	619.73	1.65	186.46	1.00	82.61	4495.36	-4521.34	3157.33
Fixation L	1	3	6905102682	6905341287	238605	486.30	614.69	78	11	-1	11.70	11.70
Fixation R	1	3	6905102682	6905341287	238605	486.30	614.69	78	11	-1	10.96	10.96
Saccade L	1	3	6905341287	6905400913	59626	485.43	608.39	776.00	550.01	3.22	113.29	0.67	54.04	2722.25	-2416.18	2051.23
Saccade R	1	3	6905341287	6905400913	59626	485.43	608.39	776.00	550.01	3.22	113.29	0.67	54.04	2722.25	-2416.18	2051.23
Fixation L	1	4	6905400913	6905599904	198991	794.95	529.60	27	32	-1	11.72	11.72
Fixation R	1	4	6905400913	6905599904	198991	794.95	529.60	27	32	-1	11.02	11.02
Saccade L	1	4	6905599904	6905619778	19874	803.32	517.48	849.85	515.83	0.36	47.10	1.00	18.04	1132.02	-1078.38	861.98
Saccade R	1	4	6905599904	6905619778	19874	803.32	517.48	849.85	515.83	0.36	47.10	1.00	18.04	1132.02	-1078.38	861.98
Fixation L	1	5	6905619778	6905815560	195782	873.78	505.21	50	29	-1	11.61	11.61
Fixation R	1	5	6905619778	6905815560	195782	873.78	505.21	50	29	-1	11.16	11.16
Saccade L	1	5	6905815560	6905838518	22958	900.10	485.89	934.51	480.66	0.40	35.22	1.00	17.48	771.49	-592.12	571.03
Saccade R	1	5	6905815560	6905838518	22958	900.10	485.89	934.51	480.66	0.40	35.22	1.00	17.48	771.49	-592.12	571.03
Fixation L	1	6	6905838518	6906017503	178985	972.16	475.61	81	18	-1	11.90	11.90
Fixation R	1	6	6905838518	6906017503	178985	972.16	475.61	81	18	-1	11.11	11.11
Saccade L	1	6	6906017503	6906037500	19997	1015.60	466.65	1022.62	467.63	0.17	11.88	1.00	8.46	43.80	-205.82	122.41
Saccade R	1	6	6906017503	6906037500	19997	1015.60	466.65	1022.62	467.63	0.17	11.88	1.00	8.46	43.80	-205.82	122.41
Fixation L	1	7	6906037500	6906276126	238626	1052.99	452.59	70	25	-1	12.24	12.24
Fixation R	1	7	6906037500	6906276126	238626	1052.99	452.59	70	25	-1	11.24	11.24
Saccade L	1	7	6906276126	6906295998	19872	1093.28	441.97	1108.73	441.51	0.22	15.63	1.00	11.26	163.16	-351.41	190.12
Saccade R	1	7	6906276126	6906295998	19872	1093.28	441.97	1108.73	441.51	0.22	15.63	1.00	11.26	163.16	-351.41	190.12
Fixation L	1	8	6906295998	6906554612	258614	1151.33	441.75	81	17	-1	12.12	12.12
Fixation R	1	8	6906295998	6906554612	258614	1151.33	441.75	81	17	-1	11.07	11.07
Saccade L	1	8	6906554612	6906574481	19869	1190.32	453.47	1197.53	454.00	0.20	12.94	1.00	10.02	290.68	-44.80	130.38
Saccade R	1	8	6906554612	6906574481	19869	1190.32	453.47	1197.53	454.00	0.20	12.94	1.00	10.02	290.68	-44.80	130.38
Fixation L	1	9	6906574481	6906713722	139241	1223.13	475.94	40	33	-1	12.11	12.11
Fixation R	1	9	6906574481	6906713722	139241	1223.13	475.94	40	33	-1	11.22	11.22
