[BeGaze]
Converted from:	C:\Documents and Settings\iViewX\Desktop\EXPERIMENTATIONS\Experiments\results\finaleart\S22H22551-finaleart-1.idf
Date:	27.03.2019 15:57:17
Version:	BeGaze 2.5.77
Sample Rate:	50
Subject:	S22H22551
Description:	Mathieu Chambre

Table Header for Fixations:
Event Type	Trial	Number	Start	End	Duration	Location X	Location Y	Dispersion X	Dispersion Y	Plane	Avg. Pupil Size X	Avg. Pupil Size Y

Table Header for Saccades:
Event Type	Trial	Number	Start	End	Duration	Start Loc.X	Start Loc.Y	End Loc.X	End Loc.Y	Amplitude	Peak Speed	Peak Speed At	Average Speed	Peak Accel.	Peak Decel.	Average Accel.

Table Header for Blinks:
Event Type	Trial	Number	Start	End	Duration

Table Header for User Events:
Event Type	Trial	Number	Start	Description

UserEvent	1	1	4931071893	# Message: Landscape_at_L-Estaque_Braque-1906.jpg
Fixation L	1	1	4931090108	4931567452	477344	1032.62	423.49	26	52	-1	19.06	19.06
Fixation R	1	1	4931090108	4931567452	477344	1032.62	423.49	26	52	-1	18.83	18.83
Saccade L	1	1	4931567452	4931607216	39764	1021.85	404.51	773.55	370.10	2.33	162.71	0.50	58.60	4050.59	-3247.63	2933.86
Saccade R	1	1	4931567452	4931607216	39764	1021.85	404.51	773.55	370.10	2.33	162.71	0.50	58.60	4050.59	-3247.63	2933.86
Fixation L	1	2	4931607216	4931746447	139231	781.63	387.34	18	29	-1	17.61	17.61
Fixation R	1	2	4931607216	4931746447	139231	781.63	387.34	18	29	-1	17.48	17.48
Saccade L	1	2	4931746447	4931766323	19876	769.48	377.79	611.07	250.66	1.16	205.39	1.00	58.36	4983.62	-4997.81	3434.51
Saccade R	1	2	4931746447	4931766323	19876	769.48	377.79	611.07	250.66	1.16	205.39	1.00	58.36	4983.62	-4997.81	3434.51
Fixation L	1	3	4931766323	4931925440	159117	611.69	259.90	41	24	-1	15.61	15.61
Fixation R	1	3	4931766323	4931925440	159117	611.69	259.90	41	24	-1	15.53	15.53
Saccade L	1	3	4931925440	4931945441	20001	579.28	259.03	495.07	219.81	0.79	93.97	1.00	39.36	2300.46	-2298.40	1751.05
Saccade R	1	3	4931925440	4931945441	20001	579.28	259.03	495.07	219.81	0.79	93.97	1.00	39.36	2300.46	-2298.40	1751.05
Fixation L	1	4	4931945441	4932124429	178988	508.24	223.05	50	32	-1	14.79	14.79
Fixation R	1	4	4931945441	4932124429	178988	508.24	223.05	50	32	-1	14.49	14.49
Saccade L	1	4	4932124429	4932164181	39752	535.09	208.83	510.63	568.45	3.30	237.92	1.00	83.06	5861.79	-5610.09	4168.16
Saccade R	1	4	4932124429	4932164181	39752	535.09	208.83	510.63	568.45	3.30	237.92	1.00	83.06	5861.79	-5610.09	4168.16
Fixation L	1	5	4932164181	4932363042	198861	510.66	593.72	15	37	-1	15.21	15.21
Fixation R	1	5	4932164181	4932363042	198861	510.66	593.72	15	37	-1	15.31	15.31
Saccade L	1	5	4932363042	4932402792	39750	504.05	596.23	497.40	891.83	2.60	167.12	0.50	65.38	4106.94	-3609.48	3423.73
Saccade R	1	5	4932363042	4932402792	39750	504.05	596.23	497.40	891.83	2.60	167.12	0.50	65.38	4106.94	-3609.48	3423.73
Fixation L	1	6	4932402792	4932641525	238733	489.24	929.68	28	71	-1	15.46	15.46
Fixation R	1	6	4932402792	4932641525	238733	489.24	929.68	28	71	-1	16.05	16.05
Saccade L	1	6	4932641525	4932661394	19869	475.24	963.20	471.54	961.79	0.14	12.57	0.00	7.28	14.51	-86.10	42.27
Saccade R	1	6	4932641525	4932661394	19869	475.24	963.20	471.54	961.79	0.14	12.57	0.00	7.28	14.51	-86.10	42.27
Fixation L	1	7	4932661394	4932780773	119379	463.83	971.94	15	15	-1	15.23	15.23
Fixation R	1	7	4932661394	4932780773	119379	463.83	971.94	15	15	-1	15.91	15.91
Saccade L	1	7	4932780773	4932840395	59622	456.21	977.12	1066.12	855.84	6.60	332.45	0.67	110.78	8227.35	-7889.87	4980.95
Saccade R	1	7	4932780773	4932840395	59622	456.21	977.12	1066.12	855.84	6.60	332.45	0.67	110.78	8227.35	-7889.87	4980.95
Fixation L	1	8	4932840395	4932999514	159119	1070.85	845.20	9	14	-1	15.40	15.40
Fixation R	1	8	4932840395	4932999514	159119	1070.85	845.20	9	14	-1	16.14	16.14
Saccade L	1	8	4932999514	4933039379	39865	1069.56	846.10	1275.29	540.21	3.16	233.36	0.50	79.29	5769.76	-5597.07	4660.10
Saccade R	1	8	4932999514	4933039379	39865	1069.56	846.10	1275.29	540.21	3.16	233.36	0.50	79.29	5769.76	-5597.07	4660.10
Fixation L	1	9	4933039379	4933178500	139121	1282.24	545.06	66	25	-1	15.13	15.13
Fixation R	1	9	4933039379	4933178500	139121	1282.24	545.06	66	25	-1	15.44	15.44
Saccade L	1	9	4933178500	4933198494	19994	1228.54	538.72	1048.25	381.10	1.70	242.12	1.00	85.21	5783.62	-5910.90	4348.77
Saccade R	1	9	4933178500	4933198494	19994	1228.54	538.72	1048.25	381.10	1.70	242.12	1.00	85.21	5783.62	-5910.90	4348.77
Fixation L	1	10	4933198494	4933357614	159120	1019.81	388.01	43	11	-1	15.29	15.29
Fixation R	1	10	4933198494	4933357614	159120	1019.81	388.01	43	11	-1	15.18	15.18
Saccade L	1	10	4933357614	4933377481	19867	1008.47	393.04	1201.98	386.68	1.05	195.79	1.00	52.85	4742.97	-4604.18	3129.52
Saccade R	1	10	4933357614	4933377481	19867	1008.47	393.04	1201.98	386.68	1.05	195.79	1.00	52.85	4742.97	-4604.18	3129.52
Fixation L	1	11	4933377481	4933735466	357985	1214.06	358.68	25	72	-1	16.05	16.05
Fixation R	1	11	4933377481	4933735466	357985	1214.06	358.68	25	72	-1	15.65	15.65
Saccade L	1	11	4933735466	4933775219	39753	1221.60	318.53	1433.12	201.82	2.09	234.14	1.00	52.65	5739.00	-5771.86	2929.58
Saccade R	1	11	4933735466	4933775219	39753	1221.60	318.53	1433.12	201.82	2.09	234.14	1.00	52.65	5739.00	-5771.86	2929.58
Fixation L	1	12	4933775219	4933914458	139239	1432.13	205.81	5	28	-1	15.80	15.80
Fixation R	1	12	4933775219	4933914458	139239	1432.13	205.81	5	28	-1	15.34	15.34
Saccade L	1	12	4933914458	4933954207	39749	1428.23	221.94	1053.76	334.92	3.57	244.09	1.00	89.91	5822.64	-6025.79	4658.38
Saccade R	1	12	4933914458	4933954207	39749	1428.23	221.94	1053.76	334.92	3.57	244.09	1.00	89.91	5822.64	-6025.79	4658.38
Fixation L	1	13	4933954207	4934153196	198989	1035.82	361.77	23	33	-1	15.99	15.99
Fixation R	1	13	4933954207	4934153196	198989	1035.82	361.77	23	33	-1	15.27	15.27
Saccade L	1	13	4934153196	4934173069	19873	1030.75	362.70	1111.20	454.73	0.70	123.64	1.00	35.34	3034.62	-2799.90	2053.84
Saccade R	1	13	4934153196	4934173069	19873	1030.75	362.70	1111.20	454.73	0.70	123.64	1.00	35.34	3034.62	-2799.90	2053.84
Fixation L	1	14	4934173069	4934431686	258617	1125.16	468.77	16	30	-1	15.66	15.66
Fixation R	1	14	4934173069	4934431686	258617	1125.16	468.77	16	30	-1	15.35	15.35
Saccade L	1	14	4934431686	4934451568	19882	1126.25	478.00	1122.59	622.85	0.75	146.55	1.00	37.96	3603.88	-3527.20	2389.59
Saccade R	1	14	4934431686	4934451568	19882	1126.25	478.00	1122.59	622.85	0.75	146.55	1.00	37.96	3603.88	-3527.20	2389.59
Fixation L	1	15	4934451568	4934610671	159103	1108.62	632.84	45	25	-1	15.29	15.29
Fixation R	1	15	4934451568	4934610671	159103	1108.62	632.84	45	25	-1	14.88	14.88
Saccade L	1	15	4934610671	4934650420	39749	1077.51	647.97	560.76	897.19	5.14	427.98	0.50	129.36	10596.85	-10440.58	7239.66
Saccade R	1	15	4934610671	4934650420	39749	1077.51	647.97	560.76	897.19	5.14	427.98	0.50	129.36	10596.85	-10440.58	7239.66
Fixation L	1	16	4934650420	4934789668	139248	552.46	903.97	26	56	-1	15.23	15.23
Fixation R	1	16	4934650420	4934789668	139248	552.46	903.97	26	56	-1	14.90	14.90
Saccade L	1	16	4934789668	4934809540	19872	534.59	947.02	466.11	963.33	0.62	71.21	1.00	31.16	1741.83	-1684.00	1498.90
Saccade R	1	16	4934789668	4934809540	19872	534.59	947.02	466.11	963.33	0.62	71.21	1.00	31.16	1741.83	-1684.00	1498.90
Fixation L	1	17	4934809540	4935068163	258623	457.64	974.14	13	15	-1	14.86	14.86
Fixation R	1	17	4934809540	4935068163	258623	457.64	974.14	13	15	-1	15.00	15.00
