[BeGaze]
Converted from:	C:\Documents and Settings\iViewX\Desktop\EXPERIMENTATIONS\Experiments\results\finaleart\S9H29221-finaleart-1.idf
Date:	27.03.2019 16:02:52
Version:	BeGaze 2.5.77
Sample Rate:	50
Subject:	S9H29221
Description:	steven

Table Header for Fixations:
Event Type	Trial	Number	Start	End	Duration	Location X	Location Y	Dispersion X	Dispersion Y	Plane	Avg. Pupil Size X	Avg. Pupil Size Y

Table Header for Saccades:
Event Type	Trial	Number	Start	End	Duration	Start Loc.X	Start Loc.Y	End Loc.X	End Loc.Y	Amplitude	Peak Speed	Peak Speed At	Average Speed	Peak Accel.	Peak Decel.	Average Accel.

Table Header for Blinks:
Event Type	Trial	Number	Start	End	Duration

Table Header for User Events:
Event Type	Trial	Number	Start	Description

UserEvent	1	1	6043671101	# Message: Le_Puy_In_The_Snow_Dubois-Pillet_1889.jpg
Fixation L	1	1	6043688015	6043906751	218736	1121.64	386.79	79	16	-1	13.60	13.60
Fixation R	1	1	6043688015	6043906751	218736	1121.64	386.79	79	16	-1	12.59	12.59
Saccade L	1	1	6043906751	6043929188	22437	1157.90	378.77	1167.50	377.29	1.15	182.15	1.00	51.41	32208.80	-30.34	12242.47
Saccade R	1	1	6043906751	6043929188	22437	1157.90	378.77	1167.50	377.29	1.15	182.15	1.00	51.41	32208.80	-30.34	12242.47
Blink L	1	1	6043929188	6044225137	295949
Blink R	1	1	6043929188	6044225137	295949
Fixation L	1	2	6044225137	6044364230	139093	1129.24	396.77	29	19	-1	13.19	13.19
Fixation R	1	2	6044225137	6044364230	139093	1129.24	396.77	29	19	-1	13.62	13.62
Saccade L	1	2	6044364230	6044404091	39861	1105.20	406.24	820.01	495.00	2.93	222.41	0.50	73.54	5488.02	-5095.56	3587.71
Saccade R	1	2	6044364230	6044404091	39861	1105.20	406.24	820.01	495.00	2.93	222.41	0.50	73.54	5488.02	-5095.56	3587.71
Fixation L	1	3	6044404091	6044673298	269207	823.19	486.99	9	17	-1	12.83	12.83
Fixation R	1	3	6044404091	6044673298	269207	823.19	486.99	9	17	-1	13.04	13.04
Saccade L	1	3	6044673298	6044702487	29189	818.41	489.91	514.87	739.08	3.00	396.64	1.00	102.89	9796.20	-9809.37	6593.76
Saccade R	1	3	6044673298	6044702487	29189	818.41	489.91	514.87	739.08	3.00	396.64	1.00	102.89	9796.20	-9809.37	6593.76
Fixation L	1	4	6044702487	6044881452	178965	507.84	742.56	55	26	-1	11.26	11.26
Fixation R	1	4	6044702487	6044881452	178965	507.84	742.56	55	26	-1	11.63	11.63
Saccade L	1	4	6044881452	6044901318	19866	468.16	723.84	470.08	704.95	0.36	25.58	1.00	18.15	-159.51	-194.45	182.76
Saccade R	1	4	6044881452	6044901318	19866	468.16	723.84	470.08	704.95	0.36	25.58	1.00	18.15	-159.51	-194.45	182.76
Fixation L	1	5	6044901318	6045120061	218743	455.39	706.12	22	15	-1	10.71	10.71
Fixation R	1	5	6044901318	6045120061	218743	455.39	706.12	22	15	-1	11.33	11.33
Saccade L	1	5	6045120061	6045159942	39881	448.00	705.62	671.00	544.73	2.57	197.39	1.00	64.43	4911.04	-4852.40	3540.94
Saccade R	1	5	6045120061	6045159942	39881	448.00	705.62	671.00	544.73	2.57	197.39	1.00	64.43	4911.04	-4852.40	3540.94
Fixation L	1	6	6045159942	6045935641	775699	681.63	524.29	35	57	-1	10.19	10.19
Fixation R	1	6	6045159942	6045935641	775699	681.63	524.29	35	57	-1	10.96	10.96
Saccade L	1	6	6045935641	6045975395	39754	657.41	487.31	671.53	267.79	1.89	121.60	1.00	47.52	2912.84	-2700.37	2604.04
Saccade R	1	6	6045935641	6045975395	39754	657.41	487.31	671.53	267.79	1.89	121.60	1.00	47.52	2912.84	-2700.37	2604.04
Fixation L	1	7	6045975395	6046333386	357991	691.01	296.46	30	40	-1	10.68	10.68
Fixation R	1	7	6045975395	6046333386	357991	691.01	296.46	30	40	-1	11.50	11.50
Saccade L	1	7	6046333386	6046393013	59627	700.37	308.13	588.89	609.67	3.80	116.95	0.33	63.78	2895.60	-2587.73	1849.36
Saccade R	1	7	6046333386	6046393013	59627	700.37	308.13	588.89	609.67	3.80	116.95	0.33	63.78	2895.60	-2587.73	1849.36
Fixation L	1	8	6046393013	6046572117	179104	560.86	656.06	35	57	-1	10.83	10.83
Fixation R	1	8	6046393013	6046572117	179104	560.86	656.06	35	57	-1	11.50	11.50
Saccade L	1	8	6046572117	6046592003	19886	553.61	664.40	463.25	668.92	0.55	91.51	1.00	27.80	2264.65	-2122.06	1554.44
Saccade R	1	8	6046572117	6046592003	19886	553.61	664.40	463.25	668.92	0.55	91.51	1.00	27.80	2264.65	-2122.06	1554.44
Fixation L	1	9	6046592003	6047705813	1113810	456.75	698.91	36	46	-1	10.76	10.76
Fixation R	1	9	6046592003	6047705813	1113810	456.75	698.91	36	46	-1	11.61	11.61
