[BeGaze]
Converted from:	C:\Documents and Settings\iViewX\Desktop\EXPERIMENTATIONS\Experiments\results\finaleart\S22H22551-finaleart-1.idf
Date:	27.03.2019 15:58:55
Version:	BeGaze 2.5.77
Sample Rate:	50
Subject:	S22H22551
Description:	Mathieu Chambre

Table Header for Fixations:
Event Type	Trial	Number	Start	End	Duration	Location X	Location Y	Dispersion X	Dispersion Y	Plane	Avg. Pupil Size X	Avg. Pupil Size Y

Table Header for Saccades:
Event Type	Trial	Number	Start	End	Duration	Start Loc.X	Start Loc.Y	End Loc.X	End Loc.Y	Amplitude	Peak Speed	Peak Speed At	Average Speed	Peak Accel.	Peak Decel.	Average Accel.

Table Header for Blinks:
Event Type	Trial	Number	Start	End	Duration

Table Header for User Events:
Event Type	Trial	Number	Start	Description

UserEvent	1	1	5794159624	# Message: void.jpg
Fixation L	1	1	5794174823	5794373707	198884	555.00	409.71	57	18	-1	13.44	13.44
Fixation R	1	1	5794174823	5794373707	198884	555.00	409.71	57	18	-1	13.14	13.14
Saccade L	1	1	5794373707	5794393558	19851	541.76	414.73	477.25	255.48	0.95	173.77	1.00	47.77	4289.02	-3884.05	2726.34
Saccade R	1	1	5794373707	5794393558	19851	541.76	414.73	477.25	255.48	0.95	173.77	1.00	47.77	4289.02	-3884.05	2726.34
Fixation L	1	2	5794393558	5794572587	179029	461.87	272.03	23	34	-1	12.92	12.92
Fixation R	1	2	5794393558	5794572587	179029	461.87	272.03	23	34	-1	12.89	12.89
Blink L	1	1	5794572587	5794831159	258572
Blink R	1	1	5794572587	5794831159	258572
Fixation L	1	3	5794831159	5794930655	99496	1089.75	279.34	5	37	-1	12.95	12.95
Fixation R	1	3	5794831159	5794930655	99496	1089.75	279.34	5	37	-1	13.69	13.69
Blink L	1	2	5794930655	5795189142	258487
Blink R	1	2	5794930655	5795189142	258487
Fixation L	1	4	5795189142	5795606875	417733	1166.75	322.25	68	26	-1	14.57	14.57
Fixation R	1	4	5795189142	5795606875	417733	1166.75	322.25	68	26	-1	14.71	14.71
Saccade L	1	2	5795606875	5795626741	19866	1116.31	330.14	1107.38	334.38	0.35	52.01	1.00	17.50	110.40	-1050.27	441.25
Saccade R	1	2	5795606875	5795626741	19866	1116.31	330.14	1107.38	334.38	0.35	52.01	1.00	17.50	110.40	-1050.27	441.25
Fixation L	1	5	5795626741	5795805729	178988	1097.02	345.68	19	18	-1	14.21	14.21
Fixation R	1	5	5795626741	5795805729	178988	1097.02	345.68	19	18	-1	14.39	14.39
Saccade L	1	3	5795805729	5795825610	19881	1088.08	352.75	1013.38	356.84	0.44	75.68	1.00	21.93	1801.24	-1601.19	1152.36
Saccade R	1	3	5795805729	5795825610	19881	1088.08	352.75	1013.38	356.84	0.44	75.68	1.00	21.93	1801.24	-1601.19	1152.36
Fixation L	1	6	5795825610	5796123966	298356	993.08	371.49	53	35	-1	14.30	14.30
Fixation R	1	6	5795825610	5796123966	298356	993.08	371.49	53	35	-1	14.71	14.71
Saccade L	1	4	5796123966	5796143839	19873	965.74	391.62	955.73	398.54	0.19	12.98	1.00	9.47	0.00	-16.83	8.41
Saccade R	1	4	5796123966	5796143839	19873	965.74	391.62	955.73	398.54	0.19	12.98	1.00	9.47	0.00	-16.83	8.41
