[BeGaze]
Converted from:	C:\Documents and Settings\iViewX\Desktop\EXPERIMENTATIONS\Experiments\results\finaleart\S11H21112-finaleart-1.idf
Date:	27.03.2019 15:38:34
Version:	BeGaze 2.5.77
Sample Rate:	50
Subject:	S11H21112
Description:	Clement legrand-Duchenne

Table Header for Fixations:
Event Type	Trial	Number	Start	End	Duration	Location X	Location Y	Dispersion X	Dispersion Y	Plane	Avg. Pupil Size X	Avg. Pupil Size Y

Table Header for Saccades:
Event Type	Trial	Number	Start	End	Duration	Start Loc.X	Start Loc.Y	End Loc.X	End Loc.Y	Amplitude	Peak Speed	Peak Speed At	Average Speed	Peak Accel.	Peak Decel.	Average Accel.

Table Header for Blinks:
Event Type	Trial	Number	Start	End	Duration

Table Header for User Events:
Event Type	Trial	Number	Start	Description

UserEvent	1	1	3932368967	# Message: REJECTED_after-the-bath_degas_1885.jpg
Blink L	1	1	3932369348	3932468827	99479
Blink R	1	1	3932369348	3932468827	99479
Fixation L	1	1	3932468827	3932906338	437511	931.42	479.15	47	23	-1	17.95	17.95
Fixation R	1	1	3932468827	3932906338	437511	931.42	479.15	47	23	-1	20.49	20.49
Saccade L	1	1	3932906338	3932926315	19977	911.10	485.31	732.85	503.96	1.05	181.25	1.00	52.49	4403.69	-4217.58	2883.90
Saccade R	1	1	3932906338	3932926315	19977	911.10	485.31	732.85	503.96	1.05	181.25	1.00	52.49	4403.69	-4217.58	2883.90
Fixation L	1	2	3932926315	3933244541	318226	724.75	488.60	10	31	-1	15.23	15.23
Fixation R	1	2	3932926315	3933244541	318226	724.75	488.60	10	31	-1	17.80	17.80
Saccade L	1	2	3933244541	3933284293	39752	724.70	478.49	485.24	496.57	2.15	172.64	1.00	54.14	4269.97	-3841.70	2755.70
Saccade R	1	2	3933244541	3933284293	39752	724.70	478.49	485.24	496.57	2.15	172.64	1.00	54.14	4269.97	-3841.70	2755.70
Fixation L	1	3	3933284293	3933522904	238611	493.31	529.16	14	43	-1	14.14	14.14
Fixation R	1	3	3933284293	3933522904	238611	493.31	529.16	14	43	-1	16.23	16.23
Saccade L	1	3	3933522904	3933542906	20002	493.74	537.35	350.89	508.41	0.87	147.42	1.00	43.38	3634.33	-3630.35	2515.45
Saccade R	1	3	3933522904	3933542906	20002	493.74	537.35	350.89	508.41	0.87	147.42	1.00	43.38	3634.33	-3630.35	2515.45
Fixation L	1	4	3933542906	3933682050	139144	367.79	489.28	58	31	-1	13.28	13.28
Fixation R	1	4	3933542906	3933682050	139144	367.79	489.28	58	31	-1	15.62	15.62
Saccade L	1	4	3933682050	3933702033	19983	408.89	476.78	547.88	469.88	1.11	140.75	1.00	55.36	3216.64	-3218.00	2258.85
Saccade R	1	4	3933682050	3933702033	19983	408.89	476.78	547.88	469.88	1.11	140.75	1.00	55.36	3216.64	-3218.00	2258.85
Fixation L	1	5	3933702033	3933940644	238611	546.08	448.48	17	29	-1	12.89	12.89
Fixation R	1	5	3933702033	3933940644	238611	546.08	448.48	17	29	-1	15.22	15.22
Saccade L	1	5	3933940644	3934000272	59628	541.67	439.98	1117.06	332.69	6.16	274.30	0.33	103.32	6839.03	-5615.71	4885.19
Saccade R	1	5	3933940644	3934000272	59628	541.67	439.98	1117.06	332.69	6.16	274.30	0.33	103.32	6839.03	-5615.71	4885.19
Fixation L	1	6	3934000272	3934318622	318350	1092.81	331.23	38	25	-1	13.33	13.33
Fixation R	1	6	3934000272	3934318622	318350	1092.81	331.23	38	25	-1	15.13	15.13
Saccade L	1	6	3934318622	3934338494	19872	1084.35	346.38	1175.25	478.88	1.00	162.50	1.00	50.36	3970.91	-3973.09	2669.09
Saccade R	1	6	3934318622	3934338494	19872	1084.35	346.38	1175.25	478.88	1.00	162.50	1.00	50.36	3970.91	-3973.09	2669.09
Fixation L	1	7	3934338494	3934656732	318238	1186.46	487.02	17	48	-1	14.06	14.06
Fixation R	1	7	3934338494	3934656732	318238	1186.46	487.02	17	48	-1	15.90	15.90
Saccade L	1	7	3934656732	3934676602	19870	1184.24	526.63	1185.68	564.95	0.46	47.73	0.00	23.04	933.53	-1088.09	938.21
Saccade R	1	7	3934656732	3934676602	19870	1184.24	526.63	1185.68	564.95	0.46	47.73	0.00	23.04	933.53	-1088.09	938.21
Fixation L	1	8	3934676602	3935034593	357991	1170.76	585.28	24	33	-1	14.61	14.61
Fixation R	1	8	3934676602	3935034593	357991	1170.76	585.28	24	33	-1	16.39	16.39
Saccade L	1	8	3935034593	3935074335	39742	1168.28	592.82	1564.91	587.61	3.79	254.15	1.00	95.24	6204.76	-4635.82	4116.66
Saccade R	1	8	3935034593	3935074335	39742	1168.28	592.82	1564.91	587.61	3.79	254.15	1.00	95.24	6204.76	-4635.82	4116.66
Fixation L	1	9	3935074335	3935372704	298369	1586.71	548.36	31	67	-1	14.22	14.22
Fixation R	1	9	3935074335	3935372704	298369	1586.71	548.36	31	67	-1	16.03	16.03
Saccade L	1	9	3935372704	3935392574	19870	1587.61	543.30	1592.25	407.31	1.10	137.63	1.00	55.44	2961.84	-1959.52	1894.92
Saccade R	1	9	3935372704	3935392574	19870	1587.61	543.30	1592.25	407.31	1.10	137.63	1.00	55.44	2961.84	-1959.52	1894.92
Fixation L	1	10	3935392574	3935531819	139245	1600.91	414.38	21	76	-1	14.57	14.57
Fixation R	1	10	3935392574	3935531819	139245	1600.91	414.38	21	76	-1	15.90	15.90
Saccade L	1	10	3935531819	3935551688	19869	1607.37	437.16	1603.22	443.47	0.19	15.29	0.00	9.58	-17.96	-206.99	118.68
Saccade R	1	10	3935531819	3935551688	19869	1607.37	437.16	1603.22	443.47	0.19	15.29	0.00	9.58	-17.96	-206.99	118.68
Fixation L	1	11	3935551688	3935850058	298370	1613.06	452.22	15	27	-1	14.70	14.70
Fixation R	1	11	3935551688	3935850058	298370	1613.06	452.22	15	27	-1	15.90	15.90
Saccade L	1	11	3935850058	3935869932	19874	1619.09	469.34	1629.99	552.32	0.70	84.66	1.00	35.27	1932.03	-1581.93	1452.65
Saccade R	1	11	3935850058	3935869932	19874	1619.09	469.34	1629.99	552.32	0.70	84.66	1.00	35.27	1932.03	-1581.93	1452.65
Fixation L	1	12	3935869932	3936128544	258612	1634.69	577.03	18	49	-1	14.80	14.80
Fixation R	1	12	3935869932	3936128544	258612	1634.69	577.03	18	49	-1	16.09	16.09
Saccade L	1	12	3936128544	3936168290	39746	1635.82	578.61	1397.27	407.90	2.54	151.53	0.50	63.95	3689.71	-3624.35	3630.26
Saccade R	1	12	3936128544	3936168290	39746	1635.82	578.61	1397.27	407.90	2.54	151.53	0.50	63.95	3689.71	-3624.35	3630.26
Fixation L	1	13	3936168290	3936367283	198993	1388.33	397.33	13	17	-1	15.12	15.12
Fixation R	1	13	3936168290	3936367283	198993	1388.33	397.33	13	17	-1	16.92	16.92
