[BeGaze]
Converted from:	C:\Documents and Settings\iViewX\Desktop\EXPERIMENTATIONS\Experiments\results\finaleart\S11H21112-finaleart-1.idf
Date:	27.03.2019 15:39:18
Version:	BeGaze 2.5.77
Sample Rate:	50
Subject:	S11H21112
Description:	Clement legrand-Duchenne

Table Header for Fixations:
Event Type	Trial	Number	Start	End	Duration	Location X	Location Y	Dispersion X	Dispersion Y	Plane	Avg. Pupil Size X	Avg. Pupil Size Y

Table Header for Saccades:
Event Type	Trial	Number	Start	End	Duration	Start Loc.X	Start Loc.Y	End Loc.X	End Loc.Y	Amplitude	Peak Speed	Peak Speed At	Average Speed	Peak Accel.	Peak Decel.	Average Accel.

Table Header for Blinks:
Event Type	Trial	Number	Start	End	Duration

Table Header for User Events:
Event Type	Trial	Number	Start	Description

UserEvent	1	1	5303411552	# Message: void.jpg
Fixation L	1	1	5303414139	5303533628	119489	652.85	416.55	19	31	-1	13.78	13.78
Fixation R	1	1	5303414139	5303533628	119489	652.85	416.55	19	31	-1	15.98	15.98
Saccade L	1	1	5303533628	5303573605	39977	647.01	406.65	832.20	524.49	2.07	127.99	0.50	51.83	2840.58	-2854.28	2461.69
Saccade R	1	1	5303533628	5303573605	39977	647.01	406.65	832.20	524.49	2.07	127.99	0.50	51.83	2840.58	-2854.28	2461.69
Fixation L	1	2	5303573605	5303712883	139278	828.64	522.03	4	13	-1	14.47	14.47
Fixation R	1	2	5303573605	5303712883	139278	828.64	522.03	4	13	-1	16.36	16.36
Saccade L	1	2	5303712883	5303752756	39873	827.84	522.42	1040.51	693.39	2.26	169.75	0.50	56.77	4219.34	-4102.26	3313.55
Saccade R	1	2	5303712883	5303752756	39873	827.84	522.42	1040.51	693.39	2.26	169.75	0.50	56.77	4219.34	-4102.26	3313.55
Fixation L	1	3	5303752756	5303971733	218977	1046.45	680.00	10	25	-1	14.98	14.98
Fixation R	1	3	5303752756	5303971733	218977	1046.45	680.00	10	25	-1	17.13	17.13
Blink L	1	1	5303971733	5304290340	318607
Blink R	1	1	5303971733	5304111108	139375
Blink R	1	2	5304130975	5304290340	159365
Saccade L	1	3	5304290340	5304429708	139368	1598.73	-7.70	1553.06	-27.89	5.58	147.19	1.00	40.04	2642.74	-2306.91	1144.18
Saccade R	1	3	5304290340	5304429708	139368	1598.73	-7.70	1553.06	-27.89	5.58	147.19	1.00	40.04	2642.74	-2306.91	1144.18
Fixation L	1	4	5304429708	5304549203	119495	1524.36	-8.87	49	48	-1	12.85	12.85
Fixation R	1	4	5304429708	5304549203	119495	1524.36	-8.87	49	48	-1	14.65	14.65
Saccade L	1	4	5304549203	5304569080	19877	1503.41	-14.73	1543.65	-38.69	0.48	47.38	1.00	24.38	640.99	-572.16	458.59
Saccade R	1	4	5304549203	5304569080	19877	1503.41	-14.73	1543.65	-38.69	0.48	47.38	1.00	24.38	640.99	-572.16	458.59
Fixation L	1	5	5304569080	5304768201	199121	1526.71	-43.15	30	67	-1	12.79	12.79
Fixation R	1	5	5304569080	5304768201	199121	1526.71	-43.15	30	67	-1	14.74	14.74
Saccade L	1	5	5304768201	5305007184	238983	1546.63	-55.57	1325.07	150.78	61.10	1548.64	0.25	255.65	38404.43	-37982.21	11708.04
Saccade R	1	5	5304768201	5305007184	238983	1546.63	-55.57	1325.07	150.78	61.10	1548.64	0.25	255.65	38404.43	-37982.21	11708.04
Fixation L	1	6	5305007184	5305186441	179257	1302.17	137.97	31	53	-1	12.76	12.76
Fixation R	1	6	5305007184	5305186441	179257	1302.17	137.97	31	53	-1	14.84	14.84
Saccade L	1	6	5305186441	5305246177	59736	1294.06	148.70	1165.25	151.83	2.54	96.17	1.00	42.44	1231.25	-2194.80	1202.51
Saccade R	1	6	5305186441	5305246177	59736	1294.06	148.70	1165.25	151.83	2.54	96.17	1.00	42.44	1231.25	-2194.80	1202.51
Fixation L	1	7	5305246177	5305405419	159242	1145.33	178.89	27	57	-1	12.90	12.90
Fixation R	1	7	5305246177	5305405419	159242	1145.33	178.89	27	57	-1	14.78	14.78
