[BeGaze]
Converted from:	C:\Documents and Settings\iViewX\Desktop\EXPERIMENTATIONS\Experiments\results\finaleart\S20H24222-finaleart-1.idf
Date:	27.03.2019 15:53:47
Version:	BeGaze 2.5.77
Sample Rate:	50
Subject:	S20H24222
Description:	Hugo Brument

Table Header for Fixations:
Event Type	Trial	Number	Start	End	Duration	Location X	Location Y	Dispersion X	Dispersion Y	Plane	Avg. Pupil Size X	Avg. Pupil Size Y

Table Header for Saccades:
Event Type	Trial	Number	Start	End	Duration	Start Loc.X	Start Loc.Y	End Loc.X	End Loc.Y	Amplitude	Peak Speed	Peak Speed At	Average Speed	Peak Accel.	Peak Decel.	Average Accel.

Table Header for Blinks:
Event Type	Trial	Number	Start	End	Duration

Table Header for User Events:
Event Type	Trial	Number	Start	Description

UserEvent	1	1	12175713141	# Message: Sailboats_On_The_River_Sheldt_van_Rysselberghe_1892.jpg
Fixation L	1	1	12175724677	12176599762	875085	902.32	698.67	7	78	-1	13.24	13.24
Fixation R	1	1	12175724677	12176599762	875085	902.32	698.67	7	78	-1	14.53	14.53
Saccade L	1	1	12176599762	12176619627	19865	902.77	644.51	903.12	617.53	0.31	27.29	1.00	15.36	340.15	-545.48	297.70
Saccade R	1	1	12176599762	12176619627	19865	902.77	644.51	903.12	617.53	0.31	27.29	1.00	15.36	340.15	-545.48	297.70
Fixation L	1	2	12176619627	12176778754	159127	914.14	605.56	28	51	-1	9.75	9.75
Fixation R	1	2	12176619627	12176778754	159127	914.14	605.56	28	51	-1	10.88	10.88
Saccade L	1	2	12176778754	12176798757	20003	931.62	576.22	1120.03	563.19	1.18	190.98	1.00	58.84	4649.85	-4492.58	3120.62
Saccade R	1	2	12176778754	12176798757	20003	931.62	576.22	1120.03	563.19	1.18	190.98	1.00	58.84	4649.85	-4492.58	3120.62
Fixation L	1	3	12176798757	12177057232	258475	1130.83	536.33	28	41	-1	9.00	9.00
Fixation R	1	3	12176798757	12177057232	258475	1130.83	536.33	28	41	-1	10.25	10.25
Saccade L	1	3	12177057232	12177077107	19875	1147.47	521.30	1265.02	521.06	0.70	118.90	1.00	35.33	2863.78	-2899.12	1951.58
Saccade R	1	3	12177057232	12177077107	19875	1147.47	521.30	1265.02	521.06	0.70	118.90	1.00	35.33	2863.78	-2899.12	1951.58
Fixation L	1	4	12177077107	12177236235	159128	1263.27	530.22	22	20	-1	8.61	8.61
Fixation R	1	4	12177077107	12177236235	159128	1263.27	530.22	22	20	-1	9.76	9.76
Saccade L	1	4	12177236235	12177276101	39866	1252.80	541.38	1241.35	324.20	2.08	128.68	1.00	52.11	3169.42	-2592.38	2341.75
Saccade R	1	4	12177236235	12177276101	39866	1252.80	541.38	1241.35	324.20	2.08	128.68	1.00	52.11	3169.42	-2592.38	2341.75
Fixation L	1	5	12177276101	12177494845	218744	1205.59	334.52	61	37	-1	8.96	8.96
Fixation R	1	5	12177276101	12177494845	218744	1205.59	334.52	61	37	-1	9.90	9.90
Saccade L	1	5	12177494845	12177514723	19878	1179.65	345.52	1177.04	340.96	0.10	7.21	1.00	4.92	167.46	-51.22	88.69
Saccade R	1	5	12177494845	12177514723	19878	1179.65	345.52	1177.04	340.96	0.10	7.21	1.00	4.92	167.46	-51.22	88.69
Fixation L	1	6	12177514723	12177653967	139244	1174.37	343.27	5	11	-1	9.80	9.80
Fixation R	1	6	12177514723	12177653967	139244	1174.37	343.27	5	11	-1	10.55	10.55
Saccade L	1	6	12177653967	12177693710	39743	1172.91	339.56	837.40	340.46	2.76	228.24	1.00	69.54	5609.41	-5408.93	4118.28
Saccade R	1	6	12177653967	12177693710	39743	1172.91	339.56	837.40	340.46	2.76	228.24	1.00	69.54	5609.41	-5408.93	4118.28
Fixation L	1	7	12177693710	12178091568	397858	815.36	337.87	34	10	-1	10.57	10.57
Fixation R	1	7	12177693710	12178091568	397858	815.36	337.87	34	10	-1	11.83	11.83
Saccade L	1	7	12178091568	12178131310	39742	815.35	340.11	566.79	339.54	2.14	159.85	0.50	53.77	3924.38	-3752.23	3029.08
Saccade R	1	7	12178091568	12178131310	39742	815.35	340.11	566.79	339.54	2.14	159.85	0.50	53.77	3924.38	-3752.23	3029.08
Fixation L	1	8	12178131310	12178588804	457494	562.06	350.54	54	23	-1	11.01	11.01
Fixation R	1	8	12178131310	12178588804	457494	562.06	350.54	54	23	-1	12.51	12.51
Saccade L	1	8	12178588804	12178628545	39741	610.11	345.51	1121.02	336.93	4.75	357.76	0.50	119.55	8840.39	-8319.22	5905.61
Saccade R	1	8	12178588804	12178628545	39741	610.11	345.51	1121.02	336.93	4.75	357.76	0.50	119.55	8840.39	-8319.22	5905.61
Fixation L	1	9	12178628545	12178847427	218882	1111.28	314.22	17	30	-1	11.85	11.85
Fixation R	1	9	12178628545	12178847427	218882	1111.28	314.22	17	30	-1	12.86	12.86
Saccade L	1	9	12178847427	12178907034	59607	1110.29	308.71	1138.30	1051.22	7.89	303.32	0.67	132.30	7506.70	-6744.46	5216.28
Saccade R	1	9	12178847427	12178907034	59607	1110.29	308.71	1138.30	1051.22	7.89	303.32	0.67	132.30	7506.70	-6744.46	5216.28
Fixation L	1	10	12178907034	12179404260	497226	1146.81	1030.06	29	33	-1	12.22	12.22
Fixation R	1	10	12178907034	12179404260	497226	1146.81	1030.06	29	33	-1	12.90	12.90
Saccade L	1	10	12179404260	12179464010	59750	1154.40	1026.77	1171.07	535.46	5.13	224.10	0.67	85.90	5551.23	-5380.92	4265.85
Saccade R	1	10	12179404260	12179464010	59750	1154.40	1026.77	1171.07	535.46	5.13	224.10	0.67	85.90	5551.23	-5380.92	4265.85
Fixation L	1	11	12179464010	12179603264	139254	1176.53	531.51	19	12	-1	10.72	10.72
Fixation R	1	11	12179464010	12179603264	139254	1176.53	531.51	19	12	-1	11.52	11.52
Saccade L	1	11	12179603264	12179702628	99364	1186.86	532.97	824.21	283.19	7.69	184.25	0.40	77.42	4441.37	-4119.08	2713.73
Saccade R	1	11	12179603264	12179702628	99364	1186.86	532.97	824.21	283.19	7.69	184.25	0.40	77.42	4441.37	-4119.08	2713.73
