[BeGaze]
Converted from:	C:\Documents and Settings\iViewX\Desktop\EXPERIMENTATIONS\Experiments\results\finaleart\S22H22551-finaleart-1.idf
Date:	27.03.2019 15:57:57
Version:	BeGaze 2.5.77
Sample Rate:	50
Subject:	S22H22551
Description:	Mathieu Chambre

Table Header for Fixations:
Event Type	Trial	Number	Start	End	Duration	Location X	Location Y	Dispersion X	Dispersion Y	Plane	Avg. Pupil Size X	Avg. Pupil Size Y

Table Header for Saccades:
Event Type	Trial	Number	Start	End	Duration	Start Loc.X	Start Loc.Y	End Loc.X	End Loc.Y	Amplitude	Peak Speed	Peak Speed At	Average Speed	Peak Accel.	Peak Decel.	Average Accel.

Table Header for Blinks:
Event Type	Trial	Number	Start	End	Duration

Table Header for User Events:
Event Type	Trial	Number	Start	Description

UserEvent	1	1	5289706764	# Message: void.jpg
Fixation L	1	1	5289711695	5289811186	99491	417.38	967.63	4	11	-1	16.14	16.14
Fixation R	1	1	5289711695	5289811186	99491	417.38	967.63	4	11	-1	16.83	16.83
Saccade L	1	1	5289811186	5289850935	39749	414.97	964.70	143.39	874.58	2.45	225.40	0.50	61.71	5583.43	-5559.17	3671.49
Saccade R	1	1	5289811186	5289850935	39749	414.97	964.70	143.39	874.58	2.45	225.40	0.50	61.71	5583.43	-5559.17	3671.49
Fixation L	1	2	5289850935	5289970292	119357	151.22	878.93	22	11	-1	15.29	15.29
Fixation R	1	2	5289850935	5289970292	119357	151.22	878.93	22	11	-1	16.28	16.28
Saccade L	1	2	5289970292	5290029918	59626	165.50	882.99	299.92	196.96	7.34	379.80	0.67	123.17	9106.80	-9294.99	5739.95
Saccade R	1	2	5289970292	5290029918	59626	165.50	882.99	299.92	196.96	7.34	379.80	0.67	123.17	9106.80	-9294.99	5739.95
Fixation L	1	3	5290029918	5290129408	99490	310.66	236.23	28	69	-1	14.97	14.97
Fixation R	1	3	5290029918	5290129408	99490	310.66	236.23	28	69	-1	15.83	15.83
Saccade L	1	3	5290129408	5290169160	39752	324.56	266.68	329.56	282.62	1.09	107.45	1.00	27.40	2550.50	-35.52	1046.97
Saccade R	1	3	5290129408	5290169160	39752	324.56	266.68	329.56	282.62	1.09	107.45	1.00	27.40	2550.50	-35.52	1046.97
Blink L	1	1	5290169160	5290427653	258493
Blink R	1	1	5290169160	5290427653	258493
Fixation L	1	4	5290427653	5290706139	278486	1138.11	448.50	16	13	-1	18.35	18.35
Fixation R	1	4	5290427653	5290706139	278486	1138.11	448.50	16	13	-1	18.61	18.61
Saccade L	1	4	5290706139	5290726005	19866	1130.36	451.72	1039.53	453.88	0.55	91.90	1.00	27.51	2276.65	-1994.94	1545.62
Saccade R	1	4	5290706139	5290726005	19866	1130.36	451.72	1039.53	453.88	0.55	91.90	1.00	27.51	2276.65	-1994.94	1545.62
Fixation L	1	5	5290726005	5291621098	895093	1028.36	431.16	51	41	-1	19.20	19.20
Fixation R	1	5	5290726005	5291621098	895093	1028.36	431.16	51	41	-1	19.25	19.25
Saccade L	1	5	5291621098	5291700708	79610	1000.14	440.94	988.28	459.17	0.72	15.69	1.00	9.04	279.33	-175.74	113.82
Saccade R	1	5	5291621098	5291700708	79610	1000.14	440.94	988.28	459.17	0.72	15.69	1.00	9.04	279.33	-175.74	113.82
