[BeGaze]
Converted from:	C:\Documents and Settings\iViewX\Desktop\EXPERIMENTATIONS\Experiments\results\finaleart\S13H22431-finaleart-1.idf
Date:	27.03.2019 15:41:29
Version:	BeGaze 2.5.77
Sample Rate:	50
Subject:	S13H22431
Description:	Jimmy Petit

Table Header for Fixations:
Event Type	Trial	Number	Start	End	Duration	Location X	Location Y	Dispersion X	Dispersion Y	Plane	Avg. Pupil Size X	Avg. Pupil Size Y

Table Header for Saccades:
Event Type	Trial	Number	Start	End	Duration	Start Loc.X	Start Loc.Y	End Loc.X	End Loc.Y	Amplitude	Peak Speed	Peak Speed At	Average Speed	Peak Accel.	Peak Decel.	Average Accel.

Table Header for Blinks:
Event Type	Trial	Number	Start	End	Duration

Table Header for User Events:
Event Type	Trial	Number	Start	Description

UserEvent	1	1	27369157648	# Message: void.jpg
Fixation L	1	1	27369166462	27369444799	278337	1119.79	31.26	83	12	-1	12.26	12.26
Fixation R	1	1	27369166462	27369444799	278337	1119.79	31.26	83	12	-1	11.82	11.82
Saccade L	1	1	27369444799	27369464800	20001	1154.77	27.20	1158.46	21.41	0.15	10.83	1.00	7.31	72.82	-97.09	73.07
Saccade R	1	1	27369444799	27369464800	20001	1154.77	27.20	1158.46	21.41	0.15	10.83	1.00	7.31	72.82	-97.09	73.07
Fixation L	1	2	27369464800	27369822792	357992	1175.92	25.77	26	26	-1	12.57	12.57
Fixation R	1	2	27369464800	27369822792	357992	1175.92	25.77	26	26	-1	12.37	12.37
Saccade L	1	2	27369822792	27369882411	59619	1166.34	40.97	991.42	177.60	2.61	134.20	0.67	43.77	3194.86	-3210.49	1812.04
Saccade R	1	2	27369822792	27369882411	59619	1166.34	40.97	991.42	177.60	2.61	134.20	0.67	43.77	3194.86	-3210.49	1812.04
Fixation L	1	3	27369882411	27370041532	159121	981.45	187.24	17	15	-1	13.91	13.91
Fixation R	1	3	27369882411	27370041532	159121	981.45	187.24	17	15	-1	13.92	13.92
Saccade L	1	3	27370041532	27370081271	39739	973.47	192.86	769.87	314.75	2.27	173.87	1.00	57.18	4142.08	-3895.12	2766.01
Saccade R	1	3	27370041532	27370081271	39739	973.47	192.86	769.87	314.75	2.27	173.87	1.00	57.18	4142.08	-3895.12	2766.01
Fixation L	1	4	27370081271	27370200635	119364	737.56	307.62	46	39	-1	14.82	14.82
Fixation R	1	4	27370081271	27370200635	119364	737.56	307.62	46	39	-1	14.66	14.66
Saccade L	1	4	27370200635	27370220519	19884	724.28	293.20	726.58	259.35	0.42	34.32	1.00	21.24	636.99	-628.78	580.98
Saccade R	1	4	27370200635	27370220519	19884	724.28	293.20	726.58	259.35	0.42	34.32	1.00	21.24	636.99	-628.78	580.98
Fixation L	1	5	27370220519	27370518877	298358	725.10	295.06	19	47	-1	15.29	15.29
Fixation R	1	5	27370220519	27370518877	298358	725.10	295.06	19	47	-1	14.18	14.18
Blink L	1	1	27370518877	27370618376	99499
Blink R	1	1	27370518877	27370618376	99499
Fixation L	1	6	27370618376	27370876989	258613	735.97	324.97	15	35	-1	16.03	16.03
Fixation R	1	6	27370618376	27370876989	258613	735.97	324.97	15	35	-1	15.43	15.43
Saccade L	1	5	27370876989	27370896857	19868	744.61	343.73	835.97	363.97	0.76	94.66	1.00	38.46	2253.33	-2214.54	1927.51
Saccade R	1	5	27370876989	27370896857	19868	744.61	343.73	835.97	363.97	0.76	94.66	1.00	38.46	2253.33	-2214.54	1927.51
Fixation L	1	7	27370896857	27370996239	99382	853.70	413.40	24	74	-1	16.28	16.28
Fixation R	1	7	27370896857	27370996239	99382	853.70	413.40	24	74	-1	17.33	17.33
Saccade L	1	6	27370996239	27371016108	19869	860.85	438.87	861.08	433.08	0.15	11.76	0.00	7.73	42.81	-157.10	82.98
Saccade R	1	6	27370996239	27371016108	19869	860.85	438.87	861.08	433.08	0.15	11.76	0.00	7.73	42.81	-157.10	82.98
Fixation L	1	8	27371016108	27371115600	99492	863.23	437.97	12	18	-1	16.43	16.43
Fixation R	1	8	27371016108	27371115600	99492	863.23	437.97	12	18	-1	17.30	17.30
Saccade L	1	7	27371115600	27371155347	39747	871.86	449.55	928.06	498.86	0.93	68.44	0.50	23.28	1645.57	-170.01	605.20
Saccade R	1	7	27371115600	27371155347	39747	871.86	449.55	928.06	498.86	0.93	68.44	0.50	23.28	1645.57	-170.01	605.20
