[BeGaze]
Converted from:	C:\Documents and Settings\iViewX\Desktop\EXPERIMENTATIONS\Experiments\results\finaleart\S14F27123-finaleart-1.idf
Date:	27.03.2019 15:42:45
Version:	BeGaze 2.5.77
Sample Rate:	50
Subject:	S14F27123
Description:	Anne-flore Perrin

Table Header for Fixations:
Event Type	Trial	Number	Start	End	Duration	Location X	Location Y	Dispersion X	Dispersion Y	Plane	Avg. Pupil Size X	Avg. Pupil Size Y

Table Header for Saccades:
Event Type	Trial	Number	Start	End	Duration	Start Loc.X	Start Loc.Y	End Loc.X	End Loc.Y	Amplitude	Peak Speed	Peak Speed At	Average Speed	Peak Accel.	Peak Decel.	Average Accel.

Table Header for Blinks:
Event Type	Trial	Number	Start	End	Duration

Table Header for User Events:
Event Type	Trial	Number	Start	Description

UserEvent	1	1	30290317410	# Message: still-life-with-red-mullet-and-jug_gaugain_1876.jpg
Fixation L	1	1	30290322190	30290461534	139344	686.46	561.86	10	57	-1	14.44	14.44
Fixation R	1	1	30290322190	30290461534	139344	686.46	561.86	10	57	-1	14.95	14.95
Saccade L	1	1	30290461534	30290481293	19759	690.33	591.84	804.47	583.50	0.73	115.77	1.00	36.91	2657.63	-1834.99	1568.35
Saccade R	1	1	30290461534	30290481293	19759	690.33	591.84	804.47	583.50	0.73	115.77	1.00	36.91	2657.63	-1834.99	1568.35
Fixation L	1	2	30290481293	30290739918	258625	785.06	599.64	32	55	-1	15.53	15.53
Fixation R	1	2	30290481293	30290739918	258625	785.06	599.64	32	55	-1	15.68	15.68
Saccade L	1	2	30290739918	30290779648	39730	772.29	578.36	836.08	876.12	3.00	235.15	1.00	75.51	5265.02	-5872.30	3441.80
Saccade R	1	2	30290739918	30290779648	39730	772.29	578.36	836.08	876.12	3.00	235.15	1.00	75.51	5265.02	-5872.30	3441.80
Fixation L	1	3	30290779648	30291038259	258611	862.91	874.59	36	14	-1	15.19	15.19
Fixation R	1	3	30290779648	30291038259	258611	862.91	874.59	36	14	-1	15.62	15.62
Saccade L	1	3	30291038259	30291058144	19885	861.47	873.40	746.79	870.05	0.72	116.05	1.00	36.15	2666.72	-2750.19	1828.30
Saccade R	1	3	30291038259	30291058144	19885	861.47	873.40	746.79	870.05	0.72	116.05	1.00	36.15	2666.72	-2750.19	1828.30
Fixation L	1	4	30291058144	30291396244	338100	721.91	864.78	54	18	-1	15.46	15.46
Fixation R	1	4	30291058144	30291396244	338100	721.91	864.78	54	18	-1	15.78	15.78
Saccade L	1	4	30291396244	30291455870	59626	697.67	865.77	955.09	589.08	4.06	170.79	0.67	68.17	4122.41	-3891.99	3201.71
Saccade R	1	4	30291396244	30291455870	59626	697.67	865.77	955.09	589.08	4.06	170.79	0.67	68.17	4122.41	-3891.99	3201.71
Fixation L	1	5	30291455870	30291575246	119376	962.19	571.61	12	26	-1	15.11	15.11
Fixation R	1	5	30291455870	30291575246	119376	962.19	571.61	12	26	-1	15.78	15.78
Saccade L	1	5	30291575246	30291595108	19862	959.18	567.37	1098.46	374.29	1.34	240.70	1.00	67.43	5932.78	-5867.16	4066.11
Saccade R	1	5	30291575246	30291595108	19862	959.18	567.37	1098.46	374.29	1.34	240.70	1.00	67.43	5932.78	-5867.16	4066.11
Fixation L	1	6	30291595108	30291873599	278491	1097.98	408.67	20	53	-1	14.34	14.34
Fixation R	1	6	30291595108	30291873599	278491	1097.98	408.67	20	53	-1	15.44	15.44
Saccade L	1	6	30291873599	30291913350	39751	1100.19	423.57	768.14	431.22	2.77	171.50	1.00	69.81	4245.73	-4245.60	4107.49
Saccade R	1	6	30291873599	30291913350	39751	1100.19	423.57	768.14	431.22	2.77	171.50	1.00	69.81	4245.73	-4245.60	4107.49
Fixation L	1	7	30291913350	30292171963	258613	770.34	425.72	15	22	-1	15.13	15.13
Fixation R	1	7	30291913350	30292171963	258613	770.34	425.72	15	22	-1	15.48	15.48
Saccade L	1	7	30292171963	30292191835	19872	778.26	420.96	874.48	413.37	0.56	97.64	1.00	27.98	2289.93	-2379.80	1597.78
Saccade R	1	7	30292171963	30292191835	19872	778.26	420.96	874.48	413.37	0.56	97.64	1.00	27.98	2289.93	-2379.80	1597.78
Fixation L	1	8	30292191835	30292390701	198866	878.17	396.78	8	30	-1	15.54	15.54
Fixation R	1	8	30292191835	30292390701	198866	878.17	396.78	8	30	-1	15.95	15.95
Saccade L	1	8	30292390701	30292430450	39749	875.96	387.79	742.17	674.80	2.91	250.25	0.50	73.17	6168.70	-6084.96	4318.25
Saccade R	1	8	30292390701	30292430450	39749	875.96	387.79	742.17	674.80	2.91	250.25	0.50	73.17	6168.70	-6084.96	4318.25
Fixation L	1	9	30292430450	30292629438	198988	743.25	666.91	19	15	-1	16.46	16.46
Fixation R	1	9	30292430450	30292629438	198988	743.25	666.91	19	15	-1	16.57	16.57
Saccade L	1	9	30292629438	30292649333	19895	752.91	668.92	595.69	860.23	1.36	250.35	1.00	68.44	6080.83	-5849.75	4027.40
Saccade R	1	9	30292629438	30292649333	19895	752.91	668.92	595.69	860.23	1.36	250.35	1.00	68.44	6080.83	-5849.75	4027.40
Fixation L	1	10	30292649333	30292808456	159123	583.41	858.49	36	18	-1	16.42	16.42
Fixation R	1	10	30292649333	30292808456	159123	583.41	858.49	36	18	-1	16.70	16.70
Saccade L	1	10	30292808456	30292828313	19857	582.72	856.38	675.32	857.26	0.69	93.68	1.00	34.77	2065.03	-2094.36	1396.72
Saccade R	1	10	30292808456	30292828313	19857	582.72	856.38	675.32	857.26	0.69	93.68	1.00	34.77	2065.03	-2094.36	1396.72
Fixation L	1	11	30292828313	30293086925	258612	673.24	859.78	22	18	-1	15.70	15.70
Fixation R	1	11	30292828313	30293086925	258612	673.24	859.78	22	18	-1	16.43	16.43
Saccade L	1	11	30293086925	30293106794	19869	681.06	863.60	855.52	866.00	0.99	176.45	1.00	49.84	4295.95	-4304.61	2924.96
Saccade R	1	11	30293086925	30293106794	19869	681.06	863.60	855.52	866.00	0.99	176.45	1.00	49.84	4295.95	-4304.61	2924.96
Fixation L	1	12	30293106794	30293285784	178990	864.97	858.15	12	17	-1	14.96	14.96
Fixation R	1	12	30293106794	30293285784	178990	864.97	858.15	12	17	-1	15.87	15.87
Saccade L	1	12	30293285784	30293305664	19880	868.01	858.07	1108.91	857.91	1.37	243.56	1.00	68.90	5981.88	-5897.41	4025.91
Saccade R	1	12	30293285784	30293305664	19880	868.01	858.07	1108.91	857.91	1.37	243.56	1.00	68.90	5981.88	-5897.41	4025.91
Fixation L	1	13	30293305664	30293444908	139244	1098.25	875.28	20	32	-1	15.35	15.35
Fixation R	1	13	30293305664	30293444908	139244	1098.25	875.28	20	32	-1	15.74	15.74
Saccade L	1	13	30293444908	30293484652	39744	1096.29	890.26	1502.12	895.44	3.73	339.32	1.00	93.75	8405.52	-8058.55	4655.13
Saccade R	1	13	30293444908	30293484652	39744	1096.29	890.26	1502.12	895.44	3.73	339.32	1.00	93.75	8405.52	-8058.55	4655.13
Fixation L	1	14	30293484652	30293663645	178993	1480.12	906.12	35	32	-1	15.21	15.21
Fixation R	1	14	30293484652	30293663645	178993	1480.12	906.12	35	32	-1	14.41	14.41
Saccade L	1	14	30293663645	30293683523	19878	1481.07	921.42	1475.40	643.05	1.57	281.44	1.00	78.73	6802.48	-6989.01	4701.75
Saccade R	1	14	30293663645	30293683523	19878	1481.07	921.42	1475.40	643.05	1.57	281.44	1.00	78.73	6802.48	-6989.01	4701.75
Fixation L	1	15	30293683523	30293842768	159245	1448.19	646.03	48	5	-1	15.20	15.20
Fixation R	1	15	30293683523	30293842768	159245	1448.19	646.03	48	5	-1	15.07	15.07
Saccade L	1	15	30293842768	30293882509	39741	1426.46	645.71	1444.25	391.12	2.37	178.19	1.00	59.58	4213.93	-4255.83	2928.43
Saccade R	1	15	30293842768	30293882509	39741	1426.46	645.71	1444.25	391.12	2.37	178.19	1.00	59.58	4213.93	-4255.83	2928.43
Fixation L	1	16	30293882509	30294041630	159121	1436.62	411.76	12	42	-1	15.21	15.21
Fixation R	1	16	30293882509	30294041630	159121	1436.62	411.76	12	42	-1	14.94	14.94
Saccade L	1	16	30294041630	30294061505	19875	1434.29	409.36	1420.58	343.06	0.63	68.49	1.00	31.61	1473.29	-1634.74	1184.47
Saccade R	1	16	30294041630	30294061505	19875	1434.29	409.36	1420.58	343.06	0.63	68.49	1.00	31.61	1473.29	-1634.74	1184.47
Fixation L	1	17	30294061505	30294260376	198871	1404.90	314.79	27	35	-1	15.41	15.41
Fixation R	1	17	30294061505	30294260376	198871	1404.90	314.79	27	35	-1	15.31	15.31
Saccade L	1	17	30294260376	30294320152	59776	1393.00	317.79	1009.97	320.31	4.83	222.48	0.33	80.87	5522.17	-5406.19	3765.95
Saccade R	1	17	30294260376	30294320152	59776	1393.00	317.79	1009.97	320.31	4.83	222.48	0.33	80.87	5522.17	-5406.19	3765.95
