[BeGaze]
Converted from:	C:\Documents and Settings\iViewX\Desktop\EXPERIMENTATIONS\Experiments\results\finaleart\S8119532-finaleart-1.idf
Date:	27.03.2019 16:00:20
Version:	BeGaze 2.5.77
Sample Rate:	50
Subject:	S8119532
Description:	Alexandre Drewery

Table Header for Fixations:
Event Type	Trial	Number	Start	End	Duration	Location X	Location Y	Dispersion X	Dispersion Y	Plane	Avg. Pupil Size X	Avg. Pupil Size Y

Table Header for Saccades:
Event Type	Trial	Number	Start	End	Duration	Start Loc.X	Start Loc.Y	End Loc.X	End Loc.Y	Amplitude	Peak Speed	Peak Speed At	Average Speed	Peak Accel.	Peak Decel.	Average Accel.

Table Header for Blinks:
Event Type	Trial	Number	Start	End	Duration

Table Header for User Events:
Event Type	Trial	Number	Start	Description

UserEvent	1	1	3058535668	# Message: Georges-braque-still-life-with-jugs-and-pipe-1906.jpg
Fixation L	1	1	3058542367	3058900361	357994	994.13	653.08	34	53	-1	13.65	13.65
Fixation R	1	1	3058542367	3058900361	357994	994.13	653.08	34	53	-1	15.76	15.76
Saccade L	1	1	3058900361	3058923623	23262	972.08	622.93	974.01	610.19	0.33	22.04	0.00	14.19	86.54	-247.82	129.15
Saccade R	1	1	3058900361	3058923623	23262	972.08	622.93	974.01	610.19	0.33	22.04	0.00	14.19	86.54	-247.82	129.15
Fixation L	1	2	3058923623	3059357826	434203	958.55	605.33	25	57	-1	14.11	14.11
Fixation R	1	2	3058923623	3059357826	434203	958.55	605.33	25	57	-1	16.14	16.14
Saccade L	1	2	3059357826	3059377702	19876	948.37	592.91	715.25	519.84	1.57	246.99	1.00	78.86	5811.12	-5376.26	3880.72
Saccade R	1	2	3059357826	3059377702	19876	948.37	592.91	715.25	519.84	1.57	246.99	1.00	78.86	5811.12	-5376.26	3880.72
Fixation L	1	3	3059377702	3059587053	209351	707.21	531.86	13	35	-1	12.98	12.98
Fixation R	1	3	3059377702	3059587053	209351	707.21	531.86	13	35	-1	15.31	15.31
Saccade L	1	3	3059587053	3059616445	29392	702.21	521.14	693.17	257.09	2.43	267.08	1.00	82.57	6294.80	-6453.28	4340.85
Saccade R	1	3	3059587053	3059616445	29392	702.21	521.14	693.17	257.09	2.43	267.08	1.00	82.57	6294.80	-6453.28	4340.85
Fixation L	1	4	3059616445	3059835170	218725	696.28	288.68	7	44	-1	10.64	10.64
Fixation R	1	4	3059616445	3059835170	218725	696.28	288.68	7	44	-1	12.19	12.19
Saccade L	1	4	3059835170	3059874922	39752	696.14	298.20	906.47	396.77	2.25	128.60	0.50	56.70	2947.10	-2804.95	2494.78
Saccade R	1	4	3059835170	3059874922	39752	696.14	298.20	906.47	396.77	2.25	128.60	0.50	56.70	2947.10	-2804.95	2494.78
Fixation L	1	5	3059874922	3060014167	139245	902.73	420.02	32	35	-1	10.38	10.38
Fixation R	1	5	3059874922	3060014167	139245	902.73	420.02	32	35	-1	11.83	11.83
Saccade L	1	5	3060014167	3060113656	99489	895.51	432.34	1194.68	911.04	8.33	252.12	0.80	83.72	5933.55	-5467.29	3305.58
Saccade R	1	5	3060014167	3060113656	99489	895.51	432.34	1194.68	911.04	8.33	252.12	0.80	83.72	5933.55	-5467.29	3305.58
Fixation L	1	6	3060113656	3060252900	139244	1198.32	935.96	16	62	-1	11.24	11.24
Fixation R	1	6	3060113656	3060252900	139244	1198.32	935.96	16	62	-1	13.00	13.00
Saccade L	1	6	3060252900	3060272776	19876	1199.99	947.45	1289.06	968.42	0.77	92.56	1.00	38.93	1756.12	-1968.14	1436.33
Saccade R	1	6	3060252900	3060272776	19876	1199.99	947.45	1289.06	968.42	0.77	92.56	1.00	38.93	1756.12	-1968.14	1436.33
Fixation L	1	7	3060272776	3060491519	218743	1275.20	986.75	31	41	-1	11.57	11.57
Fixation R	1	7	3060272776	3060491519	218743	1275.20	986.75	31	41	-1	12.90	12.90
Saccade L	1	7	3060491519	3060531261	39742	1271.87	978.17	1257.85	566.40	3.67	238.99	0.50	92.39	5847.20	-5614.50	4894.13
Saccade R	1	7	3060491519	3060531261	39742	1271.87	978.17	1257.85	566.40	3.67	238.99	0.50	92.39	5847.20	-5614.50	4894.13
Fixation L	1	8	3060531261	3060730255	198994	1235.26	558.87	36	13	-1	10.94	10.94
Fixation R	1	8	3060531261	3060730255	198994	1235.26	558.87	36	13	-1	12.18	12.18
Saccade L	1	8	3060730255	3060829645	99390	1223.43	562.30	1261.47	996.45	7.35	244.85	0.40	73.99	5888.23	-5695.80	2872.69
Saccade R	1	8	3060730255	3060829645	99390	1223.43	562.30	1261.47	996.45	7.35	244.85	0.40	73.99	5888.23	-5695.80	2872.69
Fixation L	1	9	3060829645	3060988750	159105	1263.90	945.78	12	83	-1	10.20	10.20
Fixation R	1	9	3060829645	3060988750	159105	1263.90	945.78	12	83	-1	11.82	11.82
Saccade L	1	9	3060988750	3061008620	19870	1266.09	970.84	1268.74	1051.26	0.93	81.39	1.00	46.76	1695.10	-1850.93	1287.38
Saccade R	1	9	3060988750	3061008620	19870	1266.09	970.84	1268.74	1051.26	0.93	81.39	1.00	46.76	1695.10	-1850.93	1287.38
Fixation L	1	10	3061008620	3061227486	218866	1277.02	1005.69	20	72	-1	10.64	10.64
Fixation R	1	10	3061008620	3061227486	218866	1277.02	1005.69	20	72	-1	12.17	12.17
Saccade L	1	10	3061227486	3061247358	19872	1288.63	997.17	1296.38	972.03	0.25	26.61	1.00	12.39	470.36	-400.25	335.53
Saccade R	1	10	3061227486	3061247358	19872	1288.63	997.17	1296.38	972.03	0.25	26.61	1.00	12.39	470.36	-400.25	335.53
Fixation L	1	11	3061247358	3061645208	397850	1281.77	980.51	37	49	-1	11.09	11.09
Fixation R	1	11	3061247358	3061645208	397850	1281.77	980.51	37	49	-1	12.60	12.60
Saccade L	1	11	3061645208	3061764452	119244	1296.17	960.90	1115.54	496.32	8.61	298.09	0.83	72.17	7029.68	-6968.00	2527.06
Saccade R	1	11	3061645208	3061764452	119244	1296.17	960.90	1115.54	496.32	8.61	298.09	0.83	72.17	7029.68	-6968.00	2527.06
Fixation L	1	12	3061764452	3061903704	139252	1111.24	481.58	28	33	-1	10.75	10.75
Fixation R	1	12	3061764452	3061903704	139252	1111.24	481.58	28	33	-1	12.21	12.21
Saccade L	1	12	3061903704	3061923569	19865	1092.61	462.80	879.61	372.02	1.50	234.11	1.00	75.72	5618.33	-5336.27	3820.17
Saccade R	1	12	3061903704	3061923569	19865	1092.61	462.80	879.61	372.02	1.50	234.11	1.00	75.72	5618.33	-5336.27	3820.17
Fixation L	1	13	3061923569	3062261806	338237	853.76	335.04	36	53	-1	9.90	9.90
Fixation R	1	13	3061923569	3062261806	338237	853.76	335.04	36	53	-1	11.58	11.58
Saccade L	1	13	3062261806	3062281695	19889	843.40	318.48	710.05	322.42	1.00	134.94	1.00	50.07	3122.89	-2982.71	2216.18
Saccade R	1	13	3062261806	3062281695	19889	843.40	318.48	710.05	322.42	1.00	134.94	1.00	50.07	3122.89	-2982.71	2216.18
Fixation L	1	14	3062281695	3062460688	178993	688.49	332.48	38	22	-1	9.15	9.15
Fixation R	1	14	3062281695	3062460688	178993	688.49	332.48	38	22	-1	11.14	11.14
Saccade L	1	14	3062460688	3062540163	79475	686.10	342.74	876.77	295.05	22.76	927.65	1.00	286.32	23191.19	-19279.41	12344.90
Saccade R	1	14	3062460688	3062540163	79475	686.10	342.74	876.77	295.05	22.76	927.65	1.00	286.32	23191.19	-19279.41	12344.90
