[BeGaze]
Converted from:	C:\Documents and Settings\iViewX\Desktop\EXPERIMENTATIONS\Experiments\results\finaleart\S22H22551-finaleart-1.idf
Date:	27.03.2019 15:58:28
Version:	BeGaze 2.5.77
Sample Rate:	50
Subject:	S22H22551
Description:	Mathieu Chambre

Table Header for Fixations:
Event Type	Trial	Number	Start	End	Duration	Location X	Location Y	Dispersion X	Dispersion Y	Plane	Avg. Pupil Size X	Avg. Pupil Size Y

Table Header for Saccades:
Event Type	Trial	Number	Start	End	Duration	Start Loc.X	Start Loc.Y	End Loc.X	End Loc.Y	Amplitude	Peak Speed	Peak Speed At	Average Speed	Peak Accel.	Peak Decel.	Average Accel.

Table Header for Blinks:
Event Type	Trial	Number	Start	End	Duration

Table Header for User Events:
Event Type	Trial	Number	Start	Description

UserEvent	1	1	5584994672	# Message: les_poseuses_seurat_1888.jpg
Fixation L	1	1	5585012196	5585290680	278484	1009.27	495.77	62	24	-1	18.18	18.18
Fixation R	1	1	5585012196	5585290680	278484	1009.27	495.77	62	24	-1	18.12	18.12
Saccade L	1	1	5585290680	5585310552	19872	994.36	487.20	974.04	481.25	0.20	21.42	1.00	9.90	478.25	-365.18	346.17
Saccade R	1	1	5585290680	5585310552	19872	994.36	487.20	974.04	481.25	0.20	21.42	1.00	9.90	478.25	-365.18	346.17
Fixation L	1	2	5585310552	5585449810	139258	955.72	472.92	28	15	-1	18.30	18.30
Fixation R	1	2	5585310552	5585449810	139258	955.72	472.92	28	15	-1	18.01	18.01
Saccade L	1	2	5585449810	5585469680	19870	946.53	466.06	956.10	249.18	1.48	219.51	1.00	74.69	5333.15	-5327.67	4142.52
Saccade R	1	2	5585449810	5585469680	19870	946.53	466.06	956.10	249.18	1.48	219.51	1.00	74.69	5333.15	-5327.67	4142.52
Fixation L	1	3	5585469680	5585648665	178985	964.88	193.10	24	70	-1	16.80	16.80
Fixation R	1	3	5585469680	5585648665	178985	964.88	193.10	24	70	-1	16.55	16.55
Saccade L	1	3	5585648665	5585668538	19873	975.86	198.33	980.61	200.09	0.10	10.38	0.00	4.97	41.27	-236.92	121.36
Saccade R	1	3	5585648665	5585668538	19873	975.86	198.33	980.61	200.09	0.10	10.38	0.00	4.97	41.27	-236.92	121.36
Fixation L	1	4	5585668538	5585807795	139257	983.59	209.00	11	23	-1	15.00	15.00
Fixation R	1	4	5585668538	5585807795	139257	983.59	209.00	11	23	-1	14.77	14.77
Saccade L	1	4	5585807795	5585847549	39754	992.57	223.13	1415.94	469.95	4.13	344.32	0.50	103.84	8518.35	-8444.89	6049.03
Saccade R	1	4	5585807795	5585847549	39754	992.57	223.13	1415.94	469.95	4.13	344.32	0.50	103.84	8518.35	-8444.89	6049.03
Fixation L	1	5	5585847549	5586046393	198844	1418.84	477.05	6	24	-1	14.85	14.85
Fixation R	1	5	5585847549	5586046393	198844	1418.84	477.05	6	24	-1	14.85	14.85
Saccade L	1	5	5586046393	5586086273	39880	1416.76	489.45	1408.54	804.25	2.63	183.50	1.00	66.04	4523.11	-4351.60	3850.28
Saccade R	1	5	5586046393	5586086273	39880	1416.76	489.45	1408.54	804.25	2.63	183.50	1.00	66.04	4523.11	-4351.60	3850.28
Fixation L	1	6	5586086273	5586265255	178982	1395.66	816.74	18	19	-1	14.94	14.94
Fixation R	1	6	5586086273	5586265255	178982	1395.66	816.74	18	19	-1	14.47	14.47
Saccade L	1	6	5586265255	5586285137	19882	1391.99	822.79	1519.61	850.24	0.89	132.04	1.00	44.63	3131.31	-2991.11	2330.14
Saccade R	1	6	5586265255	5586285137	19882	1391.99	822.79	1519.61	850.24	0.89	132.04	1.00	44.63	3131.31	-2991.11	2330.14
Fixation L	1	7	5586285137	5586444242	159105	1496.79	878.66	31	37	-1	15.11	15.11
Fixation R	1	7	5586285137	5586444242	159105	1496.79	878.66	31	37	-1	14.38	14.38
Saccade L	1	7	5586444242	5586464125	19883	1493.61	884.15	1491.57	810.95	0.52	74.07	1.00	26.03	1793.14	-1716.21	1348.77
Saccade R	1	7	5586444242	5586464125	19883	1493.61	884.15	1491.57	810.95	0.52	74.07	1.00	26.03	1793.14	-1716.21	1348.77
Fixation L	1	8	5586464125	5586762483	298358	1488.15	812.61	8	34	-1	15.24	15.24
Fixation R	1	8	5586464125	5586762483	298358	1488.15	812.61	8	34	-1	14.42	14.42
Saccade L	1	8	5586762483	5586802229	39746	1489.67	800.40	1589.53	335.40	3.93	369.07	0.50	98.98	9193.54	-9040.44	5846.28
Saccade R	1	8	5586762483	5586802229	39746	1489.67	800.40	1589.53	335.40	3.93	369.07	0.50	98.98	9193.54	-9040.44	5846.28
Fixation L	1	9	5586802229	5587001218	198989	1579.30	365.15	31	60	-1	14.92	14.92
Fixation R	1	9	5586802229	5587001218	198989	1579.30	365.15	31	60	-1	14.15	14.15
Saccade L	1	9	5587001218	5587060851	59633	1569.35	385.64	797.17	891.49	10.29	354.79	0.67	172.52	8588.22	-6963.30	6244.19
Saccade R	1	9	5587001218	5587060851	59633	1569.35	385.64	797.17	891.49	10.29	354.79	0.67	172.52	8588.22	-6963.30	6244.19
Fixation L	1	10	5587060851	5587180212	119361	729.27	892.20	83	14	-1	15.35	15.35
Fixation R	1	10	5587060851	5587180212	119361	729.27	892.20	83	14	-1	15.08	15.08
Saccade L	1	10	5587180212	5587200084	19872	713.82	885.80	710.53	887.65	0.08	4.56	1.00	3.86	32.82	-88.05	40.34
Saccade R	1	10	5587180212	5587200084	19872	713.82	885.80	710.53	887.65	0.08	4.56	1.00	3.86	32.82	-88.05	40.34
Fixation L	1	11	5587200084	5587319458	119374	707.74	886.02	4	2	-1	15.52	15.52
Fixation R	1	11	5587200084	5587319458	119374	707.74	886.02	4	2	-1	15.43	15.43
Saccade L	1	11	5587319458	5587339329	19871	706.95	885.67	584.12	903.92	0.73	125.60	1.00	36.53	3121.60	-2921.31	2156.04
Saccade R	1	11	5587319458	5587339329	19871	706.95	885.67	584.12	903.92	0.73	125.60	1.00	36.53	3121.60	-2921.31	2156.04
Fixation L	1	12	5587339329	5587538193	198864	558.73	927.75	33	36	-1	15.00	15.00
Fixation R	1	12	5587339329	5587538193	198864	558.73	927.75	33	36	-1	15.14	15.14
Saccade L	1	12	5587538193	5587577937	39744	550.89	940.37	373.55	570.70	3.44	225.45	0.50	86.53	5528.70	-5438.75	5059.54
Saccade R	1	12	5587538193	5587577937	39744	550.89	940.37	373.55	570.70	3.44	225.45	0.50	86.53	5528.70	-5438.75	5059.54
Fixation L	1	13	5587577937	5587776937	199000	372.96	578.11	26	14	-1	14.90	14.90
Fixation R	1	13	5587577937	5587776937	199000	372.96	578.11	26	14	-1	15.23	15.23
Saccade L	1	13	5587776937	5587796804	19867	379.01	585.41	399.06	341.28	1.28	247.64	1.00	64.46	6090.39	-5683.97	3940.18
Saccade R	1	13	5587776937	5587796804	19867	379.01	585.41	399.06	341.28	1.28	247.64	1.00	64.46	6090.39	-5683.97	3940.18
Fixation L	1	14	5587796804	5587975797	178993	422.23	355.70	41	33	-1	14.87	14.87
Fixation R	1	14	5587796804	5587975797	178993	422.23	355.70	41	33	-1	15.16	15.16
Saccade L	1	14	5587975797	5588055284	79487	438.32	366.27	574.35	118.69	4.74	177.54	0.25	59.64	4167.74	-3431.72	2284.49
Saccade R	1	14	5587975797	5588055284	79487	438.32	366.27	574.35	118.69	4.74	177.54	0.25	59.64	4167.74	-3431.72	2284.49
Fixation L	1	15	5588055284	5588254279	198995	554.34	167.63	30	66	-1	15.24	15.24
Fixation R	1	15	5588055284	5588254279	198995	554.34	167.63	30	66	-1	15.76	15.76
Saccade L	1	15	5588254279	5588274146	19867	546.43	185.03	545.19	190.65	0.09	6.91	0.00	4.44	86.33	-116.24	93.00
Saccade R	1	15	5588254279	5588274146	19867	546.43	185.03	545.19	190.65	0.09	6.91	0.00	4.44	86.33	-116.24	93.00
Fixation L	1	16	5588274146	5588373524	99378	548.29	193.55	32	12	-1	15.71	15.71
Fixation R	1	16	5588274146	5588373524	99378	548.29	193.55	32	12	-1	15.93	15.93
Saccade L	1	16	5588373524	5588393536	20012	570.38	196.06	614.78	423.64	1.66	234.44	1.00	83.13	5445.00	-5664.75	4057.32
Saccade R	1	16	5588373524	5588393536	20012	570.38	196.06	614.78	423.64	1.66	234.44	1.00	83.13	5445.00	-5664.75	4057.32
Fixation L	1	17	5588393536	5588691757	298221	638.59	458.45	28	58	-1	16.44	16.44
Fixation R	1	17	5588393536	5588691757	298221	638.59	458.45	28	58	-1	16.52	16.52
Saccade L	1	17	5588691757	5588731633	39876	640.67	452.51	936.83	308.99	2.88	300.76	1.00	72.25	7505.27	-7249.64	3980.59
Saccade R	1	17	5588691757	5588731633	39876	640.67	452.51	936.83	308.99	2.88	300.76	1.00	72.25	7505.27	-7249.64	3980.59
Fixation L	1	18	5588731633	5588930496	198863	944.34	280.40	31	61	-1	15.94	15.94
Fixation R	1	18	5588731633	5588930496	198863	944.34	280.40	31	61	-1	16.15	16.15
Saccade L	1	18	5588930496	5589029994	99498	960.31	247.91	981.32	232.51	1.24	33.70	1.00	12.48	227.16	-614.49	204.41
Saccade R	1	18	5588930496	5589029994	99498	960.31	247.91	981.32	232.51	1.24	33.70	1.00	12.48	227.16	-614.49	204.41
