[BeGaze]
Converted from:	C:\Documents and Settings\iViewX\Desktop\EXPERIMENTATIONS\Experiments\results\finaleart\S22H22551-finaleart-1.idf
Date:	27.03.2019 15:57:43
Version:	BeGaze 2.5.77
Sample Rate:	50
Subject:	S22H22551
Description:	Mathieu Chambre

Table Header for Fixations:
Event Type	Trial	Number	Start	End	Duration	Location X	Location Y	Dispersion X	Dispersion Y	Plane	Avg. Pupil Size X	Avg. Pupil Size Y

Table Header for Saccades:
Event Type	Trial	Number	Start	End	Duration	Start Loc.X	Start Loc.Y	End Loc.X	End Loc.Y	Amplitude	Peak Speed	Peak Speed At	Average Speed	Peak Accel.	Peak Decel.	Average Accel.

Table Header for Blinks:
Event Type	Trial	Number	Start	End	Duration

Table Header for User Events:
Event Type	Trial	Number	Start	Description

UserEvent	1	1	5155991222	# Message: Nu_Couche_Vlaminck_1905.jpg
Saccade L	1	1	5156001900	5156041780	39880	1085.75	443.50	923.28	444.64	1.94	155.43	1.00	48.56	3885.78	-3819.13	2048.71
Saccade R	1	1	5156001900	5156041780	39880	1085.75	443.50	923.28	444.64	1.94	155.43	1.00	48.56	3885.78	-3819.13	2048.71
Fixation L	1	1	5156041780	5156141162	99382	930.66	411.35	18	52	-1	18.29	18.29
Fixation R	1	1	5156041780	5156141162	99382	930.66	411.35	18	52	-1	18.39	18.39
Saccade L	1	2	5156141162	5156161178	20016	942.08	391.93	1000.48	413.25	0.54	62.89	1.00	26.95	1227.35	-427.31	712.26
Saccade R	1	2	5156141162	5156161178	20016	942.08	391.93	1000.48	413.25	0.54	62.89	1.00	26.95	1227.35	-427.31	712.26
Fixation L	1	2	5156161178	5156260506	99328	964.97	408.96	59	36	-1	18.47	18.47
Fixation R	1	2	5156161178	5156260506	99328	964.97	408.96	59	36	-1	18.40	18.40
Saccade L	1	3	5156260506	5156280388	19882	965.65	424.61	979.75	431.47	0.32	35.64	1.00	16.09	-137.46	-494.40	281.30
Saccade R	1	3	5156260506	5156280388	19882	965.65	424.61	979.75	431.47	0.32	35.64	1.00	16.09	-137.46	-494.40	281.30
Fixation L	1	3	5156280388	5156459379	178991	976.12	436.00	11	15	-1	18.73	18.73
Fixation R	1	3	5156280388	5156459379	178991	976.12	436.00	11	15	-1	18.72	18.72
Saccade L	1	4	5156459379	5156499126	39747	972.12	441.46	571.64	387.79	3.65	302.38	0.50	91.86	7169.05	-7143.24	4841.48
Saccade R	1	4	5156459379	5156499126	39747	972.12	441.46	571.64	387.79	3.65	302.38	0.50	91.86	7169.05	-7143.24	4841.48
Fixation L	1	4	5156499126	5157036224	537098	585.76	380.04	49	49	-1	14.66	14.66
Fixation R	1	4	5156499126	5157036224	537098	585.76	380.04	49	49	-1	14.78	14.78
Saccade L	1	5	5157036224	5157056092	19868	617.73	365.52	841.96	482.70	1.38	255.78	1.00	69.55	6354.37	-6328.34	4283.15
Saccade R	1	5	5157036224	5157056092	19868	617.73	365.52	841.96	482.70	1.38	255.78	1.00	69.55	6354.37	-6328.34	4283.15
Fixation L	1	5	5157056092	5157254959	198867	861.08	497.16	25	26	-1	13.35	13.35
Fixation R	1	5	5157056092	5157254959	198867	861.08	497.16	25	26	-1	13.77	13.77
Saccade L	1	6	5157254959	5157274831	19872	865.61	503.17	972.82	495.31	0.82	108.74	1.00	41.20	2659.28	-2608.54	2132.87
Saccade R	1	6	5157254959	5157274831	19872	865.61	503.17	972.82	495.31	0.82	108.74	1.00	41.20	2659.28	-2608.54	2132.87
Fixation L	1	6	5157274831	5157453818	178987	1027.08	497.05	68	16	-1	13.81	13.81
Fixation R	1	6	5157274831	5157453818	178987	1027.08	497.05	68	16	-1	13.70	13.70
Blink L	1	1	5157453818	5157712425	258607
Blink R	1	1	5157453818	5157712425	258607
Saccade L	1	7	5157712425	5157811922	99497	1318.52	528.43	1315.74	664.31	2.72	131.44	1.00	27.33	3238.91	-3136.13	1150.61
Saccade R	1	7	5157712425	5157811922	99497	1318.52	528.43	1315.74	664.31	2.72	131.44	1.00	27.33	3238.91	-3136.13	1150.61
Fixation L	1	7	5157811922	5157971045	159123	1308.09	659.25	14	13	-1	15.10	15.10
Fixation R	1	7	5157811922	5157971045	159123	1308.09	659.25	14	13	-1	15.09	15.09
Saccade L	1	8	5157971045	5158010797	39752	1301.38	661.82	1534.20	761.37	2.27	166.86	0.50	57.00	4107.65	-3858.68	3054.99
Saccade R	1	8	5157971045	5158010797	39752	1301.38	661.82	1534.20	761.37	2.27	166.86	0.50	57.00	4107.65	-3858.68	3054.99
Fixation L	1	8	5158010797	5158269281	258484	1523.72	776.08	15	42	-1	15.61	15.61
Fixation R	1	8	5158010797	5158269281	258484	1523.72	776.08	15	42	-1	15.16	15.16
Saccade L	1	9	5158269281	5158309157	39876	1518.41	791.85	1641.23	545.30	2.64	178.10	1.00	66.29	4392.02	-4394.42	3401.54
Saccade R	1	9	5158269281	5158309157	39876	1518.41	791.85	1641.23	545.30	2.64	178.10	1.00	66.29	4392.02	-4394.42	3401.54
Fixation L	1	9	5158309157	5158408651	99494	1637.24	569.54	5	32	-1	14.73	14.73
Fixation R	1	9	5158309157	5158408651	99494	1637.24	569.54	5	32	-1	14.32	14.32
Saccade L	1	10	5158408651	5158468266	59615	1635.31	566.84	1640.86	186.80	5.19	298.91	0.33	87.00	7395.10	-6065.60	4202.96
Saccade R	1	10	5158408651	5158468266	59615	1635.31	566.84	1640.86	186.80	5.19	298.91	0.33	87.00	7395.10	-6065.60	4202.96
Fixation L	1	10	5158468266	5158627381	159115	1641.22	214.36	41	46	-1	14.44	14.44
Fixation R	1	10	5158468266	5158627381	159115	1641.22	214.36	41	46	-1	14.07	14.07
Saccade L	1	11	5158627381	5158667133	39752	1626.36	233.26	1160.77	225.37	4.00	240.17	0.50	100.58	5761.41	-5551.69	5623.24
Saccade R	1	11	5158627381	5158667133	39752	1626.36	233.26	1160.77	225.37	4.00	240.17	0.50	100.58	5761.41	-5551.69	5623.24
Fixation L	1	11	5158667133	5158786504	119371	1152.15	205.42	16	55	-1	14.90	14.90
Fixation R	1	11	5158667133	5158786504	119371	1152.15	205.42	16	55	-1	14.63	14.63
Saccade L	1	12	5158786504	5159243990	457486	1154.75	173.47	291.35	557.62	27.35	384.04	0.13	59.79	8716.98	-9394.74	2334.71
Saccade R	1	12	5158786504	5159243990	457486	1154.75	173.47	291.35	557.62	27.35	384.04	0.13	59.79	8716.98	-9394.74	2334.71
Fixation L	1	12	5159243990	5159363221	119231	307.25	603.52	33	65	-1	15.58	15.58
Fixation R	1	12	5159243990	5159363221	119231	307.25	603.52	33	65	-1	15.91	15.91
Saccade L	1	13	5159363221	5159403109	39888	319.25	623.30	291.19	900.42	2.64	170.02	1.00	66.18	4171.01	-3798.02	3115.26
Saccade R	1	13	5159363221	5159403109	39888	319.25	623.30	291.19	900.42	2.64	170.02	1.00	66.18	4171.01	-3798.02	3115.26
Fixation L	1	13	5159403109	5159681582	278473	288.38	884.76	30	33	-1	15.29	15.29
Fixation R	1	13	5159403109	5159681582	278473	288.38	884.76	30	33	-1	16.17	16.17
Saccade L	1	14	5159681582	5159701452	19870	291.48	885.92	289.72	943.26	0.40	58.03	1.00	20.38	1335.09	-1245.41	881.43
Saccade R	1	14	5159681582	5159701452	19870	291.48	885.92	289.72	943.26	0.40	58.03	1.00	20.38	1335.09	-1245.41	881.43
Fixation L	1	14	5159701452	5159920190	218738	314.97	958.51	61	21	-1	15.29	15.29
Fixation R	1	14	5159701452	5159920190	218738	314.97	958.51	61	21	-1	16.21	16.21
Saccade L	1	15	5159920190	5159979937	59747	351.65	962.95	740.09	950.23	5.20	349.67	0.33	87.00	8625.91	-8277.20	4293.56
Saccade R	1	15	5159920190	5159979937	59747	351.65	962.95	740.09	950.23	5.20	349.67	0.33	87.00	8625.91	-8277.20	4293.56
