[BeGaze]
Converted from:	C:\Documents and Settings\iViewX\Desktop\EXPERIMENTATIONS\Experiments\results\finaleart\S14F27123-finaleart-1.idf
Date:	27.03.2019 15:43:13
Version:	BeGaze 2.5.77
Sample Rate:	50
Subject:	S14F27123
Description:	Anne-flore Perrin

Table Header for Fixations:
Event Type	Trial	Number	Start	End	Duration	Location X	Location Y	Dispersion X	Dispersion Y	Plane	Avg. Pupil Size X	Avg. Pupil Size Y

Table Header for Saccades:
Event Type	Trial	Number	Start	End	Duration	Start Loc.X	Start Loc.Y	End Loc.X	End Loc.Y	Amplitude	Peak Speed	Peak Speed At	Average Speed	Peak Accel.	Peak Decel.	Average Accel.

Table Header for Blinks:
Event Type	Trial	Number	Start	End	Duration

Table Header for User Events:
Event Type	Trial	Number	Start	Description

UserEvent	1	1	30658777468	# Message: huisje_aan_een_sloot_mauve_1888.jpg
Fixation L	1	1	30658795171	30659272511	477340	740.72	750.45	16	35	-1	13.73	13.73
Fixation R	1	1	30658795171	30659272511	477340	740.72	750.45	16	35	-1	14.01	14.01
Saccade L	1	1	30659272511	30659292383	19872	740.84	742.69	891.56	708.43	1.17	156.32	1.00	58.90	3669.75	-2710.57	2522.15
Saccade R	1	1	30659272511	30659292383	19872	740.84	742.69	891.56	708.43	1.17	156.32	1.00	58.90	3669.75	-2710.57	2522.15
Fixation L	1	2	30659292383	30659690112	397729	880.86	657.67	15	70	-1	11.16	11.16
Fixation R	1	2	30659292383	30659690112	397729	880.86	657.67	15	70	-1	10.95	10.95
Saccade L	1	2	30659690112	30659710114	20002	879.10	638.24	905.87	715.77	0.57	82.97	1.00	28.63	1989.30	-1467.40	1291.85
Saccade R	1	2	30659690112	30659710114	20002	879.10	638.24	905.87	715.77	0.57	82.97	1.00	28.63	1989.30	-1467.40	1291.85
Fixation L	1	3	30659710114	30660087972	377858	929.16	724.87	30	65	-1	11.06	11.06
Fixation R	1	3	30659710114	30660087972	377858	929.16	724.87	30	65	-1	10.98	10.98
Saccade L	1	3	30660087972	30660107842	19870	928.85	749.43	666.66	845.63	1.57	282.30	1.00	79.11	6961.52	-6710.81	4575.50
Saccade R	1	3	30660087972	30660107842	19870	928.85	749.43	666.66	845.63	1.57	282.30	1.00	79.11	6961.52	-6710.81	4575.50
Fixation L	1	4	30660107842	30660406200	298358	677.27	874.72	37	58	-1	17.67	17.67
Fixation R	1	4	30660107842	30660406200	298358	677.27	874.72	37	58	-1	11.83	11.83
Saccade L	1	4	30660406200	30660485824	79624	697.02	903.65	713.37	914.43	1.09	31.66	1.00	13.63	655.13	-480.78	308.26
Saccade R	1	4	30660406200	30660485824	79624	697.02	903.65	713.37	914.43	1.09	31.66	1.00	13.63	655.13	-480.78	308.26
Blink L	1	1	30660485824	30660585203	99379
Blink R	1	1	30660485824	30660585203	99379
Blink L	1	2	30660585203	30660684711	99508
Blink R	1	2	30660585203	30660684711	99508
Saccade L	1	5	30660684711	30660704565	19854	982.00	944.75	985.71	948.30	13.51	1357.72	1.00	680.28	37388.41	-33655.73	34939.37
Saccade R	1	5	30660684711	30660704565	19854	982.00	944.75	985.71	948.30	13.51	1357.72	1.00	680.28	37388.41	-33655.73	34939.37
Blink L	1	3	30660704565	30660804059	99494
Blink R	1	3	30660704565	30660804059	99494
Blink L	1	4	30660823931	30660923393	99462
Blink R	1	4	30660823931	30660923393	99462
Blink L	1	5	30660943310	30661022799	79489
Blink R	1	5	30660943310	30661022799	79489
Fixation L	1	5	30661042681	30661241542	198861	1025.85	772.21	9	61	-1	21.17	21.17
Fixation R	1	5	30661042681	30661241542	198861	1025.85	772.21	9	61	-1	12.33	12.33
Blink L	1	6	30661241542	30661400782	159240
Blink R	1	6	30661241542	30661400782	159240
Fixation L	1	6	30661400782	30661540035	139253	1648.69	1065.03	34	9	-1	24.58	24.58
Fixation R	1	6	30661400782	30661540035	139253	1648.69	1065.03	34	9	-1	12.55	12.55
Blink L	1	7	30661540035	30661619523	79488
Blink R	1	7	30661540035	30661619523	79488
Fixation L	1	7	30661619523	30661738892	119369	1470.74	535.13	34	12	-1	12.71	12.71
Fixation R	1	7	30661619523	30661738892	119369	1470.74	535.13	34	12	-1	12.35	12.35
Saccade L	1	6	30661738892	30661778650	39758	1481.28	534.15	874.45	582.29	5.20	325.05	0.50	130.88	7999.62	-7307.79	7369.31
Saccade R	1	6	30661738892	30661778650	39758	1481.28	534.15	874.45	582.29	5.20	325.05	0.50	130.88	7999.62	-7307.79	7369.31
Fixation L	1	8	30661778650	30662077011	298361	848.16	597.67	40	33	-1	12.55	12.55
Fixation R	1	8	30661778650	30662077011	298361	848.16	597.67	40	33	-1	12.42	12.42
Saccade L	1	7	30662077011	30662096879	19868	834.53	589.73	720.37	601.14	0.65	116.04	1.00	32.54	2774.16	-2659.70	1861.42
Saccade R	1	7	30662077011	30662096879	19868	834.53	589.73	720.37	601.14	0.65	116.04	1.00	32.54	2774.16	-2659.70	1861.42
Fixation L	1	9	30662096879	30662534486	437607	719.69	627.46	8	45	-1	11.91	11.91
Fixation R	1	9	30662096879	30662534486	437607	719.69	627.46	8	45	-1	12.09	12.09
Saccade L	1	8	30662534486	30662574236	39750	719.53	636.32	1039.72	502.87	3.21	191.69	1.00	80.84	4727.46	-4740.62	4317.86
Saccade R	1	8	30662534486	30662574236	39750	719.53	636.32	1039.72	502.87	3.21	191.69	1.00	80.84	4727.46	-4740.62	4317.86
Fixation L	1	10	30662574236	30662733369	159133	1039.50	537.25	1	47	-1	12.20	12.20
Fixation R	1	10	30662574236	30662733369	159133	1039.50	537.25	1	47	-1	12.03	12.03
Saccade L	1	9	30662733369	30662773098	39729	1039.25	534.49	1242.67	534.50	2.12	186.76	0.50	53.34	4561.12	0.00	1663.74
Saccade R	1	9	30662733369	30662773098	39729	1039.25	534.49	1242.67	534.50	2.12	186.76	0.50	53.34	4561.12	0.00	1663.74
