[BeGaze]
Converted from:	C:\Documents and Settings\iViewX\Desktop\EXPERIMENTATIONS\Experiments\results\finaleart\S7121223-finaleart-1.idf
Date:	27.03.2019 15:37:26
Version:	BeGaze 2.5.77
Sample Rate:	50
Subject:	S7121223
Description:	Gregoire pacreau

Table Header for Fixations:
Event Type	Trial	Number	Start	End	Duration	Location X	Location Y	Dispersion X	Dispersion Y	Plane	Avg. Pupil Size X	Avg. Pupil Size Y

Table Header for Saccades:
Event Type	Trial	Number	Start	End	Duration	Start Loc.X	Start Loc.Y	End Loc.X	End Loc.Y	Amplitude	Peak Speed	Peak Speed At	Average Speed	Peak Accel.	Peak Decel.	Average Accel.

Table Header for Blinks:
Event Type	Trial	Number	Start	End	Duration

Table Header for User Events:
Event Type	Trial	Number	Start	Description

UserEvent	1	1	5554757385	# Message: reclining-nude_renoir_1883.jpg
Fixation L	1	1	5554765473	5555023954	258481	686.87	656.98	74	17	-1	14.08	14.08
Fixation R	1	1	5554765473	5555023954	258481	686.87	656.98	74	17	-1	14.41	14.41
Saccade L	1	1	5555023954	5555043844	19890	748.07	646.10	758.12	643.34	0.35	39.08	1.00	17.85	-139.80	-713.44	365.80
Saccade R	1	1	5555023954	5555043844	19890	748.07	646.10	758.12	643.34	0.35	39.08	1.00	17.85	-139.80	-713.44	365.80
Fixation L	1	2	5555043844	5555183098	139254	764.48	633.83	9	16	-1	13.85	13.85
Fixation R	1	2	5555043844	5555183098	139254	764.48	633.83	9	16	-1	14.14	14.14
Saccade L	1	2	5555183098	5555222810	39712	765.99	629.07	739.62	341.57	2.44	173.59	1.00	61.46	4290.89	-3951.35	3469.74
Saccade R	1	2	5555183098	5555222810	39712	765.99	629.07	739.62	341.57	2.44	173.59	1.00	61.46	4290.89	-3951.35	3469.74
Fixation L	1	3	5555222810	5555700172	477362	750.91	329.72	47	49	-1	12.46	12.46
Fixation R	1	3	5555222810	5555700172	477362	750.91	329.72	47	49	-1	12.12	12.12
Saccade L	1	3	5555700172	5555720162	19990	769.53	302.88	769.15	298.24	0.07	5.42	1.00	3.67	18.76	-22.67	19.74
Saccade R	1	3	5555700172	5555720162	19990	769.53	302.88	769.15	298.24	0.07	5.42	1.00	3.67	18.76	-22.67	19.74
Fixation L	1	4	5555720162	5556694739	974577	778.27	331.85	24	69	-1	12.76	12.76
Fixation R	1	4	5555720162	5556694739	974577	778.27	331.85	24	69	-1	12.19	12.19
Saccade L	1	4	5556694739	5556794106	99367	768.50	334.79	649.40	342.76	2.46	84.43	1.00	24.75	1757.67	-1968.35	877.69
Saccade R	1	4	5556694739	5556794106	99367	768.50	334.79	649.40	342.76	2.46	84.43	1.00	24.75	1757.67	-1968.35	877.69
Fixation L	1	5	5556794106	5556973105	178999	611.19	335.89	52	17	-1	14.17	14.17
Fixation R	1	5	5556794106	5556973105	178999	611.19	335.89	52	17	-1	13.92	13.92
Saccade L	1	5	5556973105	5557012851	39746	605.49	336.51	440.68	332.86	1.50	97.17	1.00	37.78	2278.55	-2298.22	1932.95
Saccade R	1	5	5556973105	5557012851	39746	605.49	336.51	440.68	332.86	1.50	97.17	1.00	37.78	2278.55	-2298.22	1932.95
Fixation L	1	6	5557012851	5557231713	218862	449.97	325.96	34	12	-1	14.01	14.01
Fixation R	1	6	5557012851	5557231713	218862	449.97	325.96	34	12	-1	13.81	13.81
Saccade L	1	6	5557231713	5557251613	19900	475.41	323.31	725.77	319.01	1.60	253.14	1.00	80.19	6321.70	-6088.84	4251.73
Saccade R	1	6	5557231713	5557251613	19900	475.41	323.31	725.77	319.01	1.60	253.14	1.00	80.19	6321.70	-6088.84	4251.73
Fixation L	1	7	5557251613	5558146543	894930	775.40	324.33	59	38	-1	14.64	14.64
Fixation R	1	7	5557251613	5558146543	894930	775.40	324.33	59	38	-1	14.50	14.50
Saccade L	1	7	5558146543	5558166536	19993	777.14	345.64	777.85	352.08	0.12	13.17	0.00	6.19	108.35	-259.87	132.25
Saccade R	1	7	5558146543	5558166536	19993	777.14	345.64	777.85	352.08	0.12	13.17	0.00	6.19	108.35	-259.87	132.25
Fixation L	1	8	5558166536	5558743255	576719	780.28	340.15	12	55	-1	15.05	15.05
Fixation R	1	8	5558166536	5558743255	576719	780.28	340.15	12	55	-1	15.00	15.00
