[BeGaze]
Converted from:	C:\Documents and Settings\iViewX\Desktop\EXPERIMENTATIONS\Experiments\results\finaleart\S6124332-finaleart-1.idf
Date:	27.03.2019 15:36:04
Version:	BeGaze 2.5.77
Sample Rate:	50
Subject:	S6124332
Description:	Romain Ferrand

Table Header for Fixations:
Event Type	Trial	Number	Start	End	Duration	Location X	Location Y	Dispersion X	Dispersion Y	Plane	Avg. Pupil Size X	Avg. Pupil Size Y

Table Header for Saccades:
Event Type	Trial	Number	Start	End	Duration	Start Loc.X	Start Loc.Y	End Loc.X	End Loc.Y	Amplitude	Peak Speed	Peak Speed At	Average Speed	Peak Accel.	Peak Decel.	Average Accel.

Table Header for Blinks:
Event Type	Trial	Number	Start	End	Duration

Table Header for User Events:
Event Type	Trial	Number	Start	Description

UserEvent	1	1	12304165012	# Message: void.jpg
Fixation L	1	1	12304176724	12304296086	119362	917.31	524.88	35	4	-1	17.42	17.42
Fixation R	1	1	12304176724	12304296086	119362	917.31	524.88	35	4	-1	17.28	17.28
Saccade L	1	1	12304296086	12304316125	20039	892.18	524.17	789.93	497.63	0.70	106.85	1.00	34.91	2621.28	-2563.32	1918.57
Saccade R	1	1	12304296086	12304316125	20039	892.18	524.17	789.93	497.63	0.70	106.85	1.00	34.91	2621.28	-2563.32	1918.57
Fixation L	1	2	12304316125	12305210907	894782	790.39	481.26	20	56	-1	18.11	18.11
Fixation R	1	2	12304316125	12305210907	894782	790.39	481.26	20	56	-1	17.50	17.50
Saccade L	1	2	12305210907	12305230907	20000	791.28	496.45	840.80	500.52	0.52	50.27	1.00	25.84	737.96	-791.18	688.81
Saccade R	1	2	12305210907	12305230907	20000	791.28	496.45	840.80	500.52	0.52	50.27	1.00	25.84	737.96	-791.18	688.81
Fixation L	1	3	12305230907	12305688373	457466	835.93	530.08	27	48	-1	19.05	19.05
Fixation R	1	3	12305230907	12305688373	457466	835.93	530.08	27	48	-1	18.45	18.45
Saccade L	1	3	12305688373	12305708239	19866	840.33	546.37	926.00	547.37	0.63	86.67	1.00	31.50	2133.94	-1955.69	1540.45
Saccade R	1	3	12305688373	12305708239	19866	840.33	546.37	926.00	547.37	0.63	86.67	1.00	31.50	2133.94	-1955.69	1540.45
Fixation L	1	4	12305708239	12306165734	457495	947.84	589.85	26	52	-1	19.24	19.24
Fixation R	1	4	12305708239	12306165734	457495	947.84	589.85	26	52	-1	19.10	19.10
