[BeGaze]
Converted from:	C:\Documents and Settings\iViewX\Desktop\EXPERIMENTATIONS\Experiments\results\finaleart\S20H24222-finaleart-1.idf
Date:	27.03.2019 15:54:04
Version:	BeGaze 2.5.77
Sample Rate:	50
Subject:	S20H24222
Description:	Hugo Brument

Table Header for Fixations:
Event Type	Trial	Number	Start	End	Duration	Location X	Location Y	Dispersion X	Dispersion Y	Plane	Avg. Pupil Size X	Avg. Pupil Size Y

Table Header for Saccades:
Event Type	Trial	Number	Start	End	Duration	Start Loc.X	Start Loc.Y	End Loc.X	End Loc.Y	Amplitude	Peak Speed	Peak Speed At	Average Speed	Peak Accel.	Peak Decel.	Average Accel.

Table Header for Blinks:
Event Type	Trial	Number	Start	End	Duration

Table Header for User Events:
Event Type	Trial	Number	Start	Description

UserEvent	1	1	12317540885	# Message: garlic-cloves-and-knife-on-the-corner-of-a-table_caillebotte_1871.jpg
Fixation L	1	1	12317542375	12318139090	596715	920.34	666.50	10	40	-1	12.19	12.19
Fixation R	1	1	12317542375	12318139090	596715	920.34	666.50	10	40	-1	13.27	13.27
Saccade L	1	1	12318139090	12318178838	39748	924.14	678.93	787.63	700.55	1.22	76.38	1.00	30.60	1870.88	-1795.79	1783.47
Saccade R	1	1	12318139090	12318178838	39748	924.14	678.93	787.63	700.55	1.22	76.38	1.00	30.60	1870.88	-1795.79	1783.47
Fixation L	1	2	12318178838	12318517079	338241	779.88	716.51	14	37	-1	11.50	11.50
Fixation R	1	2	12318178838	12318517079	338241	779.88	716.51	14	37	-1	12.81	12.81
Saccade L	1	2	12318517079	12318536952	19873	777.44	719.77	647.13	730.89	0.75	132.29	1.00	37.92	3113.25	-3182.23	2107.70
Saccade R	1	2	12318517079	12318536952	19873	777.44	719.77	647.13	730.89	0.75	132.29	1.00	37.92	3113.25	-3182.23	2107.70
Fixation L	1	3	12318536952	12318795459	258507	639.64	748.20	16	26	-1	11.92	11.92
Fixation R	1	3	12318536952	12318795459	258507	639.64	748.20	16	26	-1	13.16	13.16
Saccade L	1	3	12318795459	12318815314	19855	635.16	756.89	547.67	743.77	0.54	89.49	1.00	27.30	2185.06	-1816.62	1422.02
Saccade R	1	3	12318795459	12318815314	19855	635.16	756.89	547.67	743.77	0.54	89.49	1.00	27.30	2185.06	-1816.62	1422.02
Fixation L	1	4	12318815314	12319014304	198990	542.02	739.21	13	54	-1	11.78	11.78
Fixation R	1	4	12318815314	12319014304	198990	542.02	739.21	13	54	-1	13.27	13.27
Saccade L	1	4	12319014304	12319034180	19876	534.11	701.27	390.10	648.21	1.06	155.22	1.00	53.38	3721.39	-3608.77	2481.08
Saccade R	1	4	12319014304	12319034180	19876	534.11	701.27	390.10	648.21	1.06	155.22	1.00	53.38	3721.39	-3608.77	2481.08
Fixation L	1	5	12319034180	12319252919	218739	391.32	634.44	32	28	-1	11.67	11.67
Fixation R	1	5	12319034180	12319252919	218739	391.32	634.44	32	28	-1	13.44	13.44
Saccade L	1	5	12319252919	12319272796	19877	415.33	620.13	538.31	543.89	0.98	146.35	1.00	49.43	3570.35	-3313.17	2393.37
Saccade R	1	5	12319252919	12319272796	19877	415.33	620.13	538.31	543.89	0.98	146.35	1.00	49.43	3570.35	-3313.17	2393.37
Fixation L	1	6	12319272796	12319491649	218853	564.63	551.60	63	23	-1	11.77	11.77
Fixation R	1	6	12319272796	12319491649	218853	564.63	551.60	63	23	-1	13.53	13.53
Saccade L	1	6	12319491649	12319531404	39755	601.62	548.42	1116.99	696.26	4.73	363.13	0.50	119.10	9066.45	-8815.28	6486.42
Saccade R	1	6	12319491649	12319531404	39755	601.62	548.42	1116.99	696.26	4.73	363.13	0.50	119.10	9066.45	-8815.28	6486.42
Fixation L	1	7	12319531404	12319790020	258616	1101.40	711.87	21	41	-1	12.34	12.34
Fixation R	1	7	12319531404	12319790020	258616	1101.40	711.87	21	41	-1	13.48	13.48
Saccade L	1	7	12319790020	12319809893	19873	1095.87	719.88	1259.55	709.33	0.98	165.87	1.00	49.50	3945.01	-3720.60	2718.56
Saccade R	1	7	12319790020	12319809893	19873	1095.87	719.88	1259.55	709.33	0.98	165.87	1.00	49.50	3945.01	-3720.60	2718.56
Fixation L	1	8	12319809893	12320128129	318236	1272.08	683.12	18	38	-1	11.98	11.98
Fixation R	1	8	12319809893	12320128129	318236	1272.08	683.12	18	38	-1	13.03	13.03
Saccade L	1	8	12320128129	12320167878	39749	1278.00	670.62	1322.23	399.49	2.55	177.54	0.50	64.15	4307.00	-3807.74	3318.96
Saccade R	1	8	12320128129	12320167878	39749	1278.00	670.62	1322.23	399.49	2.55	177.54	0.50	64.15	4307.00	-3807.74	3318.96
Fixation L	1	9	12320167878	12320505991	338113	1335.04	393.75	24	36	-1	11.62	11.62
Fixation R	1	9	12320167878	12320505991	338113	1335.04	393.75	24	36	-1	12.29	12.29
Saccade L	1	9	12320505991	12320545861	39870	1324.02	407.58	863.75	402.87	4.10	253.10	1.00	102.84	5974.77	-6216.31	5484.34
Saccade R	1	9	12320505991	12320545861	39870	1324.02	407.58	863.75	402.87	4.10	253.10	1.00	102.84	5974.77	-6216.31	5484.34
Fixation L	1	10	12320545861	12320844093	298232	883.42	399.04	64	26	-1	11.79	11.79
Fixation R	1	10	12320545861	12320844093	298232	883.42	399.04	64	26	-1	12.77	12.77
Saccade L	1	10	12320844093	12320883969	39876	928.00	419.67	1222.66	741.32	4.23	365.56	0.50	106.17	9097.73	-8977.82	5478.37
Saccade R	1	10	12320844093	12320883969	39876	928.00	419.67	1222.66	741.32	4.23	365.56	0.50	106.17	9097.73	-8977.82	5478.37
Fixation L	1	11	12320883969	12321281701	397732	1238.25	738.10	39	31	-1	12.54	12.54
Fixation R	1	11	12320883969	12321281701	397732	1238.25	738.10	39	31	-1	13.37	13.37
Saccade L	1	11	12321281701	12321301580	19879	1209.54	762.07	1100.87	841.38	1.07	136.07	1.00	53.76	3245.24	-3237.07	2189.58
Saccade R	1	11	12321281701	12321301580	19879	1209.54	762.07	1100.87	841.38	1.07	136.07	1.00	53.76	3245.24	-3237.07	2189.58
Fixation L	1	12	12321301580	12321540327	238747	1085.40	874.32	24	43	-1	12.61	12.61
Fixation R	1	12	12321301580	12321540327	238747	1085.40	874.32	24	43	-1	12.93	12.93
