[BeGaze]
Converted from:	C:\Documents and Settings\iViewX\Desktop\EXPERIMENTATIONS\Experiments\results\finaleart\S13H22431-finaleart-1.idf
Date:	27.03.2019 15:41:56
Version:	BeGaze 2.5.77
Sample Rate:	50
Subject:	S13H22431
Description:	Jimmy Petit

Table Header for Fixations:
Event Type	Trial	Number	Start	End	Duration	Location X	Location Y	Dispersion X	Dispersion Y	Plane	Avg. Pupil Size X	Avg. Pupil Size Y

Table Header for Saccades:
Event Type	Trial	Number	Start	End	Duration	Start Loc.X	Start Loc.Y	End Loc.X	End Loc.Y	Amplitude	Peak Speed	Peak Speed At	Average Speed	Peak Accel.	Peak Decel.	Average Accel.

Table Header for Blinks:
Event Type	Trial	Number	Start	End	Duration

Table Header for User Events:
Event Type	Trial	Number	Start	Description

UserEvent	1	1	27912540796	# Message: void.jpg
Fixation L	1	1	27912551581	27912690807	139226	1302.73	302.32	33	42	-1	12.96	12.96
Fixation R	1	1	27912551581	27912690807	139226	1302.73	302.32	33	42	-1	13.75	13.75
Saccade L	1	1	27912690807	27912710683	19876	1327.96	325.56	1350.51	333.22	0.39	32.52	0.00	19.53	349.45	-528.56	322.67
Saccade R	1	1	27912690807	27912710683	19876	1327.96	325.56	1350.51	333.22	0.39	32.52	0.00	19.53	349.45	-528.56	322.67
Fixation L	1	2	27912710683	27912889715	179032	1373.25	334.66	31	20	-1	12.95	12.95
Fixation R	1	2	27912710683	27912889715	179032	1373.25	334.66	31	20	-1	13.41	13.41
Blink L	1	1	27912889715	27913068660	178945
Blink R	1	1	27912889715	27913068660	178945
Fixation L	1	3	27913068660	27913446524	377864	1056.74	254.37	15	30	-1	13.02	13.02
Fixation R	1	3	27913068660	27913446524	377864	1056.74	254.37	15	30	-1	13.79	13.79
Saccade L	1	2	27913446524	27913526145	79621	1061.61	269.49	835.15	897.22	8.15	238.26	0.50	102.33	5916.79	-4055.52	3099.05
Saccade R	1	2	27913446524	27913526145	79621	1061.61	269.49	835.15	897.22	8.15	238.26	0.50	102.33	5916.79	-4055.52	3099.05
Fixation L	1	4	27913526145	27913744892	218747	816.07	931.78	23	54	-1	14.47	14.47
Fixation R	1	4	27913526145	27913744892	218747	816.07	931.78	23	54	-1	15.74	15.74
Saccade L	1	3	27913744892	27913824504	79612	814.03	952.00	850.61	243.85	8.82	261.40	0.50	110.82	6245.23	-3488.21	3316.32
Saccade R	1	3	27913744892	27913824504	79612	814.03	952.00	850.61	243.85	8.82	261.40	0.50	110.82	6245.23	-3488.21	3316.32
Fixation L	1	5	27913824504	27914500727	676223	866.90	276.92	24	57	-1	13.24	13.24
Fixation R	1	5	27913824504	27914500727	676223	866.90	276.92	24	57	-1	14.25	14.25
