[BeGaze]
Converted from:	C:\Documents and Settings\iViewX\Desktop\EXPERIMENTATIONS\Experiments\results\finaleart\S18F56223-finaleart-1.idf
Date:	27.03.2019 15:49:16
Version:	BeGaze 2.5.77
Sample Rate:	50
Subject:	S18F56223
Description:	Pascale Sebillot

Table Header for Fixations:
Event Type	Trial	Number	Start	End	Duration	Location X	Location Y	Dispersion X	Dispersion Y	Plane	Avg. Pupil Size X	Avg. Pupil Size Y

Table Header for Saccades:
Event Type	Trial	Number	Start	End	Duration	Start Loc.X	Start Loc.Y	End Loc.X	End Loc.Y	Amplitude	Peak Speed	Peak Speed At	Average Speed	Peak Accel.	Peak Decel.	Average Accel.

Table Header for Blinks:
Event Type	Trial	Number	Start	End	Duration

Table Header for User Events:
Event Type	Trial	Number	Start	Description

UserEvent	1	1	2829633436	# Message: void.jpg
Fixation L	1	1	2829650846	2829969074	318228	1082.22	361.66	36	45	-1	13.29	13.29
Fixation R	1	1	2829650846	2829969074	318228	1082.22	361.66	36	45	-1	13.03	13.03
Saccade L	1	1	2829969074	2829988965	19891	1083.75	387.01	1078.22	409.21	0.26	23.14	1.00	13.14	318.66	-96.59	200.65
Saccade R	1	1	2829969074	2829988965	19891	1083.75	387.01	1078.22	409.21	0.26	23.14	1.00	13.14	318.66	-96.59	200.65
Fixation L	1	2	2829988965	2830267444	278479	1066.52	445.80	19	65	-1	13.52	13.52
Fixation R	1	2	2829988965	2830267444	278479	1066.52	445.80	19	65	-1	13.09	13.09
Saccade L	1	2	2830267444	2830307312	39868	1066.22	462.90	1023.09	594.45	1.44	106.88	1.00	36.15	2456.77	-2582.95	1799.53
Saccade R	1	2	2830267444	2830307312	39868	1066.22	462.90	1023.09	594.45	1.44	106.88	1.00	36.15	2456.77	-2582.95	1799.53
Fixation L	1	3	2830307312	2830545925	238613	1014.96	602.40	29	25	-1	13.56	13.56
Fixation R	1	3	2830307312	2830545925	238613	1014.96	602.40	29	25	-1	12.94	12.94
Saccade L	1	3	2830545925	2830724916	178991	1009.43	616.10	327.00	481.33	12.15	184.20	1.00	67.85	4430.10	-4457.37	2026.19
Saccade R	1	3	2830545925	2830724916	178991	1009.43	616.10	327.00	481.33	12.15	184.20	1.00	67.85	4430.10	-4457.37	2026.19
Fixation L	1	4	2830724916	2831083024	358108	312.07	496.46	26	34	-1	12.61	12.61
Fixation R	1	4	2830724916	2831083024	358108	312.07	496.46	26	34	-1	13.23	13.23
Saccade L	1	4	2831083024	2831142649	59625	322.93	497.69	973.15	605.36	6.86	314.11	0.33	115.00	7771.84	-5524.93	5368.45
Saccade R	1	4	2831083024	2831142649	59625	322.93	497.69	973.15	605.36	6.86	314.11	0.33	115.00	7771.84	-5524.93	5368.45
Fixation L	1	5	2831142649	2831401257	258608	955.51	599.54	38	19	-1	13.42	13.42
Fixation R	1	5	2831142649	2831401257	258608	955.51	599.54	38	19	-1	13.24	13.24
Saccade L	1	5	2831401257	2831421137	19880	935.02	606.46	891.18	589.44	0.44	47.57	1.00	22.26	1038.35	-931.39	778.69
Saccade R	1	5	2831401257	2831421137	19880	935.02	606.46	891.18	589.44	0.44	47.57	1.00	22.26	1038.35	-931.39	778.69
Fixation L	1	6	2831421137	2831620002	198865	886.07	595.64	22	20	-1	13.54	13.54
Fixation R	1	6	2831421137	2831620002	198865	886.07	595.64	22	20	-1	13.06	13.06
