[BeGaze]
Converted from:	C:\Documents and Settings\iViewX\Desktop\EXPERIMENTATIONS\Experiments\results\finaleart\S6124332-finaleart-1.idf
Date:	27.03.2019 15:35:40
Version:	BeGaze 2.5.77
Sample Rate:	50
Subject:	S6124332
Description:	Romain Ferrand

Table Header for Fixations:
Event Type	Trial	Number	Start	End	Duration	Location X	Location Y	Dispersion X	Dispersion Y	Plane	Avg. Pupil Size X	Avg. Pupil Size Y

Table Header for Saccades:
Event Type	Trial	Number	Start	End	Duration	Start Loc.X	Start Loc.Y	End Loc.X	End Loc.Y	Amplitude	Peak Speed	Peak Speed At	Average Speed	Peak Accel.	Peak Decel.	Average Accel.

Table Header for Blinks:
Event Type	Trial	Number	Start	End	Duration

Table Header for User Events:
Event Type	Trial	Number	Start	Description

UserEvent	1	1	11479993038	# Message: void.jpg
Saccade L	1	1	11479993337	11480033046	39709	994.24	767.79	1012.43	599.30	2.39	131.61	1.00	60.27	3290.16	-3059.67	1755.59
Saccade R	1	1	11479993337	11480033046	39709	994.24	767.79	1012.43	599.30	2.39	131.61	1.00	60.27	3290.16	-3059.67	1755.59
Fixation L	1	1	11480033046	11480590018	556972	1015.92	539.12	15	80	-1	18.54	18.54
Fixation R	1	1	11480033046	11480590018	556972	1015.92	539.12	15	80	-1	17.78	17.78
Blink L	1	1	11480590018	11480828628	238610
Saccade R	1	2	11480590018	11480709391	119373	1021.70	539.82	1128.20	770.40	5.56	137.01	0.33	46.61	3264.35	-3097.29	1477.62
Blink R	1	1	11480709391	11480928120	218729
Fixation L	1	2	11480888371	11481305975	417604	1270.83	1182.12	11	30	-1	19.51	19.51
Fixation R	1	2	11480928120	11481305975	377855	1270.13	1182.06	7	24	-1	18.38	18.38
Blink L	1	2	11481305975	11481405471	99496
Blink R	1	2	11481305975	11481405471	99496
Fixation L	1	3	11481405471	11481564583	159112	1414.55	1299.62	12	14	-1	19.47	19.47
Fixation R	1	3	11481405471	11481564583	159112	1414.55	1299.62	12	14	-1	17.81	17.81
Saccade L	1	2	11481624212	11481644204	19992	1414.46	1308.68	1413.37	1311.07	18.81	1879.76	1.00	940.63	46960.03	-46902.17	31309.49
Saccade R	1	3	11481624212	11481644204	19992	1414.46	1308.68	1413.37	1311.07	18.81	1879.76	1.00	940.63	46960.03	-46902.17	31309.49
Blink L	1	3	11481644204	11481843067	198863
Blink R	1	3	11481644204	11481843067	198863
Blink L	1	4	11481843067	11481922559	79492
Blink R	1	4	11481843067	11481922559	79492
