[BeGaze]
Converted from:	C:\Documents and Settings\iViewX\Desktop\EXPERIMENTATIONS\Experiments\results\finaleart\S13H22431-finaleart-1.idf
Date:	27.03.2019 15:42:38
Version:	BeGaze 2.5.77
Sample Rate:	50
Subject:	S13H22431
Description:	Jimmy Petit

Table Header for Fixations:
Event Type	Trial	Number	Start	End	Duration	Location X	Location Y	Dispersion X	Dispersion Y	Plane	Avg. Pupil Size X	Avg. Pupil Size Y

Table Header for Saccades:
Event Type	Trial	Number	Start	End	Duration	Start Loc.X	Start Loc.Y	End Loc.X	End Loc.Y	Amplitude	Peak Speed	Peak Speed At	Average Speed	Peak Accel.	Peak Decel.	Average Accel.

Table Header for Blinks:
Event Type	Trial	Number	Start	End	Duration

Table Header for User Events:
Event Type	Trial	Number	Start	Description

UserEvent	1	1	28450983916	# Message: void.jpg
Fixation L	1	1	28450990058	28451268394	278336	1128.03	480.02	18	38	-1	15.48	15.48
Fixation R	1	1	28450990058	28451268394	278336	1128.03	480.02	18	38	-1	16.16	16.16
Saccade L	1	1	28451268394	28451288278	19884	1112.99	493.10	954.10	505.10	0.94	161.15	1.00	47.18	3962.50	-3532.27	2500.35
Saccade R	1	1	28451268394	28451288278	19884	1112.99	493.10	954.10	505.10	0.94	161.15	1.00	47.18	3962.50	-3532.27	2500.35
Fixation L	1	2	28451288278	28451467390	179112	936.36	511.97	24	15	-1	15.55	15.55
Fixation R	1	2	28451288278	28451467390	179112	936.36	511.97	24	15	-1	16.21	16.21
Blink L	1	1	28451467390	28451666277	198887
Blink R	1	1	28451467390	28451666277	198887
Fixation L	1	3	28451666277	28451924879	258602	504.75	165.93	21	76	-1	14.68	14.68
Fixation R	1	3	28451666277	28451924879	258602	504.75	165.93	21	76	-1	15.29	15.29
Saccade L	1	2	28451924879	28452103869	178990	517.65	191.12	1423.26	196.97	14.13	219.27	0.89	78.92	5280.79	-5009.25	2889.15
Saccade R	1	2	28451924879	28452103869	178990	517.65	191.12	1423.26	196.97	14.13	219.27	0.89	78.92	5280.79	-5009.25	2889.15
Fixation L	1	4	28452103869	28452322611	218742	1441.19	212.03	45	22	-1	15.02	15.02
Fixation R	1	4	28452103869	28452322611	218742	1441.19	212.03	45	22	-1	15.90	15.90
Saccade L	1	3	28452322611	28452461851	139240	1468.79	219.73	940.74	510.05	10.80	286.28	0.86	77.60	6667.25	-6956.79	3027.54
Saccade R	1	3	28452322611	28452461851	139240	1468.79	219.73	940.74	510.05	10.80	286.28	0.86	77.60	6667.25	-6956.79	3027.54
Fixation L	1	5	28452461851	28452660718	198867	918.61	529.63	30	38	-1	15.35	15.35
Fixation R	1	5	28452461851	28452660718	198867	918.61	529.63	30	38	-1	16.13	16.13
Saccade L	1	4	28452660718	28452700595	39877	910.23	522.90	757.17	618.96	1.62	140.53	1.00	40.59	3388.09	-3446.32	2197.15
Saccade R	1	4	28452660718	28452700595	39877	910.23	522.90	757.17	618.96	1.62	140.53	1.00	40.59	3388.09	-3446.32	2197.15
Fixation L	1	6	28452700595	28452978949	278354	762.19	624.85	8	18	-1	15.15	15.15
Fixation R	1	6	28452700595	28452978949	278354	762.19	624.85	8	18	-1	16.29	16.29
