[BeGaze]
Converted from:	C:\Documents and Settings\iViewX\Desktop\EXPERIMENTATIONS\Experiments\results\finaleart\S9H29221-finaleart-1.idf
Date:	27.03.2019 16:02:49
Version:	BeGaze 2.5.77
Sample Rate:	50
Subject:	S9H29221
Description:	steven

Table Header for Fixations:
Event Type	Trial	Number	Start	End	Duration	Location X	Location Y	Dispersion X	Dispersion Y	Plane	Avg. Pupil Size X	Avg. Pupil Size Y

Table Header for Saccades:
Event Type	Trial	Number	Start	End	Duration	Start Loc.X	Start Loc.Y	End Loc.X	End Loc.Y	Amplitude	Peak Speed	Peak Speed At	Average Speed	Peak Accel.	Peak Decel.	Average Accel.

Table Header for Blinks:
Event Type	Trial	Number	Start	End	Duration

Table Header for User Events:
Event Type	Trial	Number	Start	Description

UserEvent	1	1	6025105349	# Message: Rochers_Sur_La_Cote_A_Agay_Guillaumin_1907.jpg
Saccade L	1	1	6025110781	6025170408	59627	1480.65	427.28	1499.11	423.81	0.70	35.73	1.00	11.69	853.05	-473.82	430.84
Saccade R	1	1	6025110781	6025170408	59627	1480.65	427.28	1499.11	423.81	0.70	35.73	1.00	11.69	853.05	-473.82	430.84
Blink L	1	1	6025170408	6025579389	408981
Blink R	1	1	6025170408	6025579389	408981
Fixation L	1	1	6025579389	6025687491	108102	1565.18	385.43	39	52	-1	16.16	16.16
Fixation R	1	1	6025579389	6025687491	108102	1565.18	385.43	39	52	-1	12.56	12.56
Saccade L	1	2	6025687491	6025846614	159123	1583.92	404.34	874.22	495.71	11.59	255.12	0.75	72.85	6256.28	-5327.79	2328.41
Saccade R	1	2	6025687491	6025846614	159123	1583.92	404.34	874.22	495.71	11.59	255.12	0.75	72.85	6256.28	-5327.79	2328.41
Fixation L	1	2	6025846614	6026011568	164954	876.69	496.79	9	17	-1	12.25	12.25
Fixation R	1	2	6025846614	6026011568	164954	876.69	496.79	9	17	-1	12.02	12.02
Saccade L	1	3	6026011568	6026045614	34046	883.07	493.86	871.59	634.20	1.30	142.41	1.00	38.26	3463.76	-3422.69	2296.91
Saccade R	1	3	6026011568	6026045614	34046	883.07	493.86	871.59	634.20	1.30	142.41	1.00	38.26	3463.76	-3422.69	2296.91
Fixation L	1	3	6026045614	6026324096	278482	846.83	628.14	46	15	-1	10.82	10.82
Fixation R	1	3	6026045614	6026324096	278482	846.83	628.14	46	15	-1	11.15	11.15
Saccade L	1	4	6026324096	6026363848	39752	824.75	621.38	992.75	430.68	2.36	215.58	1.00	59.49	5372.72	-5168.74	2961.92
Saccade R	1	4	6026324096	6026363848	39752	824.75	621.38	992.75	430.68	2.36	215.58	1.00	59.49	5372.72	-5168.74	2961.92
Fixation L	1	4	6026363848	6026662193	298345	1016.15	436.81	31	30	-1	9.89	9.89
Fixation R	1	4	6026363848	6026662193	298345	1016.15	436.81	31	30	-1	10.35	10.35
Saccade L	1	5	6026662193	6026682071	19878	1013.31	435.65	941.13	284.64	1.07	169.28	1.00	53.84	4170.71	-3759.28	2834.93
Saccade R	1	5	6026662193	6026682071	19878	1013.31	435.65	941.13	284.64	1.07	169.28	1.00	53.84	4170.71	-3759.28	2834.93
Fixation L	1	5	6026682071	6027258919	576848	922.79	259.61	33	41	-1	9.13	9.13
Fixation R	1	5	6026682071	6027258919	576848	922.79	259.61	33	41	-1	9.55	9.55
Saccade L	1	6	6027258919	6027298669	39750	918.78	274.80	1160.47	429.91	2.48	200.53	0.50	62.49	4976.43	-4680.76	3458.61
Saccade R	1	6	6027258919	6027298669	39750	918.78	274.80	1160.47	429.91	2.48	200.53	0.50	62.49	4976.43	-4680.76	3458.61
Fixation L	1	6	6027298669	6027577152	278483	1146.40	424.50	55	17	-1	9.22	9.22
Fixation R	1	6	6027298669	6027577152	278483	1146.40	424.50	55	17	-1	9.79	9.79
Saccade L	1	7	6027577152	6027616917	39765	1105.29	422.05	816.30	315.40	3.15	208.54	0.50	79.17	5161.80	-4892.68	3794.99
Saccade R	1	7	6027577152	6027616917	39765	1105.29	422.05	816.30	315.40	3.15	208.54	0.50	79.17	5161.80	-4892.68	3794.99
Fixation L	1	7	6027616917	6027835644	218727	818.62	328.11	26	49	-1	9.77	9.77
Fixation R	1	7	6027616917	6027835644	218727	818.62	328.11	26	49	-1	9.98	9.98
Saccade L	1	8	6027835644	6027855513	19869	802.06	290.05	782.33	275.46	0.45	34.34	0.00	22.70	79.73	-608.05	345.02
Saccade R	1	8	6027835644	6027855513	19869	802.06	290.05	782.33	275.46	0.45	34.34	0.00	22.70	79.73	-608.05	345.02
Fixation L	1	8	6027855513	6028173752	318239	773.55	266.88	13	18	-1	9.28	9.28
Fixation R	1	8	6027855513	6028173752	318239	773.55	266.88	13	18	-1	9.83	9.83
Saccade L	1	9	6028173752	6028213631	39879	773.87	260.82	698.17	660.34	3.56	225.68	1.00	89.36	5607.31	-5492.77	4884.26
Saccade R	1	9	6028173752	6028213631	39879	773.87	260.82	698.17	660.34	3.56	225.68	1.00	89.36	5607.31	-5492.77	4884.26
Fixation L	1	9	6028213631	6028531862	318231	691.08	711.72	32	67	-1	9.45	9.45
Fixation R	1	9	6028213631	6028531862	318231	691.08	711.72	32	67	-1	10.18	10.18
Saccade L	1	10	6028531862	6028551730	19868	689.33	725.87	675.31	702.66	0.23	27.43	1.00	11.63	615.40	-207.26	362.24
Saccade R	1	10	6028531862	6028551730	19868	689.33	725.87	675.31	702.66	0.23	27.43	1.00	11.63	615.40	-207.26	362.24
Fixation L	1	10	6028551730	6028850102	298372	661.47	668.63	19	40	-1	9.90	9.90
Fixation R	1	10	6028551730	6028850102	298372	661.47	668.63	19	40	-1	10.56	10.56
Saccade L	1	11	6028850102	6028889842	39740	656.31	662.71	914.07	847.01	2.66	171.57	1.00	66.91	4240.93	-3964.90	3859.29
Saccade R	1	11	6028850102	6028889842	39740	656.31	662.71	914.07	847.01	2.66	171.57	1.00	66.91	4240.93	-3964.90	3859.29
Fixation L	1	11	6028889842	6029148449	258607	912.73	860.53	18	22	-1	9.62	9.62
Fixation R	1	11	6028889842	6029148449	258607	912.73	860.53	18	22	-1	10.33	10.33
