[BeGaze]
Converted from:	C:\Documents and Settings\iViewX\Desktop\EXPERIMENTATIONS\Experiments\results\finaleart\S9H29221-finaleart-1.idf
Date:	27.03.2019 16:04:15
Version:	BeGaze 2.5.77
Sample Rate:	50
Subject:	S9H29221
Description:	steven

Table Header for Fixations:
Event Type	Trial	Number	Start	End	Duration	Location X	Location Y	Dispersion X	Dispersion Y	Plane	Avg. Pupil Size X	Avg. Pupil Size Y

Table Header for Saccades:
Event Type	Trial	Number	Start	End	Duration	Start Loc.X	Start Loc.Y	End Loc.X	End Loc.Y	Amplitude	Peak Speed	Peak Speed At	Average Speed	Peak Accel.	Peak Decel.	Average Accel.

Table Header for Blinks:
Event Type	Trial	Number	Start	End	Duration

Table Header for User Events:
Event Type	Trial	Number	Start	Description

UserEvent	1	1	6894393909	# Message: Courbet-Femme-nue-couchee-1862.jpg
Fixation L	1	1	6894401818	6894819413	417595	1304.59	341.13	60	33	-1	12.45	12.45
Fixation R	1	1	6894401818	6894819413	417595	1304.59	341.13	60	33	-1	11.15	11.15
Saccade L	1	1	6894819413	6894938838	119425	1301.74	331.02	861.47	484.01	8.83	216.58	0.67	73.90	3247.92	-5256.77	2557.14
Saccade R	1	1	6894819413	6894938838	119425	1301.74	331.02	861.47	484.01	8.83	216.58	0.67	73.90	3247.92	-5256.77	2557.14
Fixation L	1	2	6894938838	6895177518	238680	829.02	487.95	63	6	-1	12.01	12.01
Fixation R	1	2	6894938838	6895177518	238680	829.02	487.95	63	6	-1	11.09	11.09
Saccade L	1	2	6895177518	6895217278	39760	805.13	489.92	1178.19	546.49	3.27	194.10	0.50	82.18	4802.67	-4631.10	4619.79
Saccade R	1	2	6895177518	6895217278	39760	805.13	489.92	1178.19	546.49	3.27	194.10	0.50	82.18	4802.67	-4631.10	4619.79
Fixation L	1	3	6895217278	6895396271	178993	1188.72	551.97	13	22	-1	12.14	12.14
Fixation R	1	3	6895217278	6895396271	178993	1188.72	551.97	13	22	-1	11.13	11.13
Saccade L	1	3	6895396271	6895416359	20088	1191.40	551.88	1275.91	540.42	0.82	86.27	1.00	40.84	2122.76	-2017.60	1902.06
Saccade R	1	3	6895396271	6895416359	20088	1191.40	551.88	1275.91	540.42	0.82	86.27	1.00	40.84	2122.76	-2017.60	1902.06
Fixation L	1	4	6895416359	6895555400	139041	1337.54	523.28	76	22	-1	12.42	12.42
Fixation R	1	4	6895416359	6895555400	139041	1337.54	523.28	76	22	-1	11.30	11.30
Saccade L	1	4	6895555400	6895575261	19861	1352.10	518.28	1352.85	512.17	0.07	6.23	1.00	3.52	34.68	-84.38	45.37
Saccade R	1	4	6895555400	6895575261	19861	1352.10	518.28	1352.85	512.17	0.07	6.23	1.00	3.52	34.68	-84.38	45.37
Fixation L	1	5	6895575261	6895833869	258608	1357.40	507.06	7	11	-1	12.08	12.08
Fixation R	1	5	6895575261	6895833869	258608	1357.40	507.06	7	11	-1	10.88	10.88
Saccade L	1	5	6895833869	6895853734	19865	1358.19	503.36	1246.85	565.89	0.83	129.16	1.00	41.98	3168.75	-3186.09	2355.27
Saccade R	1	5	6895833869	6895853734	19865	1358.19	503.36	1246.85	565.89	0.83	129.16	1.00	41.98	3168.75	-3186.09	2355.27
Fixation L	1	6	6895853734	6896231721	377987	1216.79	576.99	69	30	-1	11.77	11.77
Fixation R	1	6	6895853734	6896231721	377987	1216.79	576.99	69	30	-1	10.56	10.56
Saccade L	1	6	6896231721	6896251617	19896	1180.19	572.92	1174.97	578.79	0.10	7.94	1.00	5.04	1.57	-151.55	56.22
Saccade R	1	6	6896231721	6896251617	19896	1180.19	572.92	1174.97	578.79	0.10	7.94	1.00	5.04	1.57	-151.55	56.22
Fixation L	1	7	6896251617	6896689098	437481	1180.85	588.63	28	28	-1	11.44	11.44
Fixation R	1	7	6896251617	6896689098	437481	1180.85	588.63	28	28	-1	10.36	10.36
Saccade L	1	7	6896689098	6896728943	39845	1176.25	607.41	949.70	710.94	2.50	179.81	0.50	62.75	4410.57	-3998.96	2912.07
Saccade R	1	7	6896689098	6896728943	39845	1176.25	607.41	949.70	710.94	2.50	179.81	0.50	62.75	4410.57	-3998.96	2912.07
Fixation L	1	8	6896728943	6897007465	278522	950.87	727.41	35	21	-1	11.55	11.55
Fixation R	1	8	6896728943	6897007465	278522	950.87	727.41	35	21	-1	10.37	10.37
Saccade L	1	8	6897007465	6897047180	39715	927.20	728.97	693.37	809.52	2.62	190.60	0.50	65.84	4668.02	-3566.49	2579.49
Saccade R	1	8	6897007465	6897047180	39715	927.20	728.97	693.37	809.52	2.62	190.60	0.50	65.84	4668.02	-3566.49	2579.49
Fixation L	1	9	6897047180	6897405172	357992	677.97	844.91	29	50	-1	11.03	11.03
Fixation R	1	9	6897047180	6897405172	357992	677.97	844.91	29	50	-1	10.49	10.49
Saccade L	1	9	6897405172	6897425046	19874	692.87	841.25	731.42	842.99	0.38	39.04	1.00	19.09	944.50	-667.50	733.57
Saccade R	1	9	6897405172	6897425046	19874	692.87	841.25	731.42	842.99	0.38	39.04	1.00	19.09	944.50	-667.50	733.57
Fixation L	1	10	6897425046	6897623906	198860	743.09	857.61	34	31	-1	11.18	11.18
Fixation R	1	10	6897425046	6897623906	198860	743.09	857.61	34	31	-1	10.36	10.36
Saccade L	1	10	6897623906	6897643903	19997	760.81	871.02	804.71	885.37	0.44	46.73	1.00	22.14	1083.15	-867.99	800.75
Saccade R	1	10	6897623906	6897643903	19997	760.81	871.02	804.71	885.37	0.44	46.73	1.00	22.14	1083.15	-867.99	800.75
Fixation L	1	11	6897643903	6898041641	397738	831.87	908.84	36	34	-1	11.16	11.16
Fixation R	1	11	6897643903	6898041641	397738	831.87	908.84	36	34	-1	10.40	10.40
Saccade L	1	11	6898041641	6898081385	39744	841.18	888.49	934.88	643.42	2.48	168.84	1.00	62.34	3509.39	-4062.36	3044.59
Saccade R	1	11	6898041641	6898081385	39744	841.18	888.49	934.88	643.42	2.48	168.84	1.00	62.34	3509.39	-4062.36	3044.59
Fixation L	1	12	6898081385	6898240508	159123	958.27	629.36	36	50	-1	11.20	11.20
Fixation R	1	12	6898081385	6898240508	159123	958.27	629.36	36	50	-1	10.16	10.16
Saccade L	1	12	6898240508	6898260508	20000	966.37	592.51	964.72	440.71	1.05	153.54	1.00	52.69	3806.63	-3685.24	2701.63
Saccade R	1	12	6898240508	6898260508	20000	966.37	592.51	964.72	440.71	1.05	153.54	1.00	52.69	3806.63	-3685.24	2701.63
Fixation L	1	13	6898260508	6898439485	178977	977.26	420.27	17	28	-1	11.01	11.01
Fixation R	1	13	6898260508	6898439485	178977	977.26	420.27	17	28	-1	10.45	10.45
