[BeGaze]
Converted from:	C:\Documents and Settings\iViewX\Desktop\EXPERIMENTATIONS\Experiments\results\finaleart\S19F21442-finaleart-1.idf
Date:	27.03.2019 15:51:39
Version:	BeGaze 2.5.77
Sample Rate:	50
Subject:	S19F21442
Description:	Juliette Veuillez

Table Header for Fixations:
Event Type	Trial	Number	Start	End	Duration	Location X	Location Y	Dispersion X	Dispersion Y	Plane	Avg. Pupil Size X	Avg. Pupil Size Y

Table Header for Saccades:
Event Type	Trial	Number	Start	End	Duration	Start Loc.X	Start Loc.Y	End Loc.X	End Loc.Y	Amplitude	Peak Speed	Peak Speed At	Average Speed	Peak Accel.	Peak Decel.	Average Accel.

Table Header for Blinks:
Event Type	Trial	Number	Start	End	Duration

Table Header for User Events:
Event Type	Trial	Number	Start	Description

UserEvent	1	1	7744415362	# Message: void.jpg
Fixation L	1	1	7744427073	7744526434	99361	1059.34	198.43	10	8	-1	11.43	11.43
Fixation R	1	1	7744427073	7744526434	99361	1059.34	198.43	10	8	-1	11.83	11.83
Saccade L	1	1	7744526434	7744566185	39751	1054.49	198.40	1368.10	128.10	2.94	187.00	0.50	74.02	4562.68	-3741.36	3633.07
Saccade R	1	1	7744526434	7744566185	39751	1054.49	198.40	1368.10	128.10	2.94	187.00	0.50	74.02	4562.68	-3741.36	3633.07
Fixation L	1	2	7744566185	7744964030	397845	1372.25	133.92	9	55	-1	11.46	11.46
Fixation R	1	2	7744566185	7744964030	397845	1372.25	133.92	9	55	-1	11.58	11.58
Saccade L	1	2	7744964030	7745063523	99493	1374.59	141.97	1315.69	773.78	8.82	181.90	0.40	88.63	4171.85	-4083.98	2037.08
Saccade R	1	2	7744964030	7745063523	99493	1374.59	141.97	1315.69	773.78	8.82	181.90	0.40	88.63	4171.85	-4083.98	2037.08
Fixation L	1	3	7745063523	7745640257	576734	1296.84	797.76	28	57	-1	11.84	11.84
Fixation R	1	3	7745063523	7745640257	576734	1296.84	797.76	28	57	-1	11.69	11.69
Saccade L	1	3	7745640257	7745680117	39860	1287.41	827.02	1067.83	650.94	2.95	237.78	1.00	74.07	5853.84	-4236.53	2988.94
Saccade R	1	3	7745640257	7745680117	39860	1287.41	827.02	1067.83	650.94	2.95	237.78	1.00	74.07	5853.84	-4236.53	2988.94
Fixation L	1	4	7745680117	7745839234	159117	1045.07	683.45	28	71	-1	11.57	11.57
Fixation R	1	4	7745680117	7745839234	159117	1045.07	683.45	28	71	-1	11.34	11.34
Saccade L	1	4	7745839234	7745859132	19898	1042.57	685.89	1037.98	694.71	0.35	28.33	1.00	17.44	425.40	-250.29	275.77
Saccade R	1	4	7745839234	7745859132	19898	1042.57	685.89	1037.98	694.71	0.35	28.33	1.00	17.44	425.40	-250.29	275.77
Fixation L	1	5	7745859132	7746396092	536960	1031.00	695.89	12	50	-1	11.61	11.61
Fixation R	1	5	7745859132	7746396092	536960	1031.00	695.89	12	50	-1	11.79	11.79
