[BeGaze]
Converted from:	C:\Documents and Settings\iViewX\Desktop\EXPERIMENTATIONS\Experiments\results\finaleart\S4120113-finaleart-1.idf
Date:	27.03.2019 15:34:27
Version:	BeGaze 2.5.77
Sample Rate:	50
Subject:	S4120113
Description:	Vidal Attias

Table Header for Fixations:
Event Type	Trial	Number	Start	End	Duration	Location X	Location Y	Dispersion X	Dispersion Y	Plane	Avg. Pupil Size X	Avg. Pupil Size Y

Table Header for Saccades:
Event Type	Trial	Number	Start	End	Duration	Start Loc.X	Start Loc.Y	End Loc.X	End Loc.Y	Amplitude	Peak Speed	Peak Speed At	Average Speed	Peak Accel.	Peak Decel.	Average Accel.

Table Header for Blinks:
Event Type	Trial	Number	Start	End	Duration

Table Header for User Events:
Event Type	Trial	Number	Start	Description

UserEvent	1	1	6661046567	# Message: Turner-chichester-canal-1828.jpg
Fixation L	1	1	6661050162	6661507677	457515	976.76	483.65	17	79	-1	13.90	13.90
Fixation R	1	1	6661050162	6661507677	457515	976.76	483.65	17	79	-1	14.38	14.38
Saccade L	1	1	6661507677	6661527549	19872	985.05	546.56	1016.23	694.15	1.16	152.56	1.00	58.38	3784.06	-3470.02	2856.42
Saccade R	1	1	6661507677	6661527549	19872	985.05	546.56	1016.23	694.15	1.16	152.56	1.00	58.38	3784.06	-3470.02	2856.42
Fixation L	1	2	6661527549	6661885610	358061	1055.03	678.23	62	34	-1	11.51	11.51
Fixation R	1	2	6661527549	6661885610	358061	1055.03	678.23	62	34	-1	11.66	11.66
Saccade L	1	2	6661885610	6661905486	19876	1051.38	660.07	1047.47	656.11	0.26	27.61	0.00	12.95	174.13	-282.51	180.41
Saccade R	1	2	6661885610	6661905486	19876	1051.38	660.07	1047.47	656.11	0.26	27.61	0.00	12.95	174.13	-282.51	180.41
Fixation L	1	3	6661905486	6662243591	338105	1042.79	641.19	25	32	-1	10.26	10.26
Fixation R	1	3	6661905486	6662243591	338105	1042.79	641.19	25	32	-1	10.20	10.20
Saccade L	1	3	6662243591	6662283351	39760	1038.67	632.96	1541.33	600.10	4.30	308.80	1.00	108.08	7643.98	-7431.69	6100.17
Saccade R	1	3	6662243591	6662283351	39760	1038.67	632.96	1541.33	600.10	4.30	308.80	1.00	108.08	7643.98	-7431.69	6100.17
Fixation L	1	4	6662283351	6662462326	178975	1560.19	574.78	24	43	-1	10.00	10.00
Fixation R	1	4	6662283351	6662462326	178975	1560.19	574.78	24	43	-1	10.14	10.14
Saccade L	1	4	6662462326	6662482344	20018	1564.29	566.12	1729.14	560.76	1.09	166.81	1.00	54.60	4009.10	-3773.00	2889.36
Saccade R	1	4	6662462326	6662482344	20018	1564.29	566.12	1729.14	560.76	1.09	166.81	1.00	54.60	4009.10	-3773.00	2889.36
Fixation L	1	5	6662482344	6662780555	298211	1767.43	559.69	53	35	-1	10.65	10.65
Fixation R	1	5	6662482344	6662780555	298211	1767.43	559.69	53	35	-1	10.42	10.42
Saccade L	1	5	6662780555	6662800565	20010	1745.05	571.59	1501.67	603.48	1.68	248.16	1.00	84.21	5422.20	-4580.08	3342.88
Saccade R	1	5	6662780555	6662800565	20010	1745.05	571.59	1501.67	603.48	1.68	248.16	1.00	84.21	5422.20	-4580.08	3342.88
Fixation L	1	6	6662800565	6663039166	238601	1483.30	615.87	37	61	-1	11.03	11.03
Fixation R	1	6	6662800565	6663039166	238601	1483.30	615.87	37	61	-1	11.16	11.16
Saccade L	1	6	6663039166	6663059038	19872	1476.56	634.03	1454.11	630.34	0.41	26.31	1.00	20.47	268.08	-157.51	192.18
Saccade R	1	6	6663039166	6663059038	19872	1476.56	634.03	1454.11	630.34	0.41	26.31	1.00	20.47	268.08	-157.51	192.18
Fixation L	1	7	6663059038	6663198282	139244	1459.50	628.03	27	14	-1	11.17	11.17
Fixation R	1	7	6663059038	6663198282	139244	1459.50	628.03	27	14	-1	11.37	11.37
Saccade L	1	7	6663198282	6663258024	59742	1455.87	632.57	1047.72	687.29	4.44	256.57	0.67	74.40	6219.89	-6219.96	3220.79
Saccade R	1	7	6663198282	6663258024	59742	1455.87	632.57	1047.72	687.29	4.44	256.57	0.67	74.40	6219.89	-6219.96	3220.79
Fixation L	1	8	6663258024	6663417136	159112	1047.50	656.72	18	48	-1	11.32	11.32
Fixation R	1	8	6663258024	6663417136	159112	1047.50	656.72	18	48	-1	11.41	11.41
Saccade L	1	8	6663417136	6663476765	59629	1035.54	675.77	328.39	696.02	7.71	316.98	0.33	129.36	7850.11	-7211.12	5972.86
Saccade R	1	8	6663417136	6663476765	59629	1035.54	675.77	328.39	696.02	7.71	316.98	0.33	129.36	7850.11	-7211.12	5972.86
Fixation L	1	9	6663476765	6663874625	397860	328.02	713.88	26	36	-1	10.43	10.43
Fixation R	1	9	6663476765	6663874625	397860	328.02	713.88	26	36	-1	11.63	11.63
Saccade L	1	9	6663874625	6663934239	59614	316.72	718.67	659.17	642.04	4.59	196.56	0.67	77.06	4193.44	-4425.47	2563.32
Saccade R	1	9	6663874625	6663934239	59614	316.72	718.67	659.17	642.04	4.59	196.56	0.67	77.06	4193.44	-4425.47	2563.32
Fixation L	1	10	6663934239	6664391711	457472	654.23	614.59	9	63	-1	10.69	10.69
Fixation R	1	10	6663934239	6664391711	457472	654.23	614.59	9	63	-1	11.81	11.81
Saccade L	1	10	6664391711	6664431455	39744	656.01	598.95	796.18	588.36	1.72	114.94	0.50	43.35	2587.16	-2079.90	1764.38
Saccade R	1	10	6664391711	6664431455	39744	656.01	598.95	796.18	588.36	1.72	114.94	0.50	43.35	2587.16	-2079.90	1764.38
Fixation L	1	11	6664431455	6664550818	119363	788.40	540.55	13	80	-1	10.77	10.77
Fixation R	1	11	6664431455	6664550818	119363	788.40	540.55	13	80	-1	11.35	11.35
Saccade L	1	11	6664550818	6664610447	59629	787.34	530.93	783.85	150.33	4.15	184.49	0.67	69.57	4263.25	-4413.53	3320.36
Saccade R	1	11	6664550818	6664610447	59629	787.34	530.93	783.85	150.33	4.15	184.49	0.67	69.57	4263.25	-4413.53	3320.36
Fixation L	1	12	6664610447	6664968556	358109	777.03	163.97	12	31	-1	10.14	10.14
Fixation R	1	12	6664610447	6664968556	358109	777.03	163.97	12	31	-1	10.87	10.87
Saccade L	1	12	6664968556	6665048047	79491	779.65	182.09	1165.03	250.39	5.97	233.39	0.50	75.07	5820.90	-5314.60	3435.04
Saccade R	1	12	6664968556	6665048047	79491	779.65	182.09	1165.03	250.39	5.97	233.39	0.50	75.07	5820.90	-5314.60	3435.04
