[BeGaze]
Converted from:	C:\Documents and Settings\iViewX\Desktop\EXPERIMENTATIONS\Experiments\results\finaleart\S19F21442-finaleart-1.idf
Date:	27.03.2019 15:51:07
Version:	BeGaze 2.5.77
Sample Rate:	50
Subject:	S19F21442
Description:	Juliette Veuillez

Table Header for Fixations:
Event Type	Trial	Number	Start	End	Duration	Location X	Location Y	Dispersion X	Dispersion Y	Plane	Avg. Pupil Size X	Avg. Pupil Size Y

Table Header for Saccades:
Event Type	Trial	Number	Start	End	Duration	Start Loc.X	Start Loc.Y	End Loc.X	End Loc.Y	Amplitude	Peak Speed	Peak Speed At	Average Speed	Peak Accel.	Peak Decel.	Average Accel.

Table Header for Blinks:
Event Type	Trial	Number	Start	End	Duration

Table Header for User Events:
Event Type	Trial	Number	Start	Description

UserEvent	1	1	7124397912	# Message: Morning,_An_Overcast_Day_Rouen_Pissaro_1896.jpg
Fixation L	1	1	7124406096	7124803831	397735	799.79	502.80	12	62	-1	14.13	14.13
Fixation R	1	1	7124406096	7124803831	397735	799.79	502.80	12	62	-1	16.11	16.11
Saccade L	1	1	7124803831	7124823821	19990	804.20	551.00	845.91	657.71	1.00	115.89	1.00	50.15	2683.17	-2390.42	1849.64
Saccade R	1	1	7124803831	7124823821	19990	804.20	551.00	845.91	657.71	1.00	115.89	1.00	50.15	2683.17	-2390.42	1849.64
Fixation L	1	2	7124823821	7125142048	318227	879.39	653.07	39	26	-1	12.38	12.38
Fixation R	1	2	7124823821	7125142048	318227	879.39	653.07	39	26	-1	13.93	13.93
Saccade L	1	2	7125142048	7125201713	59665	885.04	660.69	1386.00	1064.11	6.73	287.98	0.67	112.73	7140.14	-6841.93	5164.57
Saccade R	1	2	7125142048	7125201713	59665	885.04	660.69	1386.00	1064.11	6.73	287.98	0.67	112.73	7140.14	-6841.93	5164.57
Fixation L	1	3	7125201713	7125778525	576812	1385.87	1062.69	33	38	-1	9.98	9.98
Fixation R	1	3	7125201713	7125778525	576812	1385.87	1062.69	33	38	-1	10.21	10.21
Saccade L	1	3	7125778525	7125798398	19873	1400.58	1062.35	1436.91	1063.95	0.28	36.79	1.00	14.20	786.25	-827.83	582.71
Saccade R	1	3	7125778525	7125798398	19873	1400.58	1062.35	1436.91	1063.95	0.28	36.79	1.00	14.20	786.25	-827.83	582.71
Fixation L	1	4	7125798398	7126037010	238612	1439.99	1054.10	27	60	-1	10.06	10.06
Fixation R	1	4	7125798398	7126037010	238612	1439.99	1054.10	27	60	-1	9.88	9.88
Saccade L	1	4	7126037010	7126076895	39885	1427.24	1006.10	994.96	626.12	5.45	324.80	0.50	136.65	8003.15	-6929.02	6539.20
Saccade R	1	4	7126037010	7126076895	39885	1427.24	1006.10	994.96	626.12	5.45	324.80	0.50	136.65	8003.15	-6929.02	6539.20
Fixation L	1	5	7126076895	7126454763	377868	980.17	656.75	24	53	-1	10.04	10.04
Fixation R	1	5	7126076895	7126454763	377868	980.17	656.75	24	53	-1	10.00	10.00
Saccade L	1	5	7126454763	7126494511	39748	978.73	655.07	687.89	687.04	2.61	157.22	1.00	65.68	3753.46	-3617.38	3422.07
Saccade R	1	5	7126454763	7126494511	39748	978.73	655.07	687.89	687.04	2.61	157.22	1.00	65.68	3753.46	-3617.38	3422.07
Fixation L	1	6	7126494511	7126693489	198978	673.04	679.85	20	19	-1	10.13	10.13
Fixation R	1	6	7126494511	7126693489	198978	673.04	679.85	20	19	-1	10.84	10.84
Saccade L	1	6	7126693489	7126733235	39746	673.17	678.28	473.42	665.56	1.81	122.89	0.50	45.50	2914.20	-2813.84	2346.69
Saccade R	1	6	7126693489	7126733235	39746	673.17	678.28	473.42	665.56	1.81	122.89	0.50	45.50	2914.20	-2813.84	2346.69
Fixation L	1	7	7126733235	7126991724	258489	464.28	656.48	21	16	-1	10.13	10.13
Fixation R	1	7	7126733235	7126991724	258489	464.28	656.48	21	16	-1	11.25	11.25
Saccade L	1	7	7126991724	7127031593	39869	452.35	650.54	700.68	443.44	2.91	179.54	0.50	73.00	4379.56	-3944.24	3879.46
Saccade R	1	7	7126991724	7127031593	39869	452.35	650.54	700.68	443.44	2.91	179.54	0.50	73.00	4379.56	-3944.24	3879.46
Fixation L	1	8	7127031593	7127250327	218734	708.87	475.60	11	40	-1	10.61	10.61
Fixation R	1	8	7127031593	7127250327	218734	708.87	475.60	11	40	-1	11.75	11.75
Saccade L	1	8	7127250327	7127310079	59752	707.85	481.43	1425.61	311.32	8.08	328.33	1.00	135.26	7764.03	-7862.39	6021.63
Saccade R	1	8	7127250327	7127310079	59752	707.85	481.43	1425.61	311.32	8.08	328.33	1.00	135.26	7764.03	-7862.39	6021.63
Fixation L	1	9	7127310079	7127508949	198870	1478.99	330.04	66	29	-1	10.36	10.36
Fixation R	1	9	7127310079	7127508949	198870	1478.99	330.04	66	29	-1	10.88	10.88
Saccade L	1	9	7127508949	7127528826	19877	1488.16	322.47	1492.71	282.03	0.31	41.17	1.00	15.44	965.51	-824.48	642.55
Saccade R	1	9	7127508949	7127528826	19877	1488.16	322.47	1492.71	282.03	0.31	41.17	1.00	15.44	965.51	-824.48	642.55
Fixation L	1	10	7127528826	7127906683	377857	1481.79	270.02	25	31	-1	9.99	9.99
Fixation R	1	10	7127528826	7127906683	377857	1481.79	270.02	25	31	-1	10.40	10.40
Saccade L	1	10	7127906683	7127946557	39874	1469.15	252.44	1427.94	613.98	3.17	209.68	0.50	79.45	4943.08	-5048.62	4289.57
Saccade R	1	10	7127906683	7127946557	39874	1469.15	252.44	1427.94	613.98	3.17	209.68	0.50	79.45	4943.08	-5048.62	4289.57
Fixation L	1	11	7127946557	7128205038	258481	1414.26	641.48	36	49	-1	10.97	10.97
Fixation R	1	11	7127946557	7128205038	258481	1414.26	641.48	36	49	-1	11.29	11.29
Saccade L	1	11	7128205038	7128244916	39878	1407.03	652.93	1176.33	631.80	1.99	186.28	1.00	49.83	4522.99	-4369.98	2765.48
Saccade R	1	11	7128205038	7128244916	39878	1407.03	652.93	1176.33	631.80	1.99	186.28	1.00	49.83	4522.99	-4369.98	2765.48
Fixation L	1	12	7128244916	7128384035	139119	1167.48	621.34	14	45	-1	11.07	11.07
Fixation R	1	12	7128244916	7128384035	139119	1167.48	621.34	14	45	-1	11.44	11.44
