[BeGaze]
Converted from:	C:\Documents and Settings\iViewX\Desktop\EXPERIMENTATIONS\Experiments\results\finaleart\S21F22332-finaleart-1.idf
Date:	27.03.2019 15:55:30
Version:	BeGaze 2.5.77
Sample Rate:	50
Subject:	S21F22332
Description:	Cyrielle Mailart

Table Header for Fixations:
Event Type	Trial	Number	Start	End	Duration	Location X	Location Y	Dispersion X	Dispersion Y	Plane	Avg. Pupil Size X	Avg. Pupil Size Y

Table Header for Saccades:
Event Type	Trial	Number	Start	End	Duration	Start Loc.X	Start Loc.Y	End Loc.X	End Loc.Y	Amplitude	Peak Speed	Peak Speed At	Average Speed	Peak Accel.	Peak Decel.	Average Accel.

Table Header for Blinks:
Event Type	Trial	Number	Start	End	Duration

Table Header for User Events:
Event Type	Trial	Number	Start	Description

UserEvent	1	1	2628814722	# Message: Les_Bords_De_Seine_A_Neuilly_Dubois_Pillet_1886.jpg
Fixation L	1	1	2628822652	2629240377	417725	1016.50	511.66	29	37	-1	14.59	14.59
Fixation R	1	1	2628822652	2629240377	417725	1016.50	511.66	29	37	-1	13.24	13.24
Saccade L	1	1	2629240377	2629260252	19875	1016.70	525.08	1176.62	760.14	1.56	287.37	1.00	78.69	7071.53	-6939.42	4822.49
Saccade R	1	1	2629240377	2629260252	19875	1016.70	525.08	1176.62	760.14	1.56	287.37	1.00	78.69	7071.53	-6939.42	4822.49
Fixation L	1	2	2629260252	2629459113	198861	1212.36	758.68	49	15	-1	13.49	13.49
Fixation R	1	2	2629260252	2629459113	198861	1212.36	758.68	49	15	-1	12.22	12.22
Saccade L	1	2	2629459113	2629498985	39872	1225.62	763.44	973.22	772.46	2.14	153.92	0.50	53.59	3717.88	-3713.93	3110.94
Saccade R	1	2	2629459113	2629498985	39872	1225.62	763.44	973.22	772.46	2.14	153.92	0.50	53.59	3717.88	-3713.93	3110.94
Fixation L	1	3	2629498985	2629658117	159132	968.43	771.03	6	10	-1	11.55	11.55
Fixation R	1	3	2629498985	2629658117	159132	968.43	771.03	6	10	-1	10.38	10.38
Saccade L	1	3	2629658117	2629677989	19872	969.20	774.21	760.14	894.87	1.44	244.04	1.00	72.42	5942.20	-5645.89	4145.29
Saccade R	1	3	2629658117	2629677989	19872	969.20	774.21	760.14	894.87	1.44	244.04	1.00	72.42	5942.20	-5645.89	4145.29
Fixation L	1	4	2629677989	2629876859	198870	711.56	892.63	60	14	-1	11.28	11.28
Fixation R	1	4	2629677989	2629876859	198870	711.56	892.63	60	14	-1	10.41	10.41
Saccade L	1	4	2629876859	2629896743	19884	709.11	898.40	498.28	874.19	1.33	214.58	1.00	66.94	5308.71	-4709.27	3736.96
Saccade R	1	4	2629876859	2629896743	19884	709.11	898.40	498.28	874.19	1.33	214.58	1.00	66.94	5308.71	-4709.27	3736.96
Fixation L	1	5	2629896743	2630135455	238712	445.63	849.37	65	34	-1	11.19	11.19
Fixation R	1	5	2629896743	2630135455	238712	445.63	849.37	65	34	-1	10.52	10.52
Saccade L	1	5	2630135455	2630155342	19887	442.81	841.84	331.13	822.06	0.98	114.72	1.00	49.07	2804.89	-2761.65	2455.21
Saccade R	1	5	2630135455	2630155342	19887	442.81	841.84	331.13	822.06	0.98	114.72	1.00	49.07	2804.89	-2761.65	2455.21
Fixation L	1	6	2630155342	2630393943	238601	331.41	770.07	9	79	-1	11.08	11.08
Fixation R	1	6	2630155342	2630393943	238601	331.41	770.07	9	79	-1	10.50	10.50
Saccade L	1	6	2630393943	2630413942	19999	334.69	775.75	310.40	778.36	0.30	31.75	1.00	15.01	768.19	-382.08	568.27
Saccade R	1	6	2630393943	2630413942	19999	334.69	775.75	310.40	778.36	0.30	31.75	1.00	15.01	768.19	-382.08	568.27
Fixation L	1	7	2630413942	2630513316	99374	305.31	775.43	62	6	-1	10.84	10.84
Fixation R	1	7	2630413942	2630513316	99374	305.31	775.43	62	6	-1	10.53	10.53
Saccade L	1	7	2630513316	2630553065	39749	327.56	771.45	713.24	763.32	3.54	206.64	1.00	89.06	4780.86	-4875.79	4460.06
Saccade R	1	7	2630513316	2630553065	39749	327.56	771.45	713.24	763.32	3.54	206.64	1.00	89.06	4780.86	-4875.79	4460.06
Fixation L	1	8	2630553065	2630831547	278482	732.43	726.59	24	50	-1	11.09	11.09
Fixation R	1	8	2630553065	2630831547	278482	732.43	726.59	24	50	-1	10.89	10.89
Saccade L	1	8	2630831547	2630871304	39757	733.49	715.64	899.12	641.19	1.64	139.89	0.50	41.36	3451.48	-3101.07	2109.50
Saccade R	1	8	2630831547	2630871304	39757	733.49	715.64	899.12	641.19	1.64	139.89	0.50	41.36	3451.48	-3101.07	2109.50
Fixation L	1	9	2630871304	2631209529	338225	927.33	632.93	33	21	-1	11.47	11.47
Fixation R	1	9	2630871304	2631209529	338225	927.33	632.93	33	21	-1	10.87	10.87
Saccade L	1	9	2631209529	2631229394	19865	930.60	637.29	927.89	816.23	0.99	180.99	1.00	49.73	4483.81	-4219.86	2920.70
Saccade R	1	9	2631209529	2631229394	19865	930.60	637.29	927.89	816.23	0.99	180.99	1.00	49.73	4483.81	-4219.86	2920.70
Fixation L	1	10	2631229394	2631527760	298366	919.59	833.96	14	37	-1	11.30	11.30
Fixation R	1	10	2631229394	2631527760	298366	919.59	833.96	14	37	-1	11.10	11.10
Saccade L	1	10	2631527760	2631587385	59625	913.21	841.53	817.84	928.74	2.78	83.74	0.67	46.67	2032.61	-1882.82	1390.50
Saccade R	1	10	2631527760	2631587385	59625	913.21	841.53	817.84	928.74	2.78	83.74	0.67	46.67	2032.61	-1882.82	1390.50
Fixation L	1	11	2631587385	2631706751	119366	777.15	920.69	49	17	-1	11.77	11.77
Fixation R	1	11	2631587385	2631706751	119366	777.15	920.69	49	17	-1	11.31	11.31
Saccade L	1	11	2631706751	2631746496	39745	768.75	927.45	892.44	764.90	2.04	121.19	0.50	51.43	2965.60	-2566.69	2686.49
Saccade R	1	11	2631706751	2631746496	39745	768.75	927.45	892.44	764.90	2.04	121.19	0.50	51.43	2965.60	-2566.69	2686.49
Fixation L	1	12	2631746496	2631925487	178991	899.55	806.97	13	85	-1	11.95	11.95
Fixation R	1	12	2631746496	2631925487	178991	899.55	806.97	13	85	-1	11.24	11.24
Saccade L	1	12	2631925487	2631985241	59754	905.61	821.70	1320.31	619.82	5.63	321.92	0.67	94.29	7770.39	-7890.78	4680.31
Saccade R	1	12	2631925487	2631985241	59754	905.61	821.70	1320.31	619.82	5.63	321.92	0.67	94.29	7770.39	-7890.78	4680.31
Fixation L	1	13	2631985241	2632124475	139234	1321.78	626.29	5	33	-1	11.97	11.97
Fixation R	1	13	2631985241	2632124475	139234	1321.78	626.29	5	33	-1	11.22	11.22
Saccade L	1	13	2632124475	2632164229	39754	1323.98	647.59	1491.60	725.47	1.69	136.07	1.00	42.55	3235.95	-3345.32	2409.97
Saccade R	1	13	2632124475	2632164229	39754	1323.98	647.59	1491.60	725.47	1.69	136.07	1.00	42.55	3235.95	-3345.32	2409.97
Fixation L	1	14	2632164229	2632382967	218738	1513.67	745.20	42	31	-1	11.73	11.73
Fixation R	1	14	2632164229	2632382967	218738	1513.67	745.20	42	31	-1	11.01	11.01
Saccade L	1	14	2632382967	2632402837	19870	1531.98	748.71	1419.06	751.17	0.60	114.25	1.00	30.25	2829.60	-2710.96	1847.81
Saccade R	1	14	2632382967	2632402837	19870	1531.98	748.71	1419.06	751.17	0.60	114.25	1.00	30.25	2829.60	-2710.96	1847.81
Fixation L	1	15	2632402837	2632561965	159128	1428.03	746.85	14	11	-1	12.10	12.10
Fixation R	1	15	2632402837	2632561965	159128	1428.03	746.85	14	11	-1	10.93	10.93
Saccade L	1	15	2632561965	2632621702	59737	1433.78	741.10	1396.79	529.84	4.64	172.80	0.33	77.60	4283.37	-3012.67	3006.64
Saccade R	1	15	2632561965	2632621702	59737	1433.78	741.10	1396.79	529.84	4.64	172.80	0.33	77.60	4283.37	-3012.67	3006.64
Fixation L	1	16	2632621702	2632780828	159126	1378.76	511.05	24	29	-1	12.13	12.13
Fixation R	1	16	2632621702	2632780828	159126	1378.76	511.05	24	29	-1	11.03	11.03
Saccade L	1	16	2632780828	2632840440	59612	1372.02	507.07	768.50	832.07	8.49	334.58	0.33	142.35	8231.61	-6854.16	5695.43
Saccade R	1	16	2632780828	2632840440	59612	1372.02	507.07	768.50	832.07	8.49	334.58	0.33	142.35	8231.61	-6854.16	5695.43
