[BeGaze]
Converted from:	C:\Documents and Settings\iViewX\Desktop\EXPERIMENTATIONS\Experiments\results\finaleart\S22H22551-finaleart-1.idf
Date:	27.03.2019 15:57:22
Version:	BeGaze 2.5.77
Sample Rate:	50
Subject:	S22H22551
Description:	Mathieu Chambre

Table Header for Fixations:
Event Type	Trial	Number	Start	End	Duration	Location X	Location Y	Dispersion X	Dispersion Y	Plane	Avg. Pupil Size X	Avg. Pupil Size Y

Table Header for Saccades:
Event Type	Trial	Number	Start	End	Duration	Start Loc.X	Start Loc.Y	End Loc.X	End Loc.Y	Amplitude	Peak Speed	Peak Speed At	Average Speed	Peak Accel.	Peak Decel.	Average Accel.

Table Header for Blinks:
Event Type	Trial	Number	Start	End	Duration

Table Header for User Events:
Event Type	Trial	Number	Start	Description

UserEvent	1	1	4961770370	# Message: A_Highland_Landscape_Landseer_1830.jpg
Fixation L	1	1	4961780264	4962118364	338100	1054.06	382.82	53	43	-1	17.33	17.33
Fixation R	1	1	4961780264	4962118364	338100	1054.06	382.82	53	43	-1	17.94	17.94
Saccade L	1	1	4962118364	4962138408	20044	1018.24	408.19	1017.62	411.86	0.08	6.43	1.00	3.99	99.78	-66.48	56.32
Saccade R	1	1	4962118364	4962138408	20044	1018.24	408.19	1017.62	411.86	0.08	6.43	1.00	3.99	99.78	-66.48	56.32
Fixation L	1	2	4962138408	4962297483	159075	1016.57	418.71	4	11	-1	17.81	17.81
Fixation R	1	2	4962138408	4962297483	159075	1016.57	418.71	4	11	-1	18.32	18.32
Saccade L	1	2	4962297483	4962317358	19875	1019.41	423.41	1157.27	414.12	1.06	139.76	1.00	53.20	3479.61	-3255.47	2763.60
Saccade R	1	2	4962297483	4962317358	19875	1019.41	423.41	1157.27	414.12	1.06	139.76	1.00	53.20	3479.61	-3255.47	2763.60
Fixation L	1	3	4962317358	4962416722	99364	1209.97	402.25	65	20	-1	17.62	17.62
Fixation R	1	3	4962317358	4962416722	99364	1209.97	402.25	65	20	-1	17.60	17.60
Saccade L	1	3	4962416722	4962476467	59745	1222.81	393.59	1433.85	235.84	2.92	185.74	1.00	48.95	4297.32	-4428.23	2412.97
Saccade R	1	3	4962416722	4962476467	59745	1222.81	393.59	1433.85	235.84	2.92	185.74	1.00	48.95	4297.32	-4428.23	2412.97
Fixation L	1	4	4962476467	4962715088	238621	1428.81	250.83	17	29	-1	15.76	15.76
Fixation R	1	4	4962476467	4962715088	238621	1428.81	250.83	17	29	-1	16.46	16.46
Saccade L	1	4	4962715088	4962754959	39871	1418.54	265.13	957.15	324.01	3.96	319.47	0.50	99.37	7862.73	-7675.89	5740.27
Saccade R	1	4	4962715088	4962754959	39871	1418.54	265.13	957.15	324.01	3.96	319.47	0.50	99.37	7862.73	-7675.89	5740.27
Fixation L	1	5	4962754959	4962933967	179008	976.27	322.98	26	11	-1	15.75	15.75
Fixation R	1	5	4962754959	4962933967	179008	976.27	322.98	26	11	-1	15.92	15.92
Saccade L	1	5	4962933967	4962973692	39725	983.28	326.72	753.86	281.75	1.94	125.14	1.00	48.89	3065.17	-2781.61	2844.17
Saccade R	1	5	4962933967	4962973692	39725	983.28	326.72	753.86	281.75	1.94	125.14	1.00	48.89	3065.17	-2781.61	2844.17
Fixation L	1	6	4962973692	4963232306	258614	743.17	269.32	23	17	-1	15.48	15.48
Fixation R	1	6	4962973692	4963232306	258614	743.17	269.32	23	17	-1	15.94	15.94
Saccade L	1	6	4963232306	4963272059	39753	731.43	272.15	950.68	224.35	2.03	121.42	0.50	51.13	2975.79	-2530.71	2623.27
Saccade R	1	6	4963232306	4963272059	39753	731.43	272.15	950.68	224.35	2.03	121.42	0.50	51.13	2975.79	-2530.71	2623.27
Fixation L	1	7	4963272059	4963451047	178988	952.69	213.14	41	30	-1	15.89	15.89
Fixation R	1	7	4963272059	4963451047	178988	952.69	213.14	41	30	-1	16.18	16.18
Saccade L	1	7	4963451047	4963470923	19876	986.20	206.69	1087.62	200.16	0.74	102.80	1.00	37.19	2416.24	-2373.70	1814.10
Saccade R	1	7	4963451047	4963470923	19876	986.20	206.69	1087.62	200.16	0.74	102.80	1.00	37.19	2416.24	-2373.70	1814.10
Fixation L	1	8	4963470923	4963669784	198861	1101.62	190.49	19	24	-1	15.91	15.91
Fixation R	1	8	4963470923	4963669784	198861	1101.62	190.49	19	24	-1	16.44	16.44
Saccade L	1	8	4963669784	4963689810	20026	1104.58	180.53	1156.43	319.83	1.04	150.33	1.00	51.98	3467.51	-3419.79	2584.89
Saccade R	1	8	4963669784	4963689810	20026	1104.58	180.53	1156.43	319.83	1.04	150.33	1.00	51.98	3467.51	-3419.79	2584.89
Fixation L	1	9	4963689810	4963908532	218722	1161.05	350.31	30	37	-1	17.09	17.09
Fixation R	1	9	4963689810	4963908532	218722	1161.05	350.31	30	37	-1	17.05	17.05
Saccade L	1	9	4963908532	4963928394	19862	1165.30	357.28	931.50	556.41	1.62	310.37	1.00	81.79	7742.73	-7560.60	5178.83
Saccade R	1	9	4963908532	4963928394	19862	1165.30	357.28	931.50	556.41	1.62	310.37	1.00	81.79	7742.73	-7560.60	5178.83
Fixation L	1	10	4963928394	4964107386	178992	928.06	556.88	5	15	-1	17.38	17.38
Fixation R	1	10	4963928394	4964107386	178992	928.06	556.88	5	15	-1	17.54	17.54
Saccade L	1	10	4964107386	4964127284	19898	926.50	556.34	769.27	699.01	1.19	214.68	1.00	60.01	5346.11	-5115.94	3609.75
Saccade R	1	10	4964107386	4964127284	19898	926.50	556.34	769.27	699.01	1.19	214.68	1.00	60.01	5346.11	-5115.94	3609.75
Fixation L	1	11	4964127284	4964306255	178971	777.03	717.08	25	57	-1	17.33	17.33
Fixation R	1	11	4964127284	4964306255	178971	777.03	717.08	25	57	-1	17.69	17.69
Saccade L	1	11	4964306255	4964326251	19996	763.26	754.18	583.74	859.88	1.28	210.66	1.00	63.87	5176.54	-5037.16	3598.11
Saccade R	1	11	4964306255	4964326251	19996	763.26	754.18	583.74	859.88	1.28	210.66	1.00	63.87	5176.54	-5037.16	3598.11
Fixation L	1	12	4964326251	4964525117	198866	590.87	871.33	11	33	-1	16.84	16.84
Fixation R	1	12	4964326251	4964525117	198866	590.87	871.33	11	33	-1	17.26	17.26
Saccade L	1	12	4964525117	4964584739	59622	591.83	884.50	1164.84	888.27	5.89	334.88	0.67	98.72	8302.69	-8155.85	4778.11
Saccade R	1	12	4964525117	4964584739	59622	591.83	884.50	1164.84	888.27	5.89	334.88	0.67	98.72	8302.69	-8155.85	4778.11
Fixation L	1	13	4964584739	4964783731	198992	1157.99	892.80	10	10	-1	17.22	17.22
Fixation R	1	13	4964584739	4964783731	198992	1157.99	892.80	10	10	-1	17.19	17.19
Saccade L	1	13	4964783731	4964823493	39762	1160.01	892.04	1361.55	713.32	2.53	200.69	1.00	63.53	4978.72	-4911.98	3664.19
Saccade R	1	13	4964783731	4964823493	39762	1160.01	892.04	1361.55	713.32	2.53	200.69	1.00	63.53	4978.72	-4911.98	3664.19
Fixation L	1	14	4964823493	4965002463	178970	1368.09	721.56	8	10	-1	16.88	16.88
Fixation R	1	14	4964823493	4965002463	178970	1368.09	721.56	8	10	-1	16.70	16.70
Saccade L	1	14	4965002463	4965042223	39760	1367.92	723.49	1372.05	430.72	2.37	169.12	1.00	59.70	4219.56	-4041.22	3641.50
Saccade R	1	14	4965002463	4965042223	39760	1367.92	723.49	1372.05	430.72	2.37	169.12	1.00	59.70	4219.56	-4041.22	3641.50
Fixation L	1	15	4965042223	4965241201	198978	1381.96	431.79	25	70	-1	16.86	16.86
Fixation R	1	15	4965042223	4965241201	198978	1381.96	431.79	25	70	-1	16.56	16.56
Saccade L	1	15	4965241201	4965280952	39751	1397.27	373.33	1471.87	216.36	2.40	187.38	0.50	60.41	4541.93	-4064.31	2606.96
Saccade R	1	15	4965241201	4965280952	39751	1397.27	373.33	1471.87	216.36	2.40	187.38	0.50	60.41	4541.93	-4064.31	2606.96
Fixation L	1	16	4965280952	4965420201	139249	1452.39	256.33	28	57	-1	16.56	16.56
Fixation R	1	16	4965280952	4965420201	139249	1452.39	256.33	28	57	-1	16.45	16.45
Saccade L	1	16	4965420201	4965440067	19866	1451.96	272.73	1447.05	290.64	0.24	18.78	1.00	12.21	331.79	-287.73	270.43
Saccade R	1	16	4965420201	4965440067	19866	1451.96	272.73	1447.05	290.64	0.24	18.78	1.00	12.21	331.79	-287.73	270.43
Fixation L	1	17	4965440067	4965579332	139265	1446.06	287.70	10	18	-1	16.26	16.26
Fixation R	1	17	4965440067	4965579332	139265	1446.06	287.70	10	18	-1	16.31	16.31
Saccade L	1	17	4965579332	4965619056	39724	1442.06	294.43	1055.56	313.01	3.21	197.56	1.00	80.76	4888.03	-4718.21	4763.10
Saccade R	1	17	4965579332	4965619056	39724	1442.06	294.43	1055.56	313.01	3.21	197.56	1.00	80.76	4888.03	-4718.21	4763.10
Fixation L	1	18	4965619056	4965758304	139248	1041.01	310.08	21	7	-1	16.70	16.70
Fixation R	1	18	4965619056	4965758304	139248	1041.01	310.08	21	7	-1	16.67	16.67
