[BeGaze]
Converted from:	C:\Documents and Settings\iViewX\Desktop\EXPERIMENTATIONS\Experiments\results\finaleart\S21F22332-finaleart-1.idf
Date:	27.03.2019 15:56:24
Version:	BeGaze 2.5.77
Sample Rate:	50
Subject:	S21F22332
Description:	Cyrielle Mailart

Table Header for Fixations:
Event Type	Trial	Number	Start	End	Duration	Location X	Location Y	Dispersion X	Dispersion Y	Plane	Avg. Pupil Size X	Avg. Pupil Size Y

Table Header for Saccades:
Event Type	Trial	Number	Start	End	Duration	Start Loc.X	Start Loc.Y	End Loc.X	End Loc.Y	Amplitude	Peak Speed	Peak Speed At	Average Speed	Peak Accel.	Peak Decel.	Average Accel.

Table Header for Blinks:
Event Type	Trial	Number	Start	End	Duration

Table Header for User Events:
Event Type	Trial	Number	Start	Description

UserEvent	1	1	3170747565	# Message: stilleven-met-vis_dubois-pillet_1885.jpg
Fixation L	1	1	3170758935	3171196536	437601	900.06	470.56	68	23	-1	13.33	13.33
Fixation R	1	1	3170758935	3171196536	437601	900.06	470.56	68	23	-1	12.23	12.23
Saccade L	1	1	3171196536	3171236295	39759	848.72	469.14	559.45	324.03	3.31	170.68	0.50	83.20	4212.68	-3814.90	3571.33
Saccade R	1	1	3171196536	3171236295	39759	848.72	469.14	559.45	324.03	3.31	170.68	0.50	83.20	4212.68	-3814.90	3571.33
Fixation L	1	2	3171236295	3171355644	119349	576.02	306.12	29	64	-1	12.40	12.40
Fixation R	1	2	3171236295	3171355644	119349	576.02	306.12	29	64	-1	11.59	11.59
Saccade L	1	2	3171355644	3171395393	39749	574.39	284.50	1196.06	116.75	5.78	369.49	0.50	145.40	8058.69	-9120.23	7516.36
Saccade R	1	2	3171355644	3171395393	39749	574.39	284.50	1196.06	116.75	5.78	369.49	0.50	145.40	8058.69	-9120.23	7516.36
Fixation L	1	3	3171395393	3171673884	278491	1199.34	144.43	10	39	-1	10.99	10.99
Fixation R	1	3	3171395393	3171673884	278491	1199.34	144.43	10	39	-1	9.95	9.95
Saccade L	1	3	3171673884	3171693757	19873	1200.93	152.30	1266.97	135.27	0.42	68.99	1.00	20.88	1671.65	-1651.30	1150.77
Saccade R	1	3	3171673884	3171693757	19873	1200.93	152.30	1266.97	135.27	0.42	68.99	1.00	20.88	1671.65	-1651.30	1150.77
Fixation L	1	4	3171693757	3171892619	198862	1264.68	119.27	57	32	-1	11.47	11.47
Fixation R	1	4	3171693757	3171892619	198862	1264.68	119.27	57	32	-1	10.73	10.73
Saccade L	1	4	3171892619	3171912625	20006	1214.18	102.72	1192.22	110.55	0.50	58.66	0.00	24.88	386.60	-1238.07	617.72
Saccade R	1	4	3171892619	3171912625	20006	1214.18	102.72	1192.22	110.55	0.50	58.66	0.00	24.88	386.60	-1238.07	617.72
Fixation L	1	5	3171912625	3172051743	139118	1187.63	119.99	22	19	-1	12.17	12.17
Fixation R	1	5	3171912625	3172051743	139118	1187.63	119.99	22	19	-1	11.08	11.08
Saccade L	1	5	3172051743	3172071735	19992	1203.79	129.20	1367.41	118.79	1.03	165.81	1.00	51.46	3965.71	-4120.03	2804.92
Saccade R	1	5	3172051743	3172071735	19992	1203.79	129.20	1367.41	118.79	1.03	165.81	1.00	51.46	3965.71	-4120.03	2804.92
Fixation L	1	6	3172071735	3172350113	278378	1354.74	121.65	17	33	-1	12.49	12.49
Fixation R	1	6	3172071735	3172350113	278378	1354.74	121.65	17	33	-1	11.43	11.43
Saccade L	1	6	3172350113	3172370093	19980	1349.51	123.35	1215.87	116.98	0.76	135.33	1.00	37.85	3141.45	-3230.10	2133.42
Saccade R	1	6	3172350113	3172370093	19980	1349.51	123.35	1215.87	116.98	0.76	135.33	1.00	37.85	3141.45	-3230.10	2133.42
Fixation L	1	7	3172370093	3172568964	198871	1217.91	113.35	5	13	-1	12.83	12.83
Fixation R	1	7	3172370093	3172568964	198871	1217.91	113.35	5	13	-1	11.82	11.82
Saccade L	1	7	3172568964	3172628586	59622	1220.95	115.71	1224.18	772.66	6.77	349.57	0.67	113.48	8705.66	-8416.31	5537.50
Saccade R	1	7	3172568964	3172628586	59622	1220.95	115.71	1224.18	772.66	6.77	349.57	0.67	113.48	8705.66	-8416.31	5537.50
Fixation L	1	8	3172628586	3172827450	198864	1212.86	791.45	32	36	-1	13.57	13.57
Fixation R	1	8	3172628586	3172827450	198864	1212.86	791.45	32	36	-1	12.53	12.53
Saccade L	1	8	3172827450	3172847450	20000	1191.25	806.09	940.19	828.04	1.43	254.78	1.00	71.48	6233.44	-6325.84	4218.53
Saccade R	1	8	3172827450	3172847450	20000	1191.25	806.09	940.19	828.04	1.43	254.78	1.00	71.48	6233.44	-6325.84	4218.53
Fixation L	1	9	3172847450	3173006564	159114	951.29	839.11	14	18	-1	13.26	13.26
Fixation R	1	9	3172847450	3173006564	159114	951.29	839.11	14	18	-1	12.07	12.07
Saccade L	1	9	3173006564	3173026436	19872	954.39	843.54	864.06	841.01	0.52	91.41	1.00	25.98	2225.51	-2158.82	1499.73
Saccade R	1	9	3173006564	3173026436	19872	954.39	843.54	864.06	841.01	0.52	91.41	1.00	25.98	2225.51	-2158.82	1499.73
Fixation L	1	10	3173026436	3173145811	119375	860.67	831.70	10	20	-1	13.15	13.15
Fixation R	1	10	3173026436	3173145811	119375	860.67	831.70	10	20	-1	11.72	11.72
Saccade L	1	10	3173145811	3173165687	19876	855.73	820.21	615.95	824.88	1.27	242.48	1.00	64.01	6013.67	-5850.12	3969.45
Saccade R	1	10	3173145811	3173165687	19876	855.73	820.21	615.95	824.88	1.27	242.48	1.00	64.01	6013.67	-5850.12	3969.45
Fixation L	1	11	3173165687	3173384423	218736	613.45	809.37	31	23	-1	12.86	12.86
Fixation R	1	11	3173165687	3173384423	218736	613.45	809.37	31	23	-1	11.93	11.93
Saccade L	1	11	3173384423	3173404294	19871	587.52	809.56	409.80	846.32	1.19	183.52	1.00	59.75	4557.46	-4365.04	3020.83
Saccade R	1	11	3173384423	3173404294	19871	587.52	809.56	409.80	846.32	1.19	183.52	1.00	59.75	4557.46	-4365.04	3020.83
Fixation L	1	12	3173404294	3173682774	278480	428.83	873.85	49	34	-1	12.21	12.21
Fixation R	1	12	3173404294	3173682774	278480	428.83	873.85	49	34	-1	11.84	11.84
Saccade L	1	12	3173682774	3173702658	19884	459.25	875.95	643.17	850.65	1.17	187.75	1.00	59.01	4668.11	-4245.22	3097.72
Saccade R	1	12	3173682774	3173702658	19884	459.25	875.95	643.17	850.65	1.17	187.75	1.00	59.01	4668.11	-4245.22	3097.72
Fixation L	1	13	3173702658	3173881643	178985	657.00	811.52	20	57	-1	11.89	11.89
Fixation R	1	13	3173702658	3173881643	178985	657.00	811.52	20	57	-1	11.65	11.65
Saccade L	1	13	3173881643	3173921521	39878	663.26	796.08	1078.96	604.88	4.19	301.20	0.50	105.13	7458.65	-6164.16	5350.53
Saccade R	1	13	3173881643	3173921521	39878	663.26	796.08	1078.96	604.88	4.19	301.20	0.50	105.13	7458.65	-6164.16	5350.53
Fixation L	1	14	3173921521	3174040759	119238	1084.69	563.24	11	54	-1	11.68	11.68
Fixation R	1	14	3173921521	3174040759	119238	1084.69	563.24	11	54	-1	11.32	11.32
Saccade L	1	14	3174040759	3174080635	39876	1089.83	560.17	1171.93	455.30	1.28	94.34	1.00	32.03	2309.48	-2141.60	1707.30
Saccade R	1	14	3174040759	3174080635	39876	1089.83	560.17	1171.93	455.30	1.28	94.34	1.00	32.03	2309.48	-2141.60	1707.30
Fixation L	1	15	3174080635	3174597729	517094	1184.17	452.02	31	19	-1	11.30	11.30
Fixation R	1	15	3174080635	3174597729	517094	1184.17	452.02	31	19	-1	10.69	10.69
Saccade L	1	15	3174597729	3174736975	139246	1162.32	444.93	615.04	243.69	10.02	263.69	0.29	71.99	6500.87	-5560.94	3207.02
Saccade R	1	15	3174597729	3174736975	139246	1162.32	444.93	615.04	243.69	10.02	263.69	0.29	71.99	6500.87	-5560.94	3207.02
