[BeGaze]
Converted from:	C:\Documents and Settings\iViewX\Desktop\EXPERIMENTATIONS\Experiments\results\finaleart\S11H21112-finaleart-1.idf
Date:	27.03.2019 15:39:04
Version:	BeGaze 2.5.77
Sample Rate:	50
Subject:	S11H21112
Description:	Clement legrand-Duchenne

Table Header for Fixations:
Event Type	Trial	Number	Start	End	Duration	Location X	Location Y	Dispersion X	Dispersion Y	Plane	Avg. Pupil Size X	Avg. Pupil Size Y

Table Header for Saccades:
Event Type	Trial	Number	Start	End	Duration	Start Loc.X	Start Loc.Y	End Loc.X	End Loc.Y	Amplitude	Peak Speed	Peak Speed At	Average Speed	Peak Accel.	Peak Decel.	Average Accel.

Table Header for Blinks:
Event Type	Trial	Number	Start	End	Duration

Table Header for User Events:
Event Type	Trial	Number	Start	Description

UserEvent	1	1	5092694477	# Message: void.jpg
Fixation L	1	1	5092707096	5092906092	198996	1029.55	659.29	6	11	-1	13.38	13.38
Fixation R	1	1	5092707096	5092906092	198996	1029.55	659.29	6	11	-1	15.30	15.30
Saccade L	1	1	5092906092	5092925958	19866	1027.66	664.87	1181.04	782.25	1.23	195.31	1.00	62.05	4843.47	-4577.71	3508.32
Saccade R	1	1	5092906092	5092925958	19866	1027.66	664.87	1181.04	782.25	1.23	195.31	1.00	62.05	4843.47	-4577.71	3508.32
Fixation L	1	2	5092925958	5093284191	358233	1189.16	844.40	18	75	-1	13.43	13.43
Fixation R	1	2	5092925958	5093284191	358233	1189.16	844.40	18	75	-1	15.36	15.36
Saccade L	1	2	5093284191	5093304075	19884	1199.75	850.27	1213.26	755.66	1.20	131.88	1.00	60.50	3068.99	-217.26	1865.01
Saccade R	1	2	5093284191	5093304075	19884	1199.75	850.27	1213.26	755.66	1.20	131.88	1.00	60.50	3068.99	-217.26	1865.01
Blink L	1	1	5093304075	5093483186	179111
Blink R	1	1	5093304075	5093483186	179111
Blink L	1	2	5093582682	5093662301	79619
Saccade L	1	3	5093662301	5093721917	59616	1722.04	225.73	1684.10	252.40	2.83	99.35	1.00	47.40	779.36	-905.15	579.86
Saccade R	1	3	5093662301	5093721917	59616	1722.04	225.73	1684.10	252.40	2.83	99.35	1.00	47.40	779.36	-905.15	579.86
Fixation L	1	3	5093721917	5093821416	99499	1658.07	288.56	44	51	-1	12.83	12.83
Fixation R	1	3	5093721917	5093821416	99499	1658.07	288.56	44	51	-1	14.76	14.76
Saccade L	1	4	5093821416	5093841289	19873	1639.44	300.02	1641.48	308.88	0.22	15.79	0.00	11.21	180.63	-79.04	103.09
Saccade R	1	4	5093821416	5093841289	19873	1639.44	300.02	1641.48	308.88	0.22	15.79	0.00	11.21	180.63	-79.04	103.09
Fixation L	1	4	5093841289	5094299025	457736	1636.34	280.13	30	68	-1	11.72	11.72
Fixation R	1	4	5093841289	5094338774	497485	1635.54	280.87	30	68	-1	13.87	13.87
Blink L	1	3	5094299025	5094478020	178995
Saccade R	1	5	5094338774	5094498020	159246	1631.85	268.19	1606.80	274.03	11.51	191.80	0.62	72.30	2200.13	-4009.11	1405.64
Saccade L	1	5	5094478020	5094498020	20000	1566.98	366.09	1606.80	274.03	1.11	101.46	1.00	55.50	831.34	-1946.17	1013.58
Fixation L	1	5	5094498020	5094677003	178983	1618.26	255.77	51	46	-1	13.88	13.88
Fixation R	1	5	5094498020	5094677003	178983	1618.26	255.77	51	46	-1	13.62	13.62
