[BeGaze]
Converted from:	C:\Documents and Settings\iViewX\Desktop\EXPERIMENTATIONS\Experiments\results\finaleart\S22H22551-finaleart-1.idf
Date:	27.03.2019 15:57:24
Version:	BeGaze 2.5.77
Sample Rate:	50
Subject:	S22H22551
Description:	Mathieu Chambre

Table Header for Fixations:
Event Type	Trial	Number	Start	End	Duration	Location X	Location Y	Dispersion X	Dispersion Y	Plane	Avg. Pupil Size X	Avg. Pupil Size Y

Table Header for Saccades:
Event Type	Trial	Number	Start	End	Duration	Start Loc.X	Start Loc.Y	End Loc.X	End Loc.Y	Amplitude	Peak Speed	Peak Speed At	Average Speed	Peak Accel.	Peak Decel.	Average Accel.

Table Header for Blinks:
Event Type	Trial	Number	Start	End	Duration

Table Header for User Events:
Event Type	Trial	Number	Start	Description

UserEvent	1	1	4978046272	# Message: void.jpg
Saccade L	1	1	4978050300	4978070168	19868	838.59	229.44	998.98	231.08	1.11	162.23	1.00	55.68	120.49	-4024.52	1381.67
Saccade R	1	1	4978050300	4978070168	19868	838.59	229.44	998.98	231.08	1.11	162.23	1.00	55.68	120.49	-4024.52	1381.67
Fixation L	1	1	4978070168	4978269025	198857	1001.61	227.00	4	10	-1	14.27	14.27
Fixation R	1	1	4978070168	4978269025	198857	1001.61	227.00	4	10	-1	14.26	14.26
Blink L	1	1	4978269025	4978468010	198985
Blink R	1	1	4978269025	4978468010	198985
Fixation L	1	2	4978468010	4978647001	178991	1211.97	239.17	20	26	-1	15.65	15.65
Fixation R	1	2	4978468010	4978647001	178991	1211.97	239.17	20	26	-1	15.69	15.69
Blink L	1	2	4978647001	4978825996	178995
Blink R	1	2	4978647001	4978825996	178995
Fixation L	1	3	4978825996	4979422714	596718	1203.64	306.44	39	58	-1	17.48	17.48
Fixation R	1	3	4978825996	4979422714	596718	1203.64	306.44	39	58	-1	17.76	17.76
Saccade L	1	2	4979422714	4979442590	19876	1226.62	330.90	1228.27	332.48	0.07	6.79	1.00	3.44	90.48	-11.70	41.15
Saccade R	1	2	4979422714	4979442590	19876	1226.62	330.90	1228.27	332.48	0.07	6.79	1.00	3.44	90.48	-11.70	41.15
Fixation L	1	4	4979442590	4980098937	656347	1222.18	323.73	63	30	-1	18.45	18.45
Fixation R	1	4	4979442590	4980098937	656347	1222.18	323.73	63	30	-1	18.55	18.55
