[BeGaze]
Converted from:	C:\Documents and Settings\iViewX\Desktop\EXPERIMENTATIONS\Experiments\results\finaleart\S4120113-finaleart-1.idf
Date:	27.03.2019 15:34:25
Version:	BeGaze 2.5.77
Sample Rate:	50
Subject:	S4120113
Description:	Vidal Attias

Table Header for Fixations:
Event Type	Trial	Number	Start	End	Duration	Location X	Location Y	Dispersion X	Dispersion Y	Plane	Avg. Pupil Size X	Avg. Pupil Size Y

Table Header for Saccades:
Event Type	Trial	Number	Start	End	Duration	Start Loc.X	Start Loc.Y	End Loc.X	End Loc.Y	Amplitude	Peak Speed	Peak Speed At	Average Speed	Peak Accel.	Peak Decel.	Average Accel.

Table Header for Blinks:
Event Type	Trial	Number	Start	End	Duration

Table Header for User Events:
Event Type	Trial	Number	Start	Description

UserEvent	1	1	6611810433	# Message: still-life-with-pumpkin-plums-cherries-figs-and-jug-Ribot-1860.jpg
Fixation L	1	1	6611823009	6612340115	517106	1050.69	586.55	7	54	-1	13.60	13.60
Fixation R	1	1	6611823009	6612340115	517106	1050.69	586.55	7	54	-1	14.08	14.08
Saccade L	1	1	6612340115	6612360111	19996	1053.46	613.55	1088.47	631.79	0.40	39.94	1.00	19.98	957.38	-777.05	714.38
Saccade R	1	1	6612340115	6612360111	19996	1053.46	613.55	1088.47	631.79	0.40	39.94	1.00	19.98	957.38	-777.05	714.38
Fixation L	1	2	6612360111	6613235183	875072	1095.31	668.23	23	57	-1	14.56	14.56
Fixation R	1	2	6612360111	6613235183	875072	1095.31	668.23	23	57	-1	15.03	15.03
Saccade L	1	2	6613235183	6613255040	19857	1094.98	662.54	1162.74	649.04	0.45	69.89	1.00	22.91	1478.12	-1634.15	1048.55
Saccade R	1	2	6613235183	6613255040	19857	1094.98	662.54	1162.74	649.04	0.45	69.89	1.00	22.91	1478.12	-1634.15	1048.55
Fixation L	1	3	6613255040	6614010877	755837	1175.93	671.74	36	63	-1	15.84	15.84
Fixation R	1	3	6613255040	6614010877	755837	1175.93	671.74	36	63	-1	16.06	16.06
Saccade L	1	3	6614010877	6614030748	19871	1189.56	660.74	1265.48	669.56	0.58	77.32	1.00	28.96	1817.23	-1291.72	1300.81
Saccade R	1	3	6614010877	6614030748	19871	1189.56	660.74	1265.48	669.56	0.58	77.32	1.00	28.96	1817.23	-1291.72	1300.81
Fixation L	1	4	6614030748	6614448469	417721	1262.90	731.09	13	78	-1	16.09	16.09
Fixation R	1	4	6614030748	6614448469	417721	1262.90	731.09	13	78	-1	16.18	16.18
Saccade L	1	4	6614448469	6614468353	19884	1256.22	748.16	1245.67	743.53	0.14	11.66	1.00	6.89	85.90	-145.21	77.34
Saccade R	1	4	6614448469	6614468353	19884	1256.22	748.16	1245.67	743.53	0.14	11.66	1.00	6.89	85.90	-145.21	77.34
Fixation L	1	5	6614468353	6614945689	477336	1249.29	739.08	20	28	-1	15.47	15.47
Fixation R	1	5	6614468353	6614945689	477336	1249.29	739.08	20	28	-1	15.41	15.41
Saccade L	1	5	6614945689	6614965572	19883	1262.01	730.98	1248.55	818.41	0.84	89.48	1.00	42.43	1741.74	-1704.32	1364.78
Saccade R	1	5	6614945689	6614965572	19883	1262.01	730.98	1248.55	818.41	0.84	89.48	1.00	42.43	1741.74	-1704.32	1364.78
Fixation L	1	6	6614965572	6615104808	139236	1252.71	796.22	9	42	-1	15.15	15.15
Fixation R	1	6	6614965572	6615104808	139236	1252.71	796.22	9	42	-1	15.07	15.07
Saccade L	1	6	6615104808	6615164547	59739	1252.29	799.00	762.04	726.61	5.46	278.20	0.67	91.36	6880.78	-6250.46	3759.53
Saccade R	1	6	6615104808	6615164547	59739	1252.29	799.00	762.04	726.61	5.46	278.20	0.67	91.36	6880.78	-6250.46	3759.53
Fixation L	1	7	6615164547	6615403178	238631	762.35	707.27	9	27	-1	14.77	14.77
Fixation R	1	7	6615164547	6615403178	238631	762.35	707.27	9	27	-1	15.91	15.91
Saccade L	1	7	6615403178	6615423055	19877	762.03	711.11	664.42	731.20	0.67	100.81	1.00	33.57	2322.11	-2244.80	1652.26
Saccade R	1	7	6615403178	6615423055	19877	762.03	711.11	664.42	731.20	0.67	100.81	1.00	33.57	2322.11	-2244.80	1652.26
Fixation L	1	8	6615423055	6615721401	298346	648.31	751.17	39	44	-1	13.23	13.23
Fixation R	1	8	6615423055	6615721401	298346	648.31	751.17	39	44	-1	14.73	14.73
Saccade L	1	8	6615721401	6615801022	79621	625.13	775.24	622.63	793.76	1.17	19.21	0.25	14.71	54.84	-310.70	85.81
Saccade R	1	8	6615721401	6615801022	79621	625.13	775.24	622.63	793.76	1.17	19.21	0.25	14.71	54.84	-310.70	85.81
