[BeGaze]
Converted from:	C:\Documents and Settings\iViewX\Desktop\EXPERIMENTATIONS\Experiments\results\finaleart\S12H22222-finaleart-1.idf
Date:	27.03.2019 15:40:18
Version:	BeGaze 2.5.77
Sample Rate:	50
Subject:	S12H22222
Description:	aurele barriere

Table Header for Fixations:
Event Type	Trial	Number	Start	End	Duration	Location X	Location Y	Dispersion X	Dispersion Y	Plane	Avg. Pupil Size X	Avg. Pupil Size Y

Table Header for Saccades:
Event Type	Trial	Number	Start	End	Duration	Start Loc.X	Start Loc.Y	End Loc.X	End Loc.Y	Amplitude	Peak Speed	Peak Speed At	Average Speed	Peak Accel.	Peak Decel.	Average Accel.

Table Header for Blinks:
Event Type	Trial	Number	Start	End	Duration

Table Header for User Events:
Event Type	Trial	Number	Start	Description

UserEvent	1	1	23381263577	# Message: Rapids_on_the_Petite_Creuse_at_Fresselines_Monet_1889.jpg
Fixation L	1	1	23381279562	23382254139	974577	982.44	618.15	31	67	-1	14.31	14.31
Fixation R	1	1	23381279562	23382254139	974577	982.44	618.15	31	67	-1	13.91	13.91
Saccade L	1	1	23382254139	23382373501	119362	972.91	651.97	1324.80	812.41	6.23	299.14	1.00	52.16	7332.76	-7170.68	2321.91
Saccade R	1	1	23382254139	23382373501	119362	972.91	651.97	1324.80	812.41	6.23	299.14	1.00	52.16	7332.76	-7170.68	2321.91
Fixation L	1	2	23382373501	23382592246	218745	1364.88	851.14	50	46	-1	12.95	12.95
Fixation R	1	2	23382373501	23382592246	218745	1364.88	851.14	50	46	-1	12.31	12.31
Saccade L	1	2	23382592246	23382632124	39878	1375.45	858.72	1250.97	413.59	3.81	250.75	0.50	95.50	6226.85	-6135.24	5675.79
Saccade R	1	2	23382592246	23382632124	39878	1375.45	858.72	1250.97	413.59	3.81	250.75	0.50	95.50	6226.85	-6135.24	5675.79
Fixation L	1	3	23382632124	23382970230	338106	1238.20	412.03	25	8	-1	13.00	13.00
Fixation R	1	3	23382632124	23382970230	338106	1238.20	412.03	25	8	-1	12.57	12.57
Saccade L	1	3	23382970230	23383009976	39746	1232.71	414.20	809.36	695.55	4.38	272.19	0.50	110.17	6748.94	-6033.29	6091.61
Saccade R	1	3	23382970230	23383009976	39746	1232.71	414.20	809.36	695.55	4.38	272.19	0.50	110.17	6748.94	-6033.29	6091.61
Fixation L	1	4	23383009976	23383547081	537105	777.43	685.81	40	34	-1	13.63	13.63
Fixation R	1	4	23383009976	23383547081	537105	777.43	685.81	40	34	-1	13.23	13.23
Saccade L	1	4	23383547081	23383586834	39753	775.21	696.06	867.83	592.27	1.58	98.21	0.50	39.75	2255.80	-2067.81	1983.25
Saccade R	1	4	23383547081	23383586834	39753	775.21	696.06	867.83	592.27	1.58	98.21	0.50	39.75	2255.80	-2067.81	1983.25
Fixation L	1	5	23383586834	23383785696	198862	866.45	572.93	8	25	-1	14.20	14.20
Fixation R	1	5	23383586834	23383785696	198862	866.45	572.93	8	25	-1	13.30	13.30
Saccade L	1	5	23383785696	23383805574	19878	860.75	567.56	678.81	565.92	0.97	184.00	1.00	48.98	4584.92	-4319.02	3010.31
Saccade R	1	5	23383785696	23383805574	19878	860.75	567.56	678.81	565.92	0.97	184.00	1.00	48.98	4584.92	-4319.02	3010.31
Fixation L	1	6	23383805574	23384243177	437603	697.31	575.96	38	20	-1	14.23	14.23
Fixation R	1	6	23383805574	23384243177	437603	697.31	575.96	38	20	-1	13.93	13.93
Saccade L	1	6	23384243177	23384282933	39756	717.08	579.91	1136.92	312.93	4.60	328.99	0.50	115.69	8173.75	-7236.95	5801.03
Saccade R	1	6	23384243177	23384282933	39756	717.08	579.91	1136.92	312.93	4.60	328.99	0.50	115.69	8173.75	-7236.95	5801.03
Fixation L	1	7	23384282933	23384641030	358097	1122.62	357.64	26	67	-1	14.70	14.70
Fixation R	1	7	23384282933	23384641030	358097	1122.62	357.64	26	67	-1	14.14	14.14
Saccade L	1	7	23384641030	23384680782	39752	1118.80	380.13	1029.22	510.92	1.38	122.99	1.00	34.69	3066.44	-2974.44	2008.82
Saccade R	1	7	23384641030	23384680782	39752	1118.80	380.13	1029.22	510.92	1.38	122.99	1.00	34.69	3066.44	-2974.44	2008.82
Fixation L	1	8	23384680782	23384839900	159118	1020.47	515.48	13	7	-1	14.98	14.98
Fixation R	1	8	23384680782	23384839900	159118	1020.47	515.48	13	7	-1	14.47	14.47
Saccade L	1	8	23384839900	23384879655	39755	1015.94	516.72	785.03	462.89	2.24	156.57	1.00	56.38	3890.03	-3246.86	2576.00
Saccade R	1	8	23384839900	23384879655	39755	1015.94	516.72	785.03	462.89	2.24	156.57	1.00	56.38	3890.03	-3246.86	2576.00
Fixation L	1	9	23384879655	23385078512	198857	766.14	412.65	25	62	-1	14.47	14.47
Fixation R	1	9	23384879655	23385078512	198857	766.14	412.65	25	62	-1	14.05	14.05
Saccade L	1	9	23385078512	23385118386	39874	766.11	401.33	546.26	383.26	2.23	114.49	1.00	55.90	2817.96	-2445.70	2336.58
Saccade R	1	9	23385078512	23385118386	39874	766.11	401.33	546.26	383.26	2.23	114.49	1.00	55.90	2817.96	-2445.70	2336.58
Fixation L	1	10	23385118386	23385257640	139254	544.71	324.30	8	74	-1	14.60	14.60
Fixation R	1	10	23385118386	23385257640	139254	544.71	324.30	8	74	-1	13.77	13.77
