[BeGaze]
Converted from:	C:\Documents and Settings\iViewX\Desktop\EXPERIMENTATIONS\Experiments\results\finaleart\S01A22542-finaleart-1.idf
Date:	27.03.2019 15:33:23
Version:	BeGaze 2.5.77
Sample Rate:	50
Subject:	S01A22542
Description:	Thibault Seve Minnaert

Table Header for Fixations:
Event Type	Trial	Number	Start	End	Duration	Location X	Location Y	Dispersion X	Dispersion Y	Plane	Avg. Pupil Size X	Avg. Pupil Size Y

Table Header for Saccades:
Event Type	Trial	Number	Start	End	Duration	Start Loc.X	Start Loc.Y	End Loc.X	End Loc.Y	Amplitude	Peak Speed	Peak Speed At	Average Speed	Peak Accel.	Peak Decel.	Average Accel.

Table Header for Blinks:
Event Type	Trial	Number	Start	End	Duration

Table Header for User Events:
Event Type	Trial	Number	Start	Description

UserEvent	1	1	9744707673	# Message: void.jpg
Fixation L	1	1	9744708596	9744887576	178980	614.89	914.71	22	29	-1	14.37	14.37
Fixation R	1	1	9744708596	9744887576	178980	614.89	914.71	22	29	-1	15.08	15.08
Saccade L	1	1	9744887576	9744907453	19877	606.92	928.03	495.90	930.11	0.75	112.32	1.00	37.65	2664.03	-2444.19	1948.95
Saccade R	1	1	9744887576	9744907453	19877	606.92	928.03	495.90	930.11	0.75	112.32	1.00	37.65	2664.03	-2444.19	1948.95
Fixation L	1	2	9744907453	9745066572	159119	475.13	973.19	27	67	-1	14.79	14.79
Fixation R	1	2	9744907453	9745066572	159119	475.13	973.19	27	67	-1	15.74	15.74
Saccade L	1	2	9745066572	9745086578	20006	475.99	997.85	479.47	1003.00	0.07	6.29	1.00	3.56	95.67	-123.19	106.39
Saccade R	1	2	9745066572	9745086578	20006	475.99	997.85	479.47	1003.00	0.07	6.29	1.00	3.56	95.67	-123.19	106.39
Fixation L	1	3	9745086578	9745185958	99380	480.64	1004.68	4	3	-1	14.89	14.89
Fixation R	1	3	9745086578	9745185958	99380	480.64	1004.68	4	3	-1	16.20	16.20
Blink L	1	1	9745185958	9745444570	258612
Blink R	1	1	9745185958	9745444570	258612
Fixation L	1	4	9745444570	9745762785	318215	1018.32	460.60	19	54	-1	15.93	15.93
Fixation R	1	4	9745444570	9745762785	318215	1018.32	460.60	19	54	-1	15.02	15.02
Saccade L	1	3	9745762785	9745782667	19882	1010.56	478.44	940.74	493.68	0.57	72.29	1.00	28.73	1785.32	-1465.67	1382.41
Saccade R	1	3	9745762785	9745782667	19882	1010.56	478.44	940.74	493.68	0.57	72.29	1.00	28.73	1785.32	-1465.67	1382.41
Fixation L	1	5	9745782667	9746200384	417717	912.34	484.59	64	33	-1	15.48	15.48
Fixation R	1	5	9745782667	9746200384	417717	912.34	484.59	64	33	-1	14.53	14.53
Saccade L	1	4	9746200384	9746220276	19892	947.89	497.41	953.05	504.21	0.10	8.63	1.00	4.89	175.83	-163.57	154.49
Saccade R	1	4	9746200384	9746220276	19892	947.89	497.41	953.05	504.21	0.10	8.63	1.00	4.89	175.83	-163.57	154.49
Fixation L	1	6	9746220276	9746339634	119358	940.84	509.59	70	25	-1	14.91	14.91
Fixation R	1	6	9746220276	9746339634	119358	940.84	509.59	70	25	-1	13.67	13.67
Saccade L	1	5	9746339634	9746359523	19889	886.13	528.97	874.84	556.51	0.60	42.84	0.00	30.10	-80.83	-719.08	473.76
Saccade R	1	5	9746339634	9746359523	19889	886.13	528.97	874.84	556.51	0.60	42.84	0.00	30.10	-80.83	-719.08	473.76
Fixation L	1	7	9746359523	9746598141	238618	873.42	580.39	8	37	-1	14.95	14.95
Fixation R	1	7	9746359523	9746598141	238618	873.42	580.39	8	37	-1	14.16	14.16
Saccade L	1	6	9746598141	9746697623	99482	877.76	585.40	963.04	558.48	1.63	74.23	0.20	16.41	1731.49	-1681.00	612.25
Saccade R	1	6	9746598141	9746697623	99482	877.76	585.40	963.04	558.48	1.63	74.23	0.20	16.41	1731.49	-1681.00	612.25
