[BeGaze]
Converted from:	C:\Documents and Settings\iViewX\Desktop\EXPERIMENTATIONS\Experiments\results\finaleart\S14F27123-finaleart-1.idf
Date:	27.03.2019 15:42:59
Version:	BeGaze 2.5.77
Sample Rate:	50
Subject:	S14F27123
Description:	Anne-flore Perrin

Table Header for Fixations:
Event Type	Trial	Number	Start	End	Duration	Location X	Location Y	Dispersion X	Dispersion Y	Plane	Avg. Pupil Size X	Avg. Pupil Size Y

Table Header for Saccades:
Event Type	Trial	Number	Start	End	Duration	Start Loc.X	Start Loc.Y	End Loc.X	End Loc.Y	Amplitude	Peak Speed	Peak Speed At	Average Speed	Peak Accel.	Peak Decel.	Average Accel.

Table Header for Blinks:
Event Type	Trial	Number	Start	End	Duration

Table Header for User Events:
Event Type	Trial	Number	Start	Description

UserEvent	1	1	30434990126	# Message: void.jpg
Saccade L	1	1	30435002757	30435042626	39869	527.49	531.16	532.32	695.14	1.73	150.43	1.00	43.39	3760.78	-3710.23	1917.80
Saccade R	1	1	30435002757	30435042626	39869	527.49	531.16	532.32	695.14	1.73	150.43	1.00	43.39	3760.78	-3710.23	1917.80
Fixation L	1	1	30435042626	30435221615	178989	537.67	687.28	7	14	-1	14.16	14.16
Fixation R	1	1	30435042626	30435221615	178989	537.67	687.28	7	14	-1	14.40	14.40
Saccade L	1	2	30435221615	30435261362	39747	539.00	692.03	557.64	443.92	2.24	157.57	0.50	56.48	3887.36	-3320.58	2927.61
Saccade R	1	2	30435221615	30435261362	39747	539.00	692.03	557.64	443.92	2.24	157.57	0.50	56.48	3887.36	-3320.58	2927.61
Fixation L	1	2	30435261362	30435460235	198873	585.22	442.61	36	5	-1	14.45	14.45
Fixation R	1	2	30435261362	30435460235	198873	585.22	442.61	36	5	-1	14.60	14.60
Blink L	1	1	30435460235	30435539859	79624
Blink R	1	1	30435460235	30435539859	79624
Blink L	1	2	30435559728	30435897839	338111
Blink R	1	2	30435559728	30435897839	338111
Fixation L	1	3	30435897839	30436335445	437606	742.78	811.58	19	32	-1	13.67	13.67
Fixation R	1	3	30435897839	30436335445	437606	742.78	811.58	19	32	-1	13.83	13.83
Saccade L	1	3	30436335445	30436355320	19875	730.01	806.48	623.81	938.49	1.11	171.34	1.00	56.07	4092.59	-3707.59	2909.77
Saccade R	1	3	30436335445	30436355320	19875	730.01	806.48	623.81	938.49	1.11	171.34	1.00	56.07	4092.59	-3707.59	2909.77
Fixation L	1	4	30436355320	30436673555	318235	612.08	935.47	40	55	-1	13.00	13.00
Fixation R	1	4	30436355320	30436673555	318235	612.08	935.47	40	55	-1	17.21	17.21
