[BeGaze]
Converted from:	C:\Documents and Settings\iViewX\Desktop\EXPERIMENTATIONS\Experiments\results\finaleart\S1022551-finaleart-1.idf
Date:	27.03.2019 15:38:25
Version:	BeGaze 2.5.77
Sample Rate:	50
Subject:	S1022551
Description:	Alexis Nebout

Table Header for Fixations:
Event Type	Trial	Number	Start	End	Duration	Location X	Location Y	Dispersion X	Dispersion Y	Plane	Avg. Pupil Size X	Avg. Pupil Size Y

Table Header for Saccades:
Event Type	Trial	Number	Start	End	Duration	Start Loc.X	Start Loc.Y	End Loc.X	End Loc.Y	Amplitude	Peak Speed	Peak Speed At	Average Speed	Peak Accel.	Peak Decel.	Average Accel.

Table Header for Blinks:
Event Type	Trial	Number	Start	End	Duration

Table Header for User Events:
Event Type	Trial	Number	Start	Description

UserEvent	1	1	8944515839	# Message: nature_morte_aux_oranges_Vlaminck_1909.jpg
Fixation L	1	1	8944519130	8945334707	815577	948.54	535.21	27	72	-1	11.41	11.41
Fixation R	1	1	8944519130	8945334707	815577	948.54	535.21	27	72	-1	10.25	10.25
Saccade L	1	1	8945334707	8945354587	19880	933.96	568.18	933.03	569.58	0.05	3.23	1.00	2.37	17.66	-8.42	9.29
Saccade R	1	1	8945334707	8945354587	19880	933.96	568.18	933.03	569.58	0.05	3.23	1.00	2.37	17.66	-8.42	9.29
Fixation L	1	2	8945354587	8945533440	178853	933.58	570.86	1	2	-1	11.35	11.35
Fixation R	1	2	8945354587	8945533440	178853	933.58	570.86	1	2	-1	10.11	10.11
Saccade L	1	2	8945533440	8945593197	59757	932.71	570.69	562.15	679.32	4.88	210.59	1.00	81.60	5228.80	-5158.45	4752.60
Saccade R	1	2	8945533440	8945593197	59757	932.71	570.69	562.15	679.32	4.88	210.59	1.00	81.60	5228.80	-5158.45	4752.60
Fixation L	1	3	8945593197	8946170042	576845	590.08	683.95	49	49	-1	9.71	9.71
Fixation R	1	3	8945593197	8946170042	576845	590.08	683.95	49	49	-1	9.35	9.35
Saccade L	1	3	8946170042	8946189915	19873	611.07	694.20	613.73	709.68	0.21	20.48	0.00	10.66	313.56	-438.80	334.40
Saccade R	1	3	8946170042	8946189915	19873	611.07	694.20	613.73	709.68	0.21	20.48	0.00	10.66	313.56	-438.80	334.40
Fixation L	1	4	8946189915	8946906010	716095	615.75	707.35	75	11	-1	10.56	10.56
Fixation R	1	4	8946189915	8946906010	716095	615.75	707.35	75	11	-1	10.23	10.23
Saccade L	1	4	8946906010	8946945748	39738	684.68	702.10	961.77	584.39	3.24	228.44	0.50	81.50	5673.94	-4769.86	3142.40
Saccade R	1	4	8946906010	8946945748	39738	684.68	702.10	961.77	584.39	3.24	228.44	0.50	81.50	5673.94	-4769.86	3142.40
Fixation L	1	5	8946945748	8947661851	716103	937.58	607.12	31	35	-1	11.53	11.53
Fixation R	1	5	8946945748	8947661851	716103	937.58	607.12	31	35	-1	10.74	10.74
Saccade L	1	5	8947661851	8947701587	39736	930.76	617.81	1166.87	613.61	1.94	125.18	0.50	48.74	3075.86	-3087.06	2940.93
Saccade R	1	5	8947661851	8947701587	39736	930.76	617.81	1166.87	613.61	1.94	125.18	0.50	48.74	3075.86	-3087.06	2940.93
Fixation L	1	6	8947701587	8948437567	735980	1146.31	616.72	52	40	-1	11.98	11.98
Fixation R	1	6	8947701587	8948437567	735980	1146.31	616.72	52	40	-1	10.68	10.68
Saccade L	1	6	8948437567	8948517053	79486	1114.71	638.22	1105.97	654.79	0.46	10.76	1.00	5.85	108.81	-158.97	94.21
Saccade R	1	6	8948437567	8948517053	79486	1114.71	638.22	1105.97	654.79	0.46	10.76	1.00	5.85	108.81	-158.97	94.21
