[BeGaze]
Converted from:	C:\Documents and Settings\iViewX\Desktop\EXPERIMENTATIONS\Experiments\results\finaleart\S8119532-finaleart-1.idf
Date:	27.03.2019 16:01:06
Version:	BeGaze 2.5.77
Sample Rate:	50
Subject:	S8119532
Description:	Alexandre Drewery

Table Header for Fixations:
Event Type	Trial	Number	Start	End	Duration	Location X	Location Y	Dispersion X	Dispersion Y	Plane	Avg. Pupil Size X	Avg. Pupil Size Y

Table Header for Saccades:
Event Type	Trial	Number	Start	End	Duration	Start Loc.X	Start Loc.Y	End Loc.X	End Loc.Y	Amplitude	Peak Speed	Peak Speed At	Average Speed	Peak Accel.	Peak Decel.	Average Accel.

Table Header for Blinks:
Event Type	Trial	Number	Start	End	Duration

Table Header for User Events:
Event Type	Trial	Number	Start	Description

UserEvent	1	1	3472637067	# Message: reclining-nude_renoir_1883.jpg
Fixation L	1	1	3472652283	3472990495	338212	792.69	467.56	42	38	-1	12.22	12.22
Fixation R	1	1	3472652283	3472990495	338212	792.69	467.56	42	38	-1	13.93	13.93
Saccade L	1	1	3472990495	3473020489	29994	829.26	481.11	881.48	465.37	1.04	55.18	1.00	34.73	1330.02	-1071.32	1016.81
Saccade R	1	1	3472990495	3473020489	29994	829.26	481.11	881.48	465.37	1.04	55.18	1.00	34.73	1330.02	-1071.32	1016.81
Fixation L	1	2	3473020489	3473111520	91031	892.91	475.05	18	37	-1	12.48	12.48
Fixation R	1	2	3473020489	3473111520	91031	892.91	475.05	18	37	-1	14.26	14.26
Saccade L	1	2	3473111520	3473229115	117595	897.20	454.17	900.12	470.76	4.24	85.75	1.00	36.10	1700.80	-1981.16	902.41
Saccade R	1	2	3473111520	3473229115	117595	897.20	454.17	900.12	470.76	4.24	85.75	1.00	36.10	1700.80	-1981.16	902.41
Fixation L	1	3	3473229115	3473593209	364094	901.85	487.21	5	34	-1	12.98	12.98
Fixation R	1	3	3473229115	3473593209	364094	901.85	487.21	5	34	-1	14.85	14.85
Saccade L	1	3	3473593209	3473805970	212761	901.54	505.10	619.38	377.32	11.82	275.97	0.16	55.56	6667.43	-6805.35	2094.78
Saccade R	1	3	3473593209	3473805970	212761	901.54	505.10	619.38	377.32	11.82	275.97	0.16	55.56	6667.43	-6805.35	2094.78
Fixation L	1	4	3473805970	3473905324	99354	594.12	337.42	46	52	-1	11.57	11.57
Fixation R	1	4	3473805970	3473905324	99354	594.12	337.42	46	52	-1	12.79	12.79
Saccade L	1	4	3473905324	3473984941	79617	611.14	333.56	726.24	329.68	3.24	120.78	1.00	40.66	2354.92	-1733.06	1022.19
Saccade R	1	4	3473905324	3473984941	79617	611.14	333.56	726.24	329.68	3.24	120.78	1.00	40.66	2354.92	-1733.06	1022.19
Fixation L	1	5	3473984941	3474144066	159125	741.39	325.60	79	16	-1	11.54	11.54
Fixation R	1	5	3473984941	3474144066	159125	741.39	325.60	79	16	-1	13.03	13.03
Saccade L	1	5	3474144066	3474860152	716086	762.05	330.75	1281.03	326.93	57.32	391.00	0.06	80.05	9547.28	-8265.62	2386.53
Saccade R	1	5	3474144066	3474860152	716086	762.05	330.75	1281.03	326.93	57.32	391.00	0.06	80.05	9547.28	-8265.62	2386.53
Fixation L	1	6	3474860152	3475059017	198865	1225.42	325.64	72	19	-1	12.31	12.31
Fixation R	1	6	3474860152	3475059017	198865	1225.42	325.64	72	19	-1	13.23	13.23
Saccade L	1	6	3475059017	3475098767	39750	1212.02	333.07	1073.23	289.92	1.43	79.45	0.50	35.96	1787.21	-1645.55	1289.05
Saccade R	1	6	3475059017	3475098767	39750	1212.02	333.07	1073.23	289.92	1.43	79.45	0.50	35.96	1787.21	-1645.55	1289.05
Fixation L	1	7	3475098767	3475277770	179003	1096.35	283.69	57	28	-1	11.77	11.77
Fixation R	1	7	3475098767	3475277770	179003	1096.35	283.69	57	28	-1	12.57	12.57
Saccade L	1	7	3475277770	3475317509	39739	1117.02	283.88	1471.33	265.31	3.46	201.11	1.00	87.12	4583.90	-4414.40	4336.41
Saccade R	1	7	3475277770	3475317509	39739	1117.02	283.88	1471.33	265.31	3.46	201.11	1.00	87.12	4583.90	-4414.40	4336.41
Fixation L	1	8	3475317509	3475456745	139236	1471.67	274.36	32	58	-1	11.92	11.92
Fixation R	1	8	3475317509	3475456745	139236	1471.67	274.36	32	58	-1	12.47	12.47
Saccade L	1	8	3475456745	3475476630	19885	1473.59	249.42	1483.99	213.14	0.62	38.18	1.00	31.00	489.69	-811.05	506.63
Saccade R	1	8	3475456745	3475476630	19885	1473.59	249.42	1483.99	213.14	0.62	38.18	1.00	31.00	489.69	-811.05	506.63
Fixation L	1	9	3475476630	3475576124	99494	1478.13	251.69	11	61	-1	12.11	12.11
Fixation R	1	9	3475476630	3475576124	99494	1478.13	251.69	11	61	-1	12.56	12.56
Saccade L	1	9	3475576124	3475635864	59740	1483.02	273.79	728.77	332.71	8.17	342.99	0.67	136.76	8502.36	-8053.35	6232.55
Saccade R	1	9	3475576124	3475635864	59740	1483.02	273.79	728.77	332.71	8.17	342.99	0.67	136.76	8502.36	-8053.35	6232.55
Fixation L	1	10	3475635864	3475934103	298239	709.22	328.11	38	26	-1	11.98	11.98
Fixation R	1	10	3475635864	3475954095	318231	709.83	329.76	38	40	-1	13.54	13.54
Blink L	1	1	3475934103	3476212586	278483
Blink R	1	1	3475954095	3476212586	258491
Saccade L	1	10	3476212586	3476331952	119366	497.94	346.03	511.19	313.51	5.13	80.06	0.50	43.00	1682.68	-1723.68	1254.90
Saccade R	1	10	3476212586	3476331952	119366	497.94	346.03	511.19	313.51	5.13	80.06	0.50	43.00	1682.68	-1723.68	1254.90
Fixation L	1	11	3476331952	3476451345	119393	509.88	307.35	12	80	-1	14.54	14.54
Fixation R	1	11	3476331952	3476451345	119393	509.88	307.35	12	80	-1	15.70	15.70
Saccade L	1	11	3476451345	3476471199	19854	508.35	253.24	522.12	345.94	0.97	94.80	1.00	48.64	579.29	-2339.02	1054.10
Saccade R	1	11	3476451345	3476471199	19854	508.35	253.24	522.12	345.94	0.97	94.80	1.00	48.64	579.29	-2339.02	1054.10
Fixation L	1	12	3476471199	3476650187	178988	502.23	343.76	32	45	-1	14.39	14.39
Fixation R	1	12	3476471199	3476650187	178988	502.23	343.76	32	45	-1	15.56	15.56
