[BeGaze]
Converted from:	C:\Documents and Settings\iViewX\Desktop\EXPERIMENTATIONS\Experiments\results\finaleart\S02123220-finaleart-1.idf
Date:	27.03.2019 15:33:32
Version:	BeGaze 2.5.77
Sample Rate:	50
Subject:	S02123220
Description:	David Xu

Table Header for Fixations:
Event Type	Trial	Number	Start	End	Duration	Location X	Location Y	Dispersion X	Dispersion Y	Plane	Avg. Pupil Size X	Avg. Pupil Size Y

Table Header for Saccades:
Event Type	Trial	Number	Start	End	Duration	Start Loc.X	Start Loc.Y	End Loc.X	End Loc.Y	Amplitude	Peak Speed	Peak Speed At	Average Speed	Peak Accel.	Peak Decel.	Average Accel.

Table Header for Blinks:
Event Type	Trial	Number	Start	End	Duration

Table Header for User Events:
Event Type	Trial	Number	Start	Description

UserEvent	1	1	734988108	# Message: void.jpg
Saccade L	1	1	734988512	735346534	358022	486.50	819.25	1071.37	680.37	45.17	405.64	0.11	126.16	10141.08	-9716.82	3328.92
Saccade R	1	1	734988512	735346534	358022	486.50	819.25	1071.37	680.37	45.17	405.64	0.11	126.16	10141.08	-9716.82	3328.92
Fixation L	1	1	735346534	735445991	99457	1070.33	632.54	5	85	-1	14.27	14.27
Fixation R	1	1	735346534	735445991	99457	1070.33	632.54	5	85	-1	14.28	14.28
Saccade L	1	2	735445991	735505613	59622	1069.19	641.75	1069.81	570.95	2.39	82.48	1.00	40.12	3808.98	-1469.91	1496.80
Saccade R	1	2	735445991	735505613	59622	1069.19	641.75	1069.81	570.95	2.39	82.48	1.00	40.12	3808.98	-1469.91	1496.80
Blink L	1	1	735505613	735823873	318260
Blink R	1	1	735505613	735823873	318260
Fixation L	1	2	735823873	736062574	238701	1032.75	426.39	13	84	-1	15.32	15.32
Fixation R	1	2	735823873	736062574	238701	1032.75	426.39	13	84	-1	14.29	14.29
Saccade L	1	3	736062574	736082456	19882	1026.09	424.70	1022.56	463.69	0.49	39.60	1.00	24.63	626.99	-616.30	536.93
Saccade R	1	3	736062574	736082456	19882	1026.09	424.70	1022.56	463.69	0.49	39.60	1.00	24.63	626.99	-616.30	536.93
Fixation L	1	3	736082456	736181949	99493	1016.09	435.26	19	60	-1	15.54	15.54
Fixation R	1	3	736082456	736181949	99493	1016.09	435.26	19	60	-1	14.49	14.49
Saccade L	1	4	736181949	736420570	238621	1003.09	430.88	919.51	468.51	36.57	257.96	1.00	153.27	5135.47	-6388.91	3023.61
Saccade R	1	4	736181949	736420570	238621	1003.09	430.88	919.51	468.51	36.57	257.96	1.00	153.27	5135.47	-6388.91	3023.61
Fixation L	1	4	736420570	736559798	139228	924.01	464.52	8	6	-1	15.71	15.71
Fixation R	1	4	736420570	736559798	139228	924.01	464.52	8	6	-1	14.60	14.60
Saccade L	1	5	736559798	736659296	99498	923.83	464.12	927.53	462.83	13.15	283.84	0.60	132.19	5977.87	-6157.63	3723.83
Saccade R	1	5	736559798	736659296	99498	923.83	464.12	927.53	462.83	13.15	283.84	0.60	132.19	5977.87	-6157.63	3723.83
Fixation L	1	5	736659296	736897909	238613	923.87	459.81	7	15	-1	15.99	15.99
Fixation R	1	5	736659296	736897909	238613	923.87	459.81	7	15	-1	14.93	14.93
Saccade L	1	6	736897909	736977521	79612	924.98	465.91	928.60	472.14	7.81	289.26	0.50	98.14	7138.80	-7148.51	5642.55
Saccade R	1	6	736897909	736977521	79612	924.98	465.91	928.60	472.14	7.81	289.26	0.50	98.14	7138.80	-7148.51	5642.55
