[BeGaze]
Converted from:	C:\Documents and Settings\iViewX\Desktop\EXPERIMENTATIONS\Experiments\results\finaleart\S15H25531-finaleart-1.idf
Date:	27.03.2019 15:44:42
Version:	BeGaze 2.5.77
Sample Rate:	50
Subject:	S15H25531
Description:	Mikail Demirdelen

Table Header for Fixations:
Event Type	Trial	Number	Start	End	Duration	Location X	Location Y	Dispersion X	Dispersion Y	Plane	Avg. Pupil Size X	Avg. Pupil Size Y

Table Header for Saccades:
Event Type	Trial	Number	Start	End	Duration	Start Loc.X	Start Loc.Y	End Loc.X	End Loc.Y	Amplitude	Peak Speed	Peak Speed At	Average Speed	Peak Accel.	Peak Decel.	Average Accel.

Table Header for Blinks:
Event Type	Trial	Number	Start	End	Duration

Table Header for User Events:
Event Type	Trial	Number	Start	Description

UserEvent	1	1	3797570081	# Message: Niagara_Falls_Hale_1902.jpg
Fixation L	1	1	3797586872	3798044344	457472	1011.75	869.19	19	18	-1	13.96	13.96
Fixation R	1	1	3797586872	3798044344	457472	1011.75	869.19	19	18	-1	15.18	15.18
Saccade L	1	1	3798044344	3798064220	19876	996.52	871.69	700.44	870.11	1.65	299.25	1.00	82.89	7449.95	-7023.00	4877.17
Saccade R	1	1	3798044344	3798064220	19876	996.52	871.69	700.44	870.11	1.65	299.25	1.00	82.89	7449.95	-7023.00	4877.17
Fixation L	1	2	3798064220	3798362588	298368	661.93	857.09	65	33	-1	13.36	13.36
Fixation R	1	2	3798064220	3798362588	298368	661.93	857.09	65	33	-1	14.70	14.70
Saccade L	1	2	3798362588	3798382447	19859	635.01	836.49	618.11	803.99	0.41	37.06	1.00	20.86	815.75	-368.03	396.43
Saccade R	1	2	3798362588	3798382447	19859	635.01	836.49	618.11	803.99	0.41	37.06	1.00	20.86	815.75	-368.03	396.43
Fixation L	1	3	3798382447	3798800186	417739	622.45	799.92	48	37	-1	12.32	12.32
Fixation R	1	3	3798382447	3798800186	417739	622.45	799.92	48	37	-1	13.99	13.99
Saccade L	1	3	3798800186	3798820052	19866	656.46	786.59	671.15	786.78	0.29	22.95	0.00	14.53	131.42	-305.87	213.89
Saccade R	1	3	3798800186	3798820052	19866	656.46	786.59	671.15	786.78	0.29	22.95	0.00	14.53	131.42	-305.87	213.89
Fixation L	1	4	3798820052	3799098541	278489	689.35	773.79	23	24	-1	12.37	12.37
Fixation R	1	4	3798820052	3799098541	278489	689.35	773.79	23	24	-1	14.10	14.10
Saccade L	1	4	3799098541	3799158166	59625	692.09	765.31	1071.96	354.61	6.22	222.14	0.33	104.33	5514.21	-3810.19	3737.60
Saccade R	1	4	3799098541	3799158166	59625	692.09	765.31	1071.96	354.61	6.22	222.14	0.33	104.33	5514.21	-3810.19	3737.60
Fixation L	1	5	3799158166	3799376903	218737	1090.30	311.56	23	60	-1	12.42	12.42
Fixation R	1	5	3799158166	3799376903	218737	1090.30	311.56	23	60	-1	13.76	13.76
Saccade L	1	5	3799376903	3799396905	20002	1094.96	307.34	1100.52	269.76	0.23	38.44	1.00	11.72	858.29	-906.16	602.68
Saccade R	1	5	3799376903	3799396905	20002	1094.96	307.34	1100.52	269.76	0.23	38.44	1.00	11.72	858.29	-906.16	602.68
Fixation L	1	6	3799396905	3799794630	397725	1101.24	282.56	9	35	-1	11.61	11.61
Fixation R	1	6	3799396905	3799794630	397725	1101.24	282.56	9	35	-1	12.95	12.95
Saccade L	1	6	3799794630	3799834384	39754	1096.90	298.86	1414.41	207.11	2.93	210.76	1.00	73.76	5181.23	-4037.47	3678.52
Saccade R	1	6	3799794630	3799834384	39754	1096.90	298.86	1414.41	207.11	2.93	210.76	1.00	73.76	5181.23	-4037.47	3678.52
Fixation L	1	7	3799834384	3800152620	318236	1417.30	186.73	4	53	-1	11.12	11.12
Fixation R	1	7	3799834384	3800152620	318236	1417.30	186.73	4	53	-1	12.24	12.24
Saccade L	1	7	3800152620	3800192497	39877	1417.07	178.70	1650.55	94.18	2.35	132.20	1.00	59.05	3206.45	-2515.42	2793.58
Saccade R	1	7	3800152620	3800192497	39877	1417.07	178.70	1650.55	94.18	2.35	132.20	1.00	59.05	3206.45	-2515.42	2793.58
Fixation L	1	8	3800192497	3800371481	178984	1618.28	117.69	53	46	-1	11.37	11.37
Fixation R	1	8	3800192497	3800371481	178984	1618.28	117.69	53	46	-1	12.55	12.55
Saccade L	1	8	3800371481	3800431102	59621	1604.11	129.64	1562.93	139.61	0.78	37.07	1.00	13.07	763.99	-117.02	239.28
Saccade R	1	8	3800371481	3800431102	59621	1604.11	129.64	1562.93	139.61	0.78	37.07	1.00	13.07	763.99	-117.02	239.28
Fixation L	1	9	3800431102	3800550472	119370	1529.99	122.91	62	29	-1	11.84	11.84
Fixation R	1	9	3800431102	3800550472	119370	1529.99	122.91	62	29	-1	12.87	12.87
Saccade L	1	9	3800550472	3800629973	79501	1505.30	118.38	1509.03	106.66	5.25	402.79	1.00	66.05	9708.55	-173.50	3116.30
Saccade R	1	9	3800550472	3800789204	238732	1505.30	118.38	460.45	719.10	29.47	402.79	0.42	123.46	9708.55	-8630.18	2734.38
Blink L	1	1	3800629973	3800828958	198985
Fixation R	1	10	3800789204	3801266587	477383	500.88	750.71	51	47	-1	15.00	15.00
Fixation L	1	10	3800828958	3801266587	437629	502.27	752.50	16	35	-1	13.74	13.74
Saccade L	1	10	3801266587	3801286435	19848	503.42	762.75	712.07	765.52	1.19	211.00	1.00	60.19	5180.76	-5037.66	3584.03
Saccade R	1	10	3801266587	3801286435	19848	503.42	762.75	712.07	765.52	1.19	211.00	1.00	60.19	5180.76	-5037.66	3584.03
Fixation L	1	11	3801286435	3801564929	278494	700.31	771.50	23	10	-1	13.86	13.86
Fixation R	1	11	3801286435	3801564929	278494	700.31	771.50	23	10	-1	15.37	15.37
