[BeGaze]
Converted from:	C:\Documents and Settings\iViewX\Desktop\EXPERIMENTATIONS\Experiments\results\finaleart\S20H24222-finaleart-1.idf
Date:	27.03.2019 15:52:20
Version:	BeGaze 2.5.77
Sample Rate:	50
Subject:	S20H24222
Description:	Hugo Brument

Table Header for Fixations:
Event Type	Trial	Number	Start	End	Duration	Location X	Location Y	Dispersion X	Dispersion Y	Plane	Avg. Pupil Size X	Avg. Pupil Size Y

Table Header for Saccades:
Event Type	Trial	Number	Start	End	Duration	Start Loc.X	Start Loc.Y	End Loc.X	End Loc.Y	Amplitude	Peak Speed	Peak Speed At	Average Speed	Peak Accel.	Peak Decel.	Average Accel.

Table Header for Blinks:
Event Type	Trial	Number	Start	End	Duration

Table Header for User Events:
Event Type	Trial	Number	Start	Description

UserEvent	1	1	11158637501	# Message: void.jpg
Fixation L	1	1	11158640752	11158879488	238736	818.70	63.09	9	58	-1	9.44	9.44
Fixation R	1	1	11158640752	11158879488	238736	818.70	63.09	9	58	-1	10.30	10.30
Saccade L	1	1	11158879488	11158919233	39745	811.86	109.18	677.34	470.80	3.73	212.57	0.50	93.77	5121.30	-4654.93	4502.69
Saccade R	1	1	11158879488	11158919233	39745	811.86	109.18	677.34	470.80	3.73	212.57	0.50	93.77	5121.30	-4654.93	4502.69
Fixation L	1	2	11158919233	11159078352	159119	670.13	479.58	17	30	-1	9.84	9.84
Fixation R	1	2	11158919233	11159078352	159119	670.13	479.58	17	30	-1	10.43	10.43
Blink L	1	1	11159078352	11159336962	258610
Blink R	1	1	11159078352	11159336962	258610
Fixation L	1	3	11159336962	11159854071	517109	949.14	738.07	19	58	-1	11.44	11.44
Fixation R	1	3	11159336962	11159854071	517109	949.14	738.07	19	58	-1	13.24	13.24
Saccade L	1	2	11159854071	11159873945	19874	936.52	764.39	939.80	639.76	1.01	126.11	1.00	50.75	2550.67	-2307.28	1974.83
Saccade R	1	2	11159854071	11159873945	19874	936.52	764.39	939.80	639.76	1.01	126.11	1.00	50.75	2550.67	-2307.28	1974.83
Fixation L	1	4	11159873945	11160212045	338100	957.74	621.17	25	46	-1	11.92	11.92
Fixation R	1	4	11159873945	11160212045	338100	957.74	621.17	25	46	-1	13.92	13.92
Saccade L	1	3	11160212045	11160231925	19880	955.38	605.07	836.84	588.42	0.73	121.07	1.00	36.97	2863.05	-2731.54	2006.03
Saccade R	1	3	11160212045	11160231925	19880	955.38	605.07	836.84	588.42	0.73	121.07	1.00	36.97	2863.05	-2731.54	2006.03
Fixation L	1	5	11160231925	11160629788	397863	829.14	567.86	15	38	-1	12.59	12.59
Fixation R	1	5	11160231925	11160629788	397863	829.14	567.86	15	38	-1	14.42	14.42
