[BeGaze]
Converted from:	C:\Documents and Settings\iViewX\Desktop\EXPERIMENTATIONS\Experiments\results\finaleart\S9H29221-finaleart-1.idf
Date:	27.03.2019 16:02:28
Version:	BeGaze 2.5.77
Sample Rate:	50
Subject:	S9H29221
Description:	steven

Table Header for Fixations:
Event Type	Trial	Number	Start	End	Duration	Location X	Location Y	Dispersion X	Dispersion Y	Plane	Avg. Pupil Size X	Avg. Pupil Size Y

Table Header for Saccades:
Event Type	Trial	Number	Start	End	Duration	Start Loc.X	Start Loc.Y	End Loc.X	End Loc.Y	Amplitude	Peak Speed	Peak Speed At	Average Speed	Peak Accel.	Peak Decel.	Average Accel.

Table Header for Blinks:
Event Type	Trial	Number	Start	End	Duration

Table Header for User Events:
Event Type	Trial	Number	Start	Description

UserEvent	1	1	5807681941	# Message: Ma_Maison_Martin_XXXX.jpg
Fixation L	1	1	5807701678	5807980170	278492	1771.56	347.56	66	30	-1	14.70	14.70
Fixation R	1	1	5807701678	5807980170	278492	1771.56	347.56	66	30	-1	13.62	13.62
Saccade L	1	1	5807980170	5808000035	19865	1824.83	339.72	1887.96	333.86	0.87	66.06	0.00	43.97	1522.92	-876.00	996.47
Saccade R	1	1	5807980170	5808000035	19865	1824.83	339.72	1887.96	333.86	0.87	66.06	0.00	43.97	1522.92	-876.00	996.47
Fixation L	1	2	5808000035	5808318294	318259	1865.23	354.88	57	37	-1	14.55	14.55
Fixation R	1	2	5808000035	5808318294	318259	1865.23	354.88	57	37	-1	13.45	13.45
Saccade L	1	2	5808318294	5808417652	99358	1830.41	369.86	1189.15	522.99	9.32	266.07	0.80	93.78	4597.85	-6240.85	3286.26
Saccade R	1	2	5808318294	5808417652	99358	1830.41	369.86	1189.15	522.99	9.32	266.07	0.80	93.78	4597.85	-6240.85	3286.26
Fixation L	1	3	5808417652	5808627592	209940	1175.50	484.13	19	61	-1	13.87	13.87
Fixation R	1	3	5808417652	5808627592	209940	1175.50	484.13	19	61	-1	12.76	12.76
Saccade L	1	3	5808627592	5808676265	48673	1175.13	463.60	1445.23	412.41	2.94	148.92	0.59	60.50	3598.00	-3361.73	3291.59
Saccade R	1	3	5808627592	5808676265	48673	1175.13	463.60	1445.23	412.41	2.94	148.92	0.59	60.50	3598.00	-3361.73	3291.59
Fixation L	1	4	5808676265	5809233239	556974	1457.28	386.30	29	59	-1	12.12	12.12
Fixation R	1	4	5808676265	5809233239	556974	1457.28	386.30	29	59	-1	11.47	11.47
Saccade L	1	4	5809233239	5809253103	19864	1474.40	365.57	1482.78	359.55	0.11	10.44	1.00	5.52	154.20	-56.90	90.54
Saccade R	1	4	5809233239	5809253103	19864	1474.40	365.57	1482.78	359.55	0.11	10.44	1.00	5.52	154.20	-56.90	90.54
Fixation L	1	5	5809253103	5809491721	238618	1497.68	360.25	21	24	-1	11.36	11.36
Fixation R	1	5	5809253103	5809491721	238618	1497.68	360.25	21	24	-1	10.47	10.47
Saccade L	1	5	5809491721	5809551477	59756	1496.79	378.66	1413.09	732.04	4.14	160.96	0.33	69.31	3888.73	-2284.58	2507.06
Saccade R	1	5	5809491721	5809551477	59756	1496.79	378.66	1413.09	732.04	4.14	160.96	0.33	69.31	3888.73	-2284.58	2507.06
Fixation L	1	6	5809551477	5809750333	198856	1391.58	748.59	30	27	-1	11.50	11.50
Fixation R	1	6	5809551477	5809750333	198856	1391.58	748.59	30	27	-1	10.66	10.66
Saccade L	1	6	5809750333	5809809948	59615	1391.20	759.16	1420.43	988.54	2.64	95.77	0.67	44.22	2302.38	-1906.52	1573.69
Saccade R	1	6	5809750333	5809809948	59615	1391.20	759.16	1420.43	988.54	2.64	95.77	0.67	44.22	2302.38	-1906.52	1573.69
Fixation L	1	7	5809809948	5809909450	99502	1448.86	996.68	47	37	-1	11.42	11.42
Fixation R	1	7	5809809948	5809909450	99502	1448.86	996.68	47	37	-1	10.68	10.68
Saccade L	1	7	5809909450	5809929337	19887	1468.03	973.00	1474.43	952.03	0.32	28.80	0.00	16.14	331.67	-602.90	394.98
Saccade R	1	7	5809909450	5809929337	19887	1468.03	973.00	1474.43	952.03	0.32	28.80	0.00	16.14	331.67	-602.90	394.98
Fixation L	1	8	5809929337	5810068570	139233	1491.37	991.06	33	64	-1	11.19	11.19
Fixation R	1	8	5809929337	5810068570	139233	1491.37	991.06	33	64	-1	10.51	10.51
Saccade L	1	8	5810068570	5810128191	59621	1507.21	1015.36	1520.67	1023.43	1.40	89.95	1.00	23.49	3341.07	-222.50	1118.21
Saccade R	1	8	5810068570	5810128191	59621	1507.21	1015.36	1520.67	1023.43	1.40	89.95	1.00	23.49	3341.07	-222.50	1118.21
Blink L	1	1	5810128191	5810307189	178998
Blink R	1	1	5810128191	5810307189	178998
Saccade L	1	9	5810307189	5810744781	437592	898.86	936.09	601.87	454.64	58.91	1283.43	1.00	134.63	4076.12	-28473.38	3113.33
Saccade R	1	9	5810307189	5810744781	437592	898.86	936.09	601.87	454.64	58.91	1283.43	1.00	134.63	4076.12	-28473.38	3113.33
Fixation L	1	9	5810744781	5811142637	397856	617.36	404.95	23	75	-1	11.05	11.05
Fixation R	1	9	5810744781	5811142637	397856	617.36	404.95	23	75	-1	10.58	10.58
Saccade L	1	10	5811142637	5811162512	19875	618.78	379.33	618.10	376.28	0.04	3.16	1.00	1.91	625.77	25.54	233.77
Saccade R	1	10	5811142637	5811162512	19875	618.78	379.33	618.10	376.28	0.04	3.16	1.00	1.91	625.77	25.54	233.77
Fixation L	1	10	5811162512	5811281884	119372	669.37	373.03	90	6	-1	10.89	10.89
Fixation R	1	10	5811162512	5811281884	119372	669.37	373.03	90	6	-1	10.36	10.36
Saccade L	1	11	5811281884	5811301757	19873	708.23	369.48	713.85	367.69	0.05	5.96	1.00	2.63	83.38	-111.63	66.20
Saccade R	1	11	5811281884	5811301757	19873	708.23	369.48	713.85	367.69	0.05	5.96	1.00	2.63	83.38	-111.63	66.20
Fixation L	1	11	5811301757	5811500636	198879	719.06	363.72	11	12	-1	10.86	10.86
Fixation R	1	11	5811301757	5811500636	198879	719.06	363.72	11	12	-1	10.31	10.31
Saccade L	1	12	5811500636	5811520500	19864	725.03	355.47	825.45	255.63	0.76	143.22	1.00	38.34	3572.26	-3335.76	2353.52
Saccade R	1	12	5811500636	5811520500	19864	725.03	355.47	825.45	255.63	0.76	143.22	1.00	38.34	3572.26	-3335.76	2353.52
Fixation L	1	12	5811520500	5811719501	199001	823.60	246.06	6	14	-1	10.77	10.77
Fixation R	1	12	5811520500	5811719501	199001	823.60	246.06	6	14	-1	10.46	10.46
