[BeGaze]
Converted from:	C:\Documents and Settings\iViewX\Desktop\EXPERIMENTATIONS\Experiments\results\finaleart\S7121223-finaleart-1.idf
Date:	27.03.2019 15:37:20
Version:	BeGaze 2.5.77
Sample Rate:	50
Subject:	S7121223
Description:	Gregoire pacreau

Table Header for Fixations:
Event Type	Trial	Number	Start	End	Duration	Location X	Location Y	Dispersion X	Dispersion Y	Plane	Avg. Pupil Size X	Avg. Pupil Size Y

Table Header for Saccades:
Event Type	Trial	Number	Start	End	Duration	Start Loc.X	Start Loc.Y	End Loc.X	End Loc.Y	Amplitude	Peak Speed	Peak Speed At	Average Speed	Peak Accel.	Peak Decel.	Average Accel.

Table Header for Blinks:
Event Type	Trial	Number	Start	End	Duration

Table Header for User Events:
Event Type	Trial	Number	Start	Description

UserEvent	1	1	5444738585	# Message: goya-Pavo-muerto-1812.jpg
Fixation L	1	1	5444757577	5445135501	377924	857.21	526.45	8	23	-1	14.87	14.87
Fixation R	1	1	5444757577	5445135501	377924	857.21	526.45	8	23	-1	14.79	14.79
Saccade L	1	1	5445135501	5445155490	19989	856.57	530.38	1005.95	541.20	0.81	151.47	1.00	40.66	3767.47	-3724.79	2510.23
Saccade R	1	1	5445135501	5445155490	19989	856.57	530.38	1005.95	541.20	0.81	151.47	1.00	40.66	3767.47	-3724.79	2510.23
Fixation L	1	2	5445155490	5445354300	198810	998.99	551.10	46	30	-1	15.01	15.01
Fixation R	1	2	5445155490	5445354300	198810	998.99	551.10	46	30	-1	14.55	14.55
Saccade L	1	2	5445354300	5445374155	19855	959.15	562.59	915.41	548.91	0.51	47.08	0.00	25.46	992.81	-1133.75	1048.20
Saccade R	1	2	5445354300	5445374155	19855	959.15	562.59	915.41	548.91	0.51	47.08	0.00	25.46	992.81	-1133.75	1048.20
Fixation L	1	3	5445374155	5445672514	298359	913.31	527.27	46	36	-1	13.75	13.75
Fixation R	1	3	5445374155	5445672514	298359	913.31	527.27	46	36	-1	12.91	12.91
Saccade L	1	3	5445672514	5445692386	19872	878.41	516.78	858.34	521.14	0.29	23.13	1.00	14.57	-58.86	-415.09	225.09
Saccade R	1	3	5445672514	5445692386	19872	878.41	516.78	858.34	521.14	0.29	23.13	1.00	14.57	-58.86	-415.09	225.09
Fixation L	1	4	5445692386	5445871377	178991	861.08	525.19	25	14	-1	13.83	13.83
Fixation R	1	4	5445692386	5445871377	178991	861.08	525.19	25	14	-1	13.45	13.45
Saccade L	1	4	5445871377	5445891262	19885	881.89	527.93	1026.10	537.24	0.87	146.16	1.00	44.00	3618.49	-3356.88	2524.75
Saccade R	1	4	5445871377	5445891262	19885	881.89	527.93	1026.10	537.24	0.87	146.16	1.00	44.00	3618.49	-3356.88	2524.75
Fixation L	1	5	5445891262	5446567467	676205	1006.83	556.61	40	31	-1	14.39	14.39
Fixation R	1	5	5445891262	5446567467	676205	1006.83	556.61	40	31	-1	13.62	13.62
Saccade L	1	5	5446567467	5446587346	19879	1012.00	544.68	1173.87	643.67	1.29	191.87	1.00	64.75	4708.56	-4421.29	3398.15
Saccade R	1	5	5446567467	5446587346	19879	1012.00	544.68	1173.87	643.67	1.29	191.87	1.00	64.75	4708.56	-4421.29	3398.15
Fixation L	1	6	5446587346	5446865824	278478	1187.19	696.79	17	67	-1	15.05	15.05
Fixation R	1	6	5446587346	5446865824	278478	1187.19	696.79	17	67	-1	14.19	14.19
Saccade L	1	6	5446865824	5446885701	19877	1190.24	711.56	1194.97	771.45	0.46	60.76	1.00	23.03	1482.94	-1278.37	1016.41
Saccade R	1	6	5446865824	5446885701	19877	1190.24	711.56	1194.97	771.45	0.46	60.76	1.00	23.03	1482.94	-1278.37	1016.41
Fixation L	1	7	5446885701	5447044816	159115	1222.97	795.49	42	35	-1	14.82	14.82
Fixation R	1	7	5446885701	5447044816	159115	1222.97	795.49	42	35	-1	14.22	14.22
Saccade L	1	7	5447044816	5447064692	19876	1237.23	806.72	1240.73	879.00	0.57	73.20	1.00	28.88	1689.76	-1695.29	1400.41
Saccade R	1	7	5447044816	5447064692	19876	1237.23	806.72	1240.73	879.00	0.57	73.20	1.00	28.88	1689.76	-1695.29	1400.41
Fixation L	1	8	5447064692	5447203937	139245	1249.42	912.70	17	58	-1	14.69	14.69
Fixation R	1	8	5447064692	5447203937	139245	1249.42	912.70	17	58	-1	13.48	13.48
Saccade L	1	8	5447203937	5447223803	19866	1257.92	937.34	1252.34	975.73	0.35	39.25	1.00	17.67	877.23	-671.75	562.62
Saccade R	1	8	5447203937	5447223803	19866	1257.92	937.34	1252.34	975.73	0.35	39.25	1.00	17.67	877.23	-671.75	562.62
Fixation L	1	9	5447223803	5447482417	258614	1242.26	1003.63	15	37	-1	14.64	14.64
Fixation R	1	9	5447223803	5447482417	258614	1242.26	1003.63	15	37	-1	13.67	13.67
Saccade L	1	9	5447482417	5447522172	39755	1236.71	1007.00	725.40	984.98	4.27	306.51	0.50	107.30	7615.68	-7276.64	6308.33
Saccade R	1	9	5447482417	5447522172	39755	1236.71	1007.00	725.40	984.98	4.27	306.51	0.50	107.30	7615.68	-7276.64	6308.33
Fixation L	1	10	5447522172	5447741027	218855	726.78	962.72	9	29	-1	14.61	14.61
Fixation R	1	10	5447522172	5447741027	218855	726.78	962.72	9	29	-1	14.07	14.07
Saccade L	1	10	5447741027	5447780784	39757	727.28	956.32	696.86	684.80	2.37	151.00	0.50	59.61	3690.57	-3373.25	3288.02
Saccade R	1	10	5447741027	5447780784	39757	727.28	956.32	696.86	684.80	2.37	151.00	0.50	59.61	3690.57	-3373.25	3288.02
Fixation L	1	11	5447780784	5447939895	159111	680.08	687.09	31	4	-1	13.84	13.84
Fixation R	1	11	5447780784	5447939895	159111	680.08	687.09	31	4	-1	13.66	13.66
Saccade L	1	11	5447939895	5447959769	19874	665.38	686.51	506.62	491.98	1.59	253.84	1.00	80.09	6310.13	-6243.16	4607.35
Saccade R	1	11	5447939895	5447959769	19874	665.38	686.51	506.62	491.98	1.59	253.84	1.00	80.09	6310.13	-6243.16	4607.35
Fixation L	1	12	5447959769	5448138767	178998	484.88	445.22	29	58	-1	13.71	13.71
Fixation R	1	12	5447959769	5448138767	178998	484.88	445.22	29	58	-1	13.50	13.50
Saccade L	1	12	5448138767	5448158640	19873	479.56	441.62	641.15	440.19	0.95	163.42	1.00	47.62	4025.69	-3616.44	2709.49
Saccade R	1	12	5448138767	5448158640	19873	479.56	441.62	641.15	440.19	0.95	163.42	1.00	47.62	4025.69	-3616.44	2709.49
Fixation L	1	13	5448158640	5448437121	278481	664.20	407.58	51	48	-1	13.80	13.80
Fixation R	1	13	5448158640	5448437121	278481	664.20	407.58	51	48	-1	14.01	14.01
Saccade L	1	13	5448437121	5448456991	19870	624.09	391.85	613.06	385.36	0.35	36.04	0.00	17.57	8.87	-722.42	253.76
Saccade R	1	13	5448437121	5448456991	19870	624.09	391.85	613.06	385.36	0.35	36.04	0.00	17.57	8.87	-722.42	253.76
Fixation L	1	14	5448456991	5448576364	119373	613.62	383.54	12	12	-1	14.68	14.68
Fixation R	1	14	5448456991	5448576364	119373	613.62	383.54	12	12	-1	14.82	14.82
Saccade L	1	14	5448576364	5448635984	59620	615.05	382.41	647.01	465.79	2.54	89.66	0.33	42.55	1960.18	-1417.85	1148.54
Saccade R	1	14	5448576364	5448635984	59620	615.05	382.41	647.01	465.79	2.54	89.66	0.33	42.55	1960.18	-1417.85	1148.54
Fixation L	1	15	5448635984	5448735481	99497	680.88	472.99	64	18	-1	15.51	15.51
Fixation R	1	15	5448635984	5448735481	99497	680.88	472.99	64	18	-1	15.57	15.57
