[BeGaze]
Converted from:	C:\Documents and Settings\iViewX\Desktop\EXPERIMENTATIONS\Experiments\results\finaleart\S7121223-finaleart-1.idf
Date:	27.03.2019 15:36:32
Version:	BeGaze 2.5.77
Sample Rate:	50
Subject:	S7121223
Description:	Gregoire pacreau

Table Header for Fixations:
Event Type	Trial	Number	Start	End	Duration	Location X	Location Y	Dispersion X	Dispersion Y	Plane	Avg. Pupil Size X	Avg. Pupil Size Y

Table Header for Saccades:
Event Type	Trial	Number	Start	End	Duration	Start Loc.X	Start Loc.Y	End Loc.X	End Loc.Y	Amplitude	Peak Speed	Peak Speed At	Average Speed	Peak Accel.	Peak Decel.	Average Accel.

Table Header for Blinks:
Event Type	Trial	Number	Start	End	Duration

Table Header for User Events:
Event Type	Trial	Number	Start	Description

UserEvent	1	1	3695792401	# Message: void.jpg
Fixation L	1	1	3695810982	3695910500	99518	912.35	743.88	4	11	-1	17.84	17.84
Fixation R	1	1	3695810982	3695910500	99518	912.35	743.88	4	11	-1	17.99	17.99
Saccade L	1	1	3695910500	3695930572	20072	914.73	749.09	916.86	832.50	0.48	84.41	1.00	23.98	2024.94	-2062.21	1375.57
Saccade R	1	1	3695910500	3695930572	20072	914.73	749.09	916.86	832.50	0.48	84.41	1.00	23.98	2024.94	-2062.21	1375.57
Fixation L	1	2	3695930572	3696468086	537514	930.69	848.83	23	24	-1	18.08	18.08
Fixation R	1	2	3695930572	3696468086	537514	930.69	848.83	23	24	-1	18.00	18.00
Saccade L	1	2	3696468086	3696547693	79607	938.41	849.52	903.55	667.75	2.71	114.85	0.25	34.09	2857.24	-2224.61	1184.60
Saccade R	1	2	3696468086	3696547693	79607	938.41	849.52	903.55	667.75	2.71	114.85	0.25	34.09	2857.24	-2224.61	1184.60
Fixation L	1	3	3696547693	3696766799	219106	897.89	596.47	12	87	-1	15.31	15.31
Fixation R	1	3	3696547693	3696766799	219106	897.89	596.47	12	87	-1	15.10	15.10
Saccade L	1	3	3696766799	3696786677	19878	893.19	580.51	892.79	579.44	0.02	1.38	0.00	1.10	20.89	-16.09	12.43
Saccade R	1	3	3696766799	3696786677	19878	893.19	580.51	892.79	579.44	0.02	1.38	0.00	1.10	20.89	-16.09	12.43
Fixation L	1	4	3696786677	3697782249	995572	889.29	599.10	17	41	-1	16.46	16.46
Fixation R	1	4	3696786677	3697782249	995572	889.29	599.10	17	41	-1	16.66	16.66
