[BeGaze]
Converted from:	C:\Documents and Settings\iViewX\Desktop\EXPERIMENTATIONS\Experiments\results\finaleart\S13H22431-finaleart-1.idf
Date:	27.03.2019 15:41:21
Version:	BeGaze 2.5.77
Sample Rate:	50
Subject:	S13H22431
Description:	Jimmy Petit

Table Header for Fixations:
Event Type	Trial	Number	Start	End	Duration	Location X	Location Y	Dispersion X	Dispersion Y	Plane	Avg. Pupil Size X	Avg. Pupil Size Y

Table Header for Saccades:
Event Type	Trial	Number	Start	End	Duration	Start Loc.X	Start Loc.Y	End Loc.X	End Loc.Y	Amplitude	Peak Speed	Peak Speed At	Average Speed	Peak Accel.	Peak Decel.	Average Accel.

Table Header for Blinks:
Event Type	Trial	Number	Start	End	Duration

Table Header for User Events:
Event Type	Trial	Number	Start	Description

UserEvent	1	1	27248549961	# Message: storm_off_normandy_cost_isabey_1850.jpg
Fixation L	1	1	27248553189	27248851544	298355	836.24	440.86	60	25	-1	16.46	16.46
Fixation R	1	1	27248553189	27248851544	298355	836.24	440.86	60	25	-1	17.08	17.08
Saccade L	1	1	27248851544	27248871449	19905	887.03	431.51	930.56	443.15	0.58	60.91	0.00	28.95	1077.73	-1351.42	1098.48
Saccade R	1	1	27248851544	27248871449	19905	887.03	431.51	930.56	443.15	0.58	60.91	0.00	28.95	1077.73	-1351.42	1098.48
Fixation L	1	2	27248871449	27249070406	198957	940.09	458.23	19	36	-1	16.84	16.84
Fixation R	1	2	27248871449	27249070406	198957	940.09	458.23	19	36	-1	17.20	17.20
Saccade L	1	2	27249070406	27249090282	19876	950.36	479.51	1042.35	476.95	0.61	93.09	1.00	30.81	2216.96	-1955.52	1516.30
Saccade R	1	2	27249070406	27249090282	19876	950.36	479.51	1042.35	476.95	0.61	93.09	1.00	30.81	2216.96	-1955.52	1516.30
Fixation L	1	3	27249090282	27249229532	139250	1037.03	486.19	20	15	-1	17.18	17.18
Fixation R	1	3	27249090282	27249229532	139250	1037.03	486.19	20	15	-1	17.62	17.62
Saccade L	1	3	27249229532	27249249412	19880	1050.21	489.48	1221.07	368.61	1.19	211.62	1.00	59.78	5055.16	-5117.22	3528.65
Saccade R	1	3	27249229532	27249249412	19880	1050.21	489.48	1221.07	368.61	1.19	211.62	1.00	59.78	5055.16	-5117.22	3528.65
Fixation L	1	4	27249249412	27249766498	517086	1212.42	411.14	22	64	-1	17.69	17.69
Fixation R	1	4	27249249412	27249766498	517086	1212.42	411.14	22	64	-1	17.60	17.60
Saccade L	1	4	27249766498	27249925621	159123	1222.52	431.94	648.13	684.40	11.25	333.35	0.88	70.70	8137.71	-8265.03	3467.26
Saccade R	1	4	27249766498	27249925621	159123	1222.52	431.94	648.13	684.40	11.25	333.35	0.88	70.70	8137.71	-8265.03	3467.26
Fixation L	1	5	27249925621	27250124486	198865	653.57	694.97	12	24	-1	18.14	18.14
Fixation R	1	5	27249925621	27250124486	198865	653.57	694.97	12	24	-1	18.45	18.45
Saccade L	1	5	27250124486	27250164350	39864	649.18	697.23	396.00	654.25	2.45	191.84	0.50	61.57	4756.76	-3967.84	2978.55
Saccade R	1	5	27250124486	27250164350	39864	649.18	697.23	396.00	654.25	2.45	191.84	0.50	61.57	4756.76	-3967.84	2978.55
Fixation L	1	6	27250164350	27250363222	198872	420.04	652.88	41	23	-1	17.69	17.69
Fixation R	1	6	27250164350	27250363222	198872	420.04	652.88	41	23	-1	17.61	17.61
Saccade L	1	6	27250363222	27250383110	19888	415.12	652.13	339.10	646.92	0.63	77.08	1.00	31.43	1821.03	-1501.47	1388.00
Saccade R	1	6	27250363222	27250383110	19888	415.12	652.13	339.10	646.92	0.63	77.08	1.00	31.43	1821.03	-1501.47	1388.00
Fixation L	1	7	27250383110	27250522340	139230	359.21	651.17	37	7	-1	17.93	17.93
Fixation R	1	7	27250383110	27250522340	139230	359.21	651.17	37	7	-1	17.96	17.96
Saccade L	1	7	27250522340	27250601839	79499	355.60	649.56	1207.13	416.01	10.69	323.48	0.50	134.44	8044.76	-6903.22	5022.10
Saccade R	1	7	27250522340	27250601839	79499	355.60	649.56	1207.13	416.01	10.69	323.48	0.50	134.44	8044.76	-6903.22	5022.10
Fixation L	1	8	27250601839	27250900201	298362	1206.49	433.04	25	25	-1	18.73	18.73
Fixation R	1	8	27250601839	27250900201	298362	1206.49	433.04	25	25	-1	18.64	18.64
Saccade L	1	8	27250900201	27250940079	39878	1214.68	439.62	1325.97	657.99	2.24	156.99	0.50	56.06	3772.20	-3740.21	3130.63
Saccade R	1	8	27250900201	27250940079	39878	1214.68	439.62	1325.97	657.99	2.24	156.99	0.50	56.06	3772.20	-3740.21	3130.63
Fixation L	1	9	27250940079	27251357684	417605	1327.19	648.86	17	46	-1	18.55	18.55
Fixation R	1	9	27250940079	27251357684	417605	1327.19	648.86	17	46	-1	18.44	18.44
Saccade L	1	9	27251357684	27251417437	59753	1337.50	619.20	1421.68	169.79	5.36	208.23	0.67	89.74	5082.23	-3685.70	3559.61
Saccade R	1	9	27251357684	27251417437	59753	1337.50	619.20	1421.68	169.79	5.36	208.23	0.67	89.74	5082.23	-3685.70	3559.61
Fixation L	1	10	27251417437	27251576558	159121	1432.33	128.31	25	64	-1	17.27	17.27
Fixation R	1	10	27251417437	27251576558	159121	1432.33	128.31	25	64	-1	17.03	17.03
Saccade L	1	10	27251576558	27251616295	39737	1435.30	135.24	978.45	143.50	4.40	256.78	1.00	110.67	6357.98	-6219.20	5156.22
Saccade R	1	10	27251576558	27251616295	39737	1435.30	135.24	978.45	143.50	4.40	256.78	1.00	110.67	6357.98	-6219.20	5156.22
Fixation L	1	11	27251616295	27251795291	178996	907.50	143.54	83	15	-1	17.09	17.09
Fixation R	1	11	27251616295	27251795291	178996	907.50	143.54	83	15	-1	17.01	17.01
Saccade L	1	11	27251795291	27251874910	79619	905.65	136.31	642.65	248.48	4.39	195.11	1.00	55.15	4822.03	-4527.72	2122.67
Saccade R	1	11	27251795291	27251874910	79619	905.65	136.31	642.65	248.48	4.39	195.11	1.00	55.15	4822.03	-4527.72	2122.67
Fixation L	1	12	27251874910	27252034029	159119	584.43	254.31	75	20	-1	17.81	17.81
Fixation R	1	12	27251874910	27252034029	159119	584.43	254.31	75	20	-1	17.83	17.83
Saccade L	1	12	27252034029	27252073782	39753	593.34	264.84	414.95	600.95	3.78	224.49	0.50	95.02	5560.20	-3872.94	4319.18
Saccade R	1	12	27252034029	27252073782	39753	593.34	264.84	414.95	600.95	3.78	224.49	0.50	95.02	5560.20	-3872.94	4319.18
Fixation L	1	13	27252073782	27252272650	198868	420.65	659.90	18	79	-1	18.39	18.39
Fixation R	1	13	27252073782	27252272650	198868	420.65	659.90	18	79	-1	18.85	18.85
Saccade L	1	13	27252272650	27252292517	19867	424.80	668.49	355.44	680.63	0.47	71.23	1.00	23.62	1712.89	-1633.48	1198.12
Saccade R	1	13	27252272650	27252292517	19867	424.80	668.49	355.44	680.63	0.47	71.23	1.00	23.62	1712.89	-1633.48	1198.12
Fixation L	1	14	27252292517	27252531254	238737	343.65	679.88	20	12	-1	18.10	18.10
Fixation R	1	14	27252292517	27252531254	238737	343.65	679.88	20	12	-1	18.74	18.74
