[BeGaze]
Converted from:	C:\Documents and Settings\iViewX\Desktop\EXPERIMENTATIONS\Experiments\results\finaleart\S15H25531-finaleart-1.idf
Date:	27.03.2019 15:45:41
Version:	BeGaze 2.5.77
Sample Rate:	50
Subject:	S15H25531
Description:	Mikail Demirdelen

Table Header for Fixations:
Event Type	Trial	Number	Start	End	Duration	Location X	Location Y	Dispersion X	Dispersion Y	Plane	Avg. Pupil Size X	Avg. Pupil Size Y

Table Header for Saccades:
Event Type	Trial	Number	Start	End	Duration	Start Loc.X	Start Loc.Y	End Loc.X	End Loc.Y	Amplitude	Peak Speed	Peak Speed At	Average Speed	Peak Accel.	Peak Decel.	Average Accel.

Table Header for Blinks:
Event Type	Trial	Number	Start	End	Duration

Table Header for User Events:
Event Type	Trial	Number	Start	Description

UserEvent	1	1	4557758236	# Message: void.jpg
Fixation L	1	1	4557766915	4558204522	437607	1028.42	454.05	11	82	-1	12.00	12.00
Fixation R	1	1	4557766915	4558204522	437607	1028.42	454.05	11	82	-1	12.62	12.62
Saccade L	1	1	4558204522	4558224384	19862	1024.67	522.78	1004.30	489.96	0.75	70.42	0.00	37.93	704.42	-977.38	800.67
Saccade R	1	1	4558204522	4558224384	19862	1024.67	522.78	1004.30	489.96	0.75	70.42	0.00	37.93	704.42	-977.38	800.67
Fixation L	1	2	4558224384	4558522736	298352	982.06	522.61	38	56	-1	12.10	12.10
Fixation R	1	2	4558224384	4558522736	298352	982.06	522.61	38	56	-1	12.69	12.69
Saccade L	1	2	4558522736	4558542618	19882	970.01	546.06	967.53	550.54	0.12	9.33	1.00	5.98	-97.63	-133.59	111.70
Saccade R	1	2	4558522736	4558542618	19882	970.01	546.06	967.53	550.54	0.12	9.33	1.00	5.98	-97.63	-133.59	111.70
Fixation L	1	3	4558542618	4558641995	99377	966.26	555.96	2	16	-1	12.53	12.53
Fixation R	1	3	4558542618	4558641995	99377	966.26	555.96	2	16	-1	12.96	12.96
Blink L	1	1	4558641995	4558741477	99482
Saccade R	1	3	4558641995	4558801107	159112	965.98	566.86	959.16	508.01	24.31	388.89	0.38	152.81	5865.11	-9510.70	4247.57
Saccade L	1	3	4558741477	4558801107	59630	963.85	688.27	959.16	508.01	7.93	378.00	1.00	133.06	2470.56	-4993.09	2827.68
Fixation L	1	4	4558801107	4559755936	954829	950.07	537.89	14	68	-1	13.52	13.52
Fixation R	1	4	4558801107	4559755936	954829	950.07	537.89	14	68	-1	14.15	14.15
