[BeGaze]
Converted from:	C:\Documents and Settings\iViewX\Desktop\EXPERIMENTATIONS\Experiments\results\finaleart\S1022551-finaleart-1.idf
Date:	27.03.2019 15:38:31
Version:	BeGaze 2.5.77
Sample Rate:	50
Subject:	S1022551
Description:	Alexis Nebout

Table Header for Fixations:
Event Type	Trial	Number	Start	End	Duration	Location X	Location Y	Dispersion X	Dispersion Y	Plane	Avg. Pupil Size X	Avg. Pupil Size Y

Table Header for Saccades:
Event Type	Trial	Number	Start	End	Duration	Start Loc.X	Start Loc.Y	End Loc.X	End Loc.Y	Amplitude	Peak Speed	Peak Speed At	Average Speed	Peak Accel.	Peak Decel.	Average Accel.

Table Header for Blinks:
Event Type	Trial	Number	Start	End	Duration

Table Header for User Events:
Event Type	Trial	Number	Start	Description

UserEvent	1	1	9041018561	# Message: void.jpg
Fixation L	1	1	9041030014	9041370491	340477	1142.59	619.88	10	63	-1	15.05	15.05
Fixation R	1	1	9041030014	9041370491	340477	1142.59	619.88	10	63	-1	12.06	12.06
Saccade L	1	1	9041370491	9041388127	17636	1135.61	587.72	810.17	587.73	1.57	328.87	1.00	89.09	8054.22	-8183.41	5427.70
Saccade R	1	1	9041370491	9041388127	17636	1135.61	587.72	810.17	587.73	1.57	328.87	1.00	89.09	8054.22	-8183.41	5427.70
Fixation L	1	2	9041388127	9041567103	178976	813.63	585.19	7	22	-1	15.21	15.21
Fixation R	1	2	9041388127	9041567103	178976	813.63	585.19	7	22	-1	12.01	12.01
Saccade L	1	2	9041567103	9041606860	39757	813.73	587.94	815.87	340.80	2.15	149.30	0.50	53.98	3632.95	-3521.82	2990.05
Saccade R	1	2	9041567103	9041606860	39757	813.73	587.94	815.87	340.80	2.15	149.30	0.50	53.98	3632.95	-3521.82	2990.05
Fixation L	1	3	9041606860	9042342814	735954	818.30	360.40	17	67	-1	12.83	12.83
Fixation R	1	3	9041606860	9042342814	735954	818.30	360.40	17	67	-1	9.95	9.95
Saccade L	1	3	9042342814	9042362702	19888	820.72	393.79	821.04	434.64	0.31	41.32	1.00	15.48	1015.00	-634.35	578.18
Saccade R	1	3	9042342814	9042362702	19888	820.72	393.79	821.04	434.64	0.31	41.32	1.00	15.48	1015.00	-634.35	578.18
Fixation L	1	4	9042362702	9042700798	338096	815.15	464.19	34	65	-1	10.92	10.92
Fixation R	1	4	9042362702	9042700798	338096	815.15	464.19	34	65	-1	8.62	8.62
Saccade L	1	4	9042700798	9042720677	19879	844.55	500.04	846.91	515.41	0.35	34.05	0.00	17.79	66.41	-643.56	310.72
Saccade R	1	4	9042700798	9042720677	19879	844.55	500.04	846.91	515.41	0.35	34.05	0.00	17.79	66.41	-643.56	310.72
Fixation L	1	5	9042720677	9043019038	298361	876.36	518.23	67	21	-1	10.67	10.67
Fixation R	1	5	9042720677	9043019038	298361	876.36	518.23	67	21	-1	8.55	8.55
Saccade L	1	5	9043019038	9043038903	19865	905.27	530.27	909.80	548.14	0.22	18.65	1.00	11.01	239.22	0.00	119.61
Saccade R	1	5	9043019038	9043038903	19865	905.27	530.27	909.80	548.14	0.22	18.65	1.00	11.01	239.22	0.00	119.61
