[BeGaze]
Converted from:	C:\Documents and Settings\iViewX\Desktop\EXPERIMENTATIONS\Experiments\results\finaleart\S6124332-finaleart-1.idf
Date:	27.03.2019 15:36:00
Version:	BeGaze 2.5.77
Sample Rate:	50
Subject:	S6124332
Description:	Romain Ferrand

Table Header for Fixations:
Event Type	Trial	Number	Start	End	Duration	Location X	Location Y	Dispersion X	Dispersion Y	Plane	Avg. Pupil Size X	Avg. Pupil Size Y

Table Header for Saccades:
Event Type	Trial	Number	Start	End	Duration	Start Loc.X	Start Loc.Y	End Loc.X	End Loc.Y	Amplitude	Peak Speed	Peak Speed At	Average Speed	Peak Accel.	Peak Decel.	Average Accel.

Table Header for Blinks:
Event Type	Trial	Number	Start	End	Duration

Table Header for User Events:
Event Type	Trial	Number	Start	Description

UserEvent	1	1	12057596599	# Message: paysage_avec_du_betail_au_limousin_jules-dupre_1837.jpg
Fixation L	1	1	12057613845	12058051444	437599	931.12	842.93	6	5	-1	18.53	18.53
Fixation R	1	1	12057613845	12058051444	437599	931.12	842.93	6	5	-1	17.55	17.55
Saccade L	1	1	12058051444	12058091183	39739	933.22	844.66	735.89	957.67	1.99	151.56	1.00	50.04	3765.78	-3745.19	2815.57
Saccade R	1	1	12058051444	12058091183	39739	933.22	844.66	735.89	957.67	1.99	151.56	1.00	50.04	3765.78	-3745.19	2815.57
Fixation L	1	2	12058091183	12058250295	159112	745.04	972.63	11	28	-1	17.77	17.77
Fixation R	1	2	12058091183	12058250295	159112	745.04	972.63	11	28	-1	16.72	16.72
Saccade L	1	2	12058250295	12058270169	19874	746.00	986.42	661.81	995.34	0.69	85.64	1.00	34.81	1947.98	-1961.01	1522.33
Saccade R	1	2	12058250295	12058270169	19874	746.00	986.42	661.81	995.34	0.69	85.64	1.00	34.81	1947.98	-1961.01	1522.33
Fixation L	1	3	12058270169	12058469026	198857	622.16	987.74	53	15	-1	16.65	16.65
Fixation R	1	3	12058270169	12058469026	198857	622.16	987.74	53	15	-1	15.63	15.63
Saccade L	1	3	12058469026	12058488909	19883	635.67	979.78	701.22	982.70	0.51	66.37	1.00	25.88	1610.86	-1566.90	1154.17
Saccade R	1	3	12058469026	12058488909	19883	635.67	979.78	701.22	982.70	0.51	66.37	1.00	25.88	1610.86	-1566.90	1154.17
Fixation L	1	4	12058488909	12058926512	437603	683.58	970.62	69	30	-1	16.79	16.79
Fixation R	1	4	12058488909	12058926512	437603	683.58	970.62	69	30	-1	16.08	16.08
Saccade L	1	4	12058926512	12058946371	19859	649.56	957.65	648.43	939.26	0.13	18.63	1.00	6.76	435.65	-291.87	252.22
Saccade R	1	4	12058926512	12058946371	19859	649.56	957.65	648.43	939.26	0.13	18.63	1.00	6.76	435.65	-291.87	252.22
Fixation L	1	5	12058946371	12059145365	198994	646.88	922.38	4	38	-1	16.93	16.93
Fixation R	1	5	12058946371	12059145365	198994	646.88	922.38	4	38	-1	16.32	16.32
Saccade L	1	5	12059145365	12059204979	59614	648.04	906.41	1329.80	891.28	7.14	289.81	0.33	119.74	6982.54	-6165.54	5297.02
Saccade R	1	5	12059145365	12059204979	59614	648.04	906.41	1329.80	891.28	7.14	289.81	0.33	119.74	6982.54	-6165.54	5297.02
Fixation L	1	6	12059204979	12059722070	517091	1344.37	889.74	85	14	-1	16.85	16.85
Fixation R	1	6	12059204979	12059722070	517091	1344.37	889.74	85	14	-1	15.80	15.80
Saccade L	1	6	12059722070	12059741949	19879	1380.45	897.42	1322.09	926.39	0.55	65.91	1.00	27.81	1553.91	-1338.75	1153.13
Saccade R	1	6	12059722070	12059741949	19879	1380.45	897.42	1322.09	926.39	0.55	65.91	1.00	27.81	1553.91	-1338.75	1153.13
Fixation L	1	7	12059741949	12060000561	258612	1302.74	952.44	33	38	-1	17.59	17.59
Fixation R	1	7	12059741949	12060000561	258612	1302.74	952.44	33	38	-1	15.98	15.98
Saccade L	1	7	12060000561	12060020432	19871	1321.22	922.52	1350.26	828.24	0.90	99.79	1.00	45.40	2414.37	-1491.32	1466.73
Saccade R	1	7	12060000561	12060020432	19871	1321.22	922.52	1350.26	828.24	0.90	99.79	1.00	45.40	2414.37	-1491.32	1466.73
Fixation L	1	8	12060020432	12060119935	99503	1384.11	804.87	55	38	-1	18.37	18.37
Fixation R	1	8	12060020432	12060119935	99503	1384.11	804.87	55	38	-1	16.63	16.63
Saccade L	1	8	12060119935	12060199419	79484	1393.75	803.51	919.35	587.18	6.52	174.53	0.75	82.00	3477.72	-4047.29	2432.92
Saccade R	1	8	12060119935	12060199419	79484	1393.75	803.51	919.35	587.18	6.52	174.53	0.75	82.00	3477.72	-4047.29	2432.92
Fixation L	1	9	12060199419	12060497781	298362	923.12	582.82	6	27	-1	18.48	18.48
Fixation R	1	9	12060199419	12060497781	298362	923.12	582.82	6	27	-1	17.27	17.27
Saccade L	1	9	12060497781	12060517659	19878	919.63	589.80	853.25	540.93	0.67	83.38	1.00	33.82	2006.51	-1894.61	1638.59
Saccade R	1	9	12060497781	12060517659	19878	919.63	589.80	853.25	540.93	0.67	83.38	1.00	33.82	2006.51	-1894.61	1638.59
Fixation L	1	10	12060517659	12060656902	139243	834.08	499.04	25	54	-1	17.67	17.67
Fixation R	1	10	12060517659	12060656902	139243	834.08	499.04	25	54	-1	16.69	16.69
Saccade L	1	10	12060656902	12060696773	39871	828.51	489.72	600.44	381.64	2.69	149.64	1.00	67.47	3651.36	-2765.92	2705.77
Saccade R	1	10	12060656902	12060696773	39871	828.51	489.72	600.44	381.64	2.69	149.64	1.00	67.47	3651.36	-2765.92	2705.77
Fixation L	1	11	12060696773	12060955247	258474	578.05	395.84	31	53	-1	16.61	16.61
Fixation R	1	11	12060696773	12060955247	258474	578.05	395.84	31	53	-1	16.03	16.03
Saccade L	1	11	12060955247	12061034876	79629	568.90	387.66	209.05	1006.47	9.21	328.10	0.50	115.72	8152.88	-5492.03	4646.20
Saccade R	1	11	12060955247	12061034876	79629	568.90	387.66	209.05	1006.47	9.21	328.10	0.50	115.72	8152.88	-5492.03	4646.20
Fixation L	1	12	12061034876	12061273480	238604	221.34	1074.01	18	79	-1	15.60	15.60
Fixation R	1	12	12061034876	12061273480	238604	221.34	1074.01	18	79	-1	15.93	15.93
Saccade L	1	12	12061273480	12061293368	19888	225.57	1085.19	295.46	1054.83	0.65	77.08	1.00	32.46	1819.58	-1356.45	1443.26
Saccade R	1	12	12061273480	12061293368	19888	225.57	1085.19	295.46	1054.83	0.65	77.08	1.00	32.46	1819.58	-1356.45	1443.26
Fixation L	1	13	12061293368	12061591720	298352	340.56	1026.84	51	40	-1	16.20	16.20
Fixation R	1	13	12061293368	12061591720	298352	340.56	1026.84	51	40	-1	16.42	16.42
