[BeGaze]
Converted from:	C:\Documents and Settings\iViewX\Desktop\EXPERIMENTATIONS\Experiments\results\finaleart\S8119532-finaleart-1.idf
Date:	27.03.2019 16:00:59
Version:	BeGaze 2.5.77
Sample Rate:	50
Subject:	S8119532
Description:	Alexandre Drewery

Table Header for Fixations:
Event Type	Trial	Number	Start	End	Duration	Location X	Location Y	Dispersion X	Dispersion Y	Plane	Avg. Pupil Size X	Avg. Pupil Size Y

Table Header for Saccades:
Event Type	Trial	Number	Start	End	Duration	Start Loc.X	Start Loc.Y	End Loc.X	End Loc.Y	Amplitude	Peak Speed	Peak Speed At	Average Speed	Peak Accel.	Peak Decel.	Average Accel.

Table Header for Blinks:
Event Type	Trial	Number	Start	End	Duration

Table Header for User Events:
Event Type	Trial	Number	Start	Description

UserEvent	1	1	3429438770	# Message: Un_Jardin_Maison_Baptiste_Butler_1895.jpg
Fixation L	1	1	3429451216	3429966376	515160	947.89	513.73	37	45	-1	15.03	15.03
Fixation R	1	1	3429451216	3429966376	515160	947.89	513.73	37	45	-1	15.20	15.20
Saccade L	1	1	3429966376	3430008065	41689	920.87	516.94	901.42	525.60	0.74	25.66	1.00	17.81	147.54	-248.62	166.44
Saccade R	1	1	3429966376	3430008065	41689	920.87	516.94	901.42	525.60	0.74	25.66	1.00	17.81	147.54	-248.62	166.44
Fixation L	1	2	3430008065	3430206915	198850	901.88	526.02	15	19	-1	15.04	15.04
Fixation R	1	2	3430008065	3430206915	198850	901.88	526.02	15	19	-1	15.13	15.13
Saccade L	1	2	3430206915	3430226928	20013	897.08	535.26	897.47	646.88	0.62	112.90	1.00	30.77	2635.57	-2307.71	1664.55
Saccade R	1	2	3430206915	3430226928	20013	897.08	535.26	897.47	646.88	0.62	112.90	1.00	30.77	2635.57	-2307.71	1664.55
Fixation L	1	3	3430226928	3430456364	229436	894.89	640.71	5	30	-1	14.95	14.95
Fixation R	1	3	3430226928	3430456364	229436	894.89	640.71	5	30	-1	15.12	15.12
Saccade L	1	3	3430456364	3430485414	29050	892.66	622.35	759.59	691.03	1.62	151.45	1.00	55.80	3539.01	-3559.34	2368.59
Saccade R	1	3	3430456364	3430485414	29050	892.66	622.35	759.59	691.03	1.62	151.45	1.00	55.80	3539.01	-3559.34	2368.59
Fixation L	1	4	3430485414	3430584903	99489	768.65	715.75	60	39	-1	13.36	13.36
Fixation R	1	4	3430485414	3430584903	99489	768.65	715.75	60	39	-1	13.32	13.32
Saccade L	1	4	3430584903	3430644522	59619	815.59	716.75	1358.31	385.75	7.24	307.00	0.33	121.48	7402.60	-6133.69	5102.04
Saccade R	1	4	3430584903	3430644522	59619	815.59	716.75	1358.31	385.75	7.24	307.00	0.33	121.48	7402.60	-6133.69	5102.04
Fixation L	1	5	3430644522	3430962753	318231	1366.01	394.56	34	42	-1	12.80	12.80
Fixation R	1	5	3430644522	3430962753	318231	1366.01	394.56	34	42	-1	12.29	12.29
Saccade L	1	5	3430962753	3431002629	39876	1383.78	387.71	1086.90	332.14	2.89	153.97	1.00	72.50	3593.31	-3147.17	3308.16
Saccade R	1	5	3430962753	3431002629	39876	1383.78	387.71	1086.90	332.14	2.89	153.97	1.00	72.50	3593.31	-3147.17	3308.16
Fixation L	1	6	3431002629	3431261128	258499	1096.27	283.06	15	79	-1	12.45	12.45
Fixation R	1	6	3431002629	3431261128	258499	1096.27	283.06	15	79	-1	12.11	12.11
Blink L	1	1	3431261128	3431440110	178982
Blink R	1	1	3431261128	3431440110	178982
Fixation L	1	7	3431440110	3431619220	179110	991.08	580.52	13	55	-1	13.01	13.01
Fixation R	1	7	3431440110	3431619220	179110	991.08	580.52	13	55	-1	14.67	14.67
Saccade L	1	6	3431619220	3431658974	39754	995.18	585.79	1008.73	251.38	2.96	240.94	0.50	74.45	5849.89	-5680.93	4004.46
Saccade R	1	6	3431619220	3431658974	39754	995.18	585.79	1008.73	251.38	2.96	240.94	0.50	74.45	5849.89	-5680.93	4004.46
Fixation L	1	8	3431658974	3431778353	119379	1022.43	229.98	21	60	-1	11.87	11.87
Fixation R	1	8	3431658974	3431778353	119379	1022.43	229.98	21	60	-1	13.50	13.50
Saccade L	1	7	3431778353	3431798217	19864	1029.91	190.80	1035.21	177.72	0.29	34.54	0.00	14.66	180.51	-794.65	422.67
Saccade R	1	7	3431778353	3431798217	19864	1029.91	190.80	1035.21	177.72	0.29	34.54	0.00	14.66	180.51	-794.65	422.67
Fixation L	1	9	3431798217	3432554062	755845	1044.39	160.28	26	34	-1	10.67	10.67
Fixation R	1	9	3431798217	3432554062	755845	1044.39	160.28	26	34	-1	12.29	12.29
Saccade L	1	8	3432554062	3432593808	39746	1045.97	155.42	734.97	234.85	2.95	169.52	1.00	74.14	4094.12	-3972.64	3716.65
Saccade R	1	8	3432554062	3432593808	39746	1045.97	155.42	734.97	234.85	2.95	169.52	1.00	74.14	4094.12	-3972.64	3716.65
Fixation L	1	10	3432593808	3432792665	198857	767.28	244.61	41	41	-1	10.04	10.04
Fixation R	1	10	3432593808	3432792665	198857	767.28	244.61	41	41	-1	11.92	11.92
Saccade L	1	9	3432792665	3432812552	19887	766.38	275.21	531.77	311.84	1.55	240.07	1.00	78.02	5979.15	-5219.85	3889.02
Saccade R	1	9	3432792665	3432812552	19887	766.38	275.21	531.77	311.84	1.55	240.07	1.00	78.02	5979.15	-5219.85	3889.02
Fixation L	1	11	3432812552	3433110900	298348	515.22	348.79	26	68	-1	9.64	9.64
Fixation R	1	11	3432812552	3433110900	298348	515.22	348.79	26	68	-1	11.72	11.72
Saccade L	1	10	3433110900	3433130783	19883	534.86	380.70	596.48	401.12	0.60	65.67	1.00	29.97	1581.02	-1136.07	1062.33
Saccade R	1	10	3433110900	3433130783	19883	534.86	380.70	596.48	401.12	0.60	65.67	1.00	29.97	1581.02	-1136.07	1062.33
Fixation L	1	12	3433130783	3433369527	238744	592.45	396.18	27	23	-1	9.84	9.84
Fixation R	1	12	3433130783	3433369527	238744	592.45	396.18	27	23	-1	12.16	12.16
Saccade L	1	11	3433369527	3433429139	59612	598.72	381.96	991.03	708.11	6.30	246.61	0.33	105.73	6060.72	-5110.70	4217.12
Saccade R	1	11	3433369527	3433429139	59612	598.72	381.96	991.03	708.11	6.30	246.61	0.33	105.73	6060.72	-5110.70	4217.12
