[BeGaze]
Converted from:	C:\Documents and Settings\iViewX\Desktop\EXPERIMENTATIONS\Experiments\results\finaleart\S4120113-finaleart-1.idf
Date:	27.03.2019 15:34:31
Version:	BeGaze 2.5.77
Sample Rate:	50
Subject:	S4120113
Description:	Vidal Attias

Table Header for Fixations:
Event Type	Trial	Number	Start	End	Duration	Location X	Location Y	Dispersion X	Dispersion Y	Plane	Avg. Pupil Size X	Avg. Pupil Size Y

Table Header for Saccades:
Event Type	Trial	Number	Start	End	Duration	Start Loc.X	Start Loc.Y	End Loc.X	End Loc.Y	Amplitude	Peak Speed	Peak Speed At	Average Speed	Peak Accel.	Peak Decel.	Average Accel.

Table Header for Blinks:
Event Type	Trial	Number	Start	End	Duration

Table Header for User Events:
Event Type	Trial	Number	Start	Description

UserEvent	1	1	6958614717	# Message: void.jpg
Fixation L	1	1	6958622328	6958900802	278474	972.78	202.95	19	39	-1	12.93	12.93
Fixation R	1	1	6958622328	6958900802	278474	972.78	202.95	19	39	-1	13.41	13.41
Blink L	1	1	6958900802	6959020173	119371
Blink R	1	1	6958900802	6959020173	119371
Saccade L	1	1	6959020173	6959040045	19872	1019.17	349.48	1000.26	233.66	5.99	1080.52	1.00	301.39	-71.54	-24045.80	8611.88
Saccade R	1	1	6959020173	6959040045	19872	1019.17	349.48	1000.26	233.66	5.99	1080.52	1.00	301.39	-71.54	-24045.80	8611.88
Fixation L	1	2	6959040045	6959238922	198877	995.73	268.35	16	48	-1	14.72	14.72
Fixation R	1	2	6959040045	6959238922	198877	995.73	268.35	16	48	-1	14.89	14.89
Blink L	1	2	6959238922	6959517393	278471
Blink R	1	2	6959238922	6959517393	278471
Fixation L	1	3	6959517393	6960193605	676212	1008.92	287.35	33	65	-1	12.55	12.55
Fixation R	1	3	6959517393	6960193605	676212	1008.92	287.35	33	65	-1	12.83	12.83
Saccade L	1	2	6960193605	6960213478	19873	997.58	285.77	995.55	291.92	0.16	12.98	0.00	8.21	128.88	-277.84	176.47
Saccade R	1	2	6960193605	6960213478	19873	997.58	285.77	995.55	291.92	0.16	12.98	0.00	8.21	128.88	-277.84	176.47
Fixation L	1	4	6960213478	6960611457	397979	992.61	306.67	5	27	-1	12.72	12.72
Fixation R	1	4	6960213478	6960611457	397979	992.61	306.67	5	27	-1	13.04	13.04
