[BeGaze]
Converted from:	C:\Documents and Settings\iViewX\Desktop\EXPERIMENTATIONS\Experiments\results\finaleart\S3121421-finaleart-1.idf
Date:	27.03.2019 15:34:10
Version:	BeGaze 2.5.77
Sample Rate:	50
Subject:	S3121421
Description:	Jean Jouve

Table Header for Fixations:
Event Type	Trial	Number	Start	End	Duration	Location X	Location Y	Dispersion X	Dispersion Y	Plane	Avg. Pupil Size X	Avg. Pupil Size Y

Table Header for Saccades:
Event Type	Trial	Number	Start	End	Duration	Start Loc.X	Start Loc.Y	End Loc.X	End Loc.Y	Amplitude	Peak Speed	Peak Speed At	Average Speed	Peak Accel.	Peak Decel.	Average Accel.

Table Header for Blinks:
Event Type	Trial	Number	Start	End	Duration

Table Header for User Events:
Event Type	Trial	Number	Start	Description

UserEvent	1	1	5335290892	# Message: void.jpg
Blink L	1	1	5335293731	5335433080	139349
Blink R	1	1	5335293731	5335433080	139349
Saccade L	1	1	5335433080	5335472836	39756	593.61	741.09	588.92	765.46	8.44	967.72	1.00	212.32	23731.00	-837.93	6243.49
Saccade R	1	1	5335433080	5335472836	39756	593.61	741.09	588.92	765.46	8.44	967.72	1.00	212.32	23731.00	-837.93	6243.49
Blink L	1	2	5335472836	5335671933	199097
Blink R	1	2	5335472836	5335671933	199097
Fixation L	1	1	5335671933	5335970552	298619	804.51	701.84	15	48	-1	10.18	10.18
Fixation R	1	1	5335671933	5335970552	298619	804.51	701.84	15	48	-1	10.53	10.53
Saccade L	1	2	5335970552	5336109912	139360	810.81	721.99	545.84	1154.17	13.02	284.67	0.71	93.43	4511.29	-5956.94	2374.23
Saccade R	1	2	5335970552	5336109912	139360	810.81	721.99	545.84	1154.17	13.02	284.67	0.71	93.43	4511.29	-5956.94	2374.23
Fixation L	1	2	5336109912	5336209394	99482	549.12	1222.63	7	88	-1	10.07	10.07
Fixation R	1	2	5336109912	5336209394	99482	549.12	1222.63	7	88	-1	11.25	11.25
Saccade L	1	3	5336209394	5336229290	19896	552.98	1242.86	573.85	1219.14	0.33	31.96	1.00	16.57	503.76	-136.75	361.99
Saccade R	1	3	5336209394	5336229290	19896	552.98	1242.86	573.85	1219.14	0.33	31.96	1.00	16.57	503.76	-136.75	361.99
Fixation L	1	3	5336229290	5336348773	119483	574.42	1224.14	45	45	-1	10.39	10.39
Fixation R	1	3	5336229290	5336348773	119483	574.42	1224.14	45	45	-1	11.08	11.08
Saccade L	1	4	5336348773	5336368638	19865	558.15	1219.21	402.75	1248.91	1.05	160.01	1.00	52.70	3778.45	-3145.47	2416.37
Saccade R	1	4	5336348773	5336368638	19865	558.15	1219.21	402.75	1248.91	1.05	160.01	1.00	52.70	3778.45	-3145.47	2416.37
Fixation L	1	4	5336368638	5336786739	418101	427.62	1268.72	39	43	-1	9.93	9.93
Fixation R	1	4	5336368638	5336786739	418101	427.62	1268.72	39	43	-1	11.26	11.26
Blink L	1	3	5336786739	5336866359	79620
Blink R	1	3	5336786739	5336906110	119371
Saccade L	1	5	5336866359	5336945974	79615	1.88	0.00	0.77	0.00	24.94	1165.58	1.00	313.21	25614.97	-29127.22	9376.20
Saccade R	1	5	5336906110	5336945974	39864	1.11	0.00	0.77	0.00	8.18	1024.80	1.00	205.19	25614.97	-7.23	6778.26
Fixation L	1	5	5337005609	5337284216	278607	918.59	457.23	24	27	-1	10.86	10.86
Fixation R	1	5	5337005609	5337284216	278607	918.59	457.23	24	27	-1	11.23	11.23
