[BeGaze]
Converted from:	C:\Documents and Settings\iViewX\Desktop\EXPERIMENTATIONS\Experiments\results\finaleart\S19F21442-finaleart-1.idf
Date:	27.03.2019 15:51:26
Version:	BeGaze 2.5.77
Sample Rate:	50
Subject:	S19F21442
Description:	Juliette Veuillez

Table Header for Fixations:
Event Type	Trial	Number	Start	End	Duration	Location X	Location Y	Dispersion X	Dispersion Y	Plane	Avg. Pupil Size X	Avg. Pupil Size Y

Table Header for Saccades:
Event Type	Trial	Number	Start	End	Duration	Start Loc.X	Start Loc.Y	End Loc.X	End Loc.Y	Amplitude	Peak Speed	Peak Speed At	Average Speed	Peak Accel.	Peak Decel.	Average Accel.

Table Header for Blinks:
Event Type	Trial	Number	Start	End	Duration

Table Header for User Events:
Event Type	Trial	Number	Start	Description

UserEvent	1	1	7642599903	# Message: lying-nude_ury_1889.jpg
Fixation L	1	1	7642609497	7643047101	437604	769.59	599.79	9	27	-1	11.47	11.47
Fixation R	1	1	7642609497	7643047101	437604	769.59	599.79	9	27	-1	13.89	13.89
Saccade L	1	1	7643047101	7643086974	39873	770.21	611.67	321.14	630.48	3.74	250.50	0.50	93.79	6245.68	-6122.54	5478.21
Saccade R	1	1	7643047101	7643086974	39873	770.21	611.67	321.14	630.48	3.74	250.50	0.50	93.79	6245.68	-6122.54	5478.21
Fixation L	1	2	7643086974	7643405200	318226	344.43	669.10	37	56	-1	11.02	11.02
Fixation R	1	2	7643086974	7643405200	318226	344.43	669.10	37	56	-1	13.62	13.62
Saccade L	1	2	7643405200	7643425084	19884	355.69	687.02	361.26	720.33	0.29	34.17	1.00	14.49	689.70	-580.38	517.52
Saccade R	1	2	7643405200	7643425084	19884	355.69	687.02	361.26	720.33	0.29	34.17	1.00	14.49	689.70	-580.38	517.52
Fixation L	1	3	7643425084	7643822815	397731	366.95	731.97	33	56	-1	10.78	10.78
Fixation R	1	3	7643425084	7643822815	397731	366.95	731.97	33	56	-1	13.52	13.52
Saccade L	1	3	7643822815	7643882565	59750	379.12	755.79	910.11	746.25	5.52	270.18	0.67	92.37	6651.78	-6444.78	4044.05
Saccade R	1	3	7643822815	7643882565	59750	379.12	755.79	910.11	746.25	5.52	270.18	0.67	92.37	6651.78	-6444.78	4044.05
Fixation L	1	4	7643882565	7644220670	338105	915.45	745.79	10	22	-1	11.36	11.36
Fixation R	1	4	7643882565	7644220670	338105	915.45	745.79	10	22	-1	13.41	13.41
Saccade L	1	4	7644220670	7644240544	19874	918.06	732.03	734.46	732.02	1.13	185.66	1.00	56.80	4573.94	-4146.89	3162.14
Saccade R	1	4	7644220670	7644240544	19874	918.06	732.03	734.46	732.02	1.13	185.66	1.00	56.80	4573.94	-4146.89	3162.14
Fixation L	1	5	7644240544	7644499158	258614	703.29	724.92	39	17	-1	10.42	10.42
Fixation R	1	5	7644240544	7644499158	258614	703.29	724.92	39	17	-1	12.41	12.41
Saccade L	1	5	7644499158	7644519035	19877	696.71	714.67	547.21	643.80	1.05	167.32	1.00	52.69	4071.63	-4101.19	2799.84
Saccade R	1	5	7644499158	7644519035	19877	696.71	714.67	547.21	643.80	1.05	167.32	1.00	52.69	4071.63	-4101.19	2799.84
Fixation L	1	6	7644519035	7644658268	139233	543.77	620.21	8	39	-1	10.48	10.48
Fixation R	1	6	7644519035	7644658268	139233	543.77	620.21	8	39	-1	12.38	12.38
Saccade L	1	6	7644658268	7644717899	59631	549.31	613.06	761.11	271.64	4.77	305.06	0.67	79.99	7421.93	-6717.60	3206.25
Saccade R	1	6	7644658268	7644717899	59631	549.31	613.06	761.11	271.64	4.77	305.06	0.67	79.99	7421.93	-6717.60	3206.25
Fixation L	1	7	7644717899	7644916770	198871	752.91	230.91	15	61	-1	10.51	10.51
Fixation R	1	7	7644717899	7644916770	198871	752.91	230.91	15	61	-1	12.44	12.44
Saccade L	1	7	7644916770	7644956643	39873	759.50	233.74	1039.40	237.01	2.44	191.24	0.50	61.26	4592.40	-4612.35	3325.98
Saccade R	1	7	7644916770	7644956643	39873	759.50	233.74	1039.40	237.01	2.44	191.24	0.50	61.26	4592.40	-4612.35	3325.98
Fixation L	1	8	7644956643	7645175378	218735	1049.71	239.18	14	15	-1	10.94	10.94
Fixation R	1	8	7644956643	7645175378	218735	1049.71	239.18	14	15	-1	12.49	12.49
Saccade L	1	8	7645175378	7645235002	59624	1053.40	230.73	1414.41	207.42	3.91	170.21	0.67	65.55	4153.63	-3730.88	2534.10
Saccade R	1	8	7645175378	7645235002	59624	1053.40	230.73	1414.41	207.42	3.91	170.21	0.67	65.55	4153.63	-3730.88	2534.10
Fixation L	1	9	7645235002	7645573238	338236	1395.76	194.55	32	37	-1	12.01	12.01
Fixation R	1	9	7645235002	7645573238	338236	1395.76	194.55	32	37	-1	13.61	13.61
Saccade L	1	9	7645573238	7645652744	79506	1387.48	206.32	1693.15	295.84	4.98	246.73	0.50	62.68	6003.51	-5759.89	2684.82
Saccade R	1	9	7645573238	7645652744	79506	1387.48	206.32	1693.15	295.84	4.98	246.73	0.50	62.68	6003.51	-5759.89	2684.82
Fixation L	1	10	7645652744	7646030609	377865	1686.01	349.49	24	75	-1	12.28	12.28
Fixation R	1	10	7645652744	7646030609	377865	1686.01	349.49	24	75	-1	13.62	13.62
Saccade L	1	10	7646030609	7646149961	119352	1699.73	330.45	1353.02	777.72	8.62	381.31	0.83	72.25	9490.10	-9233.19	3324.11
Saccade R	1	10	7646030609	7646149961	119352	1699.73	330.45	1353.02	777.72	8.62	381.31	0.83	72.25	9490.10	-9233.19	3324.11
Fixation L	1	11	7646149961	7646587569	437608	1377.83	780.12	38	14	-1	12.58	12.58
Fixation R	1	11	7646149961	7646587569	437608	1377.83	780.12	38	14	-1	13.39	13.39
