[BeGaze]
Converted from:	C:\Documents and Settings\iViewX\Desktop\EXPERIMENTATIONS\Experiments\results\finaleart\S12H22222-finaleart-1.idf
Date:	27.03.2019 15:41:07
Version:	BeGaze 2.5.77
Sample Rate:	50
Subject:	S12H22222
Description:	aurele barriere

Table Header for Fixations:
Event Type	Trial	Number	Start	End	Duration	Location X	Location Y	Dispersion X	Dispersion Y	Plane	Avg. Pupil Size X	Avg. Pupil Size Y

Table Header for Saccades:
Event Type	Trial	Number	Start	End	Duration	Start Loc.X	Start Loc.Y	End Loc.X	End Loc.Y	Amplitude	Peak Speed	Peak Speed At	Average Speed	Peak Accel.	Peak Decel.	Average Accel.

Table Header for Blinks:
Event Type	Trial	Number	Start	End	Duration

Table Header for User Events:
Event Type	Trial	Number	Start	Description

UserEvent	1	1	24207575496	# Message: storm_off_normandy_cost_isabey_1850.jpg
Fixation L	1	1	24207591761	24207711131	119370	1142.91	389.34	52	31	-1	12.84	12.84
Fixation R	1	1	24207591761	24207711131	119370	1142.91	389.34	52	31	-1	12.20	12.20
Saccade L	1	1	24207711131	24207731144	20013	1164.51	403.57	1196.37	388.76	0.38	35.54	1.00	18.87	768.88	-599.31	576.63
Saccade R	1	1	24207711131	24207731144	20013	1164.51	403.57	1196.37	388.76	0.38	35.54	1.00	18.87	768.88	-599.31	576.63
Fixation L	1	2	24207731144	24208009498	278354	1218.99	408.72	37	31	-1	12.88	12.88
Fixation R	1	2	24207731144	24208009498	278354	1218.99	408.72	37	31	-1	12.06	12.06
Saccade L	1	2	24208009498	24208029375	19877	1231.69	417.80	1115.28	493.69	0.84	140.54	1.00	42.39	3385.58	-3170.24	2358.22
Saccade R	1	2	24208009498	24208029375	19877	1231.69	417.80	1115.28	493.69	0.84	140.54	1.00	42.39	3385.58	-3170.24	2358.22
Fixation L	1	3	24208029375	24208427240	397865	1100.34	546.25	18	81	-1	12.94	12.94
Fixation R	1	3	24208029375	24208427240	397865	1100.34	546.25	18	81	-1	12.36	12.36
Saccade L	1	3	24208427240	24208447090	19850	1098.42	574.80	1098.53	576.10	0.04	3.17	1.00	1.80	6.86	-46.08	24.41
Saccade R	1	3	24208427240	24208447090	19850	1098.42	574.80	1098.53	576.10	0.04	3.17	1.00	1.80	6.86	-46.08	24.41
Fixation L	1	4	24208447090	24208566460	119370	1097.01	575.60	3	2	-1	13.29	13.29
Fixation R	1	4	24208447090	24208566460	119370	1097.01	575.60	3	2	-1	12.72	12.72
Saccade L	1	4	24208566460	24208606206	39746	1095.46	574.54	909.83	734.61	2.08	141.23	0.50	52.34	3506.29	-3230.12	2961.20
Saccade R	1	4	24208566460	24208606206	39746	1095.46	574.54	909.83	734.61	2.08	141.23	0.50	52.34	3506.29	-3230.12	2961.20
Fixation L	1	5	24208606206	24208844822	238616	921.89	732.10	59	37	-1	14.21	14.21
Fixation R	1	5	24208606206	24208844822	238616	921.89	732.10	59	37	-1	13.10	13.10
Saccade L	1	5	24208844822	24208864828	20006	969.33	704.20	1040.29	599.82	0.96	127.66	1.00	47.92	3055.44	-3118.26	2492.60
Saccade R	1	5	24208844822	24208864828	20006	969.33	704.20	1040.29	599.82	0.96	127.66	1.00	47.92	3055.44	-3118.26	2492.60
Fixation L	1	6	24208864828	24209322182	457354	1052.38	604.79	50	38	-1	14.88	14.88
Fixation R	1	6	24208864828	24209322182	457354	1052.38	604.79	50	38	-1	13.80	13.80
Saccade L	1	6	24209322182	24209362050	39868	1082.18	602.08	1181.97	443.47	1.79	154.90	1.00	44.97	3579.37	-3774.35	2266.84
Saccade R	1	6	24209322182	24209362050	39868	1082.18	602.08	1181.97	443.47	1.79	154.90	1.00	44.97	3579.37	-3774.35	2266.84
Fixation L	1	7	24209362050	24209600664	238614	1193.88	434.89	18	25	-1	15.72	15.72
Fixation R	1	7	24209362050	24209600664	238614	1193.88	434.89	18	25	-1	14.45	14.45
Saccade L	1	7	24209600664	24209640539	39875	1200.95	437.03	1328.04	742.03	2.88	223.73	1.00	72.29	5522.08	-5386.94	4146.01
Saccade R	1	7	24209600664	24209640539	39875	1200.95	437.03	1328.04	742.03	2.88	223.73	1.00	72.29	5522.08	-5386.94	4146.01
Fixation L	1	8	24209640539	24210157641	517102	1336.86	735.99	44	15	-1	15.04	15.04
Fixation R	1	8	24209640539	24210157641	517102	1336.86	735.99	44	15	-1	13.68	13.68
Saccade L	1	8	24210157641	24210237132	79491	1319.34	733.67	850.67	253.05	8.23	365.21	0.50	103.56	9127.04	-7128.77	4449.40
Saccade R	1	8	24210157641	24210237132	79491	1319.34	733.67	850.67	253.05	8.23	365.21	0.50	103.56	9127.04	-7128.77	4449.40
Fixation L	1	9	24210237132	24210654870	417738	852.17	244.33	21	65	-1	12.71	12.71
Fixation R	1	9	24210237132	24210654870	417738	852.17	244.33	21	65	-1	11.99	11.99
Saccade L	1	9	24210654870	24210674738	19868	837.60	191.28	828.68	171.16	0.44	31.23	0.00	22.36	157.77	-508.73	315.90
Saccade R	1	9	24210654870	24210674738	19868	837.60	191.28	828.68	171.16	0.44	31.23	0.00	22.36	157.77	-508.73	315.90
Fixation L	1	10	24210674738	24210774237	99499	821.61	158.17	13	20	-1	12.64	12.64
Fixation R	1	10	24210674738	24210774237	99499	821.61	158.17	13	20	-1	11.77	11.77
Saccade L	1	10	24210774237	24210813993	39756	819.87	163.23	614.51	281.80	2.64	170.22	0.50	66.42	4190.97	-2692.26	2673.21
Saccade R	1	10	24210774237	24210813993	39756	819.87	163.23	614.51	281.80	2.64	170.22	0.50	66.42	4190.97	-2692.26	2673.21
Fixation L	1	11	24210813993	24211072606	258613	599.37	241.24	25	66	-1	12.66	12.66
Fixation R	1	11	24210813993	24211072606	258613	599.37	241.24	25	66	-1	12.32	12.32
Saccade L	1	11	24211072606	24211092472	19866	591.50	267.84	594.88	290.67	0.36	34.39	1.00	18.09	-123.40	-481.68	293.69
Saccade R	1	11	24211072606	24211092472	19866	591.50	267.84	594.88	290.67	0.36	34.39	1.00	18.09	-123.40	-481.68	293.69
Fixation L	1	12	24211092472	24211569833	477361	606.32	308.91	20	42	-1	13.26	13.26
Fixation R	1	12	24211092472	24211569833	477361	606.32	308.91	20	42	-1	12.83	12.83
