[BeGaze]
Converted from:	C:\Documents and Settings\iViewX\Desktop\EXPERIMENTATIONS\Experiments\results\finaleart\S18F56223-finaleart-1.idf
Date:	27.03.2019 15:49:19
Version:	BeGaze 2.5.77
Sample Rate:	50
Subject:	S18F56223
Description:	Pascale Sebillot

Table Header for Fixations:
Event Type	Trial	Number	Start	End	Duration	Location X	Location Y	Dispersion X	Dispersion Y	Plane	Avg. Pupil Size X	Avg. Pupil Size Y

Table Header for Saccades:
Event Type	Trial	Number	Start	End	Duration	Start Loc.X	Start Loc.Y	End Loc.X	End Loc.Y	Amplitude	Peak Speed	Peak Speed At	Average Speed	Peak Accel.	Peak Decel.	Average Accel.

Table Header for Blinks:
Event Type	Trial	Number	Start	End	Duration

Table Header for User Events:
Event Type	Trial	Number	Start	Description

UserEvent	1	1	2891005840	# Message: void.jpg
Fixation L	1	1	2891011919	2891210764	198845	1374.57	1072.51	16	26	-1	19.26	19.26
Fixation R	1	1	2891011919	2891210764	198845	1374.57	1072.51	16	26	-1	17.73	17.73
Saccade L	1	1	2891210764	2891270392	59628	1377.98	1070.07	1389.63	893.10	4.47	157.89	0.67	74.93	3700.13	-3473.88	2785.70
Saccade R	1	1	2891210764	2891270392	59628	1377.98	1070.07	1389.63	893.10	4.47	157.89	0.67	74.93	3700.13	-3473.88	2785.70
Fixation L	1	2	2891270392	2891409646	139254	1395.65	900.13	23	70	-1	19.37	19.37
Fixation R	1	2	2891270392	2891409646	139254	1395.65	900.13	23	70	-1	17.60	17.60
Saccade L	1	2	2891409646	2891568752	159106	1393.63	944.63	880.67	395.82	12.40	180.93	0.75	77.91	3938.14	-2998.04	1897.34
Saccade R	1	2	2891409646	2891568752	159106	1393.63	944.63	880.67	395.82	12.40	180.93	0.75	77.91	3938.14	-2998.04	1897.34
Fixation L	1	3	2891568752	2891767760	199008	881.50	376.07	19	35	-1	16.86	16.86
Fixation R	1	3	2891568752	2891767760	199008	881.50	376.07	19	35	-1	15.00	15.00
Saccade L	1	3	2891767760	2891787661	19901	867.22	366.45	711.67	423.30	1.04	167.50	1.00	52.17	4137.10	-4070.09	2768.91
Saccade R	1	3	2891767760	2891787661	19901	867.22	366.45	711.67	423.30	1.04	167.50	1.00	52.17	4137.10	-4070.09	2768.91
Fixation L	1	4	2891787661	2891986492	198831	714.39	448.57	11	57	-1	15.34	15.34
Fixation R	1	4	2891787661	2891986492	198831	714.39	448.57	11	57	-1	13.43	13.43
Saccade L	1	4	2891986492	2892006360	19868	709.91	467.67	533.07	495.56	1.19	181.05	1.00	60.02	3790.22	-4391.04	2777.63
Saccade R	1	4	2891986492	2892006360	19868	709.91	467.67	533.07	495.56	1.19	181.05	1.00	60.02	3790.22	-4391.04	2777.63
Fixation L	1	5	2892006360	2892324595	318235	544.13	518.97	16	45	-1	15.10	15.10
Fixation R	1	5	2892006360	2892324595	318235	544.13	518.97	16	45	-1	13.73	13.73
Saccade L	1	5	2892324595	2892384341	59746	545.95	516.30	578.40	522.36	1.72	70.87	0.33	28.75	1566.54	-1484.00	1054.89
Saccade R	1	5	2892324595	2892384341	59746	545.95	516.30	578.40	522.36	1.72	70.87	0.33	28.75	1566.54	-1484.00	1054.89
Fixation L	1	6	2892384341	2892483714	99373	616.08	543.34	52	44	-1	15.17	15.17
Fixation R	1	6	2892384341	2892483714	99373	616.08	543.34	52	44	-1	14.04	14.04
Saccade L	1	6	2892483714	2892503588	19874	619.61	532.48	633.81	571.67	0.52	42.18	1.00	26.24	678.54	-679.63	668.82
Saccade R	1	6	2892483714	2892503588	19874	619.61	532.48	633.81	571.67	0.52	42.18	1.00	26.24	678.54	-679.63	668.82
Fixation L	1	7	2892503588	2892642832	139244	624.71	565.54	25	27	-1	15.58	15.58
Fixation R	1	7	2892503588	2892642832	139244	624.71	565.54	25	27	-1	14.29	14.29
Saccade L	1	7	2892642832	2892662703	19871	632.84	567.07	745.29	551.35	0.95	114.85	1.00	47.97	2003.35	-2343.17	1634.08
Saccade R	1	7	2892642832	2892662703	19871	632.84	567.07	745.29	551.35	0.95	114.85	1.00	47.97	2003.35	-2343.17	1634.08
Fixation L	1	8	2892662703	2893000814	338111	736.16	546.75	19	35	-1	15.96	15.96
Fixation R	1	8	2892662703	2893000814	338111	736.16	546.75	19	35	-1	14.61	14.61
