[BeGaze]
Converted from:	C:\Documents and Settings\iViewX\Desktop\EXPERIMENTATIONS\Experiments\results\finaleart\S01A22542-finaleart-1.idf
Date:	27.03.2019 15:33:17
Version:	BeGaze 2.5.77
Sample Rate:	50
Subject:	S01A22542
Description:	Thibault Seve Minnaert

Table Header for Fixations:
Event Type	Trial	Number	Start	End	Duration	Location X	Location Y	Dispersion X	Dispersion Y	Plane	Avg. Pupil Size X	Avg. Pupil Size Y

Table Header for Saccades:
Event Type	Trial	Number	Start	End	Duration	Start Loc.X	Start Loc.Y	End Loc.X	End Loc.Y	Amplitude	Peak Speed	Peak Speed At	Average Speed	Peak Accel.	Peak Decel.	Average Accel.

Table Header for Blinks:
Event Type	Trial	Number	Start	End	Duration

Table Header for User Events:
Event Type	Trial	Number	Start	Description

UserEvent	1	1	8887135608	# Message: void.jpg
Fixation L	1	1	8887155365	8887413973	258608	671.78	341.98	8	16	-1	13.61	13.61
Fixation R	1	1	8887155365	8887413973	258608	671.78	341.98	8	16	-1	14.81	14.81
Saccade L	1	1	8887413973	8887453729	39756	675.62	333.59	1106.76	325.99	3.95	285.34	1.00	99.25	6991.81	-6767.50	4981.08
Saccade R	1	1	8887413973	8887453729	39756	675.62	333.59	1106.76	325.99	3.95	285.34	1.00	99.25	6991.81	-6767.50	4981.08
Fixation L	1	2	8887453729	8887553234	99505	1164.80	318.39	80	14	-1	13.57	13.57
Fixation R	1	2	8887453729	8887553234	99505	1164.80	318.39	80	14	-1	14.48	14.48
Saccade L	1	2	8887553234	8887573102	19868	1187.63	311.50	1190.67	307.77	0.10	9.66	1.00	4.99	71.40	-119.79	94.18
Saccade R	1	2	8887553234	8887573102	19868	1187.63	311.50	1190.67	307.77	0.10	9.66	1.00	4.99	71.40	-119.79	94.18
Fixation L	1	3	8887573102	8887692461	119359	1194.98	306.75	11	5	-1	13.90	13.90
Fixation R	1	3	8887573102	8887692461	119359	1194.98	306.75	11	5	-1	14.58	14.58
Blink L	1	1	8887692461	8887911196	218735
Blink R	1	1	8887692461	8887911196	218735
Fixation L	1	4	8887911196	8888269182	357986	990.70	597.48	20	31	-1	13.85	13.85
Fixation R	1	4	8887911196	8888269182	357986	990.70	597.48	20	31	-1	14.58	14.58
Saccade L	1	3	8888269182	8888309052	39870	985.85	601.79	1005.00	875.81	2.26	159.73	1.00	56.77	3972.76	-3796.80	3386.20
Saccade R	1	3	8888269182	8888309052	39870	985.85	601.79	1005.00	875.81	2.26	159.73	1.00	56.77	3972.76	-3796.80	3386.20
Fixation L	1	5	8888309052	8888547683	238631	1020.61	881.07	25	14	-1	14.13	14.13
Fixation R	1	5	8888309052	8888547683	238631	1020.61	881.07	25	14	-1	14.77	14.77
Saccade L	1	4	8888547683	8888587413	39730	1025.59	873.24	911.51	538.43	3.22	241.79	0.50	81.15	5959.73	-5318.80	4055.09
Saccade R	1	4	8888547683	8888587413	39730	1025.59	873.24	911.51	538.43	3.22	241.79	0.50	81.15	5959.73	-5318.80	4055.09
Fixation L	1	6	8888587413	8889044901	457488	903.47	544.08	12	66	-1	13.25	13.25
Fixation R	1	6	8888587413	8889044901	457488	903.47	544.08	12	66	-1	14.28	14.28
Saccade L	1	5	8889044901	8889124512	79611	906.04	514.66	772.40	546.84	2.27	114.10	0.25	28.48	2765.07	-2306.84	1207.20
Saccade R	1	5	8889044901	8889124512	79611	906.04	514.66	772.40	546.84	2.27	114.10	0.25	28.48	2765.07	-2306.84	1207.20
