[BeGaze]
Converted from:	C:\Documents and Settings\iViewX\Desktop\EXPERIMENTATIONS\Experiments\results\finaleart\S18F56223-finaleart-1.idf
Date:	27.03.2019 15:48:48
Version:	BeGaze 2.5.77
Sample Rate:	50
Subject:	S18F56223
Description:	Pascale Sebillot

Table Header for Fixations:
Event Type	Trial	Number	Start	End	Duration	Location X	Location Y	Dispersion X	Dispersion Y	Plane	Avg. Pupil Size X	Avg. Pupil Size Y

Table Header for Saccades:
Event Type	Trial	Number	Start	End	Duration	Start Loc.X	Start Loc.Y	End Loc.X	End Loc.Y	Amplitude	Peak Speed	Peak Speed At	Average Speed	Peak Accel.	Peak Decel.	Average Accel.

Table Header for Blinks:
Event Type	Trial	Number	Start	End	Duration

Table Header for User Events:
Event Type	Trial	Number	Start	Description

UserEvent	1	1	2572384815	# Message: void.jpg
Fixation L	1	1	2572392256	2572511477	119221	800.09	716.50	2	3	-1	15.89	15.89
Fixation R	1	1	2572392256	2572511477	119221	800.09	716.50	2	3	-1	16.86	16.86
Saccade L	1	1	2572511477	2572551348	39871	799.18	716.24	490.15	823.77	2.83	187.40	0.50	71.10	4662.94	-4259.66	3989.34
Saccade R	1	1	2572511477	2572551348	39871	799.18	716.24	490.15	823.77	2.83	187.40	0.50	71.10	4662.94	-4259.66	3989.34
Fixation L	1	2	2572551348	2572750208	198860	510.05	837.67	38	35	-1	16.15	16.15
Fixation R	1	2	2572551348	2572750208	198860	510.05	837.67	38	35	-1	17.30	17.30
Saccade L	1	2	2572750208	2572770084	19876	524.90	850.07	601.95	848.04	0.70	77.97	1.00	35.13	1823.05	-1506.41	1334.75
Saccade R	1	2	2572750208	2572770084	19876	524.90	850.07	601.95	848.04	0.70	77.97	1.00	35.13	1823.05	-1506.41	1334.75
Fixation L	1	3	2572770084	2572869587	99503	575.32	844.82	41	6	-1	16.56	16.56
Fixation R	1	3	2572770084	2572869587	99503	575.32	844.82	41	6	-1	17.59	17.59
Saccade L	1	3	2572869587	2572929236	59649	569.12	844.90	601.78	444.76	4.62	183.50	0.33	77.44	4469.03	-2454.68	2536.20
Saccade R	1	3	2572869587	2572929236	59649	569.12	844.90	601.78	444.76	4.62	183.50	0.33	77.44	4469.03	-2454.68	2536.20
Fixation L	1	4	2572929236	2573088325	159089	623.60	400.41	42	52	-1	14.26	14.26
Fixation R	1	4	2572929236	2573088325	159089	623.60	400.41	42	52	-1	15.38	15.38
Saccade L	1	4	2573088325	2573187830	99505	632.66	392.50	233.21	139.27	6.71	230.39	0.40	67.43	5677.55	-3329.53	2082.10
Saccade R	1	4	2573088325	2573187830	99505	632.66	392.50	233.21	139.27	6.71	230.39	0.40	67.43	5677.55	-3329.53	2082.10
Fixation L	1	5	2573187830	2573307199	119369	248.67	179.92	20	75	-1	12.50	12.50
Fixation R	1	5	2573187830	2573307199	119369	248.67	179.92	20	75	-1	14.02	14.02
Saccade L	1	5	2573307199	2573327069	19870	252.93	214.40	258.20	224.54	0.24	18.95	1.00	11.97	-2.14	-184.91	68.15
Saccade R	1	5	2573307199	2573327069	19870	252.93	214.40	258.20	224.54	0.24	18.95	1.00	11.97	-2.14	-184.91	68.15
Fixation L	1	6	2573327069	2573486184	159115	259.22	235.18	14	65	-1	12.60	12.60
Fixation R	1	6	2573327069	2573486184	159115	259.22	235.18	14	65	-1	14.34	14.34
Saccade L	1	6	2573486184	2573545813	59629	269.10	288.24	587.62	741.77	6.61	294.28	0.33	110.93	7278.03	-5083.28	4349.38
Saccade R	1	6	2573486184	2573545813	59629	269.10	288.24	587.62	741.77	6.61	294.28	0.33	110.93	7278.03	-5083.28	4349.38
Fixation L	1	7	2573545813	2573824289	278476	597.14	717.88	28	37	-1	13.86	13.86
Fixation R	1	7	2573545813	2573824289	278476	597.14	717.88	28	37	-1	15.02	15.02
Saccade L	1	7	2573824289	2573844168	19879	611.31	728.39	783.51	718.28	1.00	174.45	1.00	50.55	4174.10	-4211.35	2878.64
Saccade R	1	7	2573824289	2573844168	19879	611.31	728.39	783.51	718.28	1.00	174.45	1.00	50.55	4174.10	-4211.35	2878.64
Fixation L	1	8	2573844168	2574381148	536980	786.42	663.40	17	78	-1	14.20	14.20
Fixation R	1	8	2573844168	2574381148	536980	786.42	663.40	17	78	-1	15.07	15.07
