[BeGaze]
Converted from:	C:\Documents and Settings\iViewX\Desktop\EXPERIMENTATIONS\Experiments\results\finaleart\S14F27123-finaleart-1.idf
Date:	27.03.2019 15:43:37
Version:	BeGaze 2.5.77
Sample Rate:	50
Subject:	S14F27123
Description:	Anne-flore Perrin

Table Header for Fixations:
Event Type	Trial	Number	Start	End	Duration	Location X	Location Y	Dispersion X	Dispersion Y	Plane	Avg. Pupil Size X	Avg. Pupil Size Y

Table Header for Saccades:
Event Type	Trial	Number	Start	End	Duration	Start Loc.X	Start Loc.Y	End Loc.X	End Loc.Y	Amplitude	Peak Speed	Peak Speed At	Average Speed	Peak Accel.	Peak Decel.	Average Accel.

Table Header for Blinks:
Event Type	Trial	Number	Start	End	Duration

Table Header for User Events:
Event Type	Trial	Number	Start	Description

UserEvent	1	1	31333273079	# Message: void.jpg
Fixation L	1	1	31333276101	31333673826	397725	804.26	768.12	45	34	-1	13.12	13.12
Fixation R	1	1	31333276101	31333673826	397725	804.26	768.12	45	34	-1	12.96	12.96
Blink L	1	1	31333673826	31333972196	298370
Blink R	1	1	31333673826	31333972196	298370
Blink L	1	2	31333992069	31334131339	139270
Blink R	1	2	31333992069	31334131339	139270
Fixation L	1	2	31334131339	31334270552	139213	728.72	441.30	28	40	-1	11.12	11.12
Fixation R	1	2	31334131339	31334270552	139213	728.72	441.30	28	40	-1	12.10	12.10
Saccade L	1	1	31334270552	31334290431	19879	745.83	459.56	866.67	478.20	0.77	123.66	1.00	38.85	2957.59	-3027.35	2074.16
Saccade R	1	1	31334270552	31334290431	19879	745.83	459.56	866.67	478.20	0.77	123.66	1.00	38.85	2957.59	-3027.35	2074.16
Fixation L	1	3	31334290431	31334549038	258607	874.59	487.12	12	19	-1	11.59	11.59
Fixation R	1	3	31334290431	31334549038	258607	874.59	487.12	12	19	-1	12.16	12.16
Saccade L	1	2	31334549038	31334568929	19891	872.90	492.01	850.35	553.84	0.46	66.57	1.00	23.09	1520.50	-1370.71	1111.55
Saccade R	1	2	31334549038	31334568929	19891	872.90	492.01	850.35	553.84	0.46	66.57	1.00	23.09	1520.50	-1370.71	1111.55
Fixation L	1	4	31334568929	31335265011	696082	836.14	598.11	24	63	-1	11.35	11.35
Fixation R	1	4	31334568929	31335265011	696082	836.14	598.11	24	63	-1	11.78	11.78
