[BeGaze]
Converted from:	C:\Documents and Settings\iViewX\Desktop\EXPERIMENTATIONS\Experiments\results\finaleart\S5121332-finaleart-1.idf
Date:	27.03.2019 15:35:19
Version:	BeGaze 2.5.77
Sample Rate:	50
Subject:	S5121332
Description:	Dylan Marinho

Table Header for Fixations:
Event Type	Trial	Number	Start	End	Duration	Location X	Location Y	Dispersion X	Dispersion Y	Plane	Avg. Pupil Size X	Avg. Pupil Size Y

Table Header for Saccades:
Event Type	Trial	Number	Start	End	Duration	Start Loc.X	Start Loc.Y	End Loc.X	End Loc.Y	Amplitude	Peak Speed	Peak Speed At	Average Speed	Peak Accel.	Peak Decel.	Average Accel.

Table Header for Blinks:
Event Type	Trial	Number	Start	End	Duration

Table Header for User Events:
Event Type	Trial	Number	Start	Description

UserEvent	1	1	9849616595	# Message: void.jpg
Fixation L	1	1	9849618660	9849817492	198832	860.46	924.42	4	8	-1	15.71	15.71
Fixation R	1	1	9849618660	9849817492	198832	860.46	924.42	4	8	-1	15.91	15.91
Saccade L	1	1	9849817492	9849857381	39889	861.33	920.61	1185.55	942.89	2.88	191.03	1.00	72.13	4697.50	-4641.85	3883.31
Saccade R	1	1	9849817492	9849857381	39889	861.33	920.61	1185.55	942.89	2.88	191.03	1.00	72.13	4697.50	-4641.85	3883.31
Fixation L	1	2	9849857381	9850115845	258464	1209.95	977.62	32	44	-1	15.22	15.22
Fixation R	1	2	9849857381	9850115845	258464	1209.95	977.62	32	44	-1	15.02	15.02
Blink L	1	1	9850115845	9850851806	735961
Blink R	1	1	9850115845	9850851806	735961
Saccade L	1	2	9850851806	9850931419	79613	1009.72	445.00	969.52	478.61	13.33	1080.79	1.00	167.49	26560.00	-353.15	4576.86
Saccade R	1	2	9850851806	9850931419	79613	1009.72	445.00	969.52	478.61	13.33	1080.79	1.00	167.49	26560.00	-353.15	4576.86
Blink L	1	2	9850931419	9851189909	258490
Blink R	1	2	9850931419	9851189909	258490
Fixation L	1	3	9851189909	9851329149	139240	909.22	456.44	8	88	-1	15.02	15.02
Fixation R	1	3	9851189909	9851329149	139240	909.22	456.44	8	88	-1	14.80	14.80
Saccade L	1	3	9851329149	9851349039	19890	912.03	518.26	913.50	525.01	0.38	41.66	0.00	19.24	-36.37	-952.06	477.20
Saccade R	1	3	9851329149	9851349039	19890	912.03	518.26	913.50	525.01	0.38	41.66	0.00	19.24	-36.37	-952.06	477.20
Fixation L	1	4	9851349039	9851607635	258596	910.42	529.26	8	12	-1	14.44	14.44
Fixation R	1	4	9851349039	9851607635	258596	910.42	529.26	8	12	-1	14.34	14.34
