[BeGaze]
Converted from:	C:\Documents and Settings\iViewX\Desktop\EXPERIMENTATIONS\Experiments\results\finaleart\S3121421-finaleart-1.idf
Date:	27.03.2019 15:33:55
Version:	BeGaze 2.5.77
Sample Rate:	50
Subject:	S3121421
Description:	Jean Jouve

Table Header for Fixations:
Event Type	Trial	Number	Start	End	Duration	Location X	Location Y	Dispersion X	Dispersion Y	Plane	Avg. Pupil Size X	Avg. Pupil Size Y

Table Header for Saccades:
Event Type	Trial	Number	Start	End	Duration	Start Loc.X	Start Loc.Y	End Loc.X	End Loc.Y	Amplitude	Peak Speed	Peak Speed At	Average Speed	Peak Accel.	Peak Decel.	Average Accel.

Table Header for Blinks:
Event Type	Trial	Number	Start	End	Duration

Table Header for User Events:
Event Type	Trial	Number	Start	Description

UserEvent	1	1	4320874507	# Message: void.jpg
Fixation L	1	1	4320880619	4321059615	178996	498.83	668.18	14	56	-1	10.82	10.82
Fixation R	1	1	4320880619	4321059615	178996	498.83	668.18	14	56	-1	11.73	11.73
Saccade L	1	1	4321059615	4321079472	19857	492.26	703.93	495.17	799.15	1.04	96.36	1.00	52.40	2264.93	-2160.39	1507.74
Saccade R	1	1	4321059615	4321079472	19857	492.26	703.93	495.17	799.15	1.04	96.36	1.00	52.40	2264.93	-2160.39	1507.74
Fixation L	1	2	4321079472	4321357947	278475	512.20	767.66	32	55	-1	10.68	10.68
Fixation R	1	2	4321079472	4321357947	278475	512.20	767.66	32	55	-1	11.92	11.92
Blink L	1	1	4321357947	4321596576	238629
Blink R	1	1	4321357947	4321596576	238629
Fixation L	1	3	4321596576	4321954671	358095	1084.77	443.57	24	72	-1	11.77	11.77
Fixation R	1	3	4321596576	4321954671	358095	1084.77	443.57	24	72	-1	12.52	12.52
Saccade L	1	2	4321954671	4321974541	19870	1076.96	466.25	1071.65	475.14	0.14	12.60	1.00	6.96	29.14	-140.10	74.17
Saccade R	1	2	4321954671	4321974541	19870	1076.96	466.25	1071.65	475.14	0.14	12.60	1.00	6.96	29.14	-140.10	74.17
Fixation L	1	4	4321974541	4322133661	159120	1069.25	477.05	5	9	-1	11.64	11.64
Fixation R	1	4	4321974541	4322133661	159120	1069.25	477.05	5	9	-1	12.29	12.29
Saccade L	1	3	4322133661	4322173404	39743	1067.17	481.96	894.20	489.48	1.66	113.09	0.50	41.78	2780.54	-2139.73	1931.21
Saccade R	1	3	4322133661	4322173404	39743	1067.17	481.96	894.20	489.48	1.66	113.09	0.50	41.78	2780.54	-2139.73	1931.21
Fixation L	1	5	4322173404	4322869492	696088	869.99	504.76	35	36	-1	10.89	10.89
Fixation R	1	5	4322173404	4322869492	696088	869.99	504.76	35	36	-1	11.67	11.67
