[BeGaze]
Converted from:	C:\Documents and Settings\iViewX\Desktop\EXPERIMENTATIONS\Experiments\results\finaleart\S19F21442-finaleart-1.idf
Date:	27.03.2019 15:52:02
Version:	BeGaze 2.5.77
Sample Rate:	50
Subject:	S19F21442
Description:	Juliette Veuillez

Table Header for Fixations:
Event Type	Trial	Number	Start	End	Duration	Location X	Location Y	Dispersion X	Dispersion Y	Plane	Avg. Pupil Size X	Avg. Pupil Size Y

Table Header for Saccades:
Event Type	Trial	Number	Start	End	Duration	Start Loc.X	Start Loc.Y	End Loc.X	End Loc.Y	Amplitude	Peak Speed	Peak Speed At	Average Speed	Peak Accel.	Peak Decel.	Average Accel.

Table Header for Blinks:
Event Type	Trial	Number	Start	End	Duration

Table Header for User Events:
Event Type	Trial	Number	Start	Description

UserEvent	1	1	8349634410	# Message: The_Orchard_Vlaminck_1905.jpg
Fixation L	1	1	8349637173	8350154314	517141	688.19	490.44	23	34	-1	12.01	12.01
Fixation R	1	1	8349637173	8350154314	517141	688.19	490.44	23	34	-1	14.65	14.65
Saccade L	1	1	8350154314	8350174157	19843	678.33	475.47	643.88	382.09	0.85	100.68	1.00	42.83	2477.27	-2327.04	1872.42
Saccade R	1	1	8350154314	8350174157	19843	678.33	475.47	643.88	382.09	0.85	100.68	1.00	42.83	2477.27	-2327.04	1872.42
Fixation L	1	2	8350174157	8350611764	437607	618.00	414.25	34	54	-1	9.68	9.68
Fixation R	1	2	8350174157	8350611764	437607	618.00	414.25	34	54	-1	12.03	12.03
Saccade L	1	2	8350611764	8350651496	39732	612.80	388.70	451.08	278.62	1.87	120.32	0.50	47.11	2907.42	-2649.84	2307.54
Saccade R	1	2	8350611764	8350651496	39732	612.80	388.70	451.08	278.62	1.87	120.32	0.50	47.11	2907.42	-2649.84	2307.54
Fixation L	1	3	8350651496	8351288105	636609	430.60	294.30	39	57	-1	9.91	9.91
Fixation R	1	3	8350651496	8351288105	636609	430.60	294.30	39	57	-1	12.39	12.39
Saccade L	1	3	8351288105	8351307966	19861	431.77	327.79	434.07	343.64	0.39	31.47	0.00	19.83	-99.75	-500.27	315.61
Saccade R	1	3	8351288105	8351307966	19861	431.77	327.79	434.07	343.64	0.39	31.47	0.00	19.83	-99.75	-500.27	315.61
Fixation L	1	4	8351307966	8352143319	835353	459.40	348.39	36	46	-1	10.91	10.91
Fixation R	1	4	8351307966	8352143319	835353	459.40	348.39	36	46	-1	13.52	13.52
Saccade L	1	4	8352143319	8352222929	79610	457.45	344.40	1264.21	708.79	10.77	321.96	0.50	135.24	7796.29	-6200.85	4713.69
Saccade R	1	4	8352143319	8352222929	79610	457.45	344.40	1264.21	708.79	10.77	321.96	0.50	135.24	7796.29	-6200.85	4713.69
Fixation L	1	5	8352222929	8352541167	318238	1284.18	703.38	28	11	-1	12.06	12.06
Fixation R	1	5	8352222929	8352541167	318238	1284.18	703.38	28	11	-1	13.23	13.23
Saccade L	1	5	8352541167	8352580921	39754	1291.78	703.60	1462.01	1070.49	3.43	218.67	0.50	86.38	5365.27	-5159.41	4931.79
Saccade R	1	5	8352541167	8352580921	39754	1291.78	703.60	1462.01	1070.49	3.43	218.67	0.50	86.38	5365.27	-5159.41	4931.79
Fixation L	1	6	8352580921	8352958773	377852	1467.79	1057.76	61	27	-1	10.66	10.66
Fixation R	1	6	8352580921	8352958773	377852	1467.79	1057.76	61	27	-1	11.57	11.57
Saccade L	1	6	8352958773	8352978648	19875	1521.32	1068.55	1478.92	1103.25	0.71	55.95	0.00	35.52	1280.64	-836.71	951.29
Saccade R	1	6	8352958773	8352978648	19875	1521.32	1068.55	1478.92	1103.25	0.71	55.95	0.00	35.52	1280.64	-836.71	951.29
Fixation L	1	7	8352978648	8353515745	537097	1524.81	1119.10	58	33	-1	10.30	10.30
Fixation R	1	7	8352978648	8353515745	537097	1524.81	1119.10	58	33	-1	11.31	11.31
Saccade L	1	7	8353515745	8353615246	99501	1535.53	1099.80	1370.17	257.39	13.02	336.17	0.20	130.82	8319.24	-5998.96	4868.69
Saccade R	1	7	8353515745	8353615246	99501	1535.53	1099.80	1370.17	257.39	13.02	336.17	0.20	130.82	8319.24	-5998.96	4868.69
