[BeGaze]
Converted from:	C:\Documents and Settings\iViewX\Desktop\EXPERIMENTATIONS\Experiments\results\finaleart\S4120113-finaleart-1.idf
Date:	27.03.2019 15:34:31
Version:	BeGaze 2.5.77
Sample Rate:	50
Subject:	S4120113
Description:	Vidal Attias

Table Header for Fixations:
Event Type	Trial	Number	Start	End	Duration	Location X	Location Y	Dispersion X	Dispersion Y	Plane	Avg. Pupil Size X	Avg. Pupil Size Y

Table Header for Saccades:
Event Type	Trial	Number	Start	End	Duration	Start Loc.X	Start Loc.Y	End Loc.X	End Loc.Y	Amplitude	Peak Speed	Peak Speed At	Average Speed	Peak Accel.	Peak Decel.	Average Accel.

Table Header for Blinks:
Event Type	Trial	Number	Start	End	Duration

Table Header for User Events:
Event Type	Trial	Number	Start	Description

UserEvent	1	1	6954526315	# Message: Nature-morte-Maurice-de-Vlaminck.jpg
Fixation L	1	1	6954544949	6955022281	477332	870.16	368.90	8	46	-1	12.45	12.45
Fixation R	1	1	6954544949	6955022281	477332	870.16	368.90	8	46	-1	12.30	12.30
Saccade L	1	1	6955022281	6955042163	19882	865.27	376.94	1007.64	397.35	0.93	145.46	1.00	46.64	3590.72	-2913.58	2450.50
Saccade R	1	1	6955022281	6955042163	19882	865.27	376.94	1007.64	397.35	0.93	145.46	1.00	46.64	3590.72	-2913.58	2450.50
Fixation L	1	2	6955042163	6955241023	198860	1003.71	437.50	12	69	-1	12.83	12.83
Fixation R	1	2	6955042163	6955241023	198860	1003.71	437.50	12	69	-1	12.58	12.58
Saccade L	1	2	6955241023	6955261022	19999	995.30	461.66	1131.83	469.81	0.88	138.34	1.00	43.96	3332.88	-2572.66	2028.22
Saccade R	1	2	6955241023	6955261022	19999	995.30	461.66	1131.83	469.81	0.88	138.34	1.00	43.96	3332.88	-2572.66	2028.22
Fixation L	1	3	6955261022	6955440033	179011	1120.20	518.78	18	79	-1	12.72	12.72
Fixation R	1	3	6955261022	6955440033	179011	1120.20	518.78	18	79	-1	12.53	12.53
Saccade L	1	3	6955440033	6955459885	19852	1113.24	529.00	1109.30	530.97	0.18	21.50	1.00	8.98	-52.16	-425.98	213.34
Saccade R	1	3	6955440033	6955459885	19852	1113.24	529.00	1109.30	530.97	0.18	21.50	1.00	8.98	-52.16	-425.98	213.34
Fixation L	1	4	6955459885	6955857614	397729	1100.25	549.15	19	39	-1	13.06	13.06
Fixation R	1	4	6955459885	6955857614	397729	1100.25	549.15	19	39	-1	12.91	12.91
Saccade L	1	4	6955857614	6955897487	39873	1090.51	555.99	664.76	672.93	3.81	254.88	0.50	95.44	6256.81	-5902.85	5347.06
Saccade R	1	4	6955857614	6955897487	39873	1090.51	555.99	664.76	672.93	3.81	254.88	0.50	95.44	6256.81	-5902.85	5347.06
Fixation L	1	5	6955897487	6956434448	536961	661.30	681.58	57	42	-1	12.71	12.71
Fixation R	1	5	6955897487	6956434448	536961	661.30	681.58	57	42	-1	13.12	13.12
Saccade L	1	5	6956434448	6956454322	19874	626.08	695.48	622.36	694.25	0.09	5.90	1.00	4.45	34.52	14.14	24.29
Saccade R	1	5	6956434448	6956454322	19874	626.08	695.48	622.36	694.25	0.09	5.90	1.00	4.45	34.52	14.14	24.29
Fixation L	1	6	6956454322	6956553814	99492	615.93	691.12	10	10	-1	12.14	12.14
Fixation R	1	6	6956454322	6956553814	99492	615.93	691.12	10	10	-1	13.00	13.00
Saccade L	1	6	6956553814	6956593566	39752	611.66	696.25	610.72	694.05	1.55	92.04	1.00	39.00	2213.66	-2115.61	2017.13
Saccade R	1	6	6956553814	6956593566	39752	611.66	696.25	610.72	694.05	1.55	92.04	1.00	39.00	2213.66	-2115.61	2017.13
Fixation L	1	7	6956593566	6956772547	178981	601.76	733.39	14	82	-1	12.45	12.45
Fixation R	1	7	6956593566	6956772547	178981	601.76	733.39	14	82	-1	13.15	13.15
Saccade L	1	7	6956772547	6956792440	19893	595.93	747.36	756.32	774.35	1.05	164.49	1.00	52.83	4076.13	-3965.23	2770.84
Saccade R	1	7	6956772547	6956792440	19893	595.93	747.36	756.32	774.35	1.05	164.49	1.00	52.83	4076.13	-3965.23	2770.84
Fixation L	1	8	6956792440	6957031163	238723	778.40	808.17	31	60	-1	12.75	12.75
Fixation R	1	8	6956792440	6957031163	238723	778.40	808.17	31	60	-1	13.41	13.41
Saccade L	1	8	6957031163	6957090780	59617	781.65	830.96	1505.28	976.14	7.75	332.32	0.67	129.99	8217.41	-7766.31	6107.51
Saccade R	1	8	6957031163	6957090780	59617	781.65	830.96	1505.28	976.14	7.75	332.32	0.67	129.99	8217.41	-7766.31	6107.51
Fixation L	1	9	6957090780	6957249900	159120	1493.22	1004.70	48	39	-1	12.80	12.80
Fixation R	1	9	6957090780	6957249900	159120	1493.22	1004.70	48	39	-1	12.26	12.26
Saccade L	1	9	6957249900	6957269900	20000	1469.53	1015.51	1453.93	1011.90	0.26	19.51	0.00	12.88	379.10	-317.36	271.58
Saccade R	1	9	6957249900	6957269900	20000	1469.53	1015.51	1453.93	1011.90	0.26	19.51	0.00	12.88	379.10	-317.36	271.58
Fixation L	1	10	6957269900	6957528392	258492	1468.22	1022.89	49	35	-1	12.74	12.74
Fixation R	1	10	6957269900	6957528392	258492	1468.22	1022.89	49	35	-1	12.05	12.05
Saccade L	1	10	6957528392	6957608007	79615	1477.73	1029.19	1204.02	400.35	8.54	299.61	0.50	107.23	7014.05	-6483.26	3910.02
Saccade R	1	10	6957528392	6957608007	79615	1477.73	1029.19	1204.02	400.35	8.54	299.61	0.50	107.23	7014.05	-6483.26	3910.02
Fixation L	1	11	6957608007	6957806875	198868	1191.75	395.60	35	43	-1	12.70	12.70
Fixation R	1	11	6957608007	6957806875	198868	1191.75	395.60	35	43	-1	12.25	12.25
Saccade L	1	11	6957806875	6957846617	39742	1168.67	401.50	1101.85	238.07	1.82	115.82	0.50	45.83	2668.86	-2471.30	1872.28
Saccade R	1	11	6957806875	6957846617	39742	1168.67	401.50	1101.85	238.07	1.82	115.82	0.50	45.83	2668.86	-2471.30	1872.28
Fixation L	1	12	6957846617	6958065478	218861	1103.16	237.41	28	14	-1	12.58	12.58
Fixation R	1	12	6957846617	6958065478	218861	1103.16	237.41	28	14	-1	12.20	12.20
Saccade L	1	12	6958065478	6958125091	59613	1108.04	239.12	518.09	245.35	6.71	293.63	0.67	112.54	7209.56	-5687.55	4175.73
Saccade R	1	12	6958065478	6958125091	59613	1108.04	239.12	518.09	245.35	6.71	293.63	0.67	112.54	7209.56	-5687.55	4175.73
Fixation L	1	13	6958125091	6958522949	397858	538.80	292.33	29	65	-1	12.36	12.36
Fixation R	1	13	6958125091	6958522949	397858	538.80	292.33	29	65	-1	13.13	13.13
