[BeGaze]
Converted from:	C:\Documents and Settings\iViewX\Desktop\EXPERIMENTATIONS\Experiments\results\finaleart\S22H22551-finaleart-1.idf
Date:	27.03.2019 15:56:43
Version:	BeGaze 2.5.77
Sample Rate:	50
Subject:	S22H22551
Description:	Mathieu Chambre

Table Header for Fixations:
Event Type	Trial	Number	Start	End	Duration	Location X	Location Y	Dispersion X	Dispersion Y	Plane	Avg. Pupil Size X	Avg. Pupil Size Y

Table Header for Saccades:
Event Type	Trial	Number	Start	End	Duration	Start Loc.X	Start Loc.Y	End Loc.X	End Loc.Y	Amplitude	Peak Speed	Peak Speed At	Average Speed	Peak Accel.	Peak Decel.	Average Accel.

Table Header for Blinks:
Event Type	Trial	Number	Start	End	Duration

Table Header for User Events:
Event Type	Trial	Number	Start	Description

UserEvent	1	1	4682671843	# Message: REJECTED_rose_in_a_bowl_fantin_latour_1883.jpg
Fixation L	1	1	4682682426	4683299020	616594	994.99	485.37	27	72	-1	21.99	21.99
Fixation R	1	1	4682682426	4683299020	616594	994.99	485.37	27	72	-1	21.80	21.80
Saccade L	1	1	4683299020	4683318897	19877	972.53	526.97	970.92	526.06	0.14	10.72	1.00	7.06	15.15	-221.18	93.09
Saccade R	1	1	4683299020	4683318897	19877	972.53	526.97	970.92	526.06	0.14	10.72	1.00	7.06	15.15	-221.18	93.09
Fixation L	1	2	4683318897	4683497882	178985	955.14	527.06	68	9	-1	21.38	21.38
Fixation R	1	2	4683318897	4683497882	178985	955.14	527.06	68	9	-1	21.54	21.54
Saccade L	1	2	4683497882	4683517756	19874	902.16	534.11	812.72	598.35	0.94	111.38	1.00	47.46	2770.50	-2691.59	2107.87
Saccade R	1	2	4683497882	4683517756	19874	902.16	534.11	812.72	598.35	0.94	111.38	1.00	47.46	2770.50	-2691.59	2107.87
Fixation L	1	3	4683517756	4683736502	218746	819.86	612.20	43	21	-1	21.52	21.52
Fixation R	1	3	4683517756	4683736502	218746	819.86	612.20	43	21	-1	21.87	21.87
Saccade L	1	3	4683736502	4683756490	19988	783.51	596.16	732.00	539.44	0.71	77.51	1.00	35.48	1876.28	-1560.61	1356.55
Saccade R	1	3	4683736502	4683756490	19988	783.51	596.16	732.00	539.44	0.71	77.51	1.00	35.48	1876.28	-1560.61	1356.55
Fixation L	1	4	4683756490	4683955358	198868	720.97	547.70	17	20	-1	21.37	21.37
Fixation R	1	4	4683756490	4683955358	198868	720.97	547.70	17	20	-1	21.97	21.97
Saccade L	1	4	4683955358	4683975254	19896	718.30	542.89	512.45	547.95	1.26	208.22	1.00	63.08	5124.40	-5169.00	3668.25
Saccade R	1	4	4683955358	4683975254	19896	718.30	542.89	512.45	547.95	1.26	208.22	1.00	63.08	5124.40	-5169.00	3668.25
Fixation L	1	5	4683975254	4684174095	198841	550.10	549.61	47	10	-1	20.86	20.86
Fixation R	1	5	4683975254	4684174095	198841	550.10	549.61	47	10	-1	21.38	21.38
Blink L	1	1	4684174095	4684333214	159119
Blink R	1	1	4684174095	4684333214	159119
Fixation L	1	6	4684333214	4684432711	99497	422.24	154.18	30	69	-1	20.04	20.04
Fixation R	1	6	4684333214	4684432711	99497	422.24	154.18	30	69	-1	20.28	20.28
Saccade L	1	5	4684432711	4684512199	79488	434.70	201.57	707.35	273.01	4.79	217.52	0.75	60.21	5179.43	-5033.99	2560.86
Saccade R	1	5	4684432711	4684512199	79488	434.70	201.57	707.35	273.01	4.79	217.52	0.75	60.21	5179.43	-5033.99	2560.86
Fixation L	1	7	4684512199	4684671315	159116	719.05	251.71	19	64	-1	20.33	20.33
Fixation R	1	7	4684512199	4684671315	159116	719.05	251.71	19	64	-1	20.53	20.53
Saccade L	1	6	4684671315	4684711194	39879	718.60	212.31	1031.67	516.06	3.83	368.18	0.50	96.03	9102.41	-8993.75	5234.78
Saccade R	1	6	4684671315	4684711194	39879	718.60	212.31	1031.67	516.06	3.83	368.18	0.50	96.03	9102.41	-8993.75	5234.78
Fixation L	1	8	4684711194	4684890183	178989	1035.85	526.66	9	13	-1	21.45	21.45
Fixation R	1	8	4684711194	4684890183	178989	1035.85	526.66	9	13	-1	21.57	21.57
Blink L	1	2	4684890183	4685108909	218726
Blink R	1	2	4684890183	4685108909	218726
Fixation L	1	9	4685108909	4685506785	397876	1030.39	563.77	51	44	-1	21.50	21.50
Fixation R	1	9	4685108909	4685506785	397876	1030.39	563.77	51	44	-1	21.70	21.70
Saccade L	1	7	4685506785	4685526650	19865	994.72	588.75	990.49	593.13	0.10	6.95	0.00	4.79	49.43	-126.77	93.39
Saccade R	1	7	4685506785	4685526650	19865	994.72	588.75	990.49	593.13	0.10	6.95	0.00	4.79	49.43	-126.77	93.39
Fixation L	1	10	4685526650	4685685766	159116	991.18	595.03	1	3	-1	22.20	22.20
Fixation R	1	10	4685526650	4685685766	159116	991.18	595.03	1	3	-1	22.14	22.14
Saccade L	1	8	4685685766	4685785261	99495	991.51	596.68	1280.57	603.44	6.51	225.72	1.00	65.45	37876.91	-4779.27	8232.49
Saccade R	1	8	4685685766	4685785261	99495	991.51	596.68	1280.57	603.44	6.51	225.72	1.00	65.45	37876.91	-4779.27	8232.49
Blink L	1	3	4685785261	4686004000	218739
Blink R	1	3	4685785261	4686004000	218739
Fixation L	1	11	4686004000	4686163151	159151	1456.21	679.42	12	29	-1	21.87	21.87
Fixation R	1	11	4686004000	4686163151	159151	1456.21	679.42	12	29	-1	21.31	21.31
Saccade L	1	9	4686163151	4686202860	39709	1450.12	672.11	1153.22	770.75	2.74	163.66	1.00	69.02	4032.64	-3849.21	3715.43
Saccade R	1	9	4686163151	4686202860	39709	1450.12	672.11	1153.22	770.75	2.74	163.66	1.00	69.02	4032.64	-3849.21	3715.43
Fixation L	1	12	4686202860	4686481357	278497	1129.42	792.54	30	26	-1	22.22	22.22
Fixation R	1	12	4686202860	4686481357	278497	1129.42	792.54	30	26	-1	21.83	21.83
Saccade L	1	10	4686481357	4686521095	39738	1123.76	797.16	1017.56	673.49	1.51	136.04	1.00	38.05	3373.72	-3194.82	2155.08
Saccade R	1	10	4686481357	4686521095	39738	1123.76	797.16	1017.56	673.49	1.51	136.04	1.00	38.05	3373.72	-3194.82	2155.08
Fixation L	1	13	4686521095	4686720079	198984	1016.04	683.44	7	14	-1	21.75	21.75
Fixation R	1	13	4686521095	4686720079	198984	1016.04	683.44	7	14	-1	21.48	21.48
