[BeGaze]
Converted from:	C:\Documents and Settings\iViewX\Desktop\EXPERIMENTATIONS\Experiments\results\finaleart\S11H21112-finaleart-1.idf
Date:	27.03.2019 15:39:46
Version:	BeGaze 2.5.77
Sample Rate:	50
Subject:	S11H21112
Description:	Clement legrand-Duchenne

Table Header for Fixations:
Event Type	Trial	Number	Start	End	Duration	Location X	Location Y	Dispersion X	Dispersion Y	Plane	Avg. Pupil Size X	Avg. Pupil Size Y

Table Header for Saccades:
Event Type	Trial	Number	Start	End	Duration	Start Loc.X	Start Loc.Y	End Loc.X	End Loc.Y	Amplitude	Peak Speed	Peak Speed At	Average Speed	Peak Accel.	Peak Decel.	Average Accel.

Table Header for Blinks:
Event Type	Trial	Number	Start	End	Duration

Table Header for User Events:
Event Type	Trial	Number	Start	Description

UserEvent	1	1	6208558083	# Message: Automne_En_France_Carr_1911.jpg
Fixation L	1	1	6208574862	6209012710	437848	873.78	357.18	26	63	-1	13.08	13.08
Fixation R	1	1	6208574862	6209012710	437848	873.78	357.18	26	63	-1	16.29	16.29
Saccade L	1	1	6209012710	6209032580	19870	892.20	405.34	899.65	489.20	0.84	85.16	1.00	42.32	2032.84	-1872.17	1639.66
Saccade R	1	1	6209012710	6209032580	19870	892.20	405.34	899.65	489.20	0.84	85.16	1.00	42.32	2032.84	-1872.17	1639.66
Fixation L	1	2	6209032580	6209490189	457609	937.14	493.88	52	36	-1	12.06	12.06
Fixation R	1	2	6209032580	6209490189	457609	937.14	493.88	52	36	-1	15.54	15.54
Saccade L	1	2	6209490189	6209510058	19869	934.29	468.96	789.78	474.54	0.89	146.26	1.00	44.74	3512.42	-3444.56	2342.80
Saccade R	1	2	6209490189	6209510058	19869	934.29	468.96	789.78	474.54	0.89	146.26	1.00	44.74	3512.42	-3444.56	2342.80
Fixation L	1	3	6209510058	6210007544	497486	785.19	475.75	9	20	-1	10.58	10.58
Fixation R	1	3	6209510058	6210007544	497486	785.19	475.75	9	20	-1	13.74	13.74
Saccade L	1	3	6210007544	6210047406	39862	788.84	481.00	1111.57	570.63	2.85	233.54	0.50	71.48	5793.84	-5665.22	4076.11
Saccade R	1	3	6210007544	6210047406	39862	788.84	481.00	1111.57	570.63	2.85	233.54	0.50	71.48	5793.84	-5665.22	4076.11
Fixation L	1	4	6210047406	6210624383	576977	1098.59	587.35	20	66	-1	11.36	11.36
Fixation R	1	4	6210047406	6210624383	576977	1098.59	587.35	20	66	-1	13.95	13.95
Saccade L	1	4	6210624383	6210664134	39751	1095.72	579.67	862.92	545.17	2.14	139.04	0.50	53.74	3317.65	-3064.74	2751.21
Saccade R	1	4	6210624383	6210664134	39751	1095.72	579.67	862.92	545.17	2.14	139.04	0.50	53.74	3317.65	-3064.74	2751.21
Fixation L	1	5	6210664134	6211479975	815841	862.86	522.79	10	68	-1	11.06	11.06
Fixation R	1	5	6210664134	6211479975	815841	862.86	522.79	10	68	-1	14.10	14.10
Saccade L	1	5	6211479975	6211519851	39876	865.92	501.36	1134.62	566.59	2.61	218.15	0.50	65.45	5086.60	-5111.62	3363.40
Saccade R	1	5	6211479975	6211519851	39876	865.92	501.36	1134.62	566.59	2.61	218.15	0.50	65.45	5086.60	-5111.62	3363.40
Fixation L	1	6	6211519851	6211877962	358111	1147.02	583.98	18	30	-1	11.45	11.45
Fixation R	1	6	6211519851	6211877962	358111	1147.02	583.98	18	30	-1	14.46	14.46
Saccade L	1	6	6211877962	6211917722	39760	1139.25	576.26	849.73	518.36	2.66	162.75	0.50	66.94	4039.30	-3819.33	3527.74
Saccade R	1	6	6211877962	6211917722	39760	1139.25	576.26	849.73	518.36	2.66	162.75	0.50	66.94	4039.30	-3819.33	3527.74
Fixation L	1	7	6211917722	6212335691	417969	835.22	488.74	22	50	-1	11.29	11.29
Fixation R	1	7	6211917722	6212335691	417969	835.22	488.74	22	50	-1	14.33	14.33
Saccade L	1	7	6212335691	6212355562	19871	841.41	484.67	960.43	513.20	0.81	123.80	1.00	40.90	2969.80	-2344.25	1905.30
Saccade R	1	7	6212335691	6212355562	19871	841.41	484.67	960.43	513.20	0.81	123.80	1.00	40.90	2969.80	-2344.25	1905.30
Fixation L	1	8	6212355562	6212554554	198992	984.91	505.44	31	26	-1	11.21	11.21
Fixation R	1	8	6212355562	6212554554	198992	984.91	505.44	31	26	-1	14.18	14.18
