[BeGaze]
Converted from:	C:\Documents and Settings\iViewX\Desktop\EXPERIMENTATIONS\Experiments\results\finaleart\S11H21112-finaleart-1.idf
Date:	27.03.2019 15:38:37
Version:	BeGaze 2.5.77
Sample Rate:	50
Subject:	S11H21112
Description:	Clement legrand-Duchenne

Table Header for Fixations:
Event Type	Trial	Number	Start	End	Duration	Location X	Location Y	Dispersion X	Dispersion Y	Plane	Avg. Pupil Size X	Avg. Pupil Size Y

Table Header for Saccades:
Event Type	Trial	Number	Start	End	Duration	Start Loc.X	Start Loc.Y	End Loc.X	End Loc.Y	Amplitude	Peak Speed	Peak Speed At	Average Speed	Peak Accel.	Peak Decel.	Average Accel.

Table Header for Blinks:
Event Type	Trial	Number	Start	End	Duration

Table Header for User Events:
Event Type	Trial	Number	Start	Description

UserEvent	1	1	3974149312	# Message: void.jpg
Saccade L	1	1	3974158375	3974198256	39881	1470.83	642.45	1470.23	889.30	2.62	147.52	0.50	65.75	2556.36	-3357.15	2097.28
Saccade R	1	1	3974158375	3974198256	39881	1470.83	642.45	1470.23	889.30	2.62	147.52	0.50	65.75	2556.36	-3357.15	2097.28
Fixation L	1	1	3974198256	3974934120	735864	1470.66	937.12	15	82	-1	14.40	14.40
Fixation R	1	1	3974198256	3974934120	735864	1470.66	937.12	15	82	-1	16.09	16.09
Saccade L	1	2	3974934120	3974993840	59720	1467.56	957.43	897.24	987.87	6.12	212.33	0.67	102.47	5189.73	-4799.01	3820.17
Saccade R	1	2	3974934120	3974993840	59720	1467.56	957.43	897.24	987.87	6.12	212.33	0.67	102.47	5189.73	-4799.01	3820.17
Fixation L	1	2	3974993840	3975272329	278489	899.42	1004.39	4	47	-1	15.41	15.41
Fixation R	1	2	3974993840	3975272329	278489	899.42	1004.39	4	47	-1	16.87	16.87
Saccade L	1	3	3975272329	3975312072	39743	898.70	1015.54	1117.95	1238.01	2.94	175.53	1.00	73.95	4342.58	-4119.79	4055.40
Saccade R	1	3	3975272329	3975312072	39743	898.70	1015.54	1117.95	1238.01	2.94	175.53	1.00	73.95	4342.58	-4119.79	4055.40
Fixation L	1	3	3975312072	3975888802	576730	1138.83	1254.34	37	22	-1	16.39	16.39
Fixation R	1	3	3975312072	3975888802	576730	1138.83	1254.34	37	22	-1	18.50	18.50
Saccade L	1	4	3975888802	3975948551	59749	1125.99	1256.95	643.21	1138.01	5.32	183.44	0.67	89.12	4483.54	-4054.53	3373.89
Saccade R	1	4	3975888802	3975948551	59749	1125.99	1256.95	643.21	1138.01	5.32	183.44	0.67	89.12	4483.54	-4054.53	3373.89
Fixation L	1	4	3975948551	3976107672	159121	635.08	1122.19	15	27	-1	17.85	17.85
Fixation R	1	4	3975948551	3976107672	159121	635.08	1122.19	15	27	-1	20.46	20.46
Saccade L	1	5	3976107672	3976147544	39872	636.82	1125.24	491.08	1258.34	2.12	152.11	0.50	53.20	3785.78	0.00	1742.21
Saccade R	1	5	3976107672	3976147544	39872	636.82	1125.24	491.08	1258.34	2.12	152.11	0.50	53.20	3785.78	0.00	1742.21
