[BeGaze]
Converted from:	C:\Documents and Settings\iViewX\Desktop\EXPERIMENTATIONS\Experiments\results\finaleart\S3121421-finaleart-1.idf
Date:	27.03.2019 15:33:49
Version:	BeGaze 2.5.77
Sample Rate:	50
Subject:	S3121421
Description:	Jean Jouve

Table Header for Fixations:
Event Type	Trial	Number	Start	End	Duration	Location X	Location Y	Dispersion X	Dispersion Y	Plane	Avg. Pupil Size X	Avg. Pupil Size Y

Table Header for Saccades:
Event Type	Trial	Number	Start	End	Duration	Start Loc.X	Start Loc.Y	End Loc.X	End Loc.Y	Amplitude	Peak Speed	Peak Speed At	Average Speed	Peak Accel.	Peak Decel.	Average Accel.

Table Header for Blinks:
Event Type	Trial	Number	Start	End	Duration

Table Header for User Events:
Event Type	Trial	Number	Start	Description

UserEvent	1	1	3959236380	# Message: ronde_cross_1905.jpg
Fixation L	1	1	3959248104	3959685700	437596	1068.78	402.36	5	16	-1	12.76	12.76
Fixation R	1	1	3959248104	3959685700	437596	1068.78	402.36	5	16	-1	13.48	13.48
Saccade L	1	1	3959685700	3959705578	19878	1070.23	410.71	1061.78	536.23	0.71	127.25	1.00	35.54	3115.25	-2366.10	1915.37
Saccade R	1	1	3959685700	3959705578	19878	1070.23	410.71	1061.78	536.23	0.71	127.25	1.00	35.54	3115.25	-2366.10	1915.37
Fixation L	1	2	3959705578	3959904437	198859	1037.74	559.97	45	38	-1	12.76	12.76
Fixation R	1	2	3959705578	3959904437	198859	1037.74	559.97	45	38	-1	13.30	13.30
Saccade L	1	2	3959904437	3959924311	19874	1016.62	570.10	814.85	566.30	1.24	204.06	1.00	62.29	4777.31	-4552.03	3133.64
Saccade R	1	2	3959904437	3959924311	19874	1016.62	570.10	814.85	566.30	1.24	204.06	1.00	62.29	4777.31	-4552.03	3133.64
Fixation L	1	3	3959924311	3960143180	218869	787.22	531.58	40	57	-1	11.22	11.22
Fixation R	1	3	3959924311	3960143180	218869	787.22	531.58	40	57	-1	11.70	11.70
Saccade L	1	3	3960143180	3960242550	99370	774.04	510.23	774.93	711.37	3.24	203.39	1.00	32.62	4876.41	-4978.20	1467.97
Saccade R	1	3	3960143180	3960242550	99370	774.04	510.23	774.93	711.37	3.24	203.39	1.00	32.62	4876.41	-4978.20	1467.97
Fixation L	1	4	3960242550	3960580649	338099	780.63	689.26	12	43	-1	10.36	10.36
Fixation R	1	4	3960242550	3960580649	338099	780.63	689.26	12	43	-1	10.78	10.78
Saccade L	1	4	3960580649	3960600520	19871	781.60	681.53	783.69	509.09	0.96	174.41	1.00	48.25	4299.75	-3936.75	2800.18
Saccade R	1	4	3960580649	3960600520	19871	781.60	681.53	783.69	509.09	0.96	174.41	1.00	48.25	4299.75	-3936.75	2800.18
Fixation L	1	5	3960600520	3961097754	497234	786.13	484.41	14	42	-1	9.74	9.74
Fixation R	1	5	3960600520	3961097754	497234	786.13	484.41	14	42	-1	10.66	10.66
Saccade L	1	5	3961097754	3961137610	39856	776.15	490.85	526.61	494.66	2.41	128.61	0.50	60.50	3153.88	-2870.82	2786.64
Saccade R	1	5	3961097754	3961137610	39856	776.15	490.85	526.61	494.66	2.41	128.61	0.50	60.50	3153.88	-2870.82	2786.64
Fixation L	1	6	3961137610	3961992802	855192	479.15	481.03	65	32	-1	9.57	9.57
Fixation R	1	6	3961137610	3961992802	855192	479.15	481.03	65	32	-1	10.80	10.80
Saccade L	1	6	3961992802	3962052434	59632	508.64	489.72	1283.34	512.64	8.57	336.67	0.33	143.79	8302.16	-5513.25	5425.72
Saccade R	1	6	3961992802	3962052434	59632	508.64	489.72	1283.34	512.64	8.57	336.67	0.33	143.79	8302.16	-5513.25	5425.72
Fixation L	1	7	3962052434	3962509907	457473	1259.77	537.37	32	65	-1	10.15	10.15
Fixation R	1	7	3962052434	3962509907	457473	1259.77	537.37	32	65	-1	10.76	10.76
Saccade L	1	7	3962509907	3962529776	19869	1259.65	544.41	1107.37	571.84	1.10	156.49	1.00	55.22	3853.81	-2918.69	2719.55
Saccade R	1	7	3962509907	3962529776	19869	1259.65	544.41	1107.37	571.84	1.10	156.49	1.00	55.22	3853.81	-2918.69	2719.55
Fixation L	1	8	3962529776	3962649150	119374	1094.08	603.20	22	57	-1	10.23	10.23
Fixation R	1	8	3962529776	3962649150	119374	1094.08	603.20	22	57	-1	10.58	10.58
Blink L	1	1	3962649150	3962808254	159104
Blink R	1	1	3962649150	3962808254	159104
Saccade L	1	8	3962808254	3962927633	119379	1089.26	589.11	1049.77	658.91	4.45	146.24	1.00	37.28	1998.54	-3233.91	884.82
Saccade R	1	8	3962808254	3962927633	119379	1089.26	589.11	1049.77	658.91	4.45	146.24	1.00	37.28	1998.54	-3233.91	884.82
Fixation L	1	9	3962927633	3963046872	119239	1049.84	648.67	12	87	-1	11.21	11.21
Fixation R	1	9	3962927633	3963046872	119239	1049.84	648.67	12	87	-1	14.22	14.22
Saccade L	1	9	3963046872	3963066879	20007	1055.25	631.35	1050.42	617.49	0.15	14.84	1.00	7.70	284.80	19.19	154.07
Saccade R	1	9	3963046872	3963066879	20007	1055.25	631.35	1050.42	617.49	0.15	14.84	1.00	7.70	284.80	19.19	154.07
Fixation L	1	10	3963066879	3963245867	178988	1055.66	605.15	37	32	-1	10.96	10.96
Fixation R	1	10	3963066879	3963245867	178988	1055.66	605.15	37	32	-1	13.05	13.05
