[BeGaze]
Converted from:	C:\Documents and Settings\iViewX\Desktop\EXPERIMENTATIONS\Experiments\results\finaleart\S12H22222-finaleart-1.idf
Date:	27.03.2019 15:40:25
Version:	BeGaze 2.5.77
Sample Rate:	50
Subject:	S12H22222
Description:	aurele barriere

Table Header for Fixations:
Event Type	Trial	Number	Start	End	Duration	Location X	Location Y	Dispersion X	Dispersion Y	Plane	Avg. Pupil Size X	Avg. Pupil Size Y

Table Header for Saccades:
Event Type	Trial	Number	Start	End	Duration	Start Loc.X	Start Loc.Y	End Loc.X	End Loc.Y	Amplitude	Peak Speed	Peak Speed At	Average Speed	Peak Accel.	Peak Decel.	Average Accel.

Table Header for Blinks:
Event Type	Trial	Number	Start	End	Duration

Table Header for User Events:
Event Type	Trial	Number	Start	Description

UserEvent	1	1	23460766568	# Message: Rysselberghe-Vase-of-flowers-1907.jpg
Fixation L	1	1	23460780358	23461257695	477337	1022.59	515.14	21	42	-1	14.66	14.66
Fixation R	1	1	23460780358	23461257695	477337	1022.59	515.14	21	42	-1	14.06	14.06
Saccade L	1	1	23461257695	23461277583	19888	1006.19	546.67	988.67	622.01	0.70	78.25	1.00	35.04	1931.37	-1515.58	1308.56
Saccade R	1	1	23461257695	23461277583	19888	1006.19	546.67	988.67	622.01	0.70	78.25	1.00	35.04	1931.37	-1515.58	1308.56
Fixation L	1	2	23461277583	23461814678	537095	975.14	612.63	21	29	-1	13.18	13.18
Fixation R	1	2	23461277583	23461814678	537095	975.14	612.63	21	29	-1	12.55	12.55
Saccade L	1	2	23461814678	23461834552	19874	988.06	624.13	1070.06	575.45	0.51	96.47	1.00	25.46	2365.97	-2279.49	1551.53
Saccade R	1	2	23461814678	23461834552	19874	988.06	624.13	1070.06	575.45	0.51	96.47	1.00	25.46	2365.97	-2279.49	1551.53
Fixation L	1	3	23461834552	23462132914	298362	1076.19	561.87	18	35	-1	12.13	12.13
Fixation R	1	3	23461834552	23462132914	298362	1076.19	561.87	18	35	-1	11.53	11.53
Saccade L	1	3	23462132914	23462152789	19875	1086.11	539.83	1106.47	437.19	0.82	105.84	1.00	41.41	2627.88	-2462.96	1791.90
Saccade R	1	3	23462132914	23462152789	19875	1086.11	539.83	1106.47	437.19	0.82	105.84	1.00	41.41	2627.88	-2462.96	1791.90
Fixation L	1	4	23462152789	23462252290	99501	1109.80	405.81	40	42	-1	11.81	11.81
Fixation R	1	4	23462152789	23462252290	99501	1109.80	405.81	40	42	-1	11.32	11.32
Saccade L	1	4	23462252290	23462292040	39750	1137.65	399.38	1346.04	322.98	2.28	150.19	0.50	57.29	3656.13	-3152.38	2369.48
Saccade R	1	4	23462252290	23462292040	39750	1137.65	399.38	1346.04	322.98	2.28	150.19	0.50	57.29	3656.13	-3152.38	2369.48
Fixation L	1	5	23462292040	23462530644	238604	1348.51	295.16	14	38	-1	11.53	11.53
Fixation R	1	5	23462292040	23462530644	238604	1348.51	295.16	14	38	-1	11.10	11.10
Saccade L	1	5	23462530644	23462550655	20011	1352.18	303.01	1427.51	300.48	0.45	76.25	1.00	22.30	1778.31	-1651.32	1151.60
Saccade R	1	5	23462530644	23462550655	20011	1352.18	303.01	1427.51	300.48	0.45	76.25	1.00	22.30	1778.31	-1651.32	1151.60
Fixation L	1	6	23462550655	23463028014	477359	1440.93	290.49	50	25	-1	11.80	11.80
Fixation R	1	6	23462550655	23463028014	477359	1440.93	290.49	50	25	-1	11.42	11.42
Saccade L	1	6	23463028014	23463067760	39746	1465.70	289.36	1056.78	373.68	3.67	234.12	0.50	92.42	5809.38	-4948.02	4911.22
Saccade R	1	6	23463028014	23463067760	39746	1465.70	289.36	1056.78	373.68	3.67	234.12	0.50	92.42	5809.38	-4948.02	4911.22
Fixation L	1	7	23463067760	23463246768	179008	1042.32	357.38	24	35	-1	12.34	12.34
Fixation R	1	7	23463067760	23463246768	179008	1042.32	357.38	24	35	-1	11.85	11.85
Saccade L	1	7	23463246768	23463286495	39727	1036.20	361.64	751.29	370.76	2.50	194.04	0.50	62.93	4759.45	-4378.35	3391.49
Saccade R	1	7	23463246768	23463286495	39727	1036.20	361.64	751.29	370.76	2.50	194.04	0.50	62.93	4759.45	-4378.35	3391.49
Fixation L	1	8	23463286495	23463465498	179003	752.28	381.70	16	23	-1	12.67	12.67
Fixation R	1	8	23463286495	23463465498	179003	752.28	381.70	16	23	-1	12.22	12.22
Saccade L	1	8	23463465498	23463485481	19983	746.82	394.53	683.48	389.86	0.44	64.25	1.00	21.80	1473.35	-1537.15	1023.89
Saccade R	1	8	23463465498	23463485481	19983	746.82	394.53	683.48	389.86	0.44	64.25	1.00	21.80	1473.35	-1537.15	1023.89
Fixation L	1	9	23463485481	23463743973	258492	668.60	378.52	35	17	-1	12.71	12.71
Fixation R	1	9	23463485481	23463743973	258492	668.60	378.52	35	17	-1	12.20	12.20
Saccade L	1	9	23463743973	23463763843	19870	648.01	379.00	479.22	375.10	1.08	170.75	1.00	54.14	4184.17	-4243.99	2829.99
Saccade R	1	9	23463743973	23463763843	19870	648.01	379.00	479.22	375.10	1.08	170.75	1.00	54.14	4184.17	-4243.99	2829.99
Fixation L	1	10	23463763843	23464062206	298363	456.62	412.14	30	68	-1	12.20	12.20
Fixation R	1	10	23463763843	23464062206	298363	456.62	412.14	30	68	-1	11.53	11.53
Saccade L	1	10	23464062206	23464082078	19872	471.93	443.61	522.60	436.96	0.42	51.69	1.00	21.20	1211.79	-1029.57	781.63
Saccade R	1	10	23464062206	23464082078	19872	471.93	443.61	522.60	436.96	0.42	51.69	1.00	21.20	1211.79	-1029.57	781.63
Fixation L	1	11	23464082078	23464241196	159118	525.00	405.96	12	52	-1	12.23	12.23
Fixation R	1	11	23464082078	23464241196	159118	525.00	405.96	12	52	-1	11.66	11.66
Saccade L	1	11	23464241196	23464281084	39888	528.02	384.09	672.54	287.96	2.11	138.28	1.00	52.91	3363.04	-3381.19	2094.19
Saccade R	1	11	23464241196	23464281084	39888	528.02	384.09	672.54	287.96	2.11	138.28	1.00	52.91	3363.04	-3381.19	2094.19
Fixation L	1	12	23464281084	23464519682	238598	693.38	249.74	32	66	-1	12.21	12.21
Fixation R	1	12	23464281084	23464519682	238598	693.38	249.74	32	66	-1	11.92	11.92
Saccade L	1	12	23464519682	23464559435	39753	705.34	258.41	904.34	244.90	1.84	128.43	0.50	46.21	3094.00	-2690.40	2280.26
Saccade R	1	12	23464519682	23464559435	39753	705.34	258.41	904.34	244.90	1.84	128.43	0.50	46.21	3094.00	-2690.40	2280.26
Fixation L	1	13	23464559435	23464758424	198989	925.11	218.09	27	38	-1	12.71	12.71
Fixation R	1	13	23464559435	23464758424	198989	925.11	218.09	27	38	-1	12.22	12.22
