<?xml version="1.0" encoding="utf-8"?>
<!-- Generator: Adobe Illustrator 19.1.0, SVG Export Plug-In . SVG Version: 6.00 Build 0)  -->
<svg version="1.1" id="Layer_1" xmlns="http://www.w3.org/2000/svg" xmlns:xlink="http://www.w3.org/1999/xlink" x="0px" y="0px"
	 viewBox="0 0 1520 122" style="enable-background:new 0 0 1520 122;" xml:space="preserve">
<style type="text/css">
	.st0{fill:#FFFFFF;}
</style>
<g>
	<g>
		<path class="st0" d="M1161.8,80.9c0.6,0,1.2-0.3,1.2-0.8v-0.8V68.1c0-0.6,0.5-1.2,1.2-1.2h7.7h1.3c6.9,0,12.6-5.4,12.6-12.7
			c0-0.1,0-0.3,0-0.4c0-0.1,0-0.3,0-0.4c0-7.2-5.7-12.5-12.7-12.5h-1.3h-10.2h-1.3c-0.6,0-1.2,0.5-1.2,1.2v0.8v36v0.8
			c0,0.8,0.8,1.3,1.4,1.3 M1164.2,63.5c-0.6,0-1.2-0.5-1.2-1.2V45.5c0-0.6,0.5-1.2,1.2-1.2h7.4c5.4,0,9.8,3.4,10,9.1
			c-0.2,5.8-4.6,10.1-9.9,10.1H1164.2z"/>
		<path class="st0" d="M1228.2,40.8h-1.3h-20.2h-1.3c-0.6,0-1.2,0.5-1.2,1.2v0.8v36v0.8c0,0.6,0.5,1.2,1.2,1.2h1.3h20.2h1.3
			c0.6,0,1.2-0.5,1.2-1.2c0-0.1,0-0.1,0-0.4c0-0.4,0-0.3,0-0.4c0-0.6-0.5-1.2-1.2-1.2h-1.3h-17.5c-0.6,0-1.2-0.5-1.2-1.2V63.1
			c0-0.6,0.5-1.2,1.2-1.2h14.8h1.3c0.6,0,1.2-0.5,1.2-1.2v-0.1c0-0.1,0,0,0-0.3c0-0.4,0-0.3,0-0.4v-0.1c0-0.6-0.5-1.2-1.2-1.2h-1.3
			h-14.8c-0.6,0-1.2-0.5-1.2-1.2V45.2c0-0.6,0.5-1.2,1.2-1.2h17.5h1.3c0.6,0,1.2-0.5,1.2-1.2v-0.1v-0.7V42
			C1229.4,41.4,1228.8,40.8,1228.2,40.8z"/>
		<path class="st0" d="M1517.8,40.8h-1.3h-20.2h-1.3c-0.6,0-1.2,0.5-1.2,1.2v0.8v36v0.8c0,0.6,0.5,1.2,1.2,1.2h1.3h20.2h1.3
			c0.6,0,1.2-0.5,1.2-1.2c0-0.1,0-0.1,0-0.4c0-0.4,0-0.3,0-0.4c0-0.6-0.5-1.2-1.2-1.2h-1.3H1499c-0.6,0-1.2-0.5-1.2-1.2V63.1
			c0-0.6,0.5-1.2,1.2-1.2h14.8h1.3c0.6,0,1.2-0.5,1.2-1.2v-0.1c0-0.1,0,0,0-0.3c0-0.4,0-0.3,0-0.4v-0.1c0-0.6-0.5-1.2-1.2-1.2h-1.3
			H1499c-0.6,0-1.2-0.5-1.2-1.2V45.2c0-0.6,0.5-1.2,1.2-1.2h17.5h1.3c0.6,0,1.2-0.5,1.2-1.2v-0.1v-0.7V42
			C1519,41.4,1518.5,40.8,1517.8,40.8z"/>
		<path class="st0" d="M1251,80.8h0.4c0.7,0,1.1-0.3,1.1-0.7v-0.8V66.9c0-0.6,0.5-1.2,1.2-1.2h7.8h1.3c0.1,0,0.1,0,0.2,0
			c0.4,0,0.7,0.2,0.9,0.6l7.7,13.9c0.3,0.5,0.5,0.7,1.2,0.7h1.3h0.2h1.3c0,0,1.2,0,0.3-1.8l-7.5-13.3l0.1,0.1c-0.4-0.7,0.6-1,0.6-1
			c4.4-1.5,7.9-6.9,7.7-12.3c0.1-4.3-1.9-8.6-7.5-10.9c-0.3-0.1-2.1-0.8-5.3-0.8h-1.3h-11.9h-1.3c-0.4,0-0.7,0.3-0.7,0.7v0.8v36.5
			v0.8c0,0.6,0.5,1.2,1.2,1.2h0.4 M1253.7,62.3c-0.6,0-1.2-0.5-1.2-1.2V45.4c0-0.6,0.5-1.2,1.2-1.2h9.2c5.3,0,9,3.4,9.3,8.5
			c-0.2,5.3-4,9.6-9.2,9.6H1253.7z"/>
		<path class="st0" d="M1396.8,80.8h0.4c0.7,0,1.1-0.3,1.1-0.7v-0.8V66.9c0-0.6,0.5-1.2,1.2-1.2h7.8h1.3c0.1,0,0.1,0,0.2,0
			c0.4,0,0.7,0.2,0.9,0.6l7.7,13.9c0.3,0.5,0.5,0.7,1.2,0.7h1.3h0.2h1.3c0,0,1.2,0,0.3-1.8l-7.5-13.3l0.1,0.1c-0.4-0.7,0.6-1,0.6-1
			c4.4-1.5,7.9-6.9,7.7-12.3c0.1-4.3-1.9-8.6-7.5-10.9c-0.3-0.1-2.1-0.8-5.3-0.8h-1.3h-11.9h-1.3c-0.4,0-0.7,0.3-0.7,0.7v0.8v36.5
			v0.8c0,0.6,0.5,1.2,1.2,1.2h0.4H1396.8z M1399.5,62.3c-0.7,0-1.2-0.5-1.2-1.2V45.4c0-0.6,0.5-1.2,1.2-1.2h9.2c5.3,0,9,3.4,9.3,8.5
			c-0.2,5.3-4,9.6-9.2,9.6H1399.5z"/>
		<path class="st0" d="M1299,80.8h0.6c0.6,0,0.9-0.3,0.9-0.7v-0.8V64.6c0-0.6,0.5-1.2,1.2-1.2h15.3h1.3c0.8,0,0.7-1,0.7-1.6
			c0,0,0,0,0,0c0-0.3,0-0.5,0-0.8c0-0.4-0.3-0.7-0.7-0.7h-1.3h-15.3c-0.6,0-1.2-0.5-1.2-1.2V45.2c0-0.6,0.5-1.2,1.2-1.2h17.6h1.3
			c0.6,0,1.2-0.5,1.2-1.2v-0.1v-0.7V42c0-0.6-0.5-1.2-1.2-1.2h-1.3H1299h-1.3c-0.6,0-1.2,0.5-1.2,1.2v0.8v36v0.8
			c0,0.6,0.5,1.2,1.2,1.2h0.6H1299z"/>
		<path class="st0" d="M1474.8,73.8c0.5,0.4,1.4,1.5,0.4,2.2c-4.2,3.3-8.7,5.4-13.7,5.4c-0.2,0-0.5,0-0.7,0c-0.2,0-0.4,0-0.6,0
			c-11.2,0-20.3-8.8-20.3-20.1c0-0.1,0-0.3,0-0.4c0-0.1,0-0.3,0-0.4c0-11.2,9.1-20.2,20.3-20.2c0.2,0,0.3,0,0.5,0c0.3,0,0.6,0,0.8,0
			c5.7,0,10,1.9,13.6,5.2c1.1,1,0.1,1.8,0.1,1.8l-0.8,0.8c-0.3,0.3-1.3,1.1-1.7,0.7c-0.5-0.5-0.7-0.6-0.7-0.6l0.7,0.6
			c-0.5-0.5-0.3-0.3-0.7-0.6c-3-2.7-6.8-4.4-11.1-4.6c-9.3,0.3-16.6,8-16.8,17.3c0.2,9.2,7.5,16.8,16.8,17.1c4.5-0.2,7.9-2,11.1-4.7
			C1472,73.4,1473.4,72.3,1474.8,73.8"/>
		<polygon class="st0" points="1474.8,73.7 1474.8,73.8 1474.8,73.8 		"/>
		<path class="st0" d="M1474.8,73.7c-0.1-0.1-0.2-0.2-0.2-0.2L1474.8,73.7z"/>
		<path class="st0" d="M1377.6,54.9c0,0-0.7-9.5-8.4-14.4c-1.1,1-2.4,2.3-3,2.9c-1-0.6-2.1-1.1-3.2-1.5c-9.6-3.6-19.8,0.5-25.4,8.1
			c-2.9,4.4-4.7,9.7-4.2,15.3c0,0,0,10.4,9.5,16.5c0.8-1.1,1.8-2.5,2.4-3.3c1.1,0.6,2.2,1.2,3.4,1.6c10.9,4.1,23-1.1,26.9-11.6
			C1375.6,68.3,1378.5,61.9,1377.6,54.9z M1349.9,76.1c-8.5-3.2-12.8-12.6-9.6-21.1c0.3-0.8,0.7-1.6,1.1-2.3
			c-0.4-0.4-1.4-1.1-1.3-1.2c5.1-6.2,11.8-8.1,17.7-7c1.2,0.2,2.4,0.5,3.6,0.9c8.5,3.2,12.8,12.6,9.6,21.1c-0.3,0.8-0.7,1.7-1.1,2.4
			c0.5,0.4,1.5,1.2,1.4,1.2c-5.7,6.8-13.3,8.4-19.6,6.5C1351.1,76.6,1350.5,76.4,1349.9,76.1z"/>
	</g>
	<g>
		<path class="st0" d="M895.3,30.7v20.1h-1.7c-1.3-5.2-3.6-9.2-7-12c-3.4-2.8-7.3-4.2-11.6-4.2c-3.6,0-6.9,1-9.9,3.1
			c-3,2.1-5.2,4.8-6.6,8.2c-1.8,4.3-2.7,9.1-2.7,14.3c0,5.2,0.7,9.9,2,14.1c1.3,4.3,3.4,7.5,6.1,9.6c2.8,2.2,6.4,3.3,10.8,3.3
			c3.6,0,7-0.8,10-2.4c3-1.6,6.2-4.3,9.6-8.2v5c-3.2,3.4-6.6,5.8-10.1,7.4c-3.5,1.5-7.6,2.3-12.3,2.3c-6.2,0-11.7-1.2-16.5-3.7
			c-4.8-2.5-8.5-6-11.1-10.7c-2.6-4.6-3.9-9.6-3.9-14.8c0-5.5,1.4-10.8,4.3-15.7s6.8-8.8,11.7-11.5s10.1-4.1,15.6-4.1
			c4.1,0,8.4,0.9,12.9,2.6c2.6,1,4.3,1.5,5,1.5c0.9,0,1.7-0.3,2.4-1c0.7-0.7,1.1-1.7,1.3-3.2H895.3z"/>
		<path class="st0" d="M962.3,32v1.6c-2.1,0.3-4,1.5-5.6,3.4c-1.2,1.4-3,4.8-5.3,10l-19.9,44.2H930l-19.8-46c-2.4-5.5-4-8.8-4.8-9.8
			c-0.8-1-2.3-1.6-4.6-1.8V32h27.7v1.6h-0.9c-2.5,0-4.2,0.3-5.1,0.9c-0.7,0.4-1,1.1-1,1.9c0,0.5,0.1,1.1,0.3,1.8
			c0.2,0.7,1,2.6,2.3,5.6l12.3,28.8L947.8,47c1.4-3.1,2.2-5.2,2.5-6.2c0.3-1.1,0.5-1.9,0.5-2.7c0-0.9-0.2-1.6-0.7-2.3
			c-0.5-0.7-1.1-1.2-2-1.5c-1.2-0.5-2.8-0.7-4.9-0.7V32H962.3z"/>
		<path class="st0" d="M1004.2,30.7l0.5,19.3h-1.7c-0.8-4.8-2.9-8.7-6.1-11.7s-6.7-4.4-10.5-4.4c-2.9,0-5.2,0.8-6.9,2.3
			c-1.7,1.6-2.5,3.3-2.5,5.4c0,1.3,0.3,2.4,0.9,3.4c0.8,1.3,2.1,2.7,4,4c1.3,0.9,4.4,2.6,9.3,5c6.8,3.3,11.3,6.5,13.7,9.4
			c2.3,3,3.5,6.3,3.5,10.2c0,4.8-1.9,9-5.7,12.5c-3.8,3.5-8.6,5.2-14.4,5.2c-1.8,0-3.5-0.2-5.2-0.6c-1.6-0.4-3.7-1.1-6.1-2.1
			c-1.4-0.6-2.5-0.9-3.4-0.9c-0.7,0-1.5,0.3-2.3,0.9c-0.8,0.6-1.5,1.4-2,2.6h-1.6V69.4h1.6c1.3,6.1,3.7,10.8,7.2,14.1
			c3.6,3.2,7.4,4.8,11.5,4.8c3.2,0,5.7-0.9,7.6-2.6c1.9-1.7,2.8-3.8,2.8-6.1c0-1.4-0.4-2.7-1.1-4c-0.7-1.3-1.8-2.5-3.3-3.6
			c-1.5-1.2-4.1-2.7-7.9-4.5c-5.3-2.6-9-4.8-11.4-6.6c-2.3-1.8-4.1-3.9-5.3-6.1c-1.2-2.2-1.9-4.7-1.9-7.4c0-4.6,1.7-8.5,5.1-11.8
			c3.4-3.2,7.7-4.9,12.8-4.9c1.9,0,3.7,0.2,5.5,0.7c1.3,0.3,3,1,4.9,1.9c1.9,0.9,3.3,1.4,4,1.4c0.7,0,1.3-0.2,1.7-0.7
			c0.4-0.5,0.8-1.6,1.2-3.3H1004.2z"/>
	</g>
	<g>
		<g id="rect6847_2_">
			<path class="st0" d="M689.6,121.1H589.3V0.9h100.3V121.1z M591.3,119.2h96.3V2.8h-96.3V119.2z"/>
		</g>
		<path id="text2611_2_" class="st0" d="M597.8,99.3c1.4-0.6,2.9-0.9,4.3-0.9c1.4,0,2.2,0.3,2.7,1c1-0.7,2.5-1,3.6-1
			c3.3,0,3.4,1.3,3.4,5.3v8.7c0,0.4,0.1,0.4-1.6,0.4v-9.3c0-2.9-0.1-3.7-2-3.7c-0.8,0-1.7,0.2-2.7,0.8v12c0,0.1-0.1,0.1-0.3,0.2
			c0,0-0.1,0-0.1,0h-1.2v-9.3c0-2.7,0-3.8-2-3.8c-0.8,0-1.7,0.2-2.7,0.6v12c0,0.4,0.1,0.4-1.6,0.4L597.8,99.3 M619.8,98.3
			c-2.5,0-5.2,0.7-5.2,8.2c0,5.8,2,6.7,4.8,6.7c2.1,0,4-0.7,4-1c0-0.4-0.1-1.1-0.2-1.4c-0.9,0.6-2.2,1-3.6,1c-2,0-3.3-0.6-3.3-4.9
			c1.3,0,4.6,0,7-0.5c0.2-0.9,0.3-2.3,0.3-3.4C623.4,100,622.3,98.3,619.8,98.3 M619.6,99.7c1.8,0,2.2,1.1,2.2,3.4
			c0,0.6,0,1.3-0.1,2c-1.6,0.4-4.4,0.4-5.6,0.4C616.4,100.4,618.1,99.7,619.6,99.7 M626,99.6c1.4-0.9,2.6-1.2,3.9-1.2
			c1.4,0,2.1,0.4,2.1,0.9c0,0.3-0.1,0.8-0.2,1c-0.4-0.2-0.9-0.4-1.6-0.4c-0.9,0-1.8,0.3-2.5,0.9v11.7c0,0.4,0,0.4-1.6,0.4V99.6
			 M640.7,99.3c0-0.4-1.2-0.9-2.4-0.9c-2.4,0-5.3,0.8-5.3,7.7c0,6.6,1.8,7.2,4.8,7.2c1.5,0,2.9-0.8,2.9-1.3c0-0.3-0.1-0.6-0.2-1
			c-0.6,0.4-1.5,0.9-2.5,0.9c-2.1,0-3.3-0.6-3.3-5.7c0-5.6,2-6.4,3.8-6.4c1,0,1.5,0.3,2.1,0.6C640.6,100,640.7,99.6,640.7,99.3
			 M651.9,112.3c-1.3,0.6-3,0.9-4.4,0.9c-3.7,0-4.3-1.6-4.3-5.3v-8.8c0-0.4,0-0.4,1.6-0.4v9.3c0,2.8,0.4,3.8,2.6,3.8
			c0.8,0,2-0.2,2.9-0.7v-12c0-0.4-0.1-0.4,1.6-0.4V112.3 M655.2,99.6c1.4-0.9,2.6-1.2,3.9-1.2c1.4,0,2.1,0.4,2.1,0.9
			c0,0.3-0.1,0.8-0.2,1c-0.4-0.2-0.9-0.4-1.6-0.4c-0.9,0-1.8,0.3-2.5,0.9v11.7c0,0.4,0,0.4-1.6,0.4V99.6 M665,98.8
			c-1.3,0-1.7,0-1.7,0.8v13.3c1.6,0,1.7,0,1.7-0.4V98.8 M663.2,93.8c0,0.9,0.3,1.3,0.9,1.3c0.7,0,1-0.5,1-1.3c0-0.9-0.2-1.3-0.9-1.3
			C663.6,92.5,663.3,93,663.2,93.8 M667.7,99.6c0-0.3,0.1-0.5,0.2-0.6c0.6-0.3,2.7-0.7,5.1-0.7c1.8,0,3,0.9,3,3.4v1.8
			c0,5-0.1,8.7-0.1,8.7c-0.7,0.4-1.9,0.9-4,0.9c-2.1,0-4.2-0.2-4.2-4.3c0-4,2.2-4.6,4.3-4.6c0.8,0,1.8,0.1,2.4,0.3c0,0,0-1.8,0-2.6
			c0-1.8-0.9-2.2-2-2.2c-1.5,0-3.6,0.3-4.5,0.7C667.7,100.2,667.7,99.7,667.7,99.6 M674.4,105.8c-0.6-0.2-1.3-0.3-1.9-0.3
			c-1.7,0-3.2,0.3-3.2,3.4c0,2.9,1.3,2.9,2.7,2.9c0.9,0,1.9-0.3,2.2-0.6C674.3,111.3,674.4,107.9,674.4,105.8 M680.6,112.4
			c0,0.4,0,0.4-1.6,0.4V92.9c0-0.8,0.3-0.8,1.6-0.8V112.4"/>
		<g>
			<path class="st0" d="M613,49.4c2.1-2.2,2.5-6,1.8-8.1c-1.1-3.9-4.8-6.5-8.9-6.1c-3,0.3-5.5,2.2-6.7,4.7c-1,1.5-1.5,3.4-1.4,5.4
				c0.4,4.6,4.5,8,9.2,7.5C609.5,52.6,611.6,51.3,613,49.4z"/>
			<path class="st0" d="M639.6,7.1c-10.6,1.3-17.5,6.2-20.7,12.2c-6.7,10.8-1,26,16.2,30.9c22.5,6.4,4.7,20.7,5.2,30.2
				c0.5,9.5,19.6,13,34.6-12c0.3-0.5,0.6-1,0.8-1.5C689.9,42.3,672.1,3.1,639.6,7.1z"/>
			<path class="st0" d="M633.8,67.4c-1.8-6.8-8.8-10.9-15.6-9.2c-3.7,1-6.6,3.5-8.2,6.6c-1.8,2.9-2.5,6.5-1.5,10
				c1.8,6.8,8.8,10.9,15.6,9.2c3.7-1,6.6-3.5,8.2-6.6C634.1,74.5,634.7,70.9,633.8,67.4z"/>
		</g>
	</g>
	<g>
		<path class="st0" d="M365.4,48.8c-4,0-7,2-7,6.7c0,3.6,2,6,6.8,6c4.1,0,6.8-2.4,6.8-6.2C372,51.1,369.5,48.8,365.4,48.8
			L365.4,48.8z M357.4,82.2c-0.9,1.2-1.9,2.4-1.9,3.9c0,2.9,3.7,3.8,8.8,3.8c4.2,0,10-0.3,10-4.2c0-2.3-2.8-2.5-6.3-2.7L357.4,82.2
			L357.4,82.2z M378.9,49c1.3,1.7,2.7,4,2.7,7.4c0,8.1-6.3,12.8-15.5,12.8c-2.3,0-4.4-0.3-5.8-0.7l-2.4,3.9l7.1,0.4
			c12.6,0.8,20,1.2,20,10.8c0,8.4-7.4,13.1-20,13.1c-13.2,0-18.2-3.3-18.2-9.1c0-3.3,1.5-5,4-7.4c-2.4-1-3.2-2.8-3.2-4.8
			c0-1.6,0.8-3.1,2.1-4.4c1.3-1.4,2.8-2.8,4.5-4.4c-3.6-1.7-6.3-5.5-6.3-10.9c0-8.4,5.5-14.1,16.7-14.1c3.1,0,5,0.3,6.7,0.7h14.2
			v6.2L378.9,49"/>
		<path class="st0" d="M398.4,35.8c-4.2,0-6.6-2.4-6.6-6.6c0-4.1,2.4-6.4,6.6-6.4c4.2,0,6.6,2.3,6.6,6.4
			C405.1,33.4,402.6,35.8,398.4,35.8z M389,79.6v-5.7l3.7-0.5c1-0.1,1.2-0.4,1.2-1.5V50.4c0-0.8-0.2-1.3-0.9-1.5l-3.9-1.4l0.8-5.9
			h15.1v30.2c0,1.2,0.1,1.3,1.2,1.5l3.7,0.5v5.7L389,79.6"/>
		<path class="st0" d="M438.6,76.7c-3.1,1.5-7.7,2.9-11.9,2.9c-8.7,0-11.9-3.5-11.9-11.7V48.9c0-0.4,0-0.7-0.6-0.7h-5.1v-6.5
			c6.4-0.7,9-3.9,9.8-11.9h6.9v10.3c0,0.5,0,0.7,0.6,0.7h10.3v7.3h-10.8v17.4c0,4.3,1,6,5,6c2,0,4.2-0.5,5.9-1.2L438.6,76.7"/>
		<path class="st0" d="M330.7,57.6l-33.3-33.3c-1.9-1.9-5-1.9-6.9,0l-6.9,6.9l8.8,8.8c2-0.7,4.4-0.2,6,1.4c1.6,1.6,2.1,4,1.4,6
			l8.5,8.5c2-0.7,4.4-0.2,6,1.4c2.3,2.3,2.3,6,0,8.3c-2.3,2.3-6,2.3-8.3,0c-1.7-1.7-2.1-4.2-1.3-6.4l-7.9-7.9l0,20.7
			c0.6,0.3,1.1,0.6,1.5,1.1c2.3,2.3,2.3,6,0,8.3c-2.3,2.3-6,2.3-8.3,0c-2.3-2.3-2.3-6,0-8.3c0.6-0.6,1.2-1,1.9-1.3V51
			c-0.7-0.3-1.3-0.7-1.9-1.3c-1.7-1.7-2.1-4.3-1.3-6.4l-8.6-8.6l-22.8,22.8c-1.9,1.9-1.9,5,0,6.9l33.3,33.3c1.9,1.9,5,1.9,6.9,0
			l33.1-33.1C332.6,62.7,332.6,59.6,330.7,57.6"/>
	</g>
	<g>
		<g>
			<path id="path2490_2_" class="st0" d="M5.5,96.2c-0.5,0-1,0.1-1.4,0.2c-0.4,0.2-0.7,0.4-0.9,0.7c-0.2,0.3-0.3,0.6-0.3,1
				c0,0.4,0.1,0.7,0.3,1c0.2,0.3,0.5,0.5,0.8,0.6c0.3,0.1,0.7,0.3,1.2,0.4c0.4,0.1,0.6,0.2,0.9,0.2c0.2,0.1,0.4,0.2,0.5,0.3
				c0.1,0.1,0.2,0.3,0.2,0.5c0,0.3-0.1,0.5-0.4,0.7c-0.3,0.2-0.6,0.3-1,0.3c-0.3,0-0.5,0-0.7-0.1c-0.2-0.1-0.3-0.2-0.4-0.4
				c-0.1-0.1-0.2-0.3-0.3-0.5c-0.1-0.2-0.1-0.3-0.3-0.4c-0.1-0.1-0.2-0.1-0.4-0.1c-0.2,0-0.3,0.1-0.4,0.2c-0.1,0.1-0.2,0.2-0.2,0.4
				c0,0.3,0.1,0.6,0.3,0.9c0.2,0.3,0.4,0.5,0.8,0.7c0.4,0.2,1,0.4,1.6,0.4c0.6,0,1-0.1,1.4-0.3c0.4-0.2,0.7-0.4,0.9-0.8l0-0.1l0-0.1
				l0-0.1l0-0.1l0-0.1l0-0.1l0-0.1l0-0.1l0-0.1l0-0.1l0-0.1l0-0.1l0-0.1v-0.1l0-0.1V101c0-0.3-0.1-0.6-0.2-0.8
				c-0.1-0.2-0.3-0.4-0.5-0.6c-0.2-0.1-0.5-0.3-0.8-0.4c-0.3-0.1-0.7-0.2-1-0.3c-0.3-0.1-0.5-0.1-0.6-0.2c-0.1,0-0.3-0.1-0.4-0.2
				c-0.1-0.1-0.2-0.2-0.3-0.3c-0.1-0.1-0.1-0.2-0.1-0.3c0-0.2,0.1-0.4,0.3-0.6c0.2-0.2,0.5-0.2,0.8-0.2c0.4,0,0.7,0.1,0.8,0.2
				c0.2,0.1,0.3,0.3,0.4,0.6c0.1,0.2,0.2,0.3,0.3,0.4c0.1,0.1,0.2,0.1,0.4,0.1c0.2,0,0.3-0.1,0.4-0.2c0.1-0.1,0.2-0.3,0.2-0.4
				c0-0.2,0-0.4-0.1-0.5c-0.1-0.2-0.2-0.4-0.4-0.5c-0.2-0.2-0.4-0.3-0.7-0.4C6.2,96.2,5.9,96.2,5.5,96.2z M14.3,96.2
				c-0.2,0-0.4,0.1-0.5,0.2c-0.1,0.1-0.2,0.3-0.2,0.6v3.2c0,0.5,0.1,0.9,0.2,1.3c0.1,0.4,0.3,0.7,0.5,0.9c0.2,0.2,0.5,0.4,0.9,0.5
				c0.4,0.1,0.8,0.2,1.3,0.2c0.4,0,0.8,0,1.2-0.1c0.3-0.1,0.6-0.3,0.8-0.5c0.3-0.3,0.5-0.6,0.6-0.9c0.1-0.4,0.1-0.8,0.1-1.3V97
				c0-0.3-0.1-0.5-0.2-0.6c-0.1-0.1-0.3-0.2-0.5-0.2c-0.2,0-0.4,0.1-0.5,0.2c-0.1,0.1-0.2,0.3-0.2,0.6v3.3c0,0.6-0.1,1-0.3,1.3
				c-0.2,0.3-0.6,0.4-1.1,0.4c-0.4,0-0.7-0.1-0.9-0.2c-0.2-0.1-0.4-0.3-0.4-0.6c-0.1-0.2-0.1-0.6-0.1-0.9V97c0-0.3-0.1-0.5-0.2-0.6
				C14.6,96.3,14.5,96.2,14.3,96.2z M25.8,96.3c-0.3,0-0.5,0.1-0.6,0.2c-0.1,0.1-0.2,0.3-0.2,0.6v5c0,0.3,0.1,0.5,0.2,0.6
				c0.1,0.1,0.3,0.2,0.6,0.2h2c0.4,0,0.7,0,0.9-0.1c0.3,0,0.5-0.1,0.7-0.2c0.3-0.1,0.6-0.4,0.8-0.7c0.2-0.3,0.3-0.6,0.3-1
				c0-0.8-0.4-1.4-1.3-1.6c0.7-0.3,1-0.8,1-1.5c0-0.2,0-0.4-0.1-0.6c-0.1-0.2-0.2-0.3-0.3-0.5c-0.1-0.1-0.3-0.3-0.4-0.4
				c-0.2-0.1-0.4-0.2-0.6-0.2c-0.2,0-0.5-0.1-0.8-0.1H25.8z M26.3,97.3h1.1c0.5,0,0.9,0.1,1.1,0.2c0.2,0.1,0.4,0.3,0.4,0.7
				c0,0.2,0,0.3-0.1,0.4c-0.1,0.2-0.2,0.3-0.4,0.4C28.2,99,27.9,99,27.6,99h-1.3V97.3z M26.3,100h1.4c0.5,0,0.8,0.1,1.1,0.2
				c0.2,0.1,0.4,0.4,0.4,0.7c0,0.7-0.5,1-1.4,1h-1.5V100z"/>
			<path id="path2500_2_" class="st0" d="M36.2,96.2c-0.2,0-0.3,0.1-0.5,0.2c-0.1,0.1-0.2,0.3-0.2,0.4c0,0.1,0,0.1,0,0.2
				c0,0.1,0,0.2,0.1,0.2c0,0.1,0.1,0.2,0.1,0.2l1.6,4.3c0.1,0.2,0.1,0.3,0.2,0.5c0.1,0.1,0.1,0.3,0.2,0.4c0.1,0.1,0.2,0.2,0.3,0.3
				c0.1,0.1,0.3,0.1,0.5,0.1c0.2,0,0.3,0,0.5-0.1c0.1-0.1,0.2-0.2,0.3-0.3c0.1-0.1,0.1-0.3,0.2-0.4c0.1-0.1,0.1-0.3,0.2-0.5l1.6-4.4
				c0-0.1,0.1-0.2,0.1-0.2s0.1-0.1,0.1-0.2c0-0.1,0-0.2,0-0.2c0-0.1,0-0.2-0.1-0.3c-0.1-0.1-0.1-0.2-0.2-0.2
				c-0.1-0.1-0.2-0.1-0.3-0.1c-0.2,0-0.3,0-0.4,0.1c-0.1,0.1-0.1,0.2-0.2,0.2c0,0.1-0.1,0.3-0.2,0.5l-1.5,4.5L37,97.1
				c-0.1-0.3-0.2-0.5-0.3-0.7C36.6,96.3,36.4,96.2,36.2,96.2z M70.7,96.2c-0.5,0-1,0.1-1.3,0.2c-0.4,0.2-0.7,0.4-0.9,0.7
				c-0.2,0.3-0.3,0.6-0.3,1c0,0.4,0.1,0.7,0.3,1c0.2,0.3,0.4,0.5,0.8,0.6c0.3,0.1,0.7,0.3,1.2,0.4c0.4,0.1,0.7,0.2,0.9,0.2
				s0.4,0.2,0.5,0.3c0.1,0.1,0.2,0.3,0.2,0.5c0,0.3-0.1,0.5-0.4,0.7c-0.3,0.2-0.6,0.3-1,0.3c-0.3,0-0.5,0-0.7-0.1
				c-0.2-0.1-0.3-0.2-0.4-0.4c-0.1-0.1-0.2-0.3-0.3-0.5c-0.1-0.2-0.2-0.3-0.3-0.4c-0.1-0.1-0.2-0.1-0.4-0.1c-0.2,0-0.3,0.1-0.4,0.2
				c-0.1,0.1-0.2,0.2-0.2,0.4c0,0.3,0.1,0.6,0.3,0.9c0.2,0.3,0.4,0.5,0.7,0.7c0.4,0.2,1,0.4,1.6,0.4c0.6,0,1-0.1,1.4-0.3
				c0.4-0.2,0.7-0.4,0.9-0.8l0-0.1l0-0.1l0-0.1l0-0.1l0-0.1l0-0.1l0-0.1l0-0.1l0-0.1l0-0.1l0-0.1l0-0.1l0-0.1v-0.1l0-0.1V101
				c0-0.3-0.1-0.6-0.2-0.8c-0.1-0.2-0.3-0.4-0.5-0.6c-0.2-0.1-0.5-0.3-0.8-0.4c-0.3-0.1-0.7-0.2-1-0.3c-0.3-0.1-0.5-0.1-0.7-0.2
				c-0.1,0-0.3-0.1-0.4-0.2c-0.1-0.1-0.2-0.2-0.3-0.3c-0.1-0.1-0.1-0.2-0.1-0.3c0-0.2,0.1-0.4,0.3-0.6c0.2-0.2,0.5-0.2,0.9-0.2
				c0.4,0,0.7,0.1,0.8,0.2c0.2,0.1,0.3,0.3,0.4,0.6c0.1,0.2,0.2,0.3,0.3,0.4c0.1,0.1,0.2,0.1,0.4,0.1c0.2,0,0.3-0.1,0.4-0.2
				c0.1-0.1,0.2-0.3,0.2-0.4c0-0.2-0.1-0.4-0.1-0.5c-0.1-0.2-0.2-0.4-0.4-0.5s-0.5-0.3-0.8-0.4C71.4,96.2,71.1,96.2,70.7,96.2z
				 M79.5,96.2c-0.2,0-0.4,0.1-0.5,0.2c-0.1,0.1-0.2,0.3-0.2,0.6v5.3c0,0.3,0.1,0.5,0.2,0.6c0.1,0.1,0.3,0.2,0.5,0.2
				c0.2,0,0.4-0.1,0.5-0.2c0.1-0.1,0.2-0.3,0.2-0.6V97c0-0.3-0.1-0.5-0.2-0.6C79.9,96.3,79.7,96.2,79.5,96.2z M88.9,96.2
				c-0.5,0-1,0.1-1.4,0.2c-0.4,0.1-0.7,0.4-1,0.7c-0.3,0.3-0.5,0.7-0.6,1.1c-0.1,0.4-0.2,0.9-0.2,1.4c0,0.5,0.1,1,0.2,1.4
				c0.1,0.4,0.4,0.8,0.6,1.1c0.3,0.3,0.6,0.5,1,0.7c0.4,0.2,0.9,0.3,1.4,0.3c0.5,0,1-0.1,1.4-0.2c0.4-0.2,0.8-0.4,1-0.7
				c0.3-0.3,0.5-0.7,0.6-1.1c0.1-0.4,0.2-0.9,0.2-1.4c0-0.7-0.1-1.3-0.4-1.8c-0.3-0.5-0.6-0.9-1.1-1.2l-0.1,0l-0.1,0l-0.1,0l-0.1,0
				l-0.1,0l-0.1,0l-0.1,0l-0.1,0l-0.1,0l-0.1,0l-0.1,0l-0.1,0l-0.1,0h-0.1l-0.1,0H88.9z M98.5,96.2c-0.2,0-0.3,0-0.4,0.1
				c-0.1,0.1-0.2,0.2-0.3,0.3c-0.1,0.1-0.1,0.3-0.1,0.5v5.1c0,0.3,0.1,0.4,0.2,0.6c0.1,0.1,0.3,0.2,0.5,0.2c0.2,0,0.3-0.1,0.5-0.2
				c0.1-0.1,0.2-0.3,0.2-0.6v-3.9l2.6,3.9c0.1,0.1,0.2,0.2,0.2,0.3c0.1,0.1,0.2,0.2,0.2,0.3c0.1,0.1,0.2,0.1,0.3,0.2
				c0.1,0,0.2,0,0.3,0c0.5,0,0.7-0.3,0.7-0.9V97c0-0.3-0.1-0.5-0.2-0.6c-0.1-0.1-0.3-0.2-0.5-0.2c-0.2,0-0.3,0.1-0.4,0.2
				c-0.1,0.1-0.2,0.3-0.2,0.6v4L99.4,97c-0.1-0.1-0.2-0.2-0.2-0.3c-0.1-0.1-0.1-0.2-0.2-0.3c-0.1-0.1-0.1-0.1-0.2-0.2
				C98.7,96.2,98.6,96.2,98.5,96.2z M47.4,96.3c-0.1,0-0.2,0-0.3,0.1c-0.1,0.1-0.2,0.1-0.3,0.3c-0.1,0.1-0.1,0.3-0.1,0.5v5
				c0,0.3,0.1,0.5,0.2,0.6c0.1,0.1,0.4,0.2,0.6,0.2h3.7c0.2,0,0.4-0.1,0.5-0.2c0.1-0.1,0.2-0.2,0.2-0.4s0-0.3-0.2-0.4
				c-0.1-0.1-0.3-0.1-0.5-0.1h-3.2V100h2.8c0.2,0,0.4,0,0.5-0.1c0.1-0.1,0.1-0.2,0.1-0.4c0-0.1,0-0.3-0.1-0.4
				C51.3,99,51.1,99,50.9,99h-2.8v-1.6h3.1c0.2,0,0.4,0,0.5-0.1c0.1-0.1,0.2-0.2,0.2-0.4c0-0.1-0.1-0.3-0.2-0.4
				c-0.1-0.1-0.3-0.1-0.5-0.1h-3.6C47.5,96.3,47.4,96.3,47.4,96.3z M58,96.3c-0.3,0-0.5,0.1-0.6,0.2c-0.1,0.1-0.2,0.3-0.2,0.6v5.1
				c0,0.3,0.1,0.5,0.2,0.6c0.1,0.1,0.3,0.2,0.5,0.2c0.2,0,0.4-0.1,0.5-0.2c0.1-0.1,0.2-0.3,0.2-0.6v-2.1H59c0.2,0,0.4,0,0.6,0.1
				c0.2,0.1,0.3,0.2,0.5,0.4c0.2,0.2,0.3,0.4,0.5,0.8l0.5,0.9c0.1,0.2,0.2,0.4,0.3,0.5c0.1,0.1,0.2,0.2,0.3,0.3
				c0.1,0.1,0.2,0.1,0.4,0.1c0.1,0,0.2,0,0.3-0.1c0.1,0,0.2-0.1,0.2-0.2c0.1-0.1,0.1-0.2,0.1-0.3c0-0.1,0-0.2-0.1-0.5
				c-0.1-0.2-0.2-0.5-0.4-0.8c-0.2-0.3-0.4-0.5-0.6-0.8c-0.2-0.3-0.5-0.4-0.7-0.6c0.6-0.1,1-0.3,1.3-0.6c0.3-0.3,0.4-0.7,0.4-1.2
				c0-0.2,0-0.5-0.1-0.7c-0.1-0.2-0.2-0.4-0.4-0.6c-0.2-0.2-0.4-0.3-0.6-0.4c-0.2-0.1-0.4-0.1-0.6-0.2c-0.2,0-0.5,0-0.8,0H58z
				 M88.9,97.3c0.4,0,0.7,0.1,1,0.3c0.3,0.2,0.5,0.4,0.7,0.8l0,0.1l0,0.1l0,0.1l0,0.1l0,0.1l0,0.1l0,0.1l0,0.1l0,0.1l0,0.1l0,0.1
				l0,0.1l0,0.1v0.1l0,0.1v0.1c0,0.5-0.1,1-0.3,1.3c-0.2,0.4-0.4,0.6-0.7,0.8c-0.3,0.2-0.6,0.3-1,0.3c-0.3,0-0.5-0.1-0.8-0.2
				c-0.2-0.1-0.4-0.2-0.6-0.5c-0.2-0.2-0.3-0.5-0.4-0.8c-0.1-0.3-0.1-0.7-0.1-1c0-0.4,0.1-0.7,0.1-1c0.1-0.3,0.2-0.5,0.4-0.7
				c0.2-0.2,0.4-0.3,0.6-0.5C88.4,97.3,88.6,97.3,88.9,97.3z M58.6,97.3h1.3c0.5,0,0.8,0,0.9,0.1c0.2,0.1,0.3,0.2,0.4,0.3
				c0.1,0.1,0.1,0.3,0.1,0.5c0,0.2-0.1,0.4-0.2,0.6c-0.1,0.1-0.3,0.2-0.5,0.3c-0.2,0.1-0.5,0.1-0.8,0.1h-1.2V97.3z"/>
			<path id="line2518_2_" class="st0" d="M1,106v1.1h104.1V106H1z"/>
		</g>
		<path id="polygon3517_2_" class="st0" d="M1,14.8v27.3c14.1-5.9,32.9-11.7,56.5-17.7c15.2-3.8,29.8-7,44-9.6H1z M105.1,20.7
			c-13.7,2-26,4.4-36.9,7.1c-12.4,3.1-22.4,6.3-29.9,9.5C30.8,40.4,27.3,43,27.8,45c0.4,1.7,3.6,2.5,9.5,2.4c3-0.1,8-0.4,14.8-1
			c6.8-0.6,15.6-1.5,26.4-2.6c10.7-1.1,19.5-1.9,26.6-2.3V20.7z M74.6,55.3c-3,0-7.2,0.3-12.6,0.7c-5.4,0.4-12,1-20,1.8
			c-12.4,1.3-22.6,2.4-30.8,3C7.4,61.1,4,61.3,1,61.5v22.1c16.2-2.4,30.9-5.2,44-8.5c12.8-3.2,22.7-6.4,29.7-9.4
			c7-3,10.2-5.6,9.7-7.7C83.8,56.3,80.6,55.4,74.6,55.3z M105.1,63.1C90.9,68.7,73.2,74.1,52,79.5c-19.7,4.9-36.7,8.5-51,10.7v0.2
			h104.1V63.1z M5.3,67.7c0.1,0,0.1,0,0.1,0c0.3,0,0.6,0.1,0.7,0.3c0.3,0.3,0.3,0.7,0.2,1.1c-0.2,0.4-0.7,0.7-1.1,0.6
			c-0.5-0.1-0.9-0.6-0.8-1.1C4.5,68.2,4.9,67.8,5.3,67.7z M9,67.7c0.2,0,0.5,0.1,0.6,0.2c0.3,0.3,0.5,0.8,0.3,1.1
			c-0.2,0.4-0.6,0.7-1,0.7c-0.4,0-0.7-0.2-0.9-0.6c-0.2-0.4,0-1,0.4-1.3C8.6,67.8,8.8,67.7,9,67.7z M5.5,74.3c0.4,0,0.8,0.3,1,0.7
			c0.1,0.5-0.1,1-0.5,1.2c-0.4,0.2-1,0.1-1.3-0.3c-0.3-0.4-0.2-1,0.1-1.3C5,74.3,5.2,74.2,5.5,74.3z M9,74.3c0.3,0,0.7,0.2,0.8,0.5
			c0.3,0.4,0.2,1-0.3,1.3c-0.4,0.3-1.1,0.3-1.4-0.1c-0.3-0.4-0.3-1.1,0.1-1.4C8.5,74.3,8.8,74.2,9,74.3z"/>
	</g>
</g>
</svg>