<svg version="1.1" xmlns="http://www.w3.org/2000/svg" xmlns:xlink="http://www.w3.org/1999/xlink">
 <defs>
  <linearGradient id="lava" gradientTransform="rotate(98)">
   <stop stop-color="#10b1e7" offset="0"/>
   <stop stop-color="#316db6" offset="1"/>
  </linearGradient>
  <style>
   svg > svg:target ~ svg:last-child, svg > svg { display:none; }
   svg > :last-child, svg > svg:target { display:inline; }
   path { fill: #343434; }
   #lava { fill: url(#lava); }
  </style>
 </defs>
 <svg id="horizontal" viewBox="0 0 433 58">
  <g id="t">
   <path d="m29.718 29.631c-3.3516 3.304-7.6809 4.8414-12.382 4.8414-12.103 0-17.223-8.3321-17.269-16.805-0.047467-8.5174 5.4916-17.176 17.269-17.176 4.4219 0 8.6121 1.676 11.964 4.9814l-4.0964 3.956c-2.1416-2.0947-5.0276-3.072-7.8673-3.072-7.8671 0-11.265 5.8654-11.219 11.311 0.0468 5.4 3.1651 11.033 11.219 11.033 2.8396 0 6.0516-1.164 8.1929-3.3054l4.1896 4.236"/>
   <path d="m43.503 1.1425v26.904h16.759v5.68h-22.903v-32.584h6.1443"/>
   <path d="m72.883 17.761c0.1396 5.352 3.026 11.077 10.706 11.077 7.6802 0 10.567-5.772 10.659-11.125 0.09373-5.492-2.9792-11.637-10.659-11.637-7.6803 0-10.846 6.1907-10.706 11.685zm27.418-0.14c-0.0937 8.4241-5.2604 16.851-16.712 16.851-11.451 0-16.758-8.2401-16.758-16.805 0-8.5654 5.4932-17.176 16.758-17.176 11.218 0 16.804 8.6107 16.712 17.131"/>
   <path d="m138.06 1.1892v18.665c0 9.6361-5.912 14.571-14.105 14.571-7.82 0-14.477-4.748-14.477-14.571v-18.665h6.0979v18.665c0 5.8654 3.352 8.9841 8.4254 8.9841 5.0747 0 7.96-3.3974 7.96-8.9841v-18.665h6.0987"/>
   <path d="m154.41 27.816h6.7027c7.4014 0 10.335-5.4 10.195-10.708-0.14-5.0734-3.1187-10.147-10.195-10.147h-6.7027zm22.996-10.66c0.13867 8.2387-4.888 16.571-16.293 16.571h-12.8v-32.584h12.8c11.172 0 16.153 7.9587 16.293 16.013"/>
   <path d="m194.83 16.803h18.776v2.376h-18.776v14.769h-2.516v-32.66h21.944v2.516h-19.428v12.999"/>
   <path d="m291.28 1.2718v20.205c0 17-24.896 17.047-24.896 0v-20.205h2.4627v20.205c0 13.98 19.972 13.935 19.972 0v-20.205h2.4614"/>
   <path d="m302.7 1.2718 21.877 26.894v-26.894h2.46v32.514h-0.97467l-21.923-26.847v26.847h-2.508v-32.514h1.068"/>
   <path d="m340.04 3.6412v27.73h8.5001c9.6627 0 14.12-7.2467 13.981-14.213-0.14-6.7814-4.5974-13.516-13.981-13.516zm24.99 13.516c0.18533 8.2681-5.1094 16.628-16.489 16.628h-11.007v-32.514h11.007c11.008 0 16.304 7.8961 16.489 15.885"/>
   <path d="m376.74 19.108h11.52c5.6667 0 8.1734-3.204 8.2214-7.7561 0.0453-3.8094-2.5547-7.7574-7.9427-7.7574h-11.799zm23.411 14.677h-3.2987l-11.241-12.308h-8.8707v12.308h-2.508v-32.514h14.307c7.06 0 10.635 5.0627 10.681 10.125 0.0467 5.296-3.4374 9.9401-10.543 9.9401l11.473 12.448"/>
   <path d="m417.7 20.78-12.68-19.461v-0.046667h2.9254l11.008 17.093 11.055-17.093h2.9254v0.046667l-12.727 19.461v13.005h-2.5067v-13.005"/>
  </g>
  <g id="l">
   <path id="o" d="m234.13 34.505s1.0107-3.824-3.3747-8.7574l-0.14667-0.152c-1.848-2.1907-2.8654-4.968-2.8654-7.8254 0-6.7027 5.46-12.159 12.172-12.159h0.284c6.7107 0 12.171 5.456 12.171 12.159 0 2.8574-1.016 5.6347-2.8627 7.8227l-0.14534 0.15067c-3.8934 3.8987-3.3787 8.7614-3.3787 8.7614 7.1094-2.452 11.913-9.1361 11.953-16.636 0.052-9.3747-7.516-17.367-16.868-17.815l-0.348-0.0080001c-0.14134 0-0.66801 0.0093334-0.66401 0.0093334-0.016 0-0.52133-0.0093334-0.664-0.0093334l-0.34667 0.0080001c-9.3521 0.448-16.92 8.4401-16.869 17.815 0.04 7.5001 4.844 14.184 11.953 16.636"/>
   <path id="g" d="m257.11 48.614c0.308-0.12813 0.66667-0.23494 1.0627-0.31094 0.37067-0.08133 0.78401-0.13333 1.232-0.148 0 0-0.02-0.14013-0.048-0.34534-0.0107-0.20254-0.10667-0.4744-0.20133-0.74267-0.0467-0.13174-0.092-0.26254-0.13467-0.38387-0.0547-0.12133-0.124-0.23334-0.17334-0.3292-0.10533-0.18947-0.176-0.31347-0.176-0.31347-0.44267-0.07187-0.86134-0.17187-1.2693-0.28907-0.41467-0.11614-0.80267-0.25107-1.1453-0.39374-0.64934-0.288-1.2587-0.6052-1.5813-0.96254h-1e-3c-0.38933-0.34267-0.46267-0.6812-0.448-0.98641 0.0213-0.15214 0.092-0.3 0.20933-0.43654 0.10934-0.13333 0.25467-0.25574 0.46134-0.36094 0 0-0.15467-0.08547-0.384-0.21347-0.116-0.06413-0.24267-0.1376-0.392-0.21467-0.15467-0.07347-0.32001-0.152-0.48267-0.23067-0.32401-0.1532-0.64534-0.3052-0.91468-0.40787-0.25867-0.1068-0.43067-0.17493-0.43067-0.17493-0.312 0.04427-0.652 0.064-0.99734 0.06813-0.35733 0.0079-0.72134-0.0015-1.0773-0.02813-0.69734-0.05987-1.4067-0.1572-2.0174-0.33747-0.31866-0.08227-0.59067-0.17867-0.82267-0.28494-0.236-0.10413-0.44933-0.20827-0.616-0.32547-0.32534-0.23494-0.54534-0.47347-0.54134-0.71454 0 0-0.196-0.03333-0.48934-0.08133-0.30133-0.0468-0.948-0.13334-1.356-0.18694l-0.068 0.24534-0.10533 0.5c-0.212 1.0041 0.36934 2.0213 1.3533 2.3083 2.4107 0.70107 4.2347 1.8573 4.7614 3.2771 1.0627 2.8683-3.4067 5.6746-10.205 5.6746-6.7974 0-11.269-2.8063-10.207-5.6746 0.51333-1.3853 2.264-2.5198 4.5894-3.225 1.0293-0.3136 1.64-1.3724 1.4187-2.4246l-0.14534-0.6812c-0.268 0.02973-0.584 0.0708-0.90534 0.11093-0.40533 0.04533-0.78933 0.1156-1.0867 0.16254-0.29333 0.04787-0.492 0.08013-0.492 0.08013 0.0213 0.236-0.14667 0.49854-0.46401 0.724-0.16666 0.11307-0.348 0.23334-0.57467 0.34014-0.22666 0.10773-0.50533 0.2-0.79467 0.2968-0.29867 0.0948-0.63467 0.16307-0.96934 0.22454-0.33067 0.06347-0.68134 0.1104-1.0453 0.13853-0.72267 0.05987-1.4453 0.07347-2.104-0.0093l-0.11867 0.04947-0.30534 0.13013c-0.24133 0.1152-0.56533 0.26987-0.89334 0.42707-0.32 0.16253-0.61067 0.336-0.844 0.46254l-0.27867 0.15894-0.096 0.0624c0.452 0.2104 0.70534 0.49587 0.756 0.79854 0.112 0.32027-0.0413 0.65467-0.33867 1.0161-0.16933 0.1828-0.40133 0.35627-0.636 0.52547-0.252 0.17027-0.56267 0.33334-0.91334 0.48547-0.65467 0.3104-1.504 0.58227-2.4147 0.74894 0 0-0.0787 0.12973-0.13867 0.32134-0.0693 0.1964-0.16134 0.45987-0.25467 0.7308-0.0387 0.2692-0.0787 0.54427-0.108 0.7536-0.0373 0.21454-0.02 0.3516-0.02 0.3516 0.94134 0.01187 1.7787 0.1692 2.404 0.42027 0.72667 0.24014 1.1653 0.60107 1.504 1.0401 0.26667 0.47294 0.37333 0.96921 0.13466 1.5421-0.164 0.55894-0.62 1.1817-1.364 1.7484l0.11333 0.1c0.0827 0.0584 0.20133 0.1428 0.344 0.24387 0.296 0.20254 0.66801 0.49054 1.1053 0.7504 0.46134 0.25214 0.92801 0.51094 1.284 0.70427 0.17734 0.1 0.35467 0.1624 0.46534 0.21614l0.184 0.0796c1.0507-0.4504 2.176-0.6812 3.304-0.80094 0.56134-0.05893 1.1147-0.07507 1.644-0.04013 0.53734 0.02653 1.0867 0.0708 1.6 0.19214 0.50801 0.1344 1.004 0.25987 1.4374 0.4532 0.44267 0.19213 0.83467 0.44107 1.2067 0.6812 0.74134 0.5084 1.3134 1.2229 1.5587 1.9751 0 0 0.38267 0.01293 0.95467 0.03587 0.57467 0.0156 1.34 0.06773 2.1054 0.0276 0.76534-0.024 1.532-0.03693 2.0987-0.0744 0.56267-0.0548 0.93601-0.09067 0.93601-0.09067 0.0787-0.39227 0.252-0.76147 0.49067-1.0948 0.11733-0.16414 0.25067-0.31987 0.39867-0.46774 0.144-0.15107 0.296-0.30254 0.464-0.4416 0.332-0.27294 0.71334-0.50787 1.1427-0.69427 0.416-0.19747 0.86134-0.38187 1.3787-0.49747 0.52534-0.10573 1.02-0.20827 1.5547-0.2468 0.528-0.0412 1.104-0.01467 1.6387 0.0041 1.088 0.05987 2.2947 0.312 3.3454 0.7104 0 0 0.23333-0.13173 0.58-0.32507 0.33334-0.19627 0.81067-0.4348 1.1787-0.72707 0.37467-0.27867 0.76934-0.54107 1.0093-0.75827 0.22934-0.2188 0.38267-0.36147 0.38267-0.36147-0.78133-0.54014-1.232-1.1161-1.5187-1.6865-0.13467-0.276-0.17067-0.53334-0.17867-0.79054-0.02-0.25627 0.036-0.49747 0.17733-0.72294 0.20534-0.45574 0.72668-0.79321 1.3187-1.0599"/>
  <path d="m246.2 23.485c1.748-1.424 2.8307-3.4427 2.8107-5.676-0.0373-4.2574-4.0587-7.6841-8.9801-7.6841-4.924 0-8.9441 3.4267-8.9827 7.6841-0.0187 2.2333 1.0627 4.252 2.812 5.676 2.164 1.7613 3.936 5.3254 4.04 9.2174 0.116 4.3186-0.17867 9.3161-0.35867 11.859-2.3147 0.32814-3.94 1.1016-3.94 2.0027 0 1.2 2.8787 2.5812 6.4294 2.5812 3.5494 0 6.4267-1.3812 6.4267-2.5812 0-0.90107-1.6253-1.6745-3.9374-2.0027-0.18267-2.5427-0.47734-7.5402-0.36133-11.859 0.10533-3.8907 1.8773-7.4561 4.0414-9.2174" id="lava"/>
  </g>
 </svg>
 <svg id="vertical" viewBox="211.039 0 76 76">
  <use xlink:href="#l"/>
  <path d="m 222.43246,62.069921 a 1.4937647,1.4937647 0 0 1 -1.05684,0.435229 1.4836298,1.4836298 0 1 1 0,-2.966699 1.4932016,1.4932016 0 0 1 1.05684,0.435255 l -0.15316,0.132362 a 1.2696719,1.2696719 0 0 0 -0.90087,-0.368793 1.2803775,1.2803775 0 0 0 0,2.560755 1.295009,1.295009 0 0 0 0.90763,-0.368815 l 0.1492,0.141303 v 0 z m 0.93353,-2.499378 v 2.689117 h 1.63284 v 0.2111 h -1.85806 v -2.900259 z m 5.17272,1.454358 a 1.4177533,1.4177533 0 0 1 -1.46393,1.496017 1.4200055,1.4200055 0 0 1 -1.46392,-1.50447 1.4014249,1.4014249 0 0 1 1.46392,-1.492064 1.4036771,1.4036771 0 0 1 1.46393,1.501087 z m -2.70601,-0.0042 a 1.2460238,1.2460238 0 1 0 2.49036,0 1.2049214,1.2049214 0 0 0 -1.24715,-1.288809 1.1936605,1.1936605 0 0 0 -1.24321,1.288809 z m 5.77349,-1.450415 v 1.801759 a 1.1108925,1.1108925 0 1 1 -2.22066,0 v -1.801759 h 0.21959 v 1.801759 a 0.89186703,0.89186703 0 1 0 1.78204,0 v -1.801759 h 0.21959 z m 3.35745,1.417197 a 1.3924162,1.3924162 0 0 1 -1.47068,1.483062 H 232.511 v -2.900259 h 0.98196 a 1.3929792,1.3929792 0 0 1 1.47124,1.417197 v 0 z m -2.22911,-1.206055 v 2.474608 h 0.75843 a 1.2387042,1.2387042 0 1 0 0,-2.474032 h -0.75786 z"/>
  <path d="m 240.58347,59.575877 a 1.4760677,1.4760677 0 0 0 -1.4758,1.476062 1.4760677,1.4760677 0 0 0 1.4758,1.475792 1.4760677,1.4760677 0 0 0 1.47579,-1.475792 1.4760677,1.4760677 0 0 0 -1.47579,-1.476062 z m 7.90959,2.69e-4 -0.002,5.19e-4 v 1.791117 l -1.41197,-1.78709 h -0.4392 v 2.882404 h 0.5427 v -1.943679 l 1.51574,1.9477 v -0.0042 h 0.33785 v -2.886695 z m 4.98241,5.19e-4 v 2.886161 h 0.5435 v -0.963392 h 0.52259 l 0.84005,0.963392 h 0.64647 l 5.2e-4,0.0021 v -0.03726 l -0.87277,-0.983773 a 0.85530095,0.85530095 0 0 0 0.72851,-0.906016 0.95721628,0.95721628 0 0 0 -1.03767,-0.957223 c -0.45721,0 -0.914,-0.0042 -1.37122,-0.0042 z m -2.18822,0.0026 a 1.3614994,1.3614994 0 0 0 -0.13594,10e-4 H 250.019 v 2.880262 h 1.13178 a 1.3654409,1.3654409 0 0 0 1.44147,-1.463459 1.3614994,1.3614994 0 0 0 -1.305,-1.417877 z m 5.21033,10e-4 v 0.02465 l 1.10765,1.667773 v 1.190505 h 0.54376 V 61.27352 l 1.14868,-1.668042 v -0.02465 h -0.65478 l -0.76578,1.189965 h -0.001 l -0.732,-1.1905 z m -13.47251,0.0042 v 1.651418 a 1.2027141,1.2027141 0 0 0 1.27818,1.288908 1.1706192,1.1706192 0 0 0 1.24761,-1.288908 v -1.651418 h -0.53707 v 1.651418 a 0.68975876,0.68975876 0 0 1 -0.70384,0.794741 0.70665088,0.70665088 0 0 1 -0.7454,-0.794741 v -1.651418 z m -6.70837,5.19e-4 v 2.877849 0.0026 h 0.54323 v -1.066626 h 1.4455 v -0.502209 h -1.4455 v -0.788307 h 1.52754 v -0.523125 z m 4.26677,0.449659 a 1.0168924,1.0168924 0 0 1 1.01702,1.017287 1.0168924,1.0168924 0 0 1 -1.01702,1.017022 1.0168924,1.0168924 0 0 1 -1.01702,-1.017022 1.0168924,1.0168924 0 0 1 1.01702,-1.017287 z m 14.30344,0.05147 a 0.46227914,0.46227914 0 1 1 -0.0375,0.92344 h -0.8304 v -0.922371 h 0.003 0.82772 a 0.46227914,0.46227914 0 0 1 0.0375,-10e-4 z m -4.32924,0.0091 h 0.59311 a 0.92286912,0.92286912 0 0 1 0,1.844472 h -0.59311 z"/>
 </svg>
 <svg id="logo" viewBox="211.039 0 58 58">
  <use xlink:href="#l"/>
 </svg>
</svg>
