<svg xmlns="http://www.w3.org/2000/svg" viewBox="0 0 512 512" width="512" height="512">
 <circle cx="256" cy="256" r="256" fill="#88c5cc"/>
 <path d="M176 392c0 9-7 16-16 16H72c-9 0-16-7-16-16V108c0-9 7-16 16-16h88c9 0 16 7 16 16v284z" fill="#cc584c"/>
 <path d="M56 120h120v168H56z" fill="#ccc"/>
 <path d="M80 132h72v12H80zm0 16h72v12H80zm0 16h72v12H80z" fill="#e6e6e6"/>
 <circle r="36" cy="344" cx="116" fill="none" stroke="#fff" stroke-width="10"/>
 <path d="M50 408a256 256 0 0 0 412 0H50z" fill="#99602e"/>
 <path d="M316 392c0 9-7 16-16 16h-88c-9 0-16-7-16-16V108c0-9 7-16 16-16h88c9 0 16 7 16 16v284z" fill="#5bcc4c"/>
 <path d="M196 120h120v168H196z" fill="#ccc"/>
 <path d="M220 132h72v12h-72zm0 16h72v12h-72zm0 16h72v12h-72z" fill="#e6e6e6"/>
 <circle cx="256" cy="344" r="36" fill="none" stroke="#fff" stroke-width="10"/>
 <g transform="rotate(-6.2 212.591 -2291.8878)">
  <path d="M176 392c0 9-7 16-16 16H72c-9 0-16-7-16-16V108c0-9 7-16 16-16h88c9 0 16 7 16 16v284z" fill="#4c7fcc"/>
  <path d="M56 120h120v168H56z" fill="#ccc"/>
  <path d="M80 132h72v12H80zm0 16h72v12H80zm0 16h72v12H80z" fill="#e6e6e6"/>
  <circle cx="116" cy="344" r="36" fill="none" stroke="#fff" stroke-width="10"/>
 </g>
</svg>
