<svg enable-background="new 0 0 960 560" version="1.1" viewBox="0 0 960 560" xml:space="preserve" xmlns="http://www.w3.org/2000/svg">
 <path d="M 536.19922 23.755859 A 239.19495 462.03174 82.593913 0 0 444.75391 28.902344 A 239.19495 462.03174 82.593913 0 0 -1.9921875 318.24023 A 239.19495 462.03174 82.593913 0 0 469.35742 507.72461 A 239.19495 462.03174 82.593913 0 0 916.10547 218.38672 A 239.19495 462.03174 82.593913 0 0 536.19922 23.755859 z M 532.57812 39.267578 A 212.65689 420.2688 84.59889 0 1 914.33398 222.58594 A 212.65689 420.2688 84.59889 0 1 500.21875 467.41016 A 212.65689 420.2688 84.59889 0 1 76.625 286.20312 A 212.65689 420.2688 84.59889 0 1 490.73828 41.378906 A 212.65689 420.2688 84.59889 0 1 532.57812 39.267578 z" fill="#0F9748"/>
 <g fill="#374ea1">
  <path d="m160.6 212.5v37.2h-2.9c-0.9-7.1-2.7-12.8-5.1-17-2.5-4.2-6-7.6-10.5-10.1s-9.2-3.7-14.1-3.7c-5.5 0-10 1.7-13.6 5-3.6 3.4-5.4 7.2-5.4 11.4 0 3.3 1.1 6.3 3.4 9 3.3 4 11.1 9.2 23.4 15.9 10 5.4 16.9 9.5 20.6 12.4s6.5 6.3 8.5 10.2 3 8 3 12.3c0 8.1-3.2 15.2-9.5 21-6.3 5.9-14.4 8.8-24.4 8.8-3.1 0-6.1-0.2-8.8-0.7-1.6-0.3-5-1.2-10.2-2.9s-8.4-2.5-9.8-2.5c-1.3 0-2.4 0.4-3.1 1.2-0.8 0.8-1.3 2.4-1.7 4.9h-2.9v-36.9h2.9c1.4 7.7 3.2 13.5 5.5 17.3s5.9 7 10.7 9.6c4.8 2.5 10 3.8 15.7 3.8 6.6 0 11.8-1.7 15.7-5.2 3.8-3.5 5.7-7.6 5.7-12.3 0-2.6-0.7-5.3-2.2-8s-3.7-5.2-6.8-7.5c-2.1-1.6-7.7-5-16.9-10.1-9.2-5.2-15.7-9.3-19.6-12.3-3.9-3.1-6.8-6.4-8.8-10.1s-3-7.8-3-12.2c0-7.7 3-14.4 8.9-19.9 5.9-5.6 13.4-8.4 22.6-8.4 5.7 0 11.8 1.4 18.1 4.2 3 1.3 5 2 6.3 2 1.4 0 2.5-0.4 3.4-1.2s1.6-2.5 2.1-5l2.8-0.2"/>
  <path d="m238.4 238.9v-2.4h30.6v2.4h-3.2c-3.4 0-6 1.4-7.8 4.3-0.9 1.3-1.3 4.4-1.3 9.2v35c0 8.7-0.9 15.4-2.6 20.1-1.7 4.8-5.1 8.9-10.1 12.3s-11.9 5.1-20.5 5.1c-9.4 0-16.6-1.6-21.5-4.9s-8.3-7.7-10.4-13.2c-1.4-3.8-2-10.9-2-21.3v-33.7c0-5.3-0.7-8.8-2.2-10.4-1.5-1.7-3.8-2.5-7.1-2.5h-3.3v-2.4h37.3v2.4h-3.3c-3.6 0-6.1 1.1-7.6 3.4-1.1 1.5-1.6 4.7-1.6 9.5v37.6c0 3.4 0.3 7.2 0.9 11.5s1.7 7.7 3.3 10.1 3.9 4.4 7 6c3 1.6 6.8 2.4 11.2 2.4 5.6 0 10.7-1.2 15.2-3.7s7.5-5.6 9.1-9.5c1.6-3.8 2.4-10.3 2.4-19.5v-35c0-5.4-0.6-8.8-1.8-10.1-1.7-1.9-4.1-2.8-7.4-2.8l-3.3 0.1"/>
  <path d="m299.7 282.5v25.1c0 5.4 0.6 8.8 1.8 10.1 1.6 1.9 4.1 2.8 7.3 2.8h3.3v2.4h-37v-2.4h3.2c3.7 0 6.3-1.2 7.8-3.6 0.9-1.3 1.3-4.4 1.3-9.4v-55.8c0-5.4-0.6-8.8-1.7-10.1-1.7-1.9-4.1-2.8-7.4-2.8h-3.2v-2.4h31.6c7.7 0 13.8 0.8 18.3 2.4s8.2 4.3 11.3 8.1 4.6 8.3 4.6 13.4c0 7-2.3 12.8-7 17.2-4.6 4.4-11.2 6.6-19.7 6.6-2.1 0-4.3-0.1-6.7-0.4-2.5-0.2-5.1-0.6-7.8-1.2m0-3.6c2.2 0.4 4.2 0.7 6 1 1.7 0.2 3.2 0.3 4.5 0.3 4.4 0 8.2-1.7 11.4-5.1s4.8-7.8 4.8-13.3c0-3.7-0.8-7.2-2.3-10.4s-3.7-5.6-6.5-7.2-6-2.4-9.5-2.4c-2.2 0-4.9 0.4-8.3 1.2z"/>
  <path d="m375.3 241.3v34.1h19c4.9 0 8.2-0.7 9.9-2.2 2.2-2 3.4-5.4 3.7-10.3h2.4v30h-2.4c-0.6-4.2-1.2-6.9-1.8-8.1-0.8-1.5-2-2.6-3.8-3.5-1.7-0.9-4.4-1.3-8-1.3h-19v28.5c0 3.8 0.2 6.1 0.5 7 0.3 0.8 0.9 1.5 1.8 2 0.8 0.5 2.5 0.7 4.8 0.7h14.6c4.9 0 8.4-0.3 10.6-1s4.3-2 6.4-4c2.6-2.6 5.3-6.6 8.1-11.9h2.5l-7.4 21.6h-66.5v-2.4h3.1c2 0 4-0.5 5.8-1.5 1.4-0.7 2.3-1.7 2.8-3.1s0.7-4.1 0.7-8.3v-56.1c0-5.5-0.6-8.8-1.7-10.1-1.5-1.7-4.1-2.5-7.6-2.5h-3.1v-2.4h66.5l1 18.9h-2.5c-0.9-4.5-1.9-7.7-3-9.4s-2.7-3-4.8-3.9c-1.7-0.6-4.7-1-9-1z"/>
  <path d="m518.4 322.9h-23l-29.2-40.4c-2.2 0.1-3.9 0.1-5.3 0.1h-1.8c-0.6 0-1.3-0.1-2-0.1v25.1c0 5.4 0.6 8.8 1.8 10.1 1.6 1.9 4 2.8 7.3 2.8h3.4v2.4h-37v-2.4h3.2c3.6 0 6.3-1.2 7.8-3.6 0.9-1.3 1.3-4.4 1.3-9.4v-55.8c0-5.4-0.6-8.8-1.8-10.1-1.7-1.9-4.1-2.8-7.4-2.8h-3.2v-2.4h31.5c9.2 0 15.9 0.7 20.3 2 4.3 1.3 8 3.8 11.1 7.4 3 3.6 4.6 7.9 4.6 12.8 0 5.3-1.7 9.9-5.2 13.8s-8.8 6.7-16.1 8.3l17.8 24.8c4.1 5.7 7.6 9.5 10.5 11.3 2.9 1.9 6.7 3.1 11.5 3.6l-0.1 2.5m-61.3-44.3h2.1 1.5c8.2 0 14.4-1.8 18.6-5.3 4.2-3.6 6.3-8.1 6.3-13.6 0-5.4-1.7-9.8-5.1-13.1-3.4-3.4-7.8-5.1-13.4-5.1-2.5 0-5.8 0.4-10 1.2v35.9"/>
  <path d="m573.2 322.9-33.4-72.6v57.7c0 5.3 0.6 8.6 1.7 9.9 1.6 1.8 4.1 2.7 7.4 2.7h3.1v2.4h-30v-2.4h3.1c3.6 0 6.2-1.1 7.8-3.3 0.9-1.4 1.4-4.5 1.4-9.3v-56.4c0-3.8-0.4-6.6-1.3-8.3-0.6-1.2-1.7-2.3-3.3-3.1s-4.1-1.2-7.7-1.2v-2.4h24.4l31.3 67.5 30.8-67.5h24.4v2.4h-3c-3.7 0-6.3 1.1-7.8 3.3-0.9 1.4-1.4 4.5-1.4 9.3v56.4c0 5.3 0.6 8.6 1.8 9.9 1.6 1.8 4.1 2.7 7.4 2.7h3v2.4h-36.7v-2.4h3.1c3.7 0 6.3-1.1 7.8-3.3 0.9-1.4 1.4-4.5 1.4-9.3v-57.7l-33.3 72.6h-2"/>
  <path d="m678.6 320.5v2.4h-37v-2.4h3.1c3.6 0 6.2-1 7.8-3.1 1-1.4 1.5-4.6 1.5-9.8v-55.8c0-4.4-0.3-7.3-0.8-8.7-0.4-1.1-1.3-2-2.6-2.7-1.9-1-3.8-1.5-5.9-1.5h-3.1v-2.4h37v2.4h-3.1c-3.5 0-6.1 1-7.7 3.1-1.1 1.4-1.6 4.6-1.6 9.8v55.8c0 4.4 0.3 7.3 0.8 8.7 0.4 1.1 1.3 2 2.7 2.7 1.8 1 3.8 1.5 5.8 1.5h3.1"/>
  <path d="m762.9 234.6 2 29.3h-2c-2.6-8.8-6.4-15.1-11.3-19s-10.7-5.8-17.6-5.8c-5.7 0-10.9 1.5-15.5 4.4s-8.3 7.5-10.9 13.9c-2.7 6.4-4 14.3-4 23.7 0 7.8 1.3 14.6 3.8 20.3s6.3 10.1 11.3 13.2 10.8 4.6 17.2 4.6c5.6 0 10.5-1.2 14.8-3.6s9-7.2 14.1-14.3l2 1.3c-4.3 7.7-9.4 13.3-15.2 16.9s-12.6 5.3-20.6 5.3c-14.3 0-25.4-5.3-33.2-15.9-5.9-7.9-8.8-17.2-8.8-27.9 0-8.6 1.9-16.5 5.8-23.7s9.2-12.8 15.9-16.8c6.8-4 14.2-6 22.2-6 6.2 0 12.4 1.5 18.5 4.6 1.8 0.9 3.1 1.4 3.8 1.4 1.1 0 2.1-0.4 3-1.2 1.1-1.1 1.9-2.7 2.4-4.8h2.3"/>
  <path d="m862.1 322.9h-23l-29.2-40.4c-2.2 0.1-3.9 0.1-5.3 0.1h-1.8c-0.6 0-1.3-0.1-2-0.1v25.1c0 5.4 0.6 8.8 1.8 10.1 1.6 1.9 4 2.8 7.3 2.8h3.4v2.4h-37v-2.4h3.2c3.7 0 6.3-1.2 7.8-3.6 0.9-1.3 1.3-4.4 1.3-9.4v-55.8c0-5.4-0.6-8.8-1.8-10.1-1.7-1.9-4.1-2.8-7.4-2.8h-3.2v-2.4h31.4c9.2 0 15.9 0.7 20.3 2 4.3 1.3 8 3.8 11.1 7.4 3 3.6 4.6 7.9 4.6 12.8 0 5.3-1.7 9.9-5.2 13.8s-8.8 6.7-16.1 8.3l17.8 24.8c4.1 5.7 7.6 9.5 10.5 11.3 2.9 1.9 6.7 3.1 11.5 3.6zm-61.3-44.4h2.1 1.5c8.2 0 14.4-1.8 18.6-5.3 4.2-3.6 6.3-8.1 6.3-13.6 0-5.4-1.7-9.8-5.1-13.1-3.4-3.4-7.8-5.1-13.4-5.1-2.5 0-5.8 0.4-10 1.2z"/>
 </g>
 <circle cx="911.1" cy="276.9" r="47.9" fill="#EE2C24"/>
</svg>
