<svg xmlns="http://www.w3.org/2000/svg" version="1.1" viewBox="0 0 128 128">
 <defs>
  <linearGradient id="grad">
   <stop stop-color="#f3240d" offset=".5"/>
   <stop stop-color="#830400" offset="1"/>
  </linearGradient>
  <filter id="blur">
   <feGaussianBlur stdDeviation="1"/>
  </filter>
 </defs>
 <path d="m338.07-237.08v2.2937c0 10.284 0.47415 19.933 1.7144 28.932 1.2379 8.9993 3.2422 17.355 6.3006 25.046 3.0584 7.6908 7.1816 14.709 12.625 21.002 5.4438 6.2929 12.202 11.855 20.519 16.657l0.96465 0.5559 0.95297-0.5559c8.1273-4.6924 14.789-10.192 20.205-16.452 5.4168-6.2599 9.5904-13.282 12.71-20.99 3.1196-7.7083 5.2082-16.088 6.5178-25.13 1.3103-9.042 1.8335-18.746 1.8335-29.065v-2.2703l-2.2446 0.3994c-13.024 2.3264-26.088 3.625-39.349 3.6935-13.26 0.0701-26.713-1.0931-40.495-3.6935z" transform="matrix(1.2148 0 0 1.2148 -397.94 294.61)" filter="url(#blur)" stroke="#000" stroke-width="1.5"/>
 <path d="m12.752 6.6189v2.7864c0 12.493 0.576 24.215 2.0827 35.147 1.5038 10.932 3.9386 21.083 7.654 30.426 3.7153 9.3428 8.7242 17.868 15.337 25.513 6.6131 7.6446 14.823 14.401 24.926 20.235l1.1719 0.67531 1.1577-0.67531c9.873-5.7003 17.966-12.381 24.545-19.986 6.5802-7.6045 11.65-16.135 15.44-25.499 3.7897-9.364 6.3269-19.544 7.9178-30.528 1.5918-10.984 2.2273-22.773 2.2273-35.308v-2.7626l-2.7267 0.48519c-15.817 2.8261-31.687 4.4034-47.796 4.4864-16.109 0.086-32.451-1.327-49.194-4.4864z" fill="url(#grad)"/>
 <g fill="#fff">
  <path d="m17.414 12.171c0.08512 11.758 0.71503 22.745 2.1848 32.933 1.467 10.188 3.7735 19.574 7.1847 28.152 3.4736 8.7344 8.0736 16.65 14.15 23.769 6.0761 7.1188 13.62 13.449 22.977 19.003 0.006-0.004 0.0074-0.008 0.01504-0.015-6.6007-4.5296-9.0188-72.061-4.7507-99.824 0.17024 0.0024 0.37454-0.05673 0.55614-0.05673-13.895-0.17024-27.96-1.4216-42.316-3.9735z"/>
  <path d="m109.56 14.916c-14.483 2.3097-39.435 5.5426-45.514 6.2023-0.39724 3.5023-0.72638 7.2542-0.96756 11.466 20.587-4.068 39.972-12.344 46.481-17.668zm-0.74624 26.292c-12.659 0.56748-37.848 5.3508-46.262 5.8632-0.05675 3.5616-0.1135 7.1395-0.08512 10.792 16.156-0.08516 45.176-13.215 46.347-16.655zm-5.216 22.487c-7.305 4.0674-28.025 12.908-40.664 11.983 0.17024 3.6901 0.39724 7.162 0.6441 10.586 13.458-0.8257 34.864-14.031 40.02-22.569zm-15.383 28.699c-5.0545 2.5366-17.815 7.5478-23.344 7.0235 0.4625 3.5992 0.98458 6.5683 1.569 9.135 6.218-1.7649 18.716-11.329 21.774-16.158z"/>
 </g>
</svg>
