<svg xmlns="http://www.w3.org/2000/svg" version="1.1" xmlns:xlink="http://www.w3.org/1999/xlink" viewBox="0 0 256 256">
 <style>
  #anim:target path { animation: move 24s linear infinite; }
  @keyframes move {
   from { transform: translate(0); }
   to { transform: translate(-900px); }
  }
 </style>
 <defs>
  <clipPath id="clip">
   <use xlink:href="#border"/>
  </clipPath>
 </defs>
 <rect rx="8" ry="8" height="256" width="256" y="0" x="0" fill="#272b2f"/>
 <g id="anim" stroke-width="12" stroke-linejoin="round" fill="none" clip-path="url(#clip)">
  <path id="x" stroke="#66a800" d="m 3.3545746,150.7441 77.9487014,8.8896 19.130224,-41.39222 19.25363,5.00042 22.13883,-0.5556 17.95229,4.7226 17.02049,-17.7792 22.23446,6.1116 14.5091,-33.613791 33.56841,-20.00159 28.4222,1.66679 25.33208,7.22278 10.50408,-13.05657 17.02672,-37.225202 21.54136,11.389802 22.67351,9.72299 15.4312,11.11199 22.98796,-3.3336 13.27535,-9.723 60.552,18.91626 120.12283,52.090941 35.30419,1.22078 33.61382,11.6676 19.72377,0.27782 78.30927,26.6688 H 903.303"/>
  <path id="y" stroke="#fd3c17" d="m 3.3545746,138.98595 77.9487014,4.40013 19.130224,-10.17529 41.39246,1.37503 17.95229,5.22515 17.02048,-9.5309 22.23447,5.95581 14.5091,-12.37537 33.56841,-5.50017 53.75428,1.65006 27.5308,-14.30039 21.54136,5.50014 22.67351,-5.50014 38.41914,3.30009 13.27537,-4.95015 60.552,2.75007 225.32215,13.7504 61.75173,18.42553 H 903.303"/>
  <path id="z" stroke="#3766cb" d="m 3.3545746,130.77026 77.9487014,1.36121 19.130224,-4.08365 59.34475,2.91691 17.02049,0.87102 22.23446,-2.42671 48.07751,-5.44487 53.75428,1.55569 27.5308,-3.88921 82.63403,-0.9723 73.82735,-2.13905 23.50831,7.23468 51.74565,-4.51224 44.86887,1.71676 45.555,-1.13338 121.39605,8.94514 H 903.303"/>
 <use xlink:href="#x" transform="translate(900)"/>
 <use xlink:href="#y" transform="translate(900)"/>
 <use xlink:href="#z" transform="translate(900)"/>
 </g>
 <rect fill="none" id="border" rx="8" ry="8" height="252" width="252" stroke="#3a3f44" y="2" x="2" stroke-width="4"/>
</svg>
