<svg viewBox="0 0 700 700" xmlns="http://www.w3.org/2000/svg" xmlns:xlink="http://www.w3.org/1999/xlink">
 <g id="logo">
  <path d="M591.2 379.2l-27.6-84.8-54.6-168c-2.8-8.7-15-8.7-17.8 0l-54.7 168H255.2l-54.6-168c-2.8-8.7-15-8.7-18 0l-54.5 168-27.3 84.8c-2.5 7.8.3 16.2 7 21L346 573.5l238.4-173.3c6.6-4.8 9.3-13.2 6.8-21" fill="#FC6D26"/>
  <path d="M346 573.5l90.5-279H255.2l90.7 279z" fill="#E24329"/>
  <path d="M346 573.5l-90.8-279h-127l217.7 279z" fill="#FC6D26"/>
  <path d="M128 294.4l-27.5 84.8c-2.5 7.8.3 16.2 7 21L346 573.5l-218-279z" fill="#FCA326"/>
  <path d="M128 294.4h127.2l-54.6-168c-2.8-8.7-15-8.7-18 0l-54.5 168z" fill="#E24329"/>
  <path d="M346 573.5l90.5-279h127L346 573.5z" fill="#FC6D26"/>
  <path d="M563.6 294.4l27.6 84.8c2.5 7.8-.2 16.2-6.8 21L346 573.5l217.6-279z" fill="#FCA326"/>
  <path d="M563.6 294.4h-127l54.6-168c2.8-8.7 15-8.7 17.8 0l54.6 168z" fill="#E24329"/>
 </g>
 <view id="runner" viewBox="0 700 700 700"/>
 <circle cx="350" cy="1050" r="350" fill="#0b5565"/>
 <use transform="translate(110,700) scale(.7)" xlink:href="#logo"/>
 <path d="M360 1169v113h16v-67l21 67h17v-113h-16v61l-20-61zm-213 0v113h17v-42h9l14 42h19l-17-49c8-4 14-16 14-29 0-23-13-35-29-35zm69 0v78c0 24 9 37 27 37s27-13 27-37v-78h-16v80c0 11-4 17-11 17s-10-6-10-17v-80zm69 0v113h16v-67l21 67h17v-113h-16v61l-20-61zm142 0v113h54v-17h-31v-31h22v-17h-22v-31h30v-17zm67 0v113h17v-42h8l15 42h19l-17-52c8-4 13-13 13-26 0-23-13-35-29-35zm-330 16h8c9 0 11 9 11 19 0 9-2 19-11 16h-8zm347 0h8c9 0 11 9 11 19 0 9-3 19-11 16h-8z" fill="#fff"/>
</svg>
