<svg version="1.1" xmlns="http://www.w3.org/2000/svg" xmlns:xlink="http://www.w3.org/1999/xlink">
 <style>
  svg>svg:target~svg:last-child, svg>svg { display:none; }
  svg>:last-child, svg>svg:target { display:inline; }
  #color:target { fill:#fff; }
  #color:target #bg { fill:#6a6d7a; }
 </style>
 <svg id="icon" viewBox="-60 -1 62 62">
  <use transform="translate(-60)" xlink:href="#logo"/>
 </svg>
 <svg id="color" viewBox="0 0 175.37 60.01">
  <rect x="0" y="0" width="100%" height="100%" id="bg" fill="transparent"/>
  <path d="m84.54 7.86v-3.23h-3v3.23h-1.46v-7.75h1.51v3.25h3v-3.25h1.41v7.75zm7 0h-1.2l-0.11-0.38a3.28 3.28 0 0 1-1.7 0.52c-1.06 0-1.53-0.73-1.53-1.69 0-1.14 0.51-1.57 1.7-1.57h1.4v-0.59c0-0.62-0.18-0.84-1.11-0.84a8.46 8.46 0 0 0-1.61 0.17l-0.18-1.07a7.89 7.89 0 0 1 2-0.26c1.83 0 2.37 0.62 2.37 2zm-1.43-2.11h-1.11c-0.48 0-0.61 0.13-0.61 0.55s0.13 0.56 0.59 0.56a2.37 2.37 0 0 0 1.1-0.29zm4.52 2.25a7.12 7.12 0 0 1-2-0.32l0.2-1.07a6.77 6.77 0 0 0 1.73 0.24c0.65 0 0.74-0.14 0.74-0.56s-0.07-0.52-1-0.73c-1.42-0.33-1.59-0.68-1.59-1.76s0.51-1.62 2.18-1.62a8 8 0 0 1 1.75 0.2l-0.14 1.11a10.66 10.66 0 0 0-1.6-0.16c-0.63 0-0.74 0.14-0.74 0.48s0 0.48 0.82 0.68c1.63 0.41 1.78 0.62 1.78 1.77s-0.38 1.74-2.13 1.74zm6.68-0.11v-3.89c0-0.3-0.13-0.45-0.47-0.45a4.14 4.14 0 0 0-1.52 0.45v3.86h-1.46v-7.86l1.46 0.22v2.47a5.31 5.31 0 0 1 2.13-0.54c1 0 1.32 0.65 1.32 1.65v4.06zm2.69-6.41v-1.37h1.46v1.37zm0 6.38v-5.59h1.46v5.59zm2.62-5.54c0-1.4 0.85-2.22 2.83-2.22a9.37 9.37 0 0 1 2.16 0.25l-0.17 1.25a12.21 12.21 0 0 0-1.95-0.2c-1 0-1.37 0.34-1.37 1.16v2.94c0 0.81 0.33 1.16 1.37 1.16a12.21 12.21 0 0 0 1.95-0.2l0.17 1.25a9.37 9.37 0 0 1-2.16 0.25c-2 0-2.83-0.81-2.83-2.22zm8.21 5.68c-2 0-2.53-1.06-2.53-2.2v-1.44c0-1.15 0.54-2.2 2.53-2.2s2.53 1.06 2.53 2.2v1.41c0 1.15-0.54 2.23-2.53 2.23zm0-4.63c-0.78 0-1.08 0.33-1.08 1v1.5c0 0.63 0.3 1 1.08 1s1.08-0.33 1.08-1v-1.56c-0.01-0.63-0.3-0.96-1.08-0.96zm6.64 0.09a11.57 11.57 0 0 0-1.54 0.81v3.6h-1.46v-5.6h1.23l0.1 0.62a6.63 6.63 0 0 1 1.53-0.73zm5.83 2.54a1.73 1.73 0 0 1-1.92 2 8.36 8.36 0 0 1-1.55-0.16v2.26l-1.46 0.22v-8h1.16l0.14 0.47a3.15 3.15 0 0 1 1.84-0.59c1.17 0 1.79 0.67 1.79 1.94zm-3.48 0.63a6.72 6.72 0 0 0 1.29 0.15c0.53 0 0.73-0.24 0.73-0.75v-2c0-0.46-0.18-0.71-0.72-0.71a2.11 2.11 0 0 0-1.3 0.51z"/>
  <path d="m0 0 29.89 60 30.11-60zm33.45 12h3.48v3.48h-3.48zm-6.93 14h-3.52v-3.51h3.48zm0-5.22h-3.52v-3.51h3.48zm0-5.22h-3.52v-3.51h3.48zm5.22 15.65h-3.48v-3.51h3.48zm0-5.22h-3.48v-3.5h3.48zm0-5.22h-3.48v-3.5h3.48zm0-5.22h-3.48v-3.5h3.48zm1.71 1.74h3.48v3.48h-3.48zm0 8.7v-3.5h3.55v3.51z" id="logo"/>
  <path d="m101.83 14.1h6.29l-9.55 32h-8.93l-9.55-32h6.29l7.72 26.64z"/>
  <path d="m125.59 46.07h-4.8l-0.43-1.58a12.79 12.79 0 0 1-7 2.06c-4.27 0-6.1-2.93-6.1-7 0-4.75 2.06-6.58 6.82-6.58h5.62v-2.41c0-2.59-0.72-3.5-4.46-3.5a32.66 32.66 0 0 0-6.48 0.72l-0.72-4.46a30.5 30.5 0 0 1 8-1.1c7.35 0 9.5 2.59 9.5 8.45zm-5.86-8.83h-4.32c-1.92 0-2.45 0.53-2.45 2.3s0.53 2.35 2.35 2.35a9.22 9.22 0 0 0 4.42-1.2z"/>
  <path d="m134.81 22.69v16.31c0 1.25 0.53 1.87 1.87 1.87a16.15 16.15 0 0 0 6.1-2v-16.18h5.86v23.38h-4.47l-0.58-2a23.42 23.42 0 0 1-9.36 2.45c-3.89 0-5.28-2.74-5.28-6.91v-16.92z"/>
  <path d="m151.75 46.07v-32.93l5.86-0.82v33.75z"/>
  <path d="m175.08 45.64a16.24 16.24 0 0 1-5.14 0.91c-4.27 0-6.43-2-6.43-6.19v-13h-3.51v-4.67h3.5v-5.81l5.86-0.82v6.63h6l-0.36 4.66h-5.62v12.24a1.84 1.84 0 0 0 2.11 2.06 11.27 11.27 0 0 0 2.93-0.48z"/>
 </svg>
</svg>
