<svg xmlns="http://www.w3.org/2000/svg" viewBox="0 0 6 20" font-family="monospace" font-size="11">
 <defs>
  <style type="text/css"><![CDATA[
  /* <link xmlns="http://www.w3.org/1999/xhtml" rel="stylesheet" href="styles.css" type="text/css"/> */
  .failed { stop-color:#e05d44; }
  .success { stop-color:#4c1; }

]]></style>
 </defs>
 <script type="text/ecmascript"><![CDATA[
const params = new Proxy(new URLSearchParams(window.location.search), {
 get: (searchParams, prop) => searchParams.get(prop),
});
/* TODO:
fetch(new Request(params.url))
  .then((v) => { console.log("pouet:", v); response.json(); } )
  .then((data) => { console.log("json:", data); } )
  .catch(console.error);
*/

data = {"status":"failed","new_errors":[{"description":"typecheck: : # gitlab.com/gitlab-org/cli/pkg/git [gitlab.com/gitlab-org/cli/pkg/git.test]\npkg/git/stack_struct_test.go:111:34: not enough arguments in call to tt.args.stack.RemoveRef\n\thave (StackRef)\n\twant (StackRef, GitRunner)\npkg/git/stack_struct_test.go:259:32: not enough arguments in call to tt.stack.RemoveBranch\n\thave (StackRef)\n\twant (StackRef, GitRunner)","fingerprint":"C5934211AC6EC322E1EB9B99BDDF9DE3","severity":"critical","file_path":"pkg/git/git.go","line":1,"web_url":"https://gitlab.com/gitlab-org/cli/-/blob/73cb3b48c4b55ac31872d817964d42ecf6b6604d/pkg/git/git.go#L1","engine_name":null}],"resolved_errors":[],"existing_errors":[],"summary":{"total":1,"resolved":0,"errored":1}};
data = {"status":"success","new_errors":[],"resolved_errors":[],"existing_errors":[],"summary":{"total":0,"resolved":0,"errored":0}};

document.addEventListener("DOMContentLoaded", function(){
  // set k/v
  if (params.k) { document.querySelector("#k").textContent = params.k; }
  if (params.v) { document.querySelector("#v").textContent = params.v; }
  if (data) {
    document.querySelector("#v").textContent = data.status || "unknown";
  }

  // position value
  document.querySelector("#v").setAttribute("x", 6 + document.querySelector("#k").getComputedTextLength());

  // resize
  document.querySelector('svg').viewBox.baseVal.width += Math.ceil(document.querySelector("g").getBBox().width);
  document.querySelector("rect").setAttribute("width", document.querySelector('svg').viewBox.baseVal.width);
  document.querySelectorAll("stop").forEach(function(node){
    node.offset.baseVal = Math.ceil(document.querySelector("#k").clientWidth + 1.5) / document.querySelector('svg').viewBox.baseVal.width;
  });

  // colour
  document.querySelector("stop:last-of-type").classList.add(document.querySelector("#v").textContent);
  //document.querySelector("stop:last-of-type").setAttribute("stop-color", ({success:"#44cc11", failed: "#e05d44"})[document.querySelector("#v").textContent] || "#777");

});
]]></script>
 <linearGradient id="bg" x1="0" y1="0" x2="1" y2="0"><stop offset=".5" stop-color="#555"/><stop offset=".5" stop-color="#777"/></linearGradient>
 <rect id="r" fill="url(#bg)" width="12" height="20" rx="3"/>
 <g id="t"><text id="k" x="3" y="14">code-quality</text><text id="v" x="79" y="14">n/a</text></g>
 <use href="#t" y="-1" fill="#fff"/>
</svg>
