<svg xmlns="http://www.w3.org/2000/svg" viewBox="0 0 64 64">
 <g fill="none" stroke="#444" stroke-width="3">
  <path d="M3.7 57.2h56.6" stroke-linecap="round"/>
  <path d="M32 33.6v23"/>
 </g>
 <path d="M9 10c0-4.4 13.7-6 23-6s22.8 1.6 22.8 6l.3 33.5c-.3 4.5-14 6.1-23.1 6.1-9.2 0-22.9-1.6-22.9-6V10zm23-4.2c-13.9 0-21 2.8-21 4.2 0 1.5 7.1 4.4 21 4.4s21-2.8 21-4.4c0-1.5-7.3-4.2-21-4.2z" fill="#fff"/>
 <g fill="#4178be">
  <path d="M31.9 16.1c-9.2 0-22.9-1.6-22.9-6 0-4.6 13.7-6.3 23-6.3S54.7 5.6 54.7 10c0 4.5-13.7 6.1-22.8 6.1zm0-10.3c-13.9 0-21 2.8-21 4.2 0 1.5 7.1 4.4 21 4.4s21-2.8 21-4.4c0-1.5-7.3-4.2-21-4.2z"/>
  <path d="M31.9 26.6C22.7 26.6 9 24.9 9 20.5V16c0-.5.5-1 1-1s1 .5 1 1v4.4c0 1.5 7.1 4.3 21 4.3s21-2.8 21-4.3V16c0-.5.5-1 1-1s1 .5 1 1v4.4c-.3 4.4-14 6-23.1 6zm0 11.4C22.7 38 9 36.4 9 32v-4.4c0-.5.5-1 1-1s1 .5 1 1v4.3c0 1.6 7.1 4.4 21 4.4s21-2.8 21-4.4v-4.3c0-.5.5-1 1-1s1 .5 1 1v4.3c-.3 4.6-14 6.1-23.1 6.1zm0 11.6C22.7 49.6 9 48 9 43.6v-4.4c0-.5.5-1 1-1s1 .5 1 1v4.3c0 1.6 7 4.5 21 4.5s21-2.8 21-4.4v-4.3c0-.5.5-1 1-1s1 .5 1 1v4.3c-.3 4.5-14 6.1-23.1 6.1z"/>
 </g>
 <circle cx="32" cy="57" r="4" fill="#444"/>
</svg>
