<svg xmlns="http://www.w3.org/2000/svg" viewBox="0 0 512 512">
 <path d="M455.469 97.715L390.18 32.426c-27.281-27.281-71.513-27.281-98.796 0L269.85 53.96c-27.282 27.281-27.282 71.514 0 98.796l8.032 8.032-231.601 231.6c-13.593 13.593-13.593 35.632 0 49.226 13.594 13.593 35.633 13.593 49.226 0l8.283-8.283 66.705 66.705 35.551-35.551-36.099-36.098 35.551-35.551 19.69 19.69 35.551-35.551-50.296-50.296 116.662-116.662 8.032 8.032c27.281 27.281 71.514 27.281 98.796 0l21.534-21.534c27.284-27.286 27.284-71.518.002-98.8zm-78.888 41.938c-7.233 7.235-19.007 7.235-26.239 0-7.234-7.233-7.234-19.003 0-26.238 3.618-3.618 8.368-5.426 13.119-5.426s9.503 1.809 13.119 5.425c7.235 7.236 7.235 19.007.001 26.239z" fill="#f5c525"/>
 <g fill="#231f20">
  <path d="M463.929 89.255l-65.289-65.29C383.186 8.51 362.638 0 340.783 0h-.001c-21.856 0-42.403 8.512-57.857 23.965l-21.534 21.534c-15.455 15.455-23.965 36.002-23.965 57.858 0 21.653 8.355 42.023 23.539 57.427L37.821 383.927c-18.236 18.236-18.236 47.911 0 66.147 18.176 18.176 47.718 18.234 65.97.175l58.244 58.247a11.966 11.966 0 0 0 16.92 0l35.551-35.553c4.672-4.672 4.672-12.248 0-16.921l-27.639-27.639 18.631-18.63 11.23 11.23c4.673 4.67 12.247 4.672 16.921 0l35.551-35.55a11.966 11.966 0 0 0 0-16.92l-41.836-41.836 99.745-99.745c31.936 31.477 83.526 31.334 115.285-.426l21.534-21.534c31.903-31.905 31.903-83.813.001-115.717zm-16.92 98.795l-21.534 21.534c-22.572 22.575-59.302 22.572-81.876 0l-8.033-8.032c-4.671-4.673-12.246-4.671-16.92 0L201.984 318.214c-4.672 4.672-4.672 12.248 0 16.921l41.836 41.836-18.631 18.631-40.88-40.882c-4.673-4.671-12.247-4.671-16.921 0-4.672 4.672-4.672 12.248 0 16.921l21.19 21.19-18.551 18.551-21.19-21.19c-4.673-4.671-12.247-4.671-16.921 0-4.672 4.672-4.672 12.248 0 16.921l57.21 57.369-18.63 18.63-58.243-58.246a11.968 11.968 0 0 0-16.92 0l-8.284 8.284c-8.905 8.908-23.399 8.908-32.304 0-8.906-8.906-8.906-23.399 0-32.305l231.601-231.601c4.672-4.672 4.672-12.248 0-16.921l-8.032-8.032c-10.936-10.934-16.957-25.472-16.957-40.938 0-15.464 6.022-30.002 16.957-40.937l21.534-21.534c10.933-10.934 25.472-16.956 40.937-16.956 15.465 0 30.003 6.022 40.938 16.957l65.289 65.289c22.57 22.576 22.57 59.306-.003 81.878z"/>
  <path d="M336.389 99.463c-14.927 14.928-14.927 39.216 0 54.144 7.463 7.463 17.27 11.195 27.073 11.195 9.804 0 19.61-3.732 27.073-11.195 14.927-14.928 14.927-39.216 0-54.145-14.928-14.928-39.219-14.929-54.146.001zm37.225 37.223c-5.597 5.599-14.708 5.599-20.305 0-5.598-5.597-5.598-14.706 0-20.304 2.8-2.8 6.475-4.2 10.152-4.2s7.353 1.4 10.152 4.198c5.599 5.601 5.599 14.709.001 20.306z"/>
 </g>
</svg>
