<svg width="256" height="315" viewBox="0 0 256 315" xmlns="http://www.w3.org/2000/svg" fill="#1A1918">
 <path d="M67.5 313.9a2 2 0 0 1-1.5-.7l-17.4-22.9v23.3h-4V285c0-1.1 1-2 2-2 .7 0 1.2.1 1.6.7l17.4 22.8v-23.2h4V312c0 1.1-1 2-2 2m32.7.1c-4 0-8.1-.8-12-2.2l1-3.3a38 38 0 0 0 11 2c5 0 7.6-1.9 7.6-4.4 0-2.3-2-3.4-9-6.7-7-3.3-9.7-5.4-9.7-9.5 0-5.2 4-7.3 11.4-7.3 3.1 0 7.9.7 10.7 1.5l-.7 3.4c-3-.8-6.8-1.3-9.9-1.3-5.3 0-7.4 1-7.4 3.6 0 2.4 1.6 3.5 9 7 7.7 3.5 9.7 5.4 9.7 9.1 0 5.4-5.1 8.1-11.7 8.1m30.5-30.9h4.1v30.4h-4.1v-30.4zm39 16.6h-10.2v10.4h10.2c3.4 0 5.5-2.2 5.5-5.3 0-2.9-2.2-5-5.5-5m-2-13.2h-8.2v9.7h8.2c3.3 0 5.7-2.1 5.7-5 0-3-2.1-4.7-5.7-4.7m2 27h-12.2a2 2 0 0 1-2.1-2.1v-26.4c0-1 .9-2 2-2h10.2c6.2 0 9.9 3 9.9 7.8 0 2.7-1.5 5-3.9 6.5 3.5 1 5.8 4 5.8 7.4 0 4.8-4 8.7-9.7 8.7m29.4 0a2 2 0 0 1-2-2v-28.4h4v26.7h16.4v3.7h-18.4zm46.3.5c-8.4 0-13.4-3-13.4-9.3 0-3 1.7-5.8 5-7.2-2.7-1.6-4-4-4-6.5 0-5.7 4.3-8.4 12.5-8.4 2.8 0 6.6.3 9.9 1l-.5 3.5a56 56 0 0 0-9.7-1c-5.3 0-8.2 1.6-8.2 5 0 2.9 2.7 5 6.1 5h7c1 0 1.8.8 1.8 1.8s-.8 1.8-1.7 1.8h-7.6c-4 0-6.5 2-6.5 5 0 4.4 4.1 5.7 9.2 5.7 2.8 0 6.6-.3 9.7-1l.6 3.3a40 40 0 0 1-10.2 1.3M14.1 288.9l7.2 18-10.8-8.7L14 289zM27 311l-11-27a2 2 0 0 0-1.8-1.1c-.7 0-1.4.4-1.7 1.1L.3 313.6h4.1l4.8-12.2 14.3 11.8c.6.4 1 .7 1.6.7 1 0 2-.9 2-2 0-.2 0-.5-.2-.9zm228.9-183.1a127.6 127.6 0 1 1-255.1 0 127.6 127.6 0 0 1 255 0"/>
 <path d="M130.5 78.2l33 81.5-49.9-39.3 16.9-42.2zM189 178.5L138.3 56.3a8.2 8.2 0 0 0-7.8-5.4 8.5 8.5 0 0 0-8.1 5.4l-55.8 134h19.1l22-55.3 66 53.2c2.6 2.2 4.5 3.1 7 3.1a9 9 0 0 0 9.3-9c0-1-.3-2.3-.9-3.8z" fill="#FFF"/>
</svg>
