<?xml version="1.0" encoding="utf-8"?>
<!-- Generator: Adobe Illustrator 21.1.0, SVG Export Plug-In . SVG Version: 6.00 Build 0)  -->
<svg version="1.1" id="Layer_1" xmlns="http://www.w3.org/2000/svg" xmlns:xlink="http://www.w3.org/1999/xlink" x="0px" y="0px"
	 viewBox="0 0 360.9 280.5" style="enable-background:new 0 0 360.9 280.5;" xml:space="preserve">
<style type="text/css">
	.st0{fill:#4C9AFF;}
	.st1{fill:#DFE1E5;}
	.st2{fill:#0065FF;}
	.st3{fill:#FFAB00;}
	.st4{fill:#0052CC;}
	.st5{fill:#B2D4FF;}
	.st6{fill:#FAFBFC;}
</style>
<title>illo-id_badge</title>
<path class="st0" d="M359.8,181.3l-13.7-46.5L308.5,7.7c-1.7-5.7-7.6-8.9-13.3-7.2L165.1,38.9l5.3,7.2c6.3,8.6,4.5,20.6-4,27l0,0
	c-8.6,6.3-20.6,4.5-27-4l-13.7-18.5L7.7,85.3C2,87-1.2,92.9,0.4,98.6l51.2,173.7c1.7,5.7,7.6,8.9,13.3,7.2l287.6-84.9
	C358.2,192.9,361.5,187,359.8,181.3z"/>
<path class="st0" d="M166.4,73L166.4,73c8.6-6.3,10.4-18.4,4-27l-5.3-7.2l-39.4,11.6L139.4,69C145.7,77.5,157.8,79.3,166.4,73z"/>
<path class="st1" d="M166.4,73L166.4,73c8.6-6.3,10.4-18.4,4-27l-5.3-7.2l-39.4,11.6L139.4,69C145.7,77.5,157.8,79.3,166.4,73z"/>
<path class="st2" d="M208.8,237.1l143.8-42.4c5.7-1.7,8.9-7.6,7.2-13.3l-13.7-46.5L308.5,7.7c-1.7-5.7-7.6-8.9-13.3-7.2L151.5,42.9
	L208.8,237.1z"/>
<path class="st3" d="M167,77l-14.1,0.9c-6.7,0.4-12.5-4.7-13-11.4l-3.2-48.4l38.5-2.5l3.2,48.4C178.9,70.8,173.8,76.6,167,77z"/>
<g>
	<path class="st4" d="M158.6,67.6c-2.4,0-4.6-0.9-6.4-2.5c-1.9-1.7-3-4.1-3.1-6.6c-0.1-2.6,0.8-5,2.5-6.9s4.1-3,6.6-3.1
		s5,0.8,6.9,2.5s3,4.1,3.1,6.6l0,0c0.1,2.6-0.8,5-2.5,6.9s-4.1,3-6.6,3.1C158.9,67.6,158.8,67.6,158.6,67.6z M158.6,51.6
		c-0.1,0-0.2,0-0.3,0c-1.7,0.1-3.3,0.8-4.4,2.1c-1.2,1.3-1.7,2.9-1.7,4.6c0.1,1.7,0.8,3.3,2.1,4.4c1.3,1.2,2.9,1.7,4.6,1.7
		c1.7-0.1,3.3-0.8,4.4-2.1c1.2-1.3,1.7-2.9,1.7-4.6l0,0c-0.1-1.7-0.8-3.3-2.1-4.4C161.7,52.2,160.2,51.6,158.6,51.6z"/>
</g>
<g>
	
		<rect x="202.5" y="116.8" transform="matrix(0.9592 -0.2829 0.2829 0.9592 -23.2153 76.3484)" class="st5" width="100.5" height="3.5"/>
</g>
<g>
	
		<rect x="207.5" y="136.3" transform="matrix(0.9592 -0.2829 0.2829 0.9592 -29.3024 73.1413)" class="st5" width="62.2" height="3.5"/>
</g>
<g>
	
		<rect x="199.2" y="108.6" transform="matrix(0.9592 -0.2829 0.2829 0.9592 -21.8765 69.2242)" class="st5" width="59.1" height="3.5"/>
</g>
<g>
	
		<rect x="187.5" y="68.6" transform="matrix(0.9592 -0.2829 0.2829 0.9592 -11.0321 64.2755)" class="st5" width="59.1" height="3.5"/>
</g>
<g>
	
		<rect x="220.8" y="178.6" transform="matrix(0.9592 -0.2829 0.2829 0.9592 -39.9474 84.046)" class="st5" width="100.5" height="3.5"/>
</g>
<g>
	
		<rect x="225.7" y="198.1" transform="matrix(0.9592 -0.2829 0.2829 0.9592 -46.0465 80.8128)" class="st5" width="62.2" height="3.5"/>
</g>
<g>
	
		<rect x="216.6" y="164.6" transform="matrix(0.9592 -0.2829 0.2829 0.9592 -36.1612 82.2916)" class="st5" width="100.5" height="3.5"/>
</g>
<circle class="st6" cx="104.2" cy="169.4" r="60.4"/>
<ellipse transform="matrix(0.9517 -0.3069 0.3069 0.9517 -42.2449 37.554)" class="st3" cx="98.3" cy="153.1" rx="23.9" ry="23.9"/>
<path class="st3" d="M158.9,193.9c-13.7-13.9-34.5-19.7-54.3-13.3c-18.2,5.9-31.1,20.7-35.4,38c14.5,10.3,33.4,14.1,51.8,8.7l0,0
	C138.6,222.1,152.1,209.5,158.9,193.9z"/>
</svg>
