{
    "instrumentos": [
        {
            "nombre": "Guitarra",
            "clasificacion": "cuerda",
            "descripcion": "Instrumento musical de cuerda, con una caja de resonancia y seis cuerdas en un mástil..."
        },
        {
            "nombre": "Tambor",
            "clasificacion": "percusión",
            "descripcion": "Instrumento de naturaleza variada que permite golpear una membrana que producen el sonido..."
        }
    ]
}