INSERT INTO "UserRoles" ("UserRoleId", "UserId", "RoleId") VALUES
    (2, 'de332f77-3855-4b8b-9ef4-9937cf946c39', 2),
    (3, '401e0501-b74a-4d59-815f-1e9fee1c59bb', 3),
    (4, '75ec8413-8a52-431c-96b0-8c84f0bac154', 1),
    (5, '8520e7ba-2816-47f5-bad6-6dca40182643', 2),
    (6, '5d5be54a-b2a7-43ad-8d43-57616b3dd18f', 3),
    (7, '8edc1ec5-4bc9-42c6-a1a9-6cb3e5a5fb2a', 1);