{
  "cars": [
    {
      "id": 1,
      "brand": "Mercedes-Benz",
      "model": "E-class",
      "year": 2021,
      "new": false,
      "kmage": 15503,
      "price": 6220000,
      "hp": 249,
      "img": [
        "https://avatars.mds.yandex.net/get-autoru-vos/2056813/584c7ea639258140b928ca3fdcb09c40/1200x900n",
        "https://avatars.mds.yandex.net/get-autoru-vos/2155319/13a89e614d501631ff00bdee6c6c0dc3/1200x900n",
        "https://avatars.mds.yandex.net/get-autoru-vos/2158063/381bbe691e4d8bca6fd3df53bc396770/1200x900n",
        "https://avatars.mds.yandex.net/get-autoru-vos/1780502/bb9787908efb6778b942a49dcfd3c549/1200x900n"
      ]
    },
    {
      "id": 2,
      "brand": "BMW",
      "model": "X5",
      "year": 2022,
      "new": false,
      "kmage": 4260,
      "price": 10929000,
      "hp": 350,
      "img": [
        "https://avatars.mds.yandex.net/get-autoru-vos/2156319/1a00b940089075c40c0d215043d3298a/1200x900n",
        "https://avatars.mds.yandex.net/get-autoru-vos/4518728/36363d671de2800d328e50b680082d57/1200x900n",
        "https://avatars.mds.yandex.net/get-autoru-vos/2188061/e70aec2b645bcae2a6a6432a711c3429/1200x900n",
        "https://avatars.mds.yandex.net/get-autoru-vos/2179969/950cbd23e136f0b96638f5662a83a0ba/1200x900n"
      ]
    },
    {
      "id": 3,
      "brand": "BMW",
      "model": "X5",
      "year": 2004,
      "new": false,
      "kmage": 170000,
      "price": 620000,
      "hp": 249,
      "img": [
        "https://avatars.mds.yandex.net/get-autoru-vos/2159751/db5f8c4beca43deb4a4a419be66b208b/1200x900n",
        "https://avatars.mds.yandex.net/get-autoru-vos/2159521/40754b7c68beb35d930e308a33e7d055/1200x900n",
        "https://avatars.mds.yandex.net/get-autoru-vos/2154502/6b27dfa6fd22336bbb98693dc9647ffd/1200x900n",
        "https://avatars.mds.yandex.net/get-autoru-vos/1976050/797e3671ba91e30badd9de7bc6f6ff66/1200x900n"
      ]
    },
    {
      "id": 4,
      "brand": "BMW",
      "model": "X7",
      "year": 2022,
      "new": true,
      "kmage": 0,
      "price": 21080000,
      "hp": 420,
      "img": [
        "https://avatars.mds.yandex.net/get-autoru-vos/2150233/bd463d386fd87cd01468dfdd89f45499/1200x900n",
        "https://avatars.mds.yandex.net/get-autoru-vos/2074421/1bcc3a03e19f6409f8166ac068a0984d/1200x900n",
        "https://avatars.mds.yandex.net/get-autoru-vos/2088079/446c154891588858c4a51c7f1a8cc3b5/1200x900n",
        "https://avatars.mds.yandex.net/get-autoru-vos/1921625/1d2822443d558b0903e94ce35c478de0/1200x900n"
      ]
    },
    {
      "id": 5,
      "brand": "Mercedes-Benz",
      "model": "CLK-Класс",
      "year": 2008,
      "new": false,
      "kmage": 252000,
      "price": 950000,
      "hp": 198,
      "img": [
        "https://avatars.mds.yandex.net/get-autoru-vos/5309308/03ac38145d90c8d3154570dea15d923d/1200x900n",
        "https://avatars.mds.yandex.net/get-autoru-vos/1904082/06c902ec0b262cf4c299755bb41fcb2b/1200x900n",
        "https://avatars.mds.yandex.net/get-autoru-vos/5378895/7614147abfa1947ff7b027f32f38d88e/1200x900n",
        "https://avatars.mds.yandex.net/get-autoru-vos/6053064/fe47da0e9404dadd7c74167f71736121/1200x900n"
      ]
    },
    {
      "id": 6,
      "brand": "Mercedes-Benz",
      "model": "EQS SUV",
      "year": 2022,
      "new": true,
      "kmage": 0,
      "price": 20888000,
      "hp": 300,
      "img": [
        "https://avatars.mds.yandex.net/get-autoru-vos/2204403/c127c24b83659c7161b7e3db49857587/1200x900n",
        "https://avatars.mds.yandex.net/get-autoru-vos/2134119/0d96863278efbbf8b356db314768cdcc/1200x900n",
        "https://avatars.mds.yandex.net/get-autoru-vos/1923686/5385b2982f899652f87f921381666cc1/1200x900n",
        "https://avatars.mds.yandex.net/get-autoru-vos/2088006/72bd231565d26f0ff54decb1f79e4435/1200x900n"
      ]
    },
    {
      "id": 7,
      "brand": "Audi",
      "model": "Q7",
      "year": 2016,
      "new": false,
      "kmage": 136251,
      "price": 3890000,
      "hp": 249,
      "img": [
        "https://avatars.mds.yandex.net/get-autoru-vos/1924530/bf30c5af67e56cbff7d15c1a02409179/1200x900n",
        "https://avatars.mds.yandex.net/get-autoru-vos/2079973/4005891db933b0589fdd592a7b86b1f5/1200x900n",
        "https://avatars.mds.yandex.net/get-autoru-vos/2023508/2abed17ca23e2aceac36867352f9952b/1200x900n",
        "https://avatars.mds.yandex.net/get-autoru-vos/2069460/be6a3f8dc3b5a96683668dc1eb44209b/1200x900n"
      ]
    },
    {
      "id": 8,
      "brand": "Audi",
      "model": "Q5",
      "year": 2012,
      "new": false,
      "kmage": 220000,
      "price": 1250000,
      "hp": 177,
      "img": [
        "https://avatars.mds.yandex.net/get-autoru-vos/2166533/e64e5e3261c2bfaf56486463e629b0c1/1200x900n",
        "https://avatars.mds.yandex.net/get-autoru-vos/1894023/0ffd3cdb0d9e0942ca3ea975d201c318/1200x900n",
        "https://avatars.mds.yandex.net/get-autoru-vos/2181721/5646025b730ede14981edf1a12ab91fc/1200x900n",
        "https://avatars.mds.yandex.net/get-autoru-vos/1662038/f4b8180c201ced75e6c4e20728b40d2e/1200x900n"
      ]
    },
    {
      "id": 9,
      "brand": "Audi",
      "model": "Q8",
      "year": 2023,
      "new": true,
      "kmage": 0,
      "price": 12200000,
      "hp": 286,
      "img": [
        "https://avatars.mds.yandex.net/get-autoru-vos/2180033/a85aaf405f4d68e3fd8a69a14733316f/1200x900n",
        "https://avatars.mds.yandex.net/get-autoru-vos/2079467/da8cde22bb1264fa013a14f9cb6c51ce/1200x900n",
        "https://avatars.mds.yandex.net/get-autoru-vos/1959786/7c4f5e7d350458421253b8d64f7ac17b/1200x900n",
        "https://avatars.mds.yandex.net/get-autoru-vos/2028593/61a0d2896ab34ef59525c71ffc2eb67a/1200x900n"
      ]
    },
    {
      "id": 10,
      "brand": "Audi",
      "model": "Q7",
      "year": 2006,
      "new": false,
      "kmage": 225843,
      "price": 1049000,
      "hp": 233,
      "img": [
        "https://avatars.mds.yandex.net/get-autoru-vos/2180204/de4ecaec0e4613cd3309fc5adad65d79/1200x900n",
        "https://avatars.mds.yandex.net/get-autoru-vos/2156560/9d2ce7c0dc1c4478538a573dcda28b18/1200x900n",
        "https://avatars.mds.yandex.net/get-autoru-vos/2125193/12f19d88d24a08afb1d24367816da992/1200x900n",
        "https://avatars.mds.yandex.net/get-autoru-vos/2160158/b93f5e321ee533f7a888f2e0bfa190d7/1200x900n"
      ]
    },
    {
      "id": 11,
      "brand": "Audi",
      "model": "Q8",
      "year": 2022,
      "new": true,
      "kmage": 0,
      "price": 14750000,
      "hp": 249,
      "img": [
        "https://avatars.mds.yandex.net/get-autoru-vos/2079467/c94ea87208fdfc576311ac311a524283/1200x900n",
        "https://avatars.mds.yandex.net/get-autoru-vos/2155348/14ffb770aada3d6dde4f2ee76a2ff45f/1200x900n",
        "https://avatars.mds.yandex.net/get-autoru-vos/1964949/54ca1a5fd9c247e65a4b051418747694/1200x900n",
        "https://avatars.mds.yandex.net/get-autoru-vos/2165636/b40e3d6841a5ab53d3b2db8f817ea8a7/1200x900n"
      ]
    },
    {
      "brand": "BMW",
      "model": "7 серии",
      "year": 2017,
      "new": false,
      "kmage": 204000,
      "price": 3150000,
      "hp": 325,
      "img": [
        "https://avatars.mds.yandex.net/get-autoru-vos/2203764/80b2c703495a2d6ae138a88094ead9f0/1200x900n",
        "https://avatars.mds.yandex.net/get-autoru-vos/2184575/a64a09ff40b428a5640a541e72f0c160/1200x900n",
        "https://avatars.mds.yandex.net/get-autoru-vos/2180783/55f5774c71991019f94774a30dbf4ada/1200x900n",
        "https://avatars.mds.yandex.net/get-autoru-vos/2179989/cf23a0f0ee9c263f88318822dfe57d3e/1200x900n"
      ],
      "id": 12
    },
    {
      "brand": "BMW",
      "model": "X6",
      "year": 2013,
      "new": false,
      "kmage": 88000,
      "price": 2650000,
      "hp": 245,
      "img": [
        "https://avatars.mds.yandex.net/get-autoru-vos/2062729/ba87e85a170a384ad58e787c4f711376/1200x900n",
        "https://avatars.mds.yandex.net/get-autoru-vos/2057331/2e32c1f1fad38c4881bfe2ee1d9a0875/1200x900n",
        "https://avatars.mds.yandex.net/get-autoru-vos/2023766/64105d8a65f506004b7e5b87695ad6bf/1200x900n",
        "https://avatars.mds.yandex.net/get-autoru-vos/2056611/e947b52f597c3f9034cca64234ca5ec2/1200x900n"
      ],
      "id": 13
    },
    {
      "brand": "BMW",
      "model": "X6",
      "year": 2022,
      "new": true,
      "kmage": 0,
      "price": 13000000,
      "hp": 340,
      "img": [
        "https://avatars.mds.yandex.net/get-autoru-vos/2164639/2e06a8a0d42b10118a4b8c615cd75f51/1200x900n",
        "https://avatars.mds.yandex.net/get-autoru-vos/2078197/e57f5b6a4717486f1c2984704238291d/1200x900n",
        "https://avatars.mds.yandex.net/get-autoru-vos/2172509/42a6ac57fa71ea3927fe50f77e99ba8d/1200x900n",
        "https://avatars.mds.yandex.net/get-autoru-vos/2170895/40c0f84234746029422098585e27a04f/1200x900n"
      ],
      "id": 14
    },
    {
      "brand": "Audi",
      "model": "Q7",
      "year": 2019,
      "new": false,
      "kmage": 45000,
      "price": 7650000,
      "hp": 286,
      "img": [
        "https://avatars.mds.yandex.net/get-autoru-vos/2171035/7dc3f8c8ea4bc290ceb00e35710ad67c/1200x900n",
        "https://avatars.mds.yandex.net/get-autoru-vos/2162798/31755eec9cd129fae8d654e9e8e967e5/1200x900n",
        "https://avatars.mds.yandex.net/get-autoru-vos/2158063/f766df2f5f64d36d215f393ffec1f896/1200x900n",
        "https://avatars.mds.yandex.net/get-autoru-vos/2166045/f825c8f1d84faa15ec81e7e5f3b7092c/1200x900n"
      ],
      "id": 15
    },
    {
      "brand": "Audi",
      "model": "A8",
      "year": 2010,
      "new": false,
      "kmage": 188900,
      "price": 933000,
      "hp": 372,
      "img": [
        "https://avatars.mds.yandex.net/get-autoru-vos/2077044/b7fa54a069db4328b2abbb0b59c24393/1200x900n",
        "https://avatars.mds.yandex.net/get-autoru-vos/2166244/82d1ad2cc16551a2f3a9c1386b39218f/1200x900n",
        "https://avatars.mds.yandex.net/get-autoru-vos/1595794/064f1ad2c8ca47891f575bc88dbdc550/1200x900n",
        "https://avatars.mds.yandex.net/get-autoru-vos/1880720/c0c018cacf8bcc35f75a25c978c96884/1200x900n"
      ],
      "id": 16
    },
    {
      "brand": "Audi",
      "model": "80",
      "year": 1989,
      "new": false,
      "kmage": 400000,
      "price": 80000,
      "hp": 75,
      "img": [
        "https://avatars.mds.yandex.net/get-autoru-vos/2181102/08b4af9137c6a9073c4909ec7a2ec557/1200x900n",
        "https://avatars.mds.yandex.net/get-autoru-vos/2159521/0568cc63adbf4e99ad5da2732c99ea9b/1200x900n",
        "https://avatars.mds.yandex.net/get-autoru-vos/2125735/e3a418ac49efc08ffa8b791df13bf6f9/1200x900n",
        "https://avatars.mds.yandex.net/get-autoru-vos/2087549/1178ea35c10bebeab6a4c621657cd4e5/small"
      ],
      "id": 17
    },
    {
      "brand": "Mercedes-Benz",
      "model": "G-Класс",
      "year": 2021,
      "new": true,
      "kmage": 0,
      "price": 38290000,
      "hp": 800,
      "img": [
        "https://avatars.mds.yandex.net/get-autoru-vos/2141718/3480962081ed8c5ec73f6668a9a717f5/1200x900n",
        "https://avatars.mds.yandex.net/get-autoru-vos/2144428/80f266fd9923c5abfc6d7fb193d91ee4/1200x900n",
        "https://avatars.mds.yandex.net/get-autoru-vos/1655091/8ed3d2e439ff6080f2bc6c9483ac2b45/1200x900n",
        "https://avatars.mds.yandex.net/get-autoru-vos/2127639/aaee09131562883c2b94b98090f16300/1200x900n"
      ],
      "id": 18
    },
    {
      "brand": "Mercedes-Benz",
      "model": "G-Класс",
      "year": 2009,
      "new": false,
      "kmage": 167000,
      "price": 3500000,
      "hp": 507,
      "img": [
        "https://avatars.mds.yandex.net/get-autoru-vos/2159751/0e86eaeed78612854bdac27d839d5ef2/1200x900n",
        "https://avatars.mds.yandex.net/get-autoru-vos/1964188/e396ed6995cf09de79726527fbd75511/1200x900n",
        "https://avatars.mds.yandex.net/get-autoru-vos/4392607/5bbcdc1a430e4f635d711f9530ec9a63/1200x900n",
        "https://avatars.mds.yandex.net/get-autoru-vos/2159751/0e86eaeed78612854bdac27d839d5ef2/1200x900n"
      ],
      "id": 19
    },
    {
      "brand": "Mercedes-Benz",
      "model": "C-Класс",
      "year": 2008,
      "new": false,
      "kmage": 83000,
      "price": 1200000,
      "hp": 204,
      "img": [
        "https://avatars.mds.yandex.net/get-autoru-vos/2150233/a12ba11bf7fcaaa018a6a4b22bfcb31d/1200x900n",
        "https://avatars.mds.yandex.net/get-autoru-vos/2161312/6819fd5a571bf44cb522d920ba285040/1200x900n",
        "https://avatars.mds.yandex.net/get-autoru-vos/2029912/1abb223329406e86e42032427f82dbda/1200x900n",
        "https://avatars.mds.yandex.net/get-autoru-vos/2174880/a3f1f0d8bedba636857f0313769be8cc/1200x900n"
      ],
      "id": 20
    },
    {
      "brand": "Mercedes-Benz",
      "model": "E-class",
      "year": 2011,
      "new": false,
      "kmage": 133000,
      "price": 1800000,
      "hp": 184,
      "img": [
        "https://avatars.mds.yandex.net/get-autoru-vos/2162551/a8c9da71ccfaddf42a55e1343077aeed/1200x900n",
        "https://avatars.mds.yandex.net/get-autoru-vos/2003162/df6031c99f28e4b2aac20b0a305bedd8/1200x900n",
        "https://avatars.mds.yandex.net/get-autoru-vos/1980279/4f6f95d49cfcc8ee4300d1fc6fbfcfbb/1200x900n",
        "https://avatars.mds.yandex.net/get-autoru-vos/2110460/b61bcc9da1a6956fcf1067124ed40c90/1200x900n"
      ],
      "id": 21
    },
    {
      "brand": "Mercedes-Benz",
      "model": "SL-Класc",
      "year": 2022,
      "new": true,
      "kmage": 0,
      "price": 21900000,
      "hp": 474,
      "img": [
        "https://avatars.mds.yandex.net/get-autoru-vos/2090686/b814eb282d0928cbcb6287cce2d389b4/1200x900n",
        "https://avatars.mds.yandex.net/get-autoru-vos/2077303/d4a48b10290769dbff822cf6b0186f44/1200x900n",
        "https://avatars.mds.yandex.net/get-autoru-vos/1998168/bef7dff9e8d818fb0a9c87701b8755f7/1200x900n",
        "https://avatars.mds.yandex.net/get-autoru-vos/1982319/4912b0720fe189f287cfae1f283f0abd/1200x900n"
      ],
      "id": 22
    }
  ]
}
