<?xml version="1.0" encoding="utf-8"?>
<!-- Generator: Adobe Illustrator 19.2.0, SVG Export Plug-In . SVG Version: 6.00 Build 0)  -->
<svg version="1.1" id="Layer_1" xmlns="http://www.w3.org/2000/svg" xmlns:xlink="http://www.w3.org/1999/xlink" x="0px" y="0px"
	 viewBox="0 0 100 125" style="enable-background:new 0 0 100 125;" xml:space="preserve">
<style type="text/css">
	.st0{fill:none;}
	.st1{fill:#FFFFFF;}
</style>
<g>
	<path class="st0" d="M64.5,139.6L27.7,68.2c-1.1-2.3-2.2-4.5-3.2-6.7s-1.7-3.7-2.2-4.5c-3.4,2.6-6.4,5-9,7.1
		c-2.5,2.1-4.7,4.4-6.4,6.7c-1.7,2.4-3,5-3.8,7.8C2.4,81.5,2,84.9,2,88.8c0,2.9,0.6,6.8,1.7,11.6c1.1,4.8,2.7,9.9,4.8,15.3
		c2,5.4,4.5,10.8,7.4,16.2c2.9,5.4,6,10.3,9.3,14.6s6.9,7.9,10.8,10.7c3.8,2.8,7.7,4.2,11.6,4.2c4.4,0,8.4-1,11.9-3.1
		c3.5-2,7.3-4.7,11.4-8c-1.6-2.3-2.9-4.2-3.8-5.8C66.2,143.1,65.3,141.4,64.5,139.6z"/>
</g>
<path class="st1" d="M75.3,72.9c0.2-4.5,1.5-6.3,2.4-7.2c1-1,2.1-1.7,3.6-2.1c1.4-0.4,3.1-0.5,5-0.5v-1.4H74.7h-0.2H62.8v1.4
	c1.9,0,3.6,0.2,5,0.5c1.4,0.4,2.6,1.1,3.6,2.1s2.4,3,2.4,8.7l0,0V76c0,8.5-2,15.3-4.8,20.5l-18.4-36l-0.7-1.3
	c-0.1-0.2-0.3-0.5-0.4-0.7c8.4-6.6,11.2-12.1,11.2-20c0-7.6-4.1-11.8-11.9-12c-0.1,0-0.3,0-0.5,0h-0.1l0,0c-2.2,0-5.2,0.2-7.9,1.4
	c-2.2,1-4.9,3.1-6.4,5c-2.4,3.1-4.2,8-3.9,13.5c0.3,4.2,3.3,11.8,7,19c-2.4,1.5-4.8,3.1-7.3,4.8c-2.5,1.7-4.8,3.7-6.9,5.8
	c-2.1,2.2-3.8,4.6-5.2,7.3c-1.4,2.7-2,5.7-2,9.1c0,1.9,0.3,4.2,1,7c0.7,2.7,2,5.4,4,7.9c1.9,2.5,4.7,4.7,8.1,6.5
	c3.5,1.8,8,2.7,13.6,2.7c2.4,0,4.4-0.2,6.2-0.6s3.3-0.8,4.7-1.4s2.6-1.3,3.6-2c1.1-0.8,2.2-1.6,3.3-2.5c1.3,1.8,2.9,3.3,4.6,4.6
	c1.8,1.3,4.3,1.9,7.5,1.9c3.5,0,6.7-0.9,9.3-2.5c3.6-2.3,4.8-5,4.8-8.9c0-1.5,0-4.5,0-4.5h-1.5c0,0,0,3.3,0,4.4
	c0,3.3-1.1,4.1-2.1,4.9c-0.8,0.6-1.8,0.9-2.9,0.9c-1.3,0-2.4-0.4-3.1-1.2c-0.7-0.8-1.3-1.5-1.5-2l-5.1-8.9L70,98.3
	c3.1-5.6,5.4-12.9,5.4-22.2C75.3,76.1,75.3,72.9,75.3,72.9z M41.8,37c0-6.6,3.4-9,6.8-9.1c7.1,0.1,10.7,3.7,10.7,10.5
	c0,6.6-1.8,11.7-10.5,18.7c-0.3-0.5-0.6-1.1-0.9-1.6c-0.7-1.4-3.6-7.9-4.2-9.4C43.2,44.5,41.5,40.8,41.8,37z M54.2,112.2
	c-1.6,0.9-3.4,1.4-5.4,1.4c-1.8,0-3.5-0.6-5.2-1.9c-1.7-1.2-3.3-2.8-4.9-4.8c-1.5-1.9-2.9-4.1-4.2-6.6c-1.3-2.4-2.4-4.9-3.3-7.3
	c-0.9-2.4-1.6-4.7-2.2-6.9c-0.5-2.2-0.8-3.9-0.8-5.2c0-1.8,0.2-3.3,0.6-4.6c0.4-1.3,0.9-2.5,1.7-3.5c0.8-1.1,1.7-2.1,2.9-3
	c1.1-1,2.5-2,4-3.2c0.2,0.4,0.6,1,1,2s0.9,2,1.4,3l16.5,32.1c0.4,0.8,0.8,1.6,1.2,2.3c0.4,0.7,1,1.6,1.7,2.6
	C57.5,110,55.8,111.2,54.2,112.2z"/>
</svg>
