[
  {
    "name": "login",
    "formItems": [
      {
        "name": "mobile_number",
        "type": "text",
        "allowedEvents": [
          "onBlur"
        ]
      },
      {
        "name": "sendOtp",
        "type": "button",
        "allowedEvents": [
          "onClick"
        ]
      },
      {
        "name": "verifyOtp",
        "type": "text",
        "allowedEvents": [
          "onBlur"
        ]
      },
      {
        "name": "Proceed",
        "type": "button",
        "allowedEvents": [
          "onClick"
        ],
        "allowedActions": [
          "Workflow API Call:Login"
        ]
      }
    ]
  },
  {
    "name": "Basic Information",
    "formItems": [
      {
        "name": "Pan Number",
        "type": "text",
        "allowedEvents": [
          "onBlur"
        ]
      },
      {
        "name": "Name",
        "type": "text",
        "allowedEvents": []
      },
      {
        "name": "Address",
        "type": "textbox",
        "allowedEvents": []
      },
      {
        "name": "Pincode",
        "type": "number",
        "allowedEvents": [
          "onBlur"
        ],
        "allowedActions": [
          "API Call"
        ]
      },
      {
        "name": "City",
        "type": "text",
        "readOnly": true
      },
      {
        "name": "Proceed",
        "type": "button",
        "allowedEvents": [
          "onClick"
        ],
        "allowedActions": [
          "Workflow API Call:NSDL"
        ]
      }
    ]
  }
]