,Tick,BID,ASK,LAST,TOTAL_VOLUME,BID_VWAP_1000,BID_VWAP_10000,BID_VWAP_20000,BID_VWAP_50000,ASK_VWAP_1000,ASK_VWAP_10000,ASK_VWAP_20000,ASK_VWAP_50000
0,2,24.93,25.01,25.03,8600.0,24.93,24.92060773480663,24.89288590604027,24.839621993127146,25.01,25.01,25.019565217391303,25.062948929159802
1,3,24.93,25.01,24.93,8600.0,24.93,24.92060773480663,24.89288590604027,24.839621993127146,25.01,25.01,25.019565217391303,25.062948929159802
2,5,24.93,25.03,25.03,25800.0,24.93,24.92060773480663,24.89288590604027,24.839621993127146,25.03,25.03478947368421,25.04319298245614,25.1416
3,6,24.93,25.03,25.03,35200.0,24.93,24.92060773480663,24.89288590604027,24.839621993127146,25.03,25.03478947368421,25.04319298245614,25.10565815324165
4,7,24.93,25.04,25.04,35200.0,24.93,24.92060773480663,24.89288590604027,24.839621993127146,25.06,25.124117647058824,25.124117647058824,25.22709784411277
5,8,25.01,25.06,25.06,51400.0,25.01,25.01,24.952624113475178,24.885157342657344,25.06,25.124117647058824,25.124117647058824,25.22709784411277
6,10,25.01,25.06,25.06,51400.0,25.01,25.01,24.99961904761905,24.937007874015748,25.06,25.124117647058824,25.124117647058824,25.22709784411277
7,11,24.99,25.06,24.99,62500.0,24.99,24.99,24.96190243902439,24.883120689655172,25.18,25.18,25.185133928571428,25.258346456692912
8,12,24.99,25.19,25.26,73600.0,24.99,24.99,24.96190243902439,24.883120689655172,25.26,25.270057142857144,25.316091549295773,25.511120689655172
9,13,24.99,25.28,25.28,104400.0,24.99,24.99,24.96190243902439,24.883120689655172,25.28,25.340862944162435,25.390384615384615,25.67906557377049
10,15,24.99,25.39,25.39,104400.0,24.99,24.99,24.96431506849315,24.912534722222222,25.39,25.39,25.510228758169934,25.746340996168584
11,16,25.52,25.64,25.5,123300.0,25.52,25.52,25.24620853080569,25.029228187919465,25.64,25.64,25.783478260869565,26.047049180327868
12,17,25.52,25.64,25.64,129400.0,25.52,25.52,25.24620853080569,25.029228187919465,25.94,26.080833333333334,26.080833333333334,26.16340782122905
13,18,25.52,26.2,26.2,154800.0,25.52,25.52,25.24620853080569,25.029228187919465,26.2,26.2,26.204978540772533,26.22204887218045
14,20,24.99,25.48,24.99,167100.0,24.99,24.99,24.96431506849315,24.912534722222222,25.48,25.90761421319797,26.01968051118211,26.100559845559847
15,21,25.26,25.48,24.99,167100.0,25.26,25.26,25.185342465753426,25.05904109589041,25.48,25.59059171597633,25.839895104895106,26.002857142857142
16,22,25.55,25.69,25.48,167100.0,25.55,25.383854166666666,25.28468438538206,25.126930860033728,25.69,25.97966019417476,25.97966019417476,26.125426944971537
17,24,25.55,25.69,25.48,175100.0,25.55,25.383854166666666,25.333574007220218,25.195042735042733,25.69,25.97966019417476,25.97966019417476,26.125426944971537
18,25,25.26,25.45,25.45,175300.0,25.26,25.26,25.20385964912281,25.13717693836978,25.45,25.45,25.55626865671642,25.96585635359116
19,26,25.31,25.69,25.69,183700.0,25.31,25.283170731707315,25.283170731707315,25.16463210702341,25.69,25.97966019417476,25.97966019417476,26.125426944971537
20,27,25.4,26.2,26.2,193300.0,25.4,25.4,25.35889423076923,25.240431893687706,25.76,25.76,25.980944206008584,26.118862815884476
21,29,25.4,25.76,25.76,211300.0,25.4,25.4,25.35889423076923,25.240431893687706,26.21,26.21,26.21,26.2699217221135
22,30,25.4,25.78,25.4,230700.0,25.4,25.4,25.35889423076923,25.240431893687706,25.78,25.78,25.99686956521739,26.131663516068052
23,31,25.49,25.78,25.4,230700.0,25.49,25.469415204678363,25.441795774647886,25.352299651567943,25.78,25.78,25.99686956521739,26.131663516068052
24,33,25.59,25.78,25.4,230700.0,25.59,25.53907975460123,25.50784860557769,25.40548330404218,25.78,25.78,25.825714285714287,26.063446327683614
25,34,25.59,25.78,25.78,241300.0,25.59,25.53907975460123,25.50784860557769,25.40548330404218,25.78,25.78,25.825714285714287,26.063446327683614
26,35,25.59,25.73,25.78,241300.0,25.49,25.469415204678363,25.441795774647886,25.352299651567943,25.73,25.73,25.75638888888889,25.96854748603352
27,37,25.49,25.73,25.73,260500.0,25.49,25.469415204678363,25.441795774647886,25.365627177700347,25.73,25.73,25.75638888888889,25.96854748603352
28,38,25.49,25.58,25.73,260500.0,25.49,25.469415204678363,25.441795774647886,25.365627177700347,25.58,25.664065934065935,25.708716216216217,25.78076
29,39,25.45,25.58,25.45,272300.0,25.45,25.439119170984455,25.43066176470588,25.386088495575223,25.58,25.664065934065935,25.708716216216217,25.78076
30,40,25.55,25.58,25.45,272300.0,25.55,25.49792899408284,25.471897810218977,25.421283422459894,25.78,25.78,25.825714285714287,25.997734806629833
31,42,25.55,25.71,25.78,282700.0,25.55,25.49792899408284,25.471897810218977,25.421283422459894,25.71,25.749701492537312,25.749701492537312,25.9052783109405
32,43,25.43,25.71,25.43,293600.0,25.43,25.43,25.413265993265995,25.35287904599659,25.71,25.749701492537312,25.749701492537312,25.906
33,44,25.41,25.71,25.41,304000.0,25.41,25.40411458333333,25.372961672473867,25.31867724867725,25.71,25.749701492537312,25.749701492537312,25.906
34,45,25.41,25.71,25.71,312500.0,25.41,25.40411458333333,25.372961672473867,25.31867724867725,25.82,25.851475409836066,25.86577319587629,25.95377245508982
35,47,25.41,25.81,25.82,320700.0,25.41,25.40411458333333,25.372961672473867,25.31867724867725,25.81,25.81486033519553,25.8376,25.931467116357503
36,48,25.65,25.81,25.31,332400.0,25.65,25.463294797687862,25.412790697674417,25.30313075506446,25.81,25.81486033519553,25.8376,25.931467116357503
37,49,25.65,25.81,25.31,332400.0,25.65,25.463294797687862,25.412790697674417,25.30313075506446,25.81,25.81,25.81310714285714,25.854342560553633
38,50,25.65,25.69,25.31,332400.0,25.65,25.463294797687862,25.412790697674417,25.30313075506446,25.69,25.69,25.74492537313433,25.802354948805462
39,52,25.65,25.69,25.31,332400.0,25.65,25.463294797687862,25.412790697674417,25.30313075506446,25.69,25.69,25.69511210762332,25.76079522862823
40,53,25.31,25.56,25.31,340200.0,25.31,25.281794871794872,25.263035714285714,25.16215986394558,25.56,25.56,25.60755033557047,25.665416666666665
41,54,25.31,25.56,25.31,350800.0,25.31,25.281794871794872,25.263035714285714,25.16215986394558,25.56,25.56,25.56,25.650203735144313
42,55,25.41,25.56,25.26,350800.0,25.41,25.327910447761194,25.327910447761194,25.178973063973064,25.56,25.56,25.56,25.650203735144313
43,57,25.53,25.56,25.41,371900.0,25.53,25.469668508287292,25.39041237113402,25.269739130434782,25.56,25.56,25.56,25.650203735144313
44,58,25.53,25.56,25.41,371900.0,25.53,25.469668508287292,25.39949494949495,25.3036941580756,25.56,25.56,25.56,25.650203735144313
45,59,25.43,25.44,25.53,371900.0,25.43,25.419540229885058,25.367724137931035,25.28650434782609,25.44,25.44,25.4982,25.589616666666668
46,60,25.43,25.56,25.56,380900.0,25.54,25.54,25.46645614035088,25.381956947162426,25.56,25.56,25.609545454545454,25.692175379426644
47,62,25.54,25.56,25.56,398800.0,25.54,25.54,25.46645614035088,25.381956947162426,25.69,25.69,25.69511210762332,25.76079522862823
48,63,25.56,25.7,25.7,412900.0,25.56,25.5489,25.5489,25.44001751313485,25.7,25.7,25.749126213592234,25.79544537815126
49,64,25.56,25.7,25.7,412900.0,25.56,25.555056818181818,25.549233449477352,25.48977859778598,25.7,25.7,25.749126213592234,25.79544537815126
50,66,25.55,25.7,25.55,431500.0,25.55,25.544393939393938,25.510604982206406,25.43806678383128,25.7,25.56,25.63125,25.732281746031745
51,67,25.54,25.56,25.54,443200.0,25.54,25.54,25.4744,25.388530405405405,25.56,25.56,25.63125,25.732281746031745
52,68,25.54,25.56,25.56,451600.0,25.54,25.54,25.4744,25.388530405405405,25.56,25.56,25.63125,25.732281746031745
53,69,25.43,25.56,25.43,451600.0,25.43,25.43,25.42286274509804,25.334013490725127,25.56,25.56,25.63125,25.732281746031745
54,70,25.43,25.7,25.43,464100.0,25.43,25.419418604651163,25.367291666666667,25.318392156862746,25.7,25.7,25.749126213592234,25.79544537815126
55,72,25.62,25.81,25.81,486200.0,25.62,25.530523255813954,25.488821292775665,25.36405990016639,25.81,25.81,25.816505190311418,25.842445193929173
56,73,25.62,25.81,25.62,495500.0,25.62,25.62,25.493626373626373,25.368248772504092,25.81,25.81,25.816505190311418,25.842445193929173
57,74,25.62,25.82,25.82,504800.0,25.62,25.62,25.493626373626373,25.368248772504092,25.83,25.83,25.867105263157896,25.947245901639345
58,76,25.43,25.83,25.62,535000.0,25.43,25.419418604651163,25.367291666666667,25.318392156862746,25.83,25.83,25.867105263157896,25.947245901639345
59,77,25.54,25.88,25.88,545400.0,25.54,25.489375,25.462322097378276,25.353190082644627,25.88,25.88529411764706,25.88529411764706,25.970235294117646
60,78,25.54,25.89,25.89,553800.0,25.54,25.489375,25.462322097378276,25.353190082644627,25.78,25.837669902912623,25.837669902912623,25.9507421875
61,79,25.54,25.78,25.78,553800.0,25.54,25.489375,25.462322097378276,25.353190082644627,25.78,25.837669902912623,25.837669902912623,25.9507421875
62,81,25.72,25.78,25.78,563300.0,25.72,25.72,25.702222222222222,25.512610169491527,25.78,25.837669902912623,25.837669902912623,25.9507421875
63,82,25.72,25.91,25.91,571200.0,25.72,25.72,25.702222222222222,25.512610169491527,25.91,25.91505263157895,26.02686274509804,26.1059686888454
64,83,25.8,25.91,25.68,591200.0,25.8,25.737272727272728,25.66811808118081,25.51313059033989,25.91,25.91505263157895,26.02686274509804,26.1059686888454
65,84,25.98,26.21,25.92,600600.0,25.98,25.98,25.8263309352518,25.648,26.21,26.21,26.21,26.254892367906066
66,86,25.8,25.9,25.98,610800.0,25.8,25.737272727272728,25.66811808118081,25.51313059033989,25.9,26.083469387755102,26.128688524590164,26.206852791878173
67,87,25.43,25.9,25.43,632500.0,25.43,25.419418604651163,25.367291666666667,25.318392156862746,26.21,26.21,26.21,26.254892367906066
68,88,25.43,26.09,26.13,634400.0,25.43,25.419418604651163,25.367291666666667,25.318392156862746,26.09,26.155971563981044,26.155971563981044,26.20250980392157
69,89,25.41,25.42,25.43,642200.0,25.41,25.342753623188404,25.342753623188404,25.28453307392996,25.42,25.42,25.68235849056604,25.978308270676692
70,91,25.56,25.96,25.42,653100.0,25.56,25.486612903225808,25.41109271523179,25.344942748091604,25.96,25.96,26.091687898089173,26.143969171483622
71,92,25.56,25.96,25.42,653100.0,25.56,25.56,25.509630996309962,25.43605577689243,25.96,25.96,26.091687898089173,26.143969171483622
72,93,25.41,25.96,25.56,653100.0,25.41,25.41,25.41,25.321139705882352,25.96,25.96,26.091687898089173,26.143969171483622
73,95,25.95,26.09,26.09,674800.0,25.95,25.852358974358975,25.71160839160839,25.54992263056093,26.09,26.155971563981044,26.155971563981044,26.20250980392157
74,96,25.95,26.24,26.24,682500.0,25.95,25.852358974358975,25.71160839160839,25.54992263056093,26.24,26.249894736842105,26.29020979020979,26.383478260869566
75,97,25.95,26.24,26.24,692600.0,25.95,25.852358974358975,25.71160839160839,25.54992263056093,26.24,26.249894736842105,26.29020979020979,26.383478260869566
76,98,25.78,26.24,25.78,703400.0,25.78,25.78,25.61413793103448,25.430257352941176,26.24,26.249894736842105,26.29020979020979,26.383478260869566
77,100,25.78,26.24,25.78,714400.0,25.78,25.78,25.61413793103448,25.430257352941176,26.24,26.249894736842105,26.29020979020979,26.383478260869566
78,101,25.78,26.24,25.78,714400.0,25.78,25.78,25.61413793103448,25.430257352941176,26.26,26.264597701149427,26.302074074074074,26.391878354203936
79,102,25.78,26.27,26.27,733000.0,25.78,25.78,25.61413793103448,25.430257352941176,26.15,26.15,26.25593103448276,26.36566493955095
80,103,25.78,26.15,26.27,733000.0,25.78,25.78,25.64263157894737,25.481127272727274,26.15,26.15,26.239779411764705,26.33699115044248
81,105,25.78,26.15,26.15,744000.0,25.78,25.78,25.64263157894737,25.481127272727274,26.15,26.15,26.239779411764705,26.33699115044248
82,106,25.78,25.85,25.78,752200.0,26.18,26.18,25.973548387096773,25.658404452690167,26.27,26.304556962025316,26.329291338582678,26.407255985267035
83,107,26.18,26.34,26.34,762500.0,26.18,26.18,25.973548387096773,25.658404452690167,26.32,26.32975,26.34484375,26.4142752293578
84,108,26.18,26.32,26.34,773800.0,26.18,26.18,25.973548387096773,25.658404452690167,26.32,26.32975,26.34484375,26.4142752293578
85,110,26.18,26.28,26.28,783000.0,26.18,26.18,25.973548387096773,25.658404452690167,26.28,26.28,26.30937269372694,26.37060283687943
86,111,25.78,25.8,26.18,783200.0,25.78,25.78,25.64263157894737,25.481127272727274,25.8,25.8,25.97,26.191341256366723
87,112,25.51,25.8,25.51,783200.0,25.51,25.51,25.466038647342994,25.37565693430657,25.8,25.8,25.97,26.191341256366723
88,113,25.51,25.8,25.8,794000.0,25.51,25.51,25.466038647342994,25.37565693430657,25.8,25.8,25.97,26.191341256366723
89,115,25.89,26.14,25.8,805100.0,25.89,25.66849246231156,25.58737931034483,25.48201535508637,26.14,26.14,26.21,26.3102787456446
90,116,25.89,26.04,26.14,815700.0,25.89,25.66849246231156,25.58737931034483,25.48201535508637,26.04,26.099042553191488,26.30937269372694,26.37060283687943
91,117,25.89,26.14,26.28,825400.0,25.89,25.863988439306357,25.72190311418685,25.534746317512276,26.14,26.14,26.21,26.3102787456446
92,119,25.84,26.28,26.14,846300.0,25.84,25.654174757281552,25.654174757281552,25.478901515151517,26.28,26.28,26.30937269372694,26.37060283687943
93,120,26.18,26.34,26.34,855400.0,26.18,26.18,25.836126984126984,25.66763915547025,26.34,26.35655172413793,26.389777777777777,26.445996409335727
94,121,26.18,26.34,26.18,855400.0,26.18,26.18,26.131173708920187,25.809823529411766,26.37,26.41,26.427235494880545,26.474239713774598
95,122,26.18,26.37,26.37,872200.0,26.18,26.18,26.13520737327189,25.936280834914612,26.35,26.36054945054945,26.391438848920863,26.446017699115043
96,124,26.32,26.35,26.37,872200.0,26.32,26.238829787234042,26.184527027027027,26.068358974358976,26.35,26.36054945054945,26.391438848920863,26.446017699115043
97,125,26.32,26.35,26.37,872200.0,26.32,26.238829787234042,26.184527027027027,26.078232323232324,26.35,26.36054945054945,26.391438848920863,26.446017699115043
98,126,26.09,26.16,26.18,880700.0,26.09,26.09,26.085094339622643,25.886160130718956,26.35,26.36054945054945,26.391438848920863,26.446017699115043
99,127,26.19,26.45,26.45,899700.0,26.19,26.13375,26.114864864864863,26.040732984293193,26.45,26.4551269035533,26.475778546712803,26.51584642233857
100,129,26.44,26.45,26.45,899700.0,26.44,26.316470588235294,26.228489208633093,26.12363475177305,26.46,26.46,26.498885017421603,26.578678260869566
101,130,26.44,26.46,26.46,909100.0,26.44,26.364731182795698,26.31037037037037,26.190530973451327,26.52,26.52,26.526015037593986,26.6671768707483
102,131,26.44,26.52,26.52,915900.0,26.44,26.435308641975308,26.419837398373982,26.29546468401487,26.52,26.52,26.526015037593986,26.6671768707483
103,133,26.43,26.52,26.43,925700.0,26.43,26.409,26.367076923076922,26.232805755395685,26.52,26.52,26.526015037593986,26.6671768707483
104,134,26.43,26.52,26.54,934600.0,26.43,26.409,26.367076923076922,26.232805755395685,26.54,26.574736842105263,26.658194444444444,26.8377
105,135,26.39,26.54,26.39,954900.0,26.3,26.3,26.190684931506848,26.13008532423208,26.35,26.435875706214688,26.49878048780488,26.707021996615904
106,136,26.4,26.54,26.35,958900.0,26.4,26.345652173913045,26.29686567164179,26.183676731793962,26.54,26.574736842105263,26.64315789473684,26.777589134125638
107,138,26.4,26.6,26.6,974500.0,26.4,26.345652173913045,26.29686567164179,26.183676731793962,26.6,26.6,26.68341463414634,26.814931237721023
108,139,26.3,26.6,26.3,984800.0,26.3,26.3,26.190684931506848,26.13008532423208,26.78,26.800310880829016,26.848469055374593,26.925782178217823
109,140,26.3,26.42,26.78,992600.0,26.3,26.3,26.190684931506848,26.13008532423208,26.42,26.42,26.591,26.77956349206349
110,141,26.3,26.42,26.42,1000700.0,26.3,26.3,26.190684931506848,26.13008532423208,26.42,26.42,26.453970588235293,26.690978473581215
111,142,26.3,26.42,26.42,1000700.0,26.3,26.3,26.190684931506848,26.13008532423208,26.42,26.42,26.453970588235293,26.71598039215686
112,144,26.47,26.49,26.42,1003100.0,26.47,26.46467005076142,26.40922558922559,26.2622934232715,26.49,26.515615763546798,26.515615763546798,26.71598039215686
113,145,26.35,26.49,26.19,1027600.0,26.35,26.35,26.2116,26.141464646464648,26.49,26.515615763546798,26.515615763546798,26.71598039215686
114,146,26.35,26.49,26.35,1027600.0,26.35,26.35,26.2116,26.141464646464648,26.49,26.515615763546798,26.515615763546798,26.71598039215686
115,148,26.09,26.24,26.09,1049300.0,26.09,26.09,26.085094339622643,26.044610778443115,26.24,26.24,26.36014563106796,26.566222664015903
116,149,26.09,26.24,26.24,1049300.0,26.09,26.09,26.085094339622643,26.044610778443115,26.24,26.24,26.31190909090909,26.477586872586873
117,150,26.35,26.38,26.24,1058700.0,26.35,26.198216216216217,26.15567474048443,26.08529411764706,26.38,26.38,26.431367924528303,26.588766891891893
118,151,26.09,26.38,26.09,1058900.0,26.09,26.09,26.085094339622643,26.044610778443115,26.38,26.38,26.431367924528303,26.55254766031196
119,153,26.07,26.38,26.07,1084800.0,26.07,26.06436842105263,26.01491349480969,25.87206779661017,26.38,26.38,26.431367924528303,26.55254766031196
120,154,26.06,26.27,26.06,1095700.0,26.06,26.06,25.99271844660194,25.839664694280078,26.27,26.27,26.32599099099099,26.41862549800797
121,155,26.06,26.16,26.06,1095700.0,26.06,26.06,25.99271844660194,25.839664694280078,26.16,26.16,26.214253393665157,26.298287401574804
122,156,25.92,26.03,26.06,1095700.0,25.92,25.915103092783504,25.89130281690141,25.65470297029703,26.03,26.03,26.09867924528302,26.208003992015968
123,158,25.92,26.03,26.06,1099000.0,25.92,25.915103092783504,25.89130281690141,25.65470297029703,26.03,26.03,26.09867924528302,26.208003992015968
124,159,25.92,26.03,25.92,1108700.0,25.92,25.915103092783504,25.89130281690141,25.65470297029703,26.03,26.03,26.09867924528302,26.186136363636365
125,160,25.84,25.89,25.91,1108700.0,25.51,25.51,25.466038647342994,25.37565693430657,25.77,25.77,25.82764705882353,26.010570342205323
126,162,25.51,25.67,25.84,1125600.0,25.51,25.51,25.466038647342994,25.37565693430657,25.67,25.67,25.71311475409836,25.810576540755466
127,163,25.29,25.67,25.29,1133800.0,25.29,25.29,25.275398230088495,25.251534195933456,25.67,25.67,25.71311475409836,25.810576540755466
128,164,25.29,25.33,25.29,1142800.0,25.29,25.29,25.275398230088495,25.251534195933456,25.33,25.5238,25.5238,25.740407470288623
129,166,25.41,25.6,25.33,1151400.0,25.41,25.41,25.345852534562212,25.28508078994614,25.6,25.6,25.635945945945945,25.723131115459882
130,167,25.26,25.6,25.6,1161800.0,25.26,25.26,25.254954954954954,25.22674812030075,25.6,25.6,25.635945945945945,25.723131115459882
131,168,25.25,25.58,25.25,1182300.0,25.25,25.25,25.23973913043478,25.20546332046332,25.54,25.54,25.558333333333334,25.614302103250477
132,170,25.25,25.26,25.25,1182300.0,25.25,25.25,25.23973913043478,25.20546332046332,25.26,25.41902912621359,25.41902912621359,25.54064516129032
133,171,25.25,25.26,25.26,1191100.0,25.25,25.25,25.23973913043478,25.21426168224299,25.26,25.41902912621359,25.41902912621359,25.54064516129032
134,172,25.25,25.26,25.26,1191100.0,25.25,25.25,25.242484076433122,25.229375,25.26,25.41902912621359,25.41902912621359,25.54064516129032
135,174,25.25,25.54,25.54,1200500.0,25.25,25.25,25.242484076433122,25.229375,25.54,25.54,25.558333333333334,25.614302103250477
136,175,25.27,25.58,25.58,1208500.0,25.27,25.27,25.260044444444443,25.24482421875,25.58,25.590434782608696,25.590434782608696,25.663515625
137,176,25.47,25.67,25.67,1208500.0,25.47,25.47,25.367272727272727,25.293895131086142,25.67,25.67,25.71311475409836,25.810576540755466
138,177,25.67,25.7,25.67,1226300.0,25.67,25.67,25.610550458715597,25.439818181818183,25.7,25.738848167539267,25.790103806228373,25.92067864271457
139,179,25.55,25.77,25.55,1244100.0,25.55,25.55,25.510186046511627,25.361068702290076,25.77,25.77,25.82764705882353,26.010570342205323
140,180,25.55,25.77,25.55,1244100.0,25.75,25.75,25.65046082949309,25.50831809872029,25.77,25.77,25.82764705882353,26.010570342205323
141,181,25.75,25.77,25.55,1244100.0,25.75,25.75,25.68032258064516,25.578265682656827,25.77,25.77,25.82764705882353,26.010570342205323
142,183,25.75,25.77,25.55,1244100.0,25.75,25.75,25.691121495327103,25.60977777777778,25.77,25.77,25.82764705882353,26.010570342205323
143,184,25.93,26.03,25.89,1247500.0,25.93,25.85877659574468,25.81885521885522,25.735745098039217,26.03,26.03,26.09867924528302,26.18295955882353
144,185,25.8,26.03,25.8,1256300.0,25.8,25.8,25.77429245283019,25.667129455909944,26.03,26.03,26.09867924528302,26.18295955882353
145,186,25.8,25.88,25.8,1256300.0,25.8,25.8,25.77429245283019,25.667129455909944,25.88,25.894181818181817,25.94543396226415,26.087733333333333
146,188,25.8,25.88,25.8,1256300.0,25.8,25.8,25.77429245283019,25.699288461538462,25.88,25.894181818181817,25.94543396226415,26.08318257956449
147,189,25.75,25.84,25.75,1267800.0,25.75,25.75,25.731372549019607,25.648819047619046,25.84,25.86059171597633,25.876194331983804,26.017820738137083
148,190,25.71,25.74,25.75,1273800.0,25.71,25.668,25.668,25.598821292775664,25.74,25.790306748466257,25.82152,25.902068311195446
149,191,25.71,25.74,25.71,1273800.0,25.71,25.668,25.668,25.598821292775664,25.74,25.745597826086957,25.7746992481203,25.848377358490566
150,193,25.63,25.68,25.71,1283300.0,25.63,25.63,25.61985915492958,25.560206766917293,25.68,25.68,25.7225,25.793992467043314
151,194,25.63,25.68,25.68,1283300.0,25.63,25.63,25.61985915492958,25.560206766917293,25.68,25.68,25.704428571428572,25.760742753623187
152,195,25.63,25.68,25.63,1291600.0,25.63,25.63,25.61985915492958,25.560206766917293,25.68,25.68,25.704428571428572,25.760742753623187
153,196,25.63,25.68,25.63,1300700.0,25.63,25.63,25.61985915492958,25.570349514563105,25.68,25.68,25.704428571428572,25.751408450704226
154,198,25.63,25.66,25.63,1300700.0,25.63,25.63,25.58,25.544187866927594,25.66,25.67098901098901,25.681209964412812,25.72542253521127
155,199,25.61,25.66,25.61,1310800.0,25.61,25.61,25.58,25.544187866927594,25.66,25.67098901098901,25.681209964412812,25.72542253521127
156,200,25.55,25.66,25.55,1319600.0,25.55,25.55,25.53543046357616,25.514686274509803,25.66,25.67098901098901,25.681209964412812,25.72542253521127
157,201,25.51,25.61,25.51,1319600.0,25.51,25.51,25.505213270142182,25.406436567164178,25.61,25.61,25.6475,25.687651122625216
158,203,25.5,25.61,25.5,1342600.0,25.5,25.5,25.48456730769231,25.352695167286246,25.61,25.61,25.6475,25.687651122625216
159,204,25.47,25.61,25.61,1360200.0,25.47,25.47,25.380849056603772,25.307581573896353,25.61,25.61,25.6475,25.687651122625216
160,205,25.64,25.66,25.61,1360200.0,25.64,25.546717948717948,25.456866666666667,25.372514285714285,25.66,25.67098901098901,25.681209964412812,25.72542253521127
161,206,25.47,25.66,25.47,1363500.0,25.47,25.47,25.380849056603772,25.307581573896353,25.66,25.67098901098901,25.681209964412812,25.72542253521127
162,208,25.5,25.66,25.47,1374700.0,25.5,25.483705583756347,25.41635761589404,25.349620493358636,25.66,25.67098901098901,25.681209964412812,25.72542253521127
163,209,25.5,25.66,25.47,1374700.0,25.5,25.483705583756347,25.41635761589404,25.349620493358636,25.66,25.67098901098901,25.681209964412812,25.72542253521127
164,210,25.5,25.7,25.7,1374700.0,25.5,25.483705583756347,25.41635761589404,25.349620493358636,25.7,25.718,25.72964664310954,25.7767417677643
165,212,25.5,25.7,25.7,1385100.0,25.5,25.483705583756347,25.463425605536333,25.38439842209073,25.7,25.718,25.72964664310954,25.7767417677643
166,213,25.42,25.47,25.47,1393600.0,25.42,25.35071065989848,25.321290322580644,25.293675889328064,25.47,25.47,25.58385,25.716057046979866
167,214,25.42,25.47,25.47,1397700.0,25.42,25.35071065989848,25.321290322580644,25.293675889328064,25.47,25.47,25.58385,25.716057046979866
168,215,25.29,25.47,25.29,1408300.0,25.29,25.29,25.279633027522937,25.26107355864811,25.47,25.47,25.58385,25.716057046979866
169,217,25.27,25.47,25.27,1426600.0,25.27,25.27,25.260044444444443,25.248081395348837,25.47,25.47,25.58385,25.716057046979866
170,218,25.27,25.47,25.27,1426600.0,25.27,25.27,25.260044444444443,25.252670565302143,25.47,25.47,25.58385,25.716057046979866
171,219,25.6,25.7,25.47,1426600.0,25.6,25.6,25.4305,25.32478342749529,25.7,25.718,25.72964664310954,25.76984562607204
172,220,25.6,25.7,25.47,1432600.0,25.6,25.6,25.4305,25.32478342749529,25.7,25.713681318681317,25.721787072243345,25.754093357271095
173,222,25.27,25.44,25.6,1437300.0,25.27,25.27,25.260044444444443,25.252670565302143,25.44,25.51212121212121,25.574747474747475,25.653333333333332
174,223,25.27,25.7,25.7,1446500.0,25.27,25.27,25.260044444444443,25.252670565302143,25.7,25.713681318681317,25.721787072243345,25.754093357271095
175,224,25.27,25.73,25.73,1454400.0,25.27,25.27,25.260044444444443,25.252670565302143,25.73,25.734939024390243,25.74074906367041,25.77620811287478
176,226,25.27,25.32,25.73,1463100.0,25.27,25.27,25.260044444444443,25.252670565302143,25.32,25.32,25.572973977695167,25.68264653641208
177,227,25.27,25.32,25.73,1463100.0,25.27,25.27,25.260044444444443,25.254185185185186,25.32,25.32,25.572973977695167,25.68264653641208
178,228,25.27,25.32,25.73,1463100.0,25.27,25.27,25.260044444444443,25.254185185185186,25.32,25.32,25.572973977695167,25.68264653641208
179,230,25.41,25.63,25.32,1473600.0,25.41,25.328031088082902,25.29937704918033,25.279880952380953,25.63,25.676892655367233,25.69670542635659,25.74266304347826
180,231,25.41,25.61,25.32,1473600.0,25.41,25.328031088082902,25.29937704918033,25.279880952380953,25.61,25.61,25.6194,25.69273519163763
181,232,25.41,25.44,25.44,1473600.0,25.41,25.328031088082902,25.29937704918033,25.279880952380953,25.44,25.532410256410255,25.56415224913495,25.642035714285715
182,233,25.25,25.44,25.25,1492200.0,25.25,25.25,25.25,25.243773946360154,25.44,25.532410256410255,25.56415224913495,25.642035714285715
183,235,25.54,25.61,25.44,1492400.0,25.54,25.54,25.52492957746479,25.36090909090909,25.61,25.61,25.6194,25.69273519163763
184,236,25.56,25.61,25.61,1500600.0,25.56,25.56,25.54995260663507,25.426228239845262,25.61,25.61,25.6194,25.68018181818182
185,237,25.56,25.61,25.56,1500600.0,25.56,25.56,25.54995260663507,25.440654664484452,25.61,25.61,25.6194,25.68018181818182
186,239,25.54,25.63,25.63,1530600.0,25.54,25.54,25.5306,25.41588932806324,25.63,25.652832369942196,25.674678571428572,25.70692870201097
187,240,25.54,25.71,25.71,1539400.0,25.54,25.54,25.5306,25.41588932806324,25.71,25.71,25.725092250922508,25.755221238938052
188,241,25.52,25.71,25.52,1550600.0,25.52,25.514676616915423,25.514676616915423,25.3531007751938,25.71,25.71,25.725092250922508,25.755221238938052
189,242,25.25,25.71,25.71,1559700.0,25.25,25.25,25.25,25.243773946360154,25.71,25.71,25.725092250922508,25.755221238938052
190,244,25.62,25.71,25.31,1579800.0,25.62,25.447333333333333,25.370406779661018,25.31926,25.71,25.71,25.725092250922508,25.755221238938052
191,245,25.7,25.71,25.31,1579800.0,25.7,25.7,25.663076923076922,25.465038910505836,25.71,25.71,25.725092250922508,25.755221238938052
192,246,25.48,25.71,25.71,1588800.0,25.48,25.48,25.330424836601306,25.296418786692758,25.71,25.71,25.725092250922508,25.755221238938052
193,248,25.48,25.71,25.48,1611700.0,25.48,25.48,25.330424836601306,25.296418786692758,25.71,25.71,25.725092250922508,25.755221238938052
194,249,25.48,25.59,25.48,1611700.0,25.48,25.48,25.330424836601306,25.296418786692758,25.59,25.65722513089005,25.6792700729927,25.719468864468865
195,250,25.25,25.3,25.25,1613300.0,25.25,25.25,25.25,25.24,25.3,25.445,25.54810909090909,25.6430073800738
196,251,25.25,25.3,25.25,1622600.0,25.25,25.25,25.245658536585367,25.234529750479847,25.59,25.65722513089005,25.6792700729927,25.719468864468865
197,252,25.25,25.59,25.59,1644100.0,25.25,25.25,25.25,25.239424184261036,25.54,25.54,25.61488294314381,25.674257950530034
198,254,25.26,25.54,25.59,1644100.0,25.26,25.254141414141415,25.252897526501766,25.24222222222222,25.54,25.54,25.61488294314381,25.674257950530034
199,255,25.26,25.54,25.59,1644100.0,25.26,25.254141414141415,25.252897526501766,25.24222222222222,25.54,25.54,25.576642599277978,25.650054744525548
200,256,25.26,25.54,25.54,1644100.0,25.26,25.254141414141415,25.252897526501766,25.24222222222222,25.54,25.54,25.576642599277978,25.650054744525548
201,257,25.54,25.59,25.54,1654900.0,25.54,25.403333333333332,25.340704225352113,25.289079861111112,25.59,25.600059171597632,25.642681159420288,25.690902394106814
202,259,25.26,25.59,25.26,1664800.0,25.26,25.254141414141415,25.252897526501766,25.24222222222222,25.61,25.665729166666665,25.68512727272727,25.72234003656307
203,260,25.26,25.73,25.73,1683400.0,25.26,25.254141414141415,25.252897526501766,25.24222222222222,25.73,25.734939024390243,25.74074906367041,25.77620811287478
204,261,25.42,25.73,25.73,1683400.0,25.42,25.42,25.309798657718122,25.274694915254237,25.73,25.734939024390243,25.74074906367041,25.77620811287478
205,262,25.42,25.56,25.42,1691700.0,25.42,25.42,25.309798657718122,25.274694915254237,25.56,25.64062857142857,25.6720703125,25.731363636363636
206,264,25.42,25.56,25.42,1691700.0,25.42,25.42,25.309798657718122,25.278523131672596,25.56,25.64062857142857,25.6720703125,25.731363636363636
207,265,25.58,25.73,25.56,1700900.0,25.58,25.49919191919192,25.429142857142857,25.336438596491227,25.73,25.734939024390243,25.74074906367041,25.77620811287478
208,266,25.58,25.59,25.56,1700900.0,25.58,25.527340425531914,25.490069444444444,25.372521891418565,25.59,25.654555555555554,25.681072796934867,25.735063063063063
209,267,25.42,25.59,25.42,1711400.0,25.42,25.42,25.309798657718122,25.278523131672596,25.59,25.630955056179776,25.662452107279695,25.712213883677297
210,269,25.26,25.35,25.42,1712200.0,25.26,25.254141414141415,25.252897526501766,25.244258620689656,25.35,25.47125,25.533186813186813,25.635814814814815
211,270,25.25,25.35,25.25,1712200.0,25.25,25.25,25.25,25.239509001636662,25.35,25.57,25.60875,25.673180987202926
212,271,25.25,25.57,25.25,1729800.0,25.25,25.244885057471265,25.243219696969696,25.23455172413793,25.57,25.57,25.60875,25.673180987202926
213,272,25.25,25.59,25.59,1750700.0,25.25,25.244885057471265,25.243219696969696,25.23455172413793,25.59,25.630955056179776,25.662452107279695,25.712213883677297
214,274,25.38,25.59,25.59,1750700.0,25.38,25.3754802259887,25.334770992366412,25.282307692307693,25.59,25.630955056179776,25.662452107279695,25.712213883677297
215,275,25.38,25.59,25.59,1750700.0,25.38,25.3754802259887,25.334770992366412,25.282307692307693,25.59,25.630955056179776,25.662452107279695,25.712213883677297
216,276,25.38,25.59,25.59,1750700.0,25.38,25.3754802259887,25.334770992366412,25.282307692307693,25.59,25.624074074074073,25.640851851851853,25.69052141527002
217,278,25.39,25.66,25.66,1758500.0,25.39,25.39,25.380755395683455,25.313763837638376,25.66,25.66936416184971,25.6890234375,25.725568181818183
218,279,25.64,25.66,25.66,1766700.0,25.64,25.620372670807452,25.531564885496184,25.433167938931298,25.66,25.66936416184971,25.6890234375,25.725568181818183
219,280,25.6,25.66,25.6,1776700.0,25.6,25.482166666666668,25.44638989169675,25.368851224105462,25.68,25.705304878048782,25.71677551020408,25.752894248608534
220,281,25.63,25.68,25.68,1785600.0,25.63,25.615976331360947,25.569737827715358,25.473339449541285,25.68,25.705304878048782,25.71677551020408,25.752894248608534
221,283,25.63,25.79,25.79,1805500.0,25.63,25.615976331360947,25.569737827715358,25.473339449541285,25.79,25.800785340314135,25.807766666666666,25.827458471760796
222,284,25.63,25.69,25.63,1805500.0,25.63,25.615976331360947,25.571272727272728,25.492767075306478,25.69,25.74301204819277,25.768661710037176,25.80068181818182
223,285,25.63,25.65,25.79,1824100.0,25.63,25.615976331360947,25.571272727272728,25.492767075306478,25.65,25.71695652173913,25.75034843205575,25.782854330708663
224,287,25.5,25.65,25.65,1841200.0,25.5,25.5,25.495196078431373,25.402328042328044,25.65,25.71695652173913,25.75034843205575,25.782854330708663
225,288,25.5,25.65,25.5,1851500.0,25.5,25.5,25.495196078431373,25.402328042328044,25.65,25.713529411764707,25.713529411764707,25.769623015873016
226,289,25.39,25.77,25.77,1863200.0,25.39,25.39,25.380755395683455,25.313763837638376,25.77,25.77,25.789665551839466,25.80471153846154
227,290,25.39,25.71,25.77,1870500.0,25.39,25.39,25.380755395683455,25.313763837638376,25.71,25.741456310679613,25.741456310679613,25.780770750988143
228,292,25.38,25.77,25.77,1891400.0,25.38,25.3754802259887,25.334770992366412,25.282307692307693,25.77,25.77,25.789665551839466,25.80471153846154
229,293,25.37,25.73,25.37,1900600.0,25.37,25.30818181818182,25.284291338582676,25.255547826086957,25.73,25.73,25.74972602739726,25.783275529865126
230,294,25.37,25.72,25.73,1909400.0,25.37,25.30818181818182,25.284291338582676,25.255547826086957,25.72,25.72,25.725162790697674,25.762684824902724
231,295,25.37,25.72,25.73,1909400.0,25.59,25.59,25.4171375464684,25.322102473498234,25.72,25.72,25.725162790697674,25.7599801980198
232,297,25.59,25.6,25.73,1909400.0,25.59,25.59,25.4171375464684,25.322102473498234,25.6,25.6,25.656727272727274,25.717628083491462
233,298,25.59,25.6,25.73,1909400.0,25.59,25.59,25.4171375464684,25.322102473498234,25.6,25.6,25.656727272727274,25.71428842504744
234,299,25.37,25.6,25.37,1909400.0,25.37,25.30818181818182,25.284291338582676,25.255547826086957,25.6,25.6,25.656727272727274,25.71428842504744
235,0,0.0,0.0,25.37,1920500.0,,,,,,,,
