{ 
    "client": "http://localhost:9999/v1",
    "api_key": "YMMEMXTE", 
    "logging_level": "critical",
    "algo.strategy.arbitrage": {
        "sleep_interval": 1
    },
    "algo.strategy.algo_mm": {
        "sleep_interval": 0.25
    },
    "algo.strategy.currency_reversion": {
        "frequency": 5,
        "lookback": 15
    },
    "algo.strategy.tenderoffer": {
        "profit_threshold": 0.006
    },
    "algo.strategy.etfarbitrage": {
        "half_life":7,
        "entry_score": 1.5,
        "exit_score": 0.1
    },
    "market_fee": 0.02,
    "limit_fee": 0.01,
    "universe": ["RITC", "USD", "BULL", "BEAR"]
}

