,Tick,BID,ASK,LAST,TOTAL_VOLUME,BID_VWAP_1000,BID_VWAP_10000,BID_VWAP_20000,BID_VWAP_50000,ASK_VWAP_1000,ASK_VWAP_10000,ASK_VWAP_20000,ASK_VWAP_50000
0,1,10.01,10.04,10.01,10600.0,10.01,10.01,10.005291479820627,9.973407821229051,10.04,10.04,10.04,10.060295652173913
1,3,10.02,10.04,10.04,18700.0,10.02,10.02,10.014801762114537,9.989675675675675,10.04,10.04,10.04,10.060295652173913
2,4,10.02,10.04,10.04,28300.0,10.02,10.02,10.014801762114537,10.00049815498155,10.04,10.04,10.048964285714286,10.073718166383701
3,5,10.02,10.04,10.04,28300.0,10.02,10.02,10.014801762114537,10.008113553113553,10.04,10.04,10.048964285714286,10.073718166383701
4,7,10.03,10.04,10.04,28300.0,10.03,10.03,10.025112107623318,10.018042328042329,10.04,10.04,10.048964285714286,10.073718166383701
5,8,10.03,10.05,10.05,28300.0,10.03,10.03,10.025112107623318,10.018042328042329,10.05,10.054852071005918,10.06072463768116,10.086831345826235
6,9,10.03,10.05,10.05,37600.0,10.03,10.03,10.025112107623318,10.018042328042329,10.05,10.054852071005918,10.06072463768116,10.086831345826235
7,11,10.03,10.07,10.07,57100.0,10.03,10.03,10.025112107623318,10.018042328042329,10.07,10.07,10.096148867313916,10.104245810055867
8,12,10.1,10.11,10.11,67100.0,10.1,10.0601,10.0601,10.032527472527473,10.11,10.11,10.11,10.113937621832358
9,13,10.1,10.11,10.11,76100.0,10.1,10.0601,10.0601,10.032527472527473,10.11,10.11,10.115219298245615,10.117854330708662
10,15,10.1,10.11,10.11,86000.0,10.1,10.079217877094973,10.060068259385666,10.04253358925144,10.11,10.11,10.115219298245615,10.117854330708662
11,16,10.1,10.11,10.11,86000.0,10.1,10.1,10.086714285714285,10.059477977161501,10.11,10.11,10.115219298245615,10.117854330708662
12,17,10.1,10.11,10.11,86000.0,10.1,10.1,10.093699633699634,10.068239316239316,10.11,10.11,10.115219298245615,10.117854330708662
13,18,10.1,10.12,10.12,86000.0,10.1,10.1,10.093699633699634,10.07567190226876,10.12,10.12,10.12,10.12625
14,20,10.1,10.12,10.12,95000.0,10.1,10.1,10.093699633699634,10.08330985915493,10.12,10.12,10.12,10.12625
15,21,10.1,10.12,10.12,104900.0,10.1,10.1,10.093699633699634,10.085026548672566,10.12,10.12,10.12,10.13984126984127
16,22,10.11,10.12,10.12,104900.0,10.11,10.11,10.103484320557492,10.09350604490501,10.12,10.12,10.12,10.13984126984127
17,24,10.11,10.12,10.12,124400.0,10.11,10.11,10.103484320557492,10.096842105263159,10.12,10.12,10.135,10.177162393162392
18,25,10.11,10.12,10.12,124400.0,10.11,10.11,10.103484320557492,10.096842105263159,10.12,10.12,10.135,10.177162393162392
19,26,10.11,10.15,10.15,133500.0,10.11,10.11,10.103484320557492,10.097893864013267,10.15,10.15,10.159198606271778,10.202350877192982
20,27,10.11,10.15,10.15,133500.0,10.11,10.11,10.103484320557492,10.097893864013267,10.18,10.206216216216216,10.217758007117437,10.253309090909092
21,29,10.15,10.18,10.18,151600.0,10.15,10.128260869565217,10.119259259259259,10.107253521126761,10.18,10.206216216216216,10.217758007117437,10.253309090909092
22,30,10.15,10.23,10.23,161200.0,10.15,10.138615384615385,10.128915254237288,10.11493870402802,10.23,10.234974093264249,10.246113074204947,10.2819689119171
23,31,10.15,10.24,10.24,171600.0,10.19,10.19,10.1566,10.130630323679727,10.24,10.254516129032258,10.26546468401487,10.300936967632028
24,32,10.21,10.24,10.24,171600.0,10.21,10.21,10.199952153110047,10.158373015873016,10.24,10.254516129032258,10.26546468401487,10.300936967632028
25,34,10.26,10.27,10.24,171600.0,10.26,10.26,10.235586854460093,10.189395711500975,10.27,10.279595375722543,10.290446096654275,10.316572934973639
26,35,10.26,10.29,10.29,189100.0,10.26,10.26,10.236813559322034,10.19636974789916,10.29,10.300726256983241,10.31625,10.329190140845071
27,36,10.3,10.31,10.31,198800.0,10.3,10.278308457711443,10.278308457711443,10.225711805555555,10.31,10.326478873239436,10.326478873239436,10.341726495726496
28,38,10.3,10.31,10.31,198800.0,10.3,10.3,10.3,10.259055649241146,10.31,10.326478873239436,10.326478873239436,10.341726495726496
29,39,10.33,10.34,10.31,205500.0,10.33,10.314318181818182,10.30875,10.292031558185405,10.34,10.34,10.34,10.351728813559323
30,40,10.33,10.34,10.31,205500.0,10.33,10.33,10.320212765957447,10.306944444444444,10.34,10.34,10.34,10.351728813559323
31,41,10.33,10.34,10.34,213600.0,10.33,10.33,10.320212765957447,10.306944444444444,10.34,10.345329341317365,10.354569288389513,10.370068259385665
32,43,10.33,10.34,10.34,232700.0,10.33,10.33,10.320212765957447,10.306944444444444,10.34,10.345329341317365,10.354569288389513,10.370068259385665
33,44,10.33,10.34,10.34,232700.0,10.33,10.33,10.326209150326797,10.315725490196078,10.34,10.345329341317365,10.354569288389513,10.370068259385665
34,45,10.33,10.34,10.34,232700.0,10.33,10.33,10.326209150326797,10.315725490196078,10.34,10.345329341317365,10.354569288389513,10.370068259385665
35,46,10.33,10.34,10.34,232700.0,10.33,10.33,10.33,10.317661016949152,10.34,10.34,10.343333333333334,10.357766323024055
36,48,10.33,10.34,10.34,232700.0,10.33,10.33,10.33,10.3254,10.34,10.34,10.343333333333334,10.357766323024055
37,49,10.33,10.34,10.34,232700.0,10.33,10.33,10.33,10.3254,10.34,10.34,10.343333333333334,10.357766323024055
38,50,10.33,10.34,10.34,232700.0,10.33,10.33,10.33,10.3254,10.34,10.34,10.353460207612457,10.360515873015872
39,51,10.35,10.37,10.35,254400.0,10.35,10.339629629629629,10.335820895522389,10.328719723183392,10.37,10.37,10.37,10.392509433962264
40,53,10.36,10.37,10.37,265500.0,10.36,10.355243902439025,10.346693548387098,10.335418181818183,10.37,10.37,10.37,10.429727272727273
41,54,10.36,10.37,10.37,275500.0,10.36,10.355243902439025,10.346693548387098,10.335418181818183,10.37,10.37,10.38908256880734,10.429727272727273
42,55,10.36,10.37,10.37,275500.0,10.36,10.355243902439025,10.346693548387098,10.335418181818183,10.37,10.37,10.38908256880734,10.429727272727273
43,57,10.36,10.41,10.41,296300.0,10.36,10.355243902439025,10.346693548387098,10.335418181818183,10.41,10.426323529411764,10.426323529411764,10.448503937007874
44,58,10.4,10.41,10.41,296300.0,10.4,10.394414893617022,10.383613138686131,10.359981549815497,10.41,10.426323529411764,10.426323529411764,10.448503937007874
45,59,10.43,10.44,10.44,307400.0,10.43,10.43,10.407474747474748,10.379816513761467,10.44,10.44,10.445044642857143,10.4678886756238
46,60,10.43,10.45,10.45,318500.0,10.43,10.43,10.407474747474748,10.379816513761467,10.45,10.45,10.463388157894737,10.482106299212598
47,62,10.43,10.45,10.45,318500.0,10.43,10.43,10.407474747474748,10.389448275862069,10.45,10.45,10.463388157894737,10.482106299212598
48,63,10.43,10.45,10.45,318500.0,10.43,10.43,10.421170212765958,10.400034246575343,10.45,10.45,10.463388157894737,10.482106299212598
49,64,10.43,10.45,10.45,326800.0,10.43,10.43,10.421170212765958,10.400034246575343,10.45,10.45,10.463388157894737,10.482106299212598
50,65,10.43,10.45,10.45,326800.0,10.44,10.434682926829268,10.434682926829268,10.411541095890412,10.45,10.45,10.463388157894737,10.482106299212598
51,67,10.44,10.45,10.44,335100.0,10.44,10.434682926829268,10.434682926829268,10.411541095890412,10.45,10.45,10.463388157894737,10.482106299212598
52,68,10.43,10.45,10.43,345100.0,10.43,10.43,10.421170212765958,10.40160409556314,10.45,10.45,10.463388157894737,10.482106299212598
53,69,10.43,10.44,10.48,356300.0,10.43,10.43,10.421170212765958,10.40160409556314,10.44,10.463351351351351,10.480343642611684,10.518585690515806
54,71,10.43,10.44,10.43,364400.0,10.43,10.420526315789473,10.413818897637796,10.397275985663082,10.44,10.463351351351351,10.477016949152542,10.50432119205298
55,72,10.43,10.44,10.43,364400.0,10.43,10.420526315789473,10.413818897637796,10.397275985663082,10.44,10.44,10.455882352941176,10.483003412969284
56,73,10.43,10.44,10.44,373800.0,10.43,10.420526315789473,10.413818897637796,10.397275985663082,10.44,10.462153846153846,10.475803278688524,10.48950884086444
57,74,10.43,10.48,10.48,373800.0,10.43,10.420526315789473,10.413818897637796,10.400791366906475,10.48,10.48,10.490091743119265,10.513719165085389
58,76,10.44,10.5,10.5,391300.0,10.44,10.434610778443114,10.42657258064516,10.410413533834587,10.5,10.5,10.504907407407407,10.53412547528517
59,77,10.44,10.45,10.47,391300.0,10.44,10.434610778443114,10.42657258064516,10.410413533834587,10.45,10.45,10.474774774774774,10.50713747645951
60,78,10.45,10.5,10.45,401900.0,10.45,10.44544378698225,10.440077220077221,10.423384615384615,10.5,10.5,10.504907407407407,10.53412547528517
61,80,10.45,10.5,10.5,410700.0,10.45,10.44544378698225,10.440077220077221,10.423384615384615,10.5,10.5,10.504907407407407,10.53412547528517
62,81,10.49,10.51,10.51,419300.0,10.49,10.468850574712643,10.46,10.437649325626204,10.51,10.51,10.51,10.563932806324111
63,82,10.49,10.51,10.51,428900.0,10.49,10.468850574712643,10.46,10.437649325626204,10.51,10.54103448275862,10.54103448275862,10.603161033797218
64,83,10.55,10.57,10.51,432500.0,10.55,10.55,10.525785714285714,10.484601113172541,10.57,10.57,10.57504716981132,10.65882
65,85,10.55,10.57,10.57,432500.0,10.55,10.55,10.543285198555957,10.503693181818182,10.57,10.57,10.57504716981132,10.65882
66,86,10.57,10.58,10.57,443000.0,10.57,10.559705882352942,10.559705882352942,10.541564147627417,10.58,10.58,10.6452,10.73
67,87,10.57,10.58,10.58,452600.0,10.57,10.564876847290641,10.564876847290641,10.5519627749577,10.58,10.58,10.6452,10.73
68,88,10.57,10.62,10.62,452600.0,10.57,10.564876847290641,10.564876847290641,10.5519627749577,10.57,10.595641025641026,10.615964912280702,10.694485815602837
69,90,10.56,10.57,10.57,471100.0,10.56,10.56,10.56,10.550271186440678,10.57,10.595641025641026,10.615964912280702,10.694485815602837
70,91,10.56,10.66,10.66,481600.0,10.56,10.56,10.56,10.550271186440678,10.66,10.681347150259068,10.72048611111111,10.81074074074074
71,92,10.62,10.66,10.62,491700.0,10.62,10.589261083743843,10.589261083743843,10.56501677852349,10.66,10.681347150259068,10.72048611111111,10.81074074074074
72,93,10.63,10.66,10.62,501500.0,10.63,10.63,10.62505,10.583589743589744,10.66,10.681347150259068,10.707554744525547,10.766673003802282
73,95,10.65,10.66,10.63,510600.0,10.65,10.65,10.639950248756218,10.6063468013468,10.66,10.681347150259068,10.707554744525547,10.766673003802282
74,96,10.65,10.66,10.63,510600.0,10.65,10.65,10.642986111111112,10.62065180102916,10.66,10.66,10.675315985130112,10.737775665399239
75,97,10.63,10.64,10.65,510600.0,10.63,10.63,10.62505,10.589181969949916,10.64,10.650404624277456,10.653333333333334,10.706723484848485
76,99,10.55,10.64,10.55,552300.0,10.55,10.55,10.55,10.521565836298933,10.64,10.650404624277456,10.653333333333334,10.706723484848485
77,100,10.59,10.7,10.7,561100.0,10.59,10.59,10.570733944954128,10.555309381237524,10.7,10.7,10.754372759856631,10.830075329566855
78,101,10.59,10.64,10.7,561100.0,10.59,10.59,10.570733944954128,10.555309381237524,10.64,10.650792079207921,10.650792079207921,10.729483985765125
79,102,10.59,10.64,10.7,561100.0,10.59,10.59,10.570733944954128,10.555309381237524,10.64,10.650792079207921,10.650792079207921,10.695017921146954
80,103,10.59,10.63,10.7,561100.0,10.59,10.59,10.570733944954128,10.555309381237524,10.63,10.63528409090909,10.636937269372694,10.656209964412811
81,105,10.55,10.64,10.59,583500.0,10.55,10.55,10.55,10.521565836298933,10.64,10.64,10.647340067340068,10.675262237762238
82,106,10.55,10.64,10.59,583500.0,10.55,10.55,10.55,10.521565836298933,10.64,10.64,10.64,10.657079037800687
83,107,10.55,10.64,10.55,583500.0,10.55,10.55,10.55,10.521565836298933,10.64,10.64,10.64,10.657079037800687
84,108,10.55,10.59,10.55,594600.0,10.55,10.55,10.55,10.536357267950963,10.59,10.59,10.622525951557094,10.634271457085829
85,110,10.55,10.57,10.55,603000.0,10.55,10.55,10.546529209621992,10.519551971326164,10.57,10.580860215053763,10.60057347670251,10.62494880546075
86,111,10.55,10.57,10.55,613200.0,10.55,10.55,10.545235849056604,10.504208633093524,10.57,10.580860215053763,10.60057347670251,10.62494880546075
87,112,10.55,10.59,10.59,622700.0,10.55,10.55,10.545235849056604,10.504208633093524,10.59,10.59,10.622525951557094,10.634271457085829
88,113,10.54,10.59,10.54,630700.0,10.54,10.54,10.52177536231884,10.49045955882353,10.59,10.59,10.622525951557094,10.634271457085829
89,115,10.56,10.59,10.53,640200.0,10.56,10.56,10.546323529411765,10.495361010830324,10.59,10.59,10.622525951557094,10.634271457085829
90,116,10.56,10.59,10.56,649100.0,10.56,10.56,10.546323529411765,10.495361010830324,10.59,10.59,10.622525951557094,10.6299
91,117,10.53,10.59,10.59,651300.0,10.53,10.511257142857144,10.499963503649635,10.470863039399624,10.59,10.59,10.622525951557094,10.6299
92,118,10.6,10.64,10.59,666600.0,10.6,10.6,10.544136690647482,10.501959706959706,10.64,10.64,10.64,10.644291338582677
93,120,10.49,10.64,10.49,678300.0,10.49,10.484530386740332,10.472893772893773,10.45084452975048,10.64,10.64,10.64,10.644291338582677
94,121,10.49,10.52,10.49,678300.0,10.49,10.484530386740332,10.475633802816901,10.463694029850746,10.52,10.584508670520231,10.604179104477613,10.627380952380953
95,122,10.49,10.51,10.49,678300.0,10.49,10.484530386740332,10.475633802816901,10.463694029850746,10.52,10.584508670520231,10.604179104477613,10.627380952380953
96,123,10.49,10.64,10.64,689000.0,10.49,10.484530386740332,10.475633802816901,10.469420560747663,10.64,10.64,10.64,10.644291338582677
97,125,10.48,10.54,10.48,706900.0,10.48,10.48,10.472589928057554,10.461962264150943,10.54,10.590819672131147,10.607625899280576,10.628595317725752
98,126,10.48,10.54,10.48,706900.0,10.48,10.48,10.472589928057554,10.4632156133829,10.54,10.590819672131147,10.607625899280576,10.628595317725752
99,127,10.48,10.54,10.48,706900.0,10.48,10.48,10.472589928057554,10.4632156133829,10.54,10.55,10.559850746268657,10.601574239713775
100,128,10.48,10.54,10.48,706900.0,10.48,10.48,10.472589928057554,10.4632156133829,10.54,10.55,10.559850746268657,10.582073170731707
101,130,10.48,10.54,10.48,717700.0,10.48,10.468491620111731,10.465801526717557,10.456531007751938,10.54,10.54,10.546293706293707,10.565298126064736
102,131,10.46,10.54,10.46,739900.0,10.46,10.454742857142858,10.453192307692309,10.444960784313725,10.54,10.54,10.539999999999997,10.556470588235294
103,132,10.53,10.54,10.54,751000.0,10.53,10.497541899441341,10.48140221402214,10.463391472868217,10.54,10.54,10.54,10.55940594059406
104,134,10.46,10.5,10.53,760600.0,10.46,10.454742857142858,10.453192307692309,10.444960784313725,10.5,10.52078431372549,10.52078431372549,10.549751243781095
105,135,10.45,10.54,10.54,781500.0,10.45,10.45,10.446968503937008,10.436929133858268,10.54,10.54,10.558536585365854,10.5697
106,136,10.54,10.56,10.54,781500.0,10.54,10.54,10.501413793103449,10.474878504672898,10.56,10.569887640449439,10.573793103448276,10.59811744386874
107,137,10.54,10.56,10.54,790300.0,10.54,10.54,10.520271186440677,10.486357012750455,10.56,10.569887640449439,10.573793103448276,10.59140597539543
108,139,10.54,10.56,10.54,790300.0,10.54,10.54,10.52975352112676,10.501021505376345,10.56,10.56,10.56676923076923,10.578691756272402
109,140,10.54,10.56,10.54,800000.0,10.54,10.524098360655739,10.519214285714286,10.484850187265918,10.58,10.58,10.58,10.604372822299652
110,141,10.54,10.58,10.58,819100.0,10.54,10.524098360655739,10.519214285714286,10.484850187265918,10.58,10.58,10.58,10.604372822299652
111,143,10.57,10.58,10.58,819100.0,10.57,10.57,10.541525423728814,10.50768014059754,10.58,10.58,10.58,10.594518388791593
112,144,10.54,10.57,10.57,830300.0,10.54,10.524098360655739,10.519214285714286,10.484850187265918,10.57,10.57,10.57655737704918,10.582847341337906
113,145,10.54,10.57,10.57,830300.0,10.54,10.524098360655739,10.519214285714286,10.484850187265918,10.57,10.57,10.5732,10.57667259786477
114,146,10.51,10.57,10.51,830300.0,10.51,10.51,10.52238434163701,10.486579439252337,10.57,10.57,10.5732,10.57667259786477
115,148,10.56,10.57,10.51,849400.0,10.56,10.532285714285715,10.524338235294117,10.486977186311787,10.57,10.57,10.5732,10.57667259786477
116,149,10.51,10.57,10.51,858600.0,10.51,10.48079365079365,10.47124087591241,10.454618320610686,10.57,10.57,10.5732,10.57667259786477
117,150,10.54,10.57,10.51,858600.0,10.54,10.534558823529412,10.534558823529412,10.49018018018018,10.57,10.57,10.5732,10.57667259786477
118,151,10.53,10.57,10.53,869500.0,10.53,10.53,10.520673076923076,10.474036697247707,10.57,10.575176470588236,10.57709219858156,10.580340501792115
119,153,10.53,10.57,10.53,889600.0,10.53,10.53,10.520673076923076,10.47814236111111,10.57,10.57,10.5734375,10.576906077348067
120,154,10.53,10.57,10.57,889600.0,10.53,10.53,10.520673076923076,10.47814236111111,10.57,10.575057471264367,10.576993006993007,10.580266903914591
121,155,10.49,10.5,10.51,909500.0,10.49,10.479038461538462,10.479038461538462,10.458146788990826,10.5,10.5,10.546978417266187,10.56375221238938
122,157,10.56,10.57,10.5,919000.0,10.56,10.56,10.528212560386473,10.480782608695652,10.57,10.575057471264367,10.576993006993007,10.580266903914591
123,158,10.56,10.57,10.5,919000.0,10.56,10.56,10.528212560386473,10.480782608695652,10.57,10.575057471264367,10.576993006993007,10.580266903914591
124,159,10.56,10.57,10.5,919000.0,10.56,10.56,10.528212560386473,10.480782608695652,10.57,10.575057471264367,10.576993006993007,10.580266903914591
125,160,10.56,10.57,10.5,919000.0,10.56,10.56,10.528212560386473,10.480782608695652,10.57,10.57,10.57,10.575078260869565
126,162,10.47,10.57,10.47,938600.0,10.47,10.47,10.461067961165048,10.447929759704252,10.57,10.57,10.57,10.575078260869565
127,163,10.56,10.57,10.57,947100.0,10.56,10.56,10.514601769911504,10.473090586145648,10.57,10.57,10.573087719298245,10.576555944055944
128,164,10.56,10.57,10.56,955900.0,10.56,10.56,10.52625,10.49016129032258,10.57,10.57,10.573087719298245,10.576555944055944
129,165,10.56,10.57,10.57,963900.0,10.56,10.56,10.538907849829352,10.498510273972602,10.57,10.574782608695653,10.576756756756756,10.580087412587412
130,166,10.56,10.58,10.58,973100.0,10.56,10.56,10.538907849829352,10.498510273972602,10.58,10.58,10.58,10.583386243386244
131,168,10.56,10.58,10.58,973100.0,10.56,10.56,10.538907849829352,10.498510273972602,10.58,10.58,10.58,10.583386243386244
132,169,10.56,10.58,10.58,973100.0,10.56,10.56,10.538907849829352,10.498510273972602,10.58,10.58,10.58,10.583386243386244
133,170,10.5,10.51,10.56,982700.0,10.5,10.5,10.484239631336406,10.460523465703972,10.51,10.545813953488372,10.559295774647888,10.57130357142857
134,171,10.47,10.51,10.47,993800.0,10.47,10.47,10.465000000000002,10.453221238938053,10.51,10.545813953488372,10.559295774647888,10.57130357142857
135,173,10.46,10.51,10.46,1002200.0,10.46,10.46,10.455533980582524,10.445822550831792,10.51,10.545813953488372,10.559295774647888,10.57130357142857
136,174,10.56,10.58,10.58,1010200.0,10.56,10.56,10.50841628959276,10.470268817204301,10.58,10.58,10.58,10.583386243386244
137,175,10.56,10.58,10.58,1018100.0,10.56,10.56,10.50841628959276,10.470268817204301,10.58,10.58,10.58,10.584973730297722
138,176,10.46,10.47,10.56,1028800.0,10.46,10.46,10.455533980582524,10.445822550831792,10.47,10.47,10.524513274336282,10.55703187250996
139,178,10.46,10.58,10.46,1037200.0,10.46,10.46,10.455533980582524,10.445822550831792,10.58,10.58,10.583659420289855,10.586777163904236
140,179,10.52,10.58,10.46,1045500.0,10.52,10.486634146341464,10.486634146341464,10.46090405904059,10.53,10.53,10.561028368794327,10.575565371024735
141,180,10.52,10.53,10.46,1045500.0,10.52,10.505166666666666,10.48765306122449,10.468795620437957,10.53,10.53,10.561028368794327,10.575565371024735
142,182,10.52,10.53,10.53,1053400.0,10.52,10.505166666666666,10.48765306122449,10.468795620437957,10.53,10.53,10.561028368794327,10.575565371024735
143,183,10.49,10.53,10.49,1064600.0,10.49,10.473152709359606,10.473152709359606,10.45574074074074,10.53,10.53,10.561028368794327,10.586777163904236
144,184,10.49,10.52,10.58,1074100.0,10.49,10.473152709359606,10.473152709359606,10.45574074074074,10.52,10.52,10.551141868512111,10.568617021276596
145,185,10.49,10.5,10.5,1074100.0,10.49,10.473152709359606,10.473152709359606,10.45574074074074,10.5,10.5,10.510185185185184,10.552694300518136
146,187,10.51,10.52,10.5,1084700.0,10.51,10.51,10.485870967741935,10.468351063829788,10.52,10.52,10.52,10.556481802426344
147,188,10.51,10.52,10.5,1084700.0,10.51,10.51,10.485870967741935,10.468351063829788,10.52,10.52,10.52,10.556481802426344
148,189,10.51,10.52,10.52,1094800.0,10.51,10.51,10.485870967741935,10.468351063829788,10.52,10.52,10.52,10.556481802426344
149,190,10.51,10.56,10.56,1103100.0,10.51,10.51,10.497205387205387,10.480139165009941,10.56,10.570279329608939,10.573358778625954,10.582014652014651
150,192,10.52,10.56,10.56,1111800.0,10.52,10.514676616915423,10.514676616915423,10.493049504950495,10.56,10.56,10.566433566433567,10.57650623885918
151,193,10.52,10.56,10.52,1121100.0,10.52,10.514676616915423,10.514676616915423,10.493049504950495,10.56,10.56,10.566433566433567,10.57650623885918
152,194,10.51,10.54,10.51,1121100.0,10.51,10.51,10.497205387205387,10.480139165009941,10.54,10.54,10.553063973063972,10.567801047120419
153,195,10.49,10.54,10.54,1150300.0,10.49,10.49,10.47875,10.464283154121864,10.54,10.54,10.553063973063972,10.567801047120419
154,197,10.49,10.56,10.56,1160100.0,10.52,10.505797872340425,10.500276816608997,10.477017241379311,10.56,10.56,10.57241134751773,10.581236749116607
155,198,10.52,10.56,10.56,1160100.0,10.52,10.505797872340425,10.500276816608997,10.487075098814229,10.56,10.56,10.57241134751773,10.581236749116607
156,199,10.53,10.56,10.52,1168700.0,10.53,10.53,10.52505,10.494217462932454,10.56,10.56,10.57241134751773,10.581236749116607
157,200,10.53,10.59,10.59,1178300.0,10.53,10.53,10.52505,10.500257289879931,10.59,10.59,10.59,10.591539855072464
158,202,10.53,10.59,10.59,1203700.0,10.53,10.53,10.52505,10.500257289879931,10.59,10.59,10.59,10.596294896030246
159,203,10.52,10.59,10.52,1214000.0,10.52,10.505797872340425,10.500276816608997,10.48751677852349,10.59,10.59,10.59,10.596294896030246
160,204,10.52,10.59,10.52,1214000.0,10.52,10.515238095238095,10.507158273381295,10.496538461538462,10.59,10.59,10.59,10.596294896030246
161,206,10.52,10.59,10.52,1214000.0,10.52,10.515238095238095,10.507158273381295,10.496538461538462,10.59,10.59,10.59,10.596294896030246
162,207,10.52,10.56,10.52,1214000.0,10.52,10.515238095238095,10.507158273381295,10.496538461538462,10.56,10.575593220338982,10.580229885057472,10.588504672897196
163,208,10.51,10.56,10.51,1222800.0,10.51,10.500055865921787,10.496428571428572,10.489927797833936,10.56,10.575593220338982,10.580229885057472,10.588504672897196
164,209,10.51,10.52,10.51,1222800.0,10.51,10.500055865921787,10.496428571428572,10.489927797833936,10.52,10.52,10.554048442906574,10.572872531418312
165,211,10.49,10.5,10.49,1232900.0,10.49,10.49,10.486496598639455,10.47461273666093,10.5,10.510717703349282,10.510717703349282,10.556397188049209
166,212,10.49,10.5,10.49,1242900.0,10.49,10.484663212435233,10.483284671532846,10.468159292035399,10.5,10.510717703349282,10.510717703349282,10.556397188049209
167,213,10.49,10.52,10.52,1242900.0,10.49,10.484663212435233,10.483284671532846,10.468159292035399,10.52,10.52,10.535107142857143,10.562306306306306
168,214,10.48,10.52,10.48,1252800.0,10.48,10.48,10.472348993288591,10.460670289855072,10.52,10.52,10.535107142857143,10.558779174147217
169,216,10.48,10.52,10.48,1279400.0,10.48,10.468307692307691,10.462439024390244,10.453703007518797,10.52,10.52,10.535107142857143,10.558779174147217
170,217,10.48,10.52,10.48,1279400.0,10.48,10.468307692307691,10.462439024390244,10.453703007518797,10.52,10.52,10.526070175438596,10.543224699828473
171,218,10.48,10.51,10.48,1279400.0,10.48,10.468307692307691,10.462439024390244,10.453703007518797,10.51,10.51,10.515114155251142,10.528291457286432
172,219,10.45,10.51,10.45,1287500.0,10.45,10.445246913580247,10.443469387755101,10.43142857142857,10.51,10.51,10.515114155251142,10.528291457286432
173,221,10.44,10.51,10.44,1304600.0,10.44,10.44,10.4364,10.424435946462715,10.51,10.51,10.515114155251142,10.528291457286432
174,222,10.44,10.51,10.44,1304600.0,10.44,10.44,10.44,10.430278810408922,10.51,10.51,10.515114155251142,10.524250440917108
175,223,10.46,10.51,10.44,1304600.0,10.46,10.450493827160495,10.446938775510205,10.437970479704797,10.51,10.51,10.51,10.519141716566866
176,224,10.46,10.51,10.44,1304600.0,10.46,10.450493827160495,10.446938775510205,10.437970479704797,10.51,10.51,10.51,10.515731225296443
177,225,10.46,10.51,10.51,1304600.0,10.46,10.450493827160495,10.446938775510205,10.437970479704797,10.51,10.51,10.51,10.515731225296443
178,227,10.44,10.48,10.44,1324700.0,10.44,10.44,10.44,10.431828358208955,10.48,10.497351351351352,10.50204081632653,10.51095890410959
179,228,10.5,10.51,10.48,1332500.0,10.5,10.489550561797753,10.474588235294117,10.454666666666666,10.51,10.51,10.51,10.515731225296443
180,229,10.5,10.51,10.48,1332500.0,10.5,10.489550561797753,10.486007067137809,10.466238185255198,10.51,10.51,10.51,10.515731225296443
181,230,10.48,10.49,10.48,1332500.0,10.48,10.48,10.458880597014925,10.4475226039783,10.49,10.49,10.499816513761468,10.509602272727273
182,232,10.48,10.51,10.51,1361600.0,10.48,10.48,10.458880597014925,10.4475226039783,10.51,10.51,10.515067873303167,10.52111888111888
183,233,10.48,10.51,10.51,1361600.0,10.48,10.48,10.469905660377359,10.452631578947368,10.51,10.51,10.515067873303167,10.52111888111888
184,234,10.48,10.52,10.52,1361600.0,10.48,10.48,10.469905660377359,10.452631578947368,10.52,10.52,10.523180076628352,10.52661596958175
185,235,10.48,10.49,10.52,1371600.0,10.48,10.48,10.469905660377359,10.452631578947368,10.49,10.49,10.509208633093525,10.519375
186,237,10.48,10.49,10.52,1371600.0,10.48,10.48,10.469905660377359,10.456487455197133,10.49,10.49,10.509208633093525,10.519375
187,238,10.48,10.49,10.52,1371600.0,10.48,10.48,10.48,10.466771653543308,10.49,10.49,10.509208633093525,10.519375
188,239,10.48,10.49,10.52,1371600.0,10.48,10.48,10.48,10.468221797323135,10.49,10.49,10.509208633093525,10.519375
189,241,10.49,10.52,10.49,1381600.0,10.49,10.49,10.48507042253521,10.47422641509434,10.52,10.52,10.523180076628352,10.52661596958175
190,242,10.49,10.52,10.52,1392900.0,10.49,10.49,10.48507042253521,10.47422641509434,10.52,10.52482558139535,10.526603053435114,10.530348623853211
191,243,10.49,10.53,10.53,1410700.0,10.49,10.49,10.48507042253521,10.47422641509434,10.53,10.53,10.533816254416962,10.543557858376511
192,244,10.49,10.53,10.53,1419900.0,10.49,10.49,10.48507042253521,10.47422641509434,10.53,10.535684210526316,10.540993377483444,10.550255536626917
193,246,10.49,10.54,10.54,1437800.0,10.49,10.49,10.48507042253521,10.47422641509434,10.54,10.54,10.54509090909091,10.553544554455446
194,247,10.49,10.54,10.54,1437800.0,10.49,10.49,10.48507042253521,10.47422641509434,10.54,10.54,10.54509090909091,10.553544554455446
195,248,10.49,10.55,10.55,1437800.0,10.49,10.49,10.48507042253521,10.475988909426986,10.55,10.55,10.55,10.56195608782435
196,249,10.49,10.55,10.55,1456800.0,10.49,10.49,10.48507042253521,10.475988909426986,10.55,10.554619565217392,10.560070175438597,10.573061946902655
197,250,10.49,10.55,10.55,1456800.0,10.49,10.49,10.48507042253521,10.477937384898711,10.55,10.554619565217392,10.560070175438597,10.573061946902655
198,252,10.48,10.56,10.56,1478000.0,10.48,10.48,10.48,10.4719926199262,10.56,10.565430107526883,10.570655172413794,10.580070796460177
199,253,10.49,10.56,10.56,1478000.0,10.49,10.484502617801047,10.482857142857142,10.479507874015749,10.56,10.565430107526883,10.570655172413794,10.580070796460177
200,254,10.5,10.56,10.56,1478000.0,10.5,10.495085714285715,10.489428571428572,10.482562814070352,10.56,10.565430107526883,10.570655172413794,10.580070796460177
201,255,10.55,10.56,10.55,1478000.0,10.55,10.55,10.52775,10.500778443113772,10.56,10.565430107526883,10.570655172413794,10.580070796460177
202,257,10.55,10.58,10.58,1509100.0,10.55,10.55,10.52775,10.500778443113772,10.58,10.58,10.586285714285713,10.589648148148148
203,258,10.5,10.53,10.55,1509600.0,10.5,10.5,10.496791044776119,10.487772020725389,10.53,10.556262626262626,10.56696551724138,10.577832422586521
204,259,10.5,10.53,10.5,1509600.0,10.5,10.495195530726257,10.489577464788733,10.484681583476764,10.53,10.556262626262626,10.56696551724138,10.577832422586521
205,260,10.49,10.58,10.49,1530900.0,10.49,10.484502617801047,10.482857142857142,10.47958263772955,10.58,10.58,10.586285714285713,10.589648148148148
206,262,10.49,10.55,10.49,1539900.0,10.49,10.484502617801047,10.482857142857142,10.47958263772955,10.55,10.565445544554455,10.565445544554455,10.581030741410489
207,263,10.48,10.55,10.48,1555900.0,10.48,10.48,10.48,10.475744680851063,10.55,10.565445544554455,10.565445544554455,10.581030741410489
208,264,10.48,10.55,10.48,1566600.0,10.48,10.48,10.48,10.475744680851063,10.55,10.55,10.55,10.574136752136752
209,265,10.48,10.55,10.48,1566600.0,10.48,10.48,10.48,10.475744680851063,10.55,10.55,10.55,10.574136752136752
210,267,10.48,10.5,10.48,1586800.0,10.48,10.47450495049505,10.47450495049505,10.467760617760618,10.5,10.52538860103627,10.53421926910299,10.559311531841653
211,268,10.48,10.5,10.48,1586800.0,10.48,10.47450495049505,10.47450495049505,10.464166666666667,10.48,10.490614525139664,10.50638783269962,10.53542757417103
212,269,10.47,10.48,10.48,1593900.0,10.47,10.47,10.47,10.464166666666667,10.48,10.490614525139664,10.494146341463415,10.520762564991335
213,270,10.47,10.48,10.47,1593900.0,10.47,10.47,10.47,10.464166666666667,10.48,10.490614525139664,10.494146341463415,10.520762564991335
214,272,10.46,10.48,10.46,1624700.0,10.46,10.46,10.46,10.454045534150612,10.48,10.490614525139664,10.494146341463415,10.520762564991335
215,273,10.46,10.5,10.5,1634300.0,10.46,10.46,10.46,10.450749542961608,10.5,10.5,10.5,10.536817420435511
216,274,10.46,10.5,10.5,1643500.0,10.46,10.46,10.46,10.450749542961608,10.5,10.5,10.5,10.519379432624113
217,275,10.46,10.5,10.5,1643500.0,10.46,10.46,10.46,10.450749542961608,10.5,10.5,10.5,10.512407732864675
218,277,10.46,10.5,10.46,1654900.0,10.46,10.46,10.453519163763065,10.446940966010734,10.5,10.5,10.5,10.512407732864675
219,278,10.46,10.47,10.46,1654900.0,10.46,10.46,10.453519163763065,10.446940966010734,10.47,10.48532258064516,10.490714285714287,10.501684027777777
220,279,10.46,10.47,10.46,1654900.0,10.46,10.46,10.453519163763065,10.446940966010734,10.47,10.475185185185186,10.483485915492958,10.49374358974359
221,281,10.45,10.47,10.47,1673500.0,10.45,10.45,10.443846153846154,10.440178890876565,10.47,10.475185185185186,10.483485915492958,10.49374358974359
222,282,10.45,10.47,10.47,1684300.0,10.45,10.45,10.443846153846154,10.440178890876565,10.47,10.47,10.474851485148514,10.493227424749163
223,283,10.45,10.48,10.48,1684300.0,10.45,10.45,10.443846153846154,10.440178890876565,10.48,10.489844559585492,10.493488372093024,10.502984562607205
224,284,10.44,10.48,10.44,1693700.0,10.44,10.44,10.44,10.435017182130585,10.48,10.489844559585492,10.493488372093024,10.498382608695652
225,285,10.48,10.5,10.48,1713600.0,10.48,10.48,10.459065420560748,10.444294234592446,10.5,10.5,10.5,10.506537102473498
226,287,10.48,10.5,10.48,1713600.0,10.48,10.48,10.459065420560748,10.444294234592446,10.5,10.5,10.5,10.503617747440273
227,288,10.48,10.5,10.48,1713600.0,10.48,10.48,10.459065420560748,10.444294234592446,10.5,10.5,10.5,10.503617747440273
228,289,10.44,10.45,10.48,1721900.0,10.44,10.44,10.44,10.4334431630972,10.45,10.45,10.483061889250815,10.490697674418605
229,290,10.44,10.45,10.48,1722600.0,10.44,10.44,10.44,10.4334431630972,10.45,10.45,10.467210144927536,10.483693693693693
230,292,10.44,10.45,10.45,1741700.0,10.44,10.44,10.44,10.4334431630972,10.45,10.477616279069768,10.48625,10.492763157894737
231,293,10.47,10.5,10.45,1747800.0,10.47,10.452222222222222,10.448076923076924,10.438975694444444,10.5,10.5,10.5,10.501845878136201
232,294,10.47,10.5,10.5,1756500.0,10.47,10.459746835443038,10.451555555555556,10.442146690518783,10.47,10.47,10.485211267605633,10.496267605633802
233,295,10.45,10.47,10.47,1758100.0,10.45,10.44419689119171,10.442793103448276,10.436396551724139,10.47,10.47,10.485211267605633,10.496267605633802
234,297,10.44,10.45,10.45,1774400.0,10.44,10.44,10.44,10.4334431630972,10.45,10.461052631578948,10.4751677852349,10.486545454545455
235,298,10.45,10.47,10.45,1774800.0,10.45,10.45,10.444862385321102,10.438303747534517,10.47,10.47,10.486565656565656,10.492732240437158
236,299,10.47,10.49,10.47,1783300.0,10.47,10.47,10.46,10.446536203522506,10.49,10.495625,10.497021276595744,10.50034734917733
237,0,0.0,0.0,10.49,1791800.0,,,,,,,,
