,Tick,BID,ASK,LAST,TOTAL_VOLUME,BID_VWAP_1000,BID_VWAP_10000,BID_VWAP_20000,BID_VWAP_50000,ASK_VWAP_1000,ASK_VWAP_10000,ASK_VWAP_20000,ASK_VWAP_50000
0,2,9.99,10.01,0.0,0.0,9.99,9.979238578680203,9.967805755395684,9.948132295719844,10.01,10.01,10.012968197879859,10.041390284757119
1,3,9.97,10.01,9.97,0.0,9.97,9.97,9.946611842105263,9.933466666666666,10.01,10.01,10.012968197879859,10.022292490118577
2,5,9.97,10.01,10.01,19800.0,9.97,9.97,9.951480144404332,9.939278752436648,10.01,10.01,10.012968197879859,10.022292490118577
3,6,9.94,10.01,10.01,29800.0,9.94,9.94,9.9359375,9.927013752455796,10.01,10.014590163934427,10.01671096345515,10.042390243902439
4,7,9.94,10.02,10.02,49800.0,9.94,9.934347826086956,9.934347826086956,9.921821631878558,10.02,10.02,10.034125560538117,10.058455598455598
5,8,9.94,10.02,10.02,69300.0,9.94,9.934347826086956,9.934347826086956,9.921821631878558,10.02,10.02,10.034125560538117,10.058455598455598
6,10,9.96,10.02,10.02,69300.0,9.96,9.949534883720931,9.941626297577855,9.930254901960785,10.02,10.02,10.067006369426752,10.092727272727272
7,11,9.96,10.07,10.07,78300.0,9.96,9.949534883720931,9.941626297577855,9.930254901960785,10.07,10.075550239234449,10.075550239234449,10.109656946826759
8,12,10.02,10.07,10.07,88800.0,10.02,10.02,9.99236559139785,9.958280991735537,10.07,10.075550239234449,10.075550239234449,10.109656946826759
9,13,10.02,10.08,10.08,100200.0,10.02,10.02,10.00409252669039,9.97242105263158,10.08,10.08,10.08,10.125493421052632
10,15,10.05,10.08,10.08,100200.0,10.05,10.05,10.035142857142857,10.005640569395018,10.08,10.08,10.08,10.125493421052632
11,16,10.07,10.08,10.07,100200.0,10.07,10.059658536585365,10.059658536585365,10.029523809523809,10.08,10.08,10.08,10.125493421052632
12,17,10.07,10.14,10.14,109700.0,10.07,10.059658536585365,10.059658536585365,10.029523809523809,10.14,10.14,10.143263888888889,10.152588235294118
13,18,10.1,10.14,10.14,137600.0,10.1,10.084450261780106,10.072154882154882,10.045830388692579,10.14,10.144870466321244,10.150610932475884,10.160078277886496
14,20,10.14,10.15,10.14,140500.0,10.14,10.14,10.117670250896058,10.084053097345132,10.15,10.155566037735849,10.155566037735849,10.170229445506692
15,21,10.14,10.15,10.15,140500.0,10.14,10.14,10.117670250896058,10.084053097345132,10.15,10.15,10.155198237885463,10.169665427509294
16,22,10.14,10.15,10.15,151000.0,10.14,10.14,10.134766355140187,10.11215411558669,10.15,10.15,10.155198237885463,10.169665427509294
17,24,10.14,10.16,10.16,172400.0,10.14,10.14,10.134766355140187,10.11215411558669,10.16,10.16,10.164684684684685,10.177746741154563
18,25,10.13,10.16,10.13,182300.0,10.13,10.13,10.120971223021582,10.09575652173913,10.16,10.16,10.164684684684685,10.177746741154563
19,26,10.12,10.15,10.12,191800.0,10.12,10.11487951807229,10.109573643410853,10.07891544117647,10.15,10.15,10.155064377682404,10.169448529411765
20,27,10.12,10.15,10.12,191800.0,10.12,10.11487951807229,10.109573643410853,10.07891544117647,10.15,10.15,10.155064377682404,10.1675
21,29,10.11,10.15,10.11,200100.0,10.11,10.104802259887006,10.09231884057971,10.062239858906526,10.15,10.15,10.155064377682404,10.1675
22,30,10.1,10.15,10.1,208700.0,10.1,10.084450261780106,10.072154882154882,10.045830388692579,10.15,10.15,10.155064377682404,10.165263157894737
23,31,10.07,10.08,10.1,216700.0,10.03,10.024378378378378,10.016765799256506,10.006358792184725,10.08,10.12025,10.12025,10.148637236084452
24,33,10.03,10.07,10.03,228500.0,10.02,10.02,10.007402135231317,9.99622340425532,10.07,10.07,10.102950819672131,10.128956356736243
25,34,10.02,10.05,10.02,238800.0,10.02,10.02,10.010711743772243,10.003617391304347,10.05,10.060294117647059,10.060294117647059,10.10580459770115
26,35,10.02,10.05,10.02,238800.0,10.02,10.02,10.010711743772243,10.003617391304347,10.05,10.060294117647059,10.060294117647059,10.097834179357022
27,37,10.01,10.02,10.01,250600.0,10.01,10.005254237288135,10.003444444444444,9.994068716094032,10.02,10.0365,10.048842105263159,10.075745062836624
28,38,10.0,10.02,10.0,262000.0,10.0,10.0,9.995373134328359,9.955139573070607,10.02,10.0365,10.048842105263159,10.075745062836624
29,39,10.0,10.01,10.0,273500.0,10.0,10.0,9.995373134328359,9.955139573070607,10.01,10.014969325153373,10.028206106870229,10.048065693430656
30,40,9.99,10.01,9.99,282700.0,9.99,9.975942857142858,9.963735849056604,9.945469061876247,10.01,10.014969325153373,10.017028985507247,10.037847222222222
31,42,9.99,10.0,9.99,293100.0,9.99,9.975942857142858,9.963735849056604,9.945469061876247,10.0,10.005,10.00995918367347,10.02613019891501
32,43,9.94,9.96,9.96,301500.0,9.94,9.94,9.9361,9.927312859884838,9.96,9.96,9.987132352941176,10.009433628318584
33,44,9.96,10.0,9.96,301500.0,9.96,9.949944134078212,9.94654411764706,9.941205533596838,10.0,10.005,10.00995918367347,10.02613019891501
34,45,9.96,10.01,10.01,312800.0,9.96,9.949944134078212,9.94654411764706,9.941205533596838,10.01,10.014969325153373,10.017028985507247,10.037847222222222
35,47,9.96,10.02,10.02,321300.0,9.96,9.949944134078212,9.94654411764706,9.941205533596838,10.02,10.02,10.03013651877133,10.047979274611398
36,48,10.01,10.02,10.02,321300.0,10.01,10.01,10.00519801980198,9.965296108291032,10.02,10.02,10.03013651877133,10.047979274611398
37,49,10.01,10.02,10.02,321300.0,10.01,10.01,10.00519801980198,9.968070796460177,10.02,10.02,10.03013651877133,10.047979274611398
38,50,10.01,10.02,10.02,332700.0,10.01,10.01,10.00519801980198,9.971204188481675,10.05,10.05,10.057,10.079318181818183
39,52,10.04,10.05,10.05,350100.0,10.04,10.023928571428572,10.016006825938566,9.987003484320557,10.05,10.06044776119403,10.06044776119403,10.098078231292517
40,53,10.04,10.05,10.05,350100.0,10.04,10.035229885057472,10.02573476702509,9.999257950530035,10.05,10.06044776119403,10.06044776119403,10.098078231292517
41,54,10.04,10.05,10.05,350100.0,10.04,10.035229885057472,10.02573476702509,10.00351724137931,10.05,10.06044776119403,10.06044776119403,10.098078231292517
42,55,10.05,10.07,10.07,350100.0,10.05,10.05,10.040722021660649,10.017972270363952,10.07,10.07,10.086480836236934,10.117622950819673
43,57,10.05,10.07,10.07,368900.0,10.05,10.05,10.043366013071896,10.033294701986755,10.07,10.07,10.086480836236934,10.117622950819673
44,58,10.09,10.11,10.08,368900.0,10.09,10.09,10.071100917431192,10.051805555555555,10.11,10.1148128342246,10.128211920529802,10.143664122137405
45,59,10.09,10.11,10.08,370200.0,10.09,10.09,10.080747663551401,10.05875,10.11,10.1148128342246,10.128211920529802,10.143664122137405
46,60,10.09,10.12,10.12,370200.0,10.09,10.09,10.080747663551401,10.05875,10.12,10.136829268292683,10.136829268292683,10.154828897338403
47,62,10.09,10.12,10.12,380200.0,10.09,10.09,10.085066079295155,10.067365384615385,10.12,10.136829268292683,10.136829268292683,10.154828897338403
48,63,10.09,10.12,10.12,380200.0,10.09,10.09,10.085066079295155,10.07058052434457,10.12,10.136829268292683,10.136829268292683,10.154828897338403
49,64,10.09,10.15,10.15,389900.0,10.09,10.09,10.085066079295155,10.076325757575757,10.15,10.15,10.155064377682404,10.165263157894737
50,66,10.15,10.16,10.15,400400.0,10.15,10.115151515151515,10.102451612903225,10.091798418972331,10.16,10.16,10.164684684684685,10.171748120300752
51,67,10.15,10.17,10.17,410700.0,10.15,10.115151515151515,10.102451612903225,10.093282442748091,10.17,10.17,10.17,10.17824761904762
52,68,10.16,10.17,10.17,410700.0,10.16,10.16,10.150273037542663,10.121807692307693,10.17,10.17,10.17,10.17824761904762
53,69,10.16,10.17,10.17,419800.0,10.16,10.16,10.150273037542663,10.121807692307693,10.17,10.174923076923077,10.176806451612903,10.18226843100189
54,70,10.16,10.17,10.17,419800.0,10.16,10.16,10.150273037542663,10.134790874524715,10.17,10.174923076923077,10.176806451612903,10.18226843100189
55,72,10.16,10.17,10.17,419800.0,10.16,10.16,10.150273037542663,10.144211576846308,10.17,10.174923076923077,10.176806451612903,10.18226843100189
56,73,10.16,10.17,10.17,419800.0,10.16,10.16,10.150273037542663,10.144211576846308,10.17,10.174923076923077,10.176806451612903,10.18226843100189
57,74,10.16,10.18,10.18,419800.0,10.16,10.16,10.153992673992674,10.145017182130584,10.18,10.18,10.184911504424779,10.193873873873875
58,76,10.16,10.18,10.18,440100.0,10.16,10.16,10.153992673992674,10.145017182130584,10.18,10.18,10.184911504424779,10.193873873873875
59,77,10.16,10.18,10.18,440100.0,10.16,10.16,10.153992673992674,10.145017182130584,10.18,10.18,10.184911504424779,10.193873873873875
60,78,10.16,10.18,10.18,440100.0,10.16,10.16,10.153992673992674,10.145017182130584,10.18,10.18,10.184911504424779,10.193873873873875
61,79,10.16,10.19,10.19,440100.0,10.16,10.16,10.153992673992674,10.145017182130584,10.19,10.19,10.19509090909091,10.207603773584905
62,81,10.16,10.2,10.2,469600.0,10.16,10.16,10.157046263345196,10.149638554216867,10.2,10.2,10.204932126696832,10.213546511627907
63,82,10.16,10.22,10.22,478400.0,10.16,10.16,10.157046263345196,10.149638554216867,10.22,10.22,10.22,10.231457085828342
64,83,10.16,10.22,10.22,500200.0,10.16,10.16,10.157046263345196,10.149638554216867,10.22,10.225480769230769,10.225480769230769,10.256545454545455
65,84,10.18,10.23,10.23,511000.0,10.18,10.18,10.169765258215962,10.157213403880071,10.23,10.23,10.247864077669902,10.263268101761252
66,86,10.22,10.23,10.23,521700.0,10.22,10.197513513513513,10.183605442176871,10.169689213893967,10.23,10.23,10.247864077669902,10.263268101761252
67,87,10.26,10.27,10.27,531600.0,10.26,10.242,10.219295774647888,10.18833628318584,10.27,10.27,10.27,10.287055921052632
68,88,10.26,10.27,10.27,540800.0,10.26,10.242,10.219295774647888,10.18833628318584,10.27,10.27,10.275022421524664,10.306235521235521
69,89,10.26,10.28,10.28,550000.0,10.26,10.254782608695653,10.254782608695653,10.213013972055888,10.28,10.28,10.28,10.345194174757282
70,91,10.27,10.28,10.28,559300.0,10.27,10.27,10.265123152709359,10.240762852404643,10.28,10.28,10.28,10.345194174757282
71,92,10.27,10.28,10.27,568600.0,10.27,10.27,10.265123152709359,10.240762852404643,10.28,10.313838862559242,10.313838862559242,10.359624505928855
72,93,10.32,10.34,10.28,577500.0,10.32,10.293869346733668,10.28261744966443,10.27103313840156,10.34,10.34,10.352413793103448,10.3778612716763
73,95,10.33,10.34,10.27,595800.0,10.33,10.290847457627118,10.279225352112675,10.258996415770609,10.34,10.34,10.352413793103448,10.3778612716763
74,96,10.33,10.34,10.26,606000.0,10.33,10.33,10.29535,10.26858,10.34,10.34,10.352413793103448,10.3778612716763
75,97,10.33,10.34,10.34,606000.0,10.33,10.33,10.31436018957346,10.279790476190476,10.34,10.34,10.352413793103448,10.3778612716763
76,98,10.33,10.38,10.38,623600.0,10.33,10.33,10.31436018957346,10.279790476190476,10.38,10.38,10.394208860759493,10.42404958677686
77,100,10.33,10.39,10.39,641700.0,10.33,10.33,10.31436018957346,10.279790476190476,10.39,10.40127962085308,10.40127962085308,10.4333
78,101,10.33,10.39,10.39,652500.0,10.33,10.33,10.31436018957346,10.288037735849057,10.39,10.40127962085308,10.40127962085308,10.4333
79,102,10.36,10.39,10.39,652500.0,10.36,10.36,10.345906976744185,10.316367041198502,10.39,10.40127962085308,10.40127962085308,10.4333
80,103,10.36,10.39,10.39,652500.0,10.36,10.36,10.345906976744185,10.324841121495327,10.41,10.41,10.427860465116279,10.450135135135135
81,105,10.4,10.41,10.41,660800.0,10.4,10.378591549295775,10.378591549295775,10.351832358674464,10.41,10.41,10.427860465116279,10.450135135135135
82,106,10.4,10.41,10.41,660800.0,10.4,10.38975369458128,10.38975369458128,10.36366269165247,10.41,10.41,10.427860465116279,10.450135135135135
83,107,10.39,10.4,10.4,670700.0,10.39,10.384639175257732,10.38021582733813,10.361539792387543,10.4,10.4,10.405173913043479,10.433853564547206
84,108,10.43,10.45,10.41,682200.0,10.43,10.43,10.406146788990826,10.39237721021611,10.45,10.454666666666666,10.456678200692041,10.500915619389588
85,110,10.43,10.45,10.41,688300.0,10.43,10.43,10.425507246376812,10.39237721021611,10.45,10.454666666666666,10.456678200692041,10.461615245009074
86,111,10.42,10.44,10.42,698400.0,10.42,10.398883248730964,10.390249110320285,10.366488812392427,10.44,10.44,10.444682926829268,10.456443298969072
87,112,10.38,10.4,10.42,698400.0,10.38,10.38,10.369668874172186,10.351312292358804,10.4,10.4,10.419551569506726,10.4405078125
88,113,10.38,10.42,10.44,712800.0,10.38,10.38,10.369668874172186,10.351312292358804,10.42,10.431534391534392,10.437754385964912,10.448576576576576
89,115,10.41,10.42,10.44,712800.0,10.41,10.39331550802139,10.386088560885609,10.364098073555166,10.42,10.431534391534392,10.437754385964912,10.448576576576576
90,116,10.38,10.4,10.41,721100.0,10.38,10.38,10.369668874172186,10.351312292358804,10.4,10.4,10.412727272727272,10.431026086956521
91,117,10.38,10.42,10.42,731000.0,10.38,10.38,10.369668874172186,10.351312292358804,10.42,10.42,10.427491408934708,10.44203448275862
92,119,10.38,10.42,10.42,740100.0,10.38,10.38,10.369668874172186,10.351312292358804,10.42,10.42,10.430331753554503,10.44556
93,120,10.42,10.45,10.45,750900.0,10.42,10.42,10.405505226480836,10.38140350877193,10.45,10.454666666666666,10.456678200692041,10.460195035460993
94,121,10.43,10.45,10.45,750900.0,10.43,10.43,10.425023474178404,10.396131756756757,10.45,10.454666666666666,10.456678200692041,10.458212290502793
95,122,10.42,10.45,10.42,750900.0,10.42,10.42,10.405505226480836,10.38140350877193,10.45,10.454666666666666,10.456678200692041,10.458212290502793
96,124,10.38,10.41,10.42,778600.0,10.38,10.38,10.369668874172186,10.356900684931507,10.41,10.430645161290322,10.439777777777778,10.450018281535648
97,125,10.38,10.41,10.42,778600.0,10.38,10.38,10.38,10.37017543859649,10.41,10.415544554455446,10.415544554455446,10.4425
98,126,10.38,10.41,10.38,786500.0,10.38,10.38,10.370031948881788,10.357327731092436,10.41,10.415544554455446,10.415544554455446,10.4425
99,127,10.36,10.41,10.36,826500.0,10.36,10.35060773480663,10.34322695035461,10.32735197368421,10.41,10.415544554455446,10.415544554455446,10.4425
100,129,10.34,10.41,10.34,834400.0,10.34,10.334569892473118,10.332833333333333,10.32123046875,10.41,10.415544554455446,10.415544554455446,10.436928446771379
101,130,10.33,10.41,10.33,834400.0,10.33,10.33,10.320555555555556,10.308538461538461,10.41,10.415544554455446,10.415544554455446,10.436928446771379
102,131,10.31,10.38,10.31,845600.0,10.31,10.31,10.304811320754718,10.299788053949904,10.38,10.395083798882682,10.4046735395189,10.423218806509945
103,133,10.3,10.35,10.3,863700.0,10.3,10.3,10.3,10.290135658914728,10.35,10.35,10.378315789473683,10.404347826086957
104,134,10.3,10.33,10.3,863700.0,10.3,10.3,10.3,10.290135658914728,10.33,10.341041666666667,10.351023890784983,10.377756849315068
105,135,10.3,10.33,10.3,874500.0,10.3,10.3,10.296319218241042,10.287976424361494,10.33,10.341041666666667,10.351023890784983,10.377756849315068
106,136,10.3,10.33,10.3,874500.0,10.3,10.294644549763033,10.294644549763033,10.28,10.33,10.335473684210527,10.340675675675676,10.362725694444444
107,138,10.29,10.33,10.29,904000.0,10.29,10.29,10.27529702970297,10.260617529880479,10.33,10.335473684210527,10.340675675675676,10.362725694444444
108,139,10.29,10.33,10.29,904000.0,10.29,10.29,10.27529702970297,10.260617529880479,10.33,10.335473684210527,10.337133333333334,10.3463708086785
109,140,10.26,10.29,10.26,913400.0,10.26,10.26,10.254976744186047,10.217508417508418,10.29,10.29,10.31860927152318,10.32957528957529
110,141,10.26,10.29,10.26,913400.0,10.26,10.26,10.254976744186047,10.217508417508418,10.29,10.29,10.299178743961352,10.32163708086785
111,142,10.26,10.29,10.29,923300.0,10.26,10.26,10.254976744186047,10.217508417508418,10.29,10.29,10.29,10.311037924151696
112,144,10.26,10.29,10.29,923300.0,10.26,10.26,10.254976744186047,10.225669565217391,10.29,10.29,10.29,10.3048
113,145,10.26,10.29,10.29,923300.0,10.26,10.26,10.254976744186047,10.236545768566494,10.29,10.29,10.29,10.297615384615385
114,146,10.25,10.29,10.29,933000.0,10.25,10.25,10.24358803986711,10.221979166666667,10.29,10.29,10.29,10.301891891891891
115,148,10.25,10.29,10.29,943600.0,10.25,10.25,10.246920289855073,10.236765734265735,10.29,10.29,10.29,10.301891891891891
116,149,10.25,10.29,10.25,955200.0,10.25,10.244940476190477,10.243007246376811,10.234672727272727,10.29,10.29,10.29,10.301891891891891
117,150,10.27,10.28,10.25,955200.0,10.27,10.26067415730337,10.253992395437262,10.243828996282527,10.28,10.28512315270936,10.28512315270936,10.29585798816568
118,151,10.27,10.28,10.28,955200.0,10.27,10.26067415730337,10.253992395437262,10.243828996282527,10.28,10.28512315270936,10.28512315270936,10.29585798816568
119,153,10.25,10.26,10.27,972800.0,10.25,10.244940476190477,10.243007246376811,10.234672727272727,10.26,10.26,10.269383886255925,10.285251937984496
120,154,10.24,10.26,10.24,972800.0,10.24,10.24,10.24,10.233472222222222,10.26,10.26,10.269383886255925,10.285251937984496
121,155,10.24,10.26,10.24,984000.0,10.24,10.24,10.24,10.237147887323944,10.26,10.26,10.269383886255925,10.285251937984496
122,156,10.27,10.28,10.26,984000.0,10.27,10.254730538922155,10.248945454545455,10.244323374340949,10.28,10.28512315270936,10.28512315270936,10.29585798816568
123,158,10.24,10.29,10.24,1004700.0,10.24,10.24,10.24,10.233627118644067,10.29,10.29,10.299452736318408,10.310753424657534
124,159,10.29,10.31,10.31,1010200.0,10.29,10.261122994652407,10.254468864468864,10.24414590747331,10.31,10.31,10.31,10.325041876046901
125,160,10.24,10.31,10.24,1021500.0,10.24,10.24,10.24,10.233627118644067,10.31,10.31,10.31,10.325041876046901
126,162,10.24,10.31,10.31,1049100.0,10.24,10.24,10.24,10.233627118644067,10.31,10.31,10.319142857142857,10.329931034482758
127,163,10.29,10.31,10.31,1049100.0,10.29,10.29,10.274598214285714,10.25470588235294,10.33,10.335473684210527,10.337133333333334,10.343633276740238
128,164,10.31,10.33,10.33,1059800.0,10.32,10.314814814814815,10.305738255033557,10.282015355086372,10.33,10.335473684210527,10.337133333333334,10.343633276740238
129,166,10.31,10.32,10.32,1068900.0,10.31,10.299468599033817,10.299468599033817,10.268313953488372,10.32,10.32,10.32989898989899,10.336761268781302
130,167,10.31,10.34,10.34,1079300.0,10.31,10.299468599033817,10.299468599033817,10.277193308550187,10.34,10.34,10.34,10.346529914529915
131,168,10.31,10.34,10.34,1079300.0,10.31,10.304803921568627,10.304803921568627,10.28919776119403,10.34,10.34,10.34,10.346529914529915
132,170,10.33,10.34,10.34,1090100.0,10.33,10.319462365591399,10.312397260273972,10.302848722986248,10.34,10.34,10.343509933774834,10.349982728842832
133,171,10.33,10.34,10.34,1090100.0,10.33,10.319462365591399,10.316518518518519,10.305692567567567,10.34,10.34,10.343509933774834,10.349982728842832
134,172,10.33,10.35,10.35,1098900.0,10.33,10.319462365591399,10.316518518518519,10.305692567567567,10.35,10.35,10.35340350877193,10.361588132635253
135,174,10.33,10.35,10.35,1109500.0,10.33,10.319462365591399,10.316518518518519,10.307458193979933,10.35,10.35,10.35340350877193,10.361588132635253
136,175,10.34,10.35,10.35,1119100.0,10.34,10.334971428571428,10.326007326007327,10.313929824561404,10.35,10.35,10.35340350877193,10.361588132635253
137,176,10.34,10.35,10.35,1119100.0,10.34,10.334971428571428,10.330038314176246,10.317595628415301,10.35,10.35,10.35340350877193,10.361588132635253
138,177,10.34,10.35,10.35,1119100.0,10.34,10.34,10.336752767527676,10.325046382189239,10.35,10.35,10.35340350877193,10.361588132635253
139,179,10.34,10.36,10.36,1128400.0,10.34,10.34,10.336752767527676,10.328156424581005,10.36,10.365075376884421,10.3696875,10.393094405594406
140,180,10.34,10.37,10.37,1148700.0,10.34,10.34,10.336752767527676,10.328156424581005,10.37,10.37,10.386035714285715,10.408368421052632
141,181,10.35,10.37,10.37,1148700.0,10.35,10.345297297297297,10.343487544483986,10.335456238361266,10.37,10.37,10.386035714285715,10.408368421052632
142,183,10.36,10.37,10.34,1158900.0,10.36,10.349518072289156,10.346030534351145,10.336447876447876,10.37,10.37,10.386035714285715,10.408368421052632
143,184,10.36,10.38,10.38,1168900.0,10.36,10.349518072289156,10.346030534351145,10.336447876447876,10.38,10.395083798882682,10.4046735395189,10.418783542039357
144,185,10.36,10.37,10.38,1168900.0,10.36,10.349518072289156,10.346030534351145,10.336447876447876,10.37,10.37475935828877,10.386209386281589,10.404919786096256
145,186,10.35,10.37,10.35,1168900.0,10.35,10.35,10.34569306930693,10.335902527075813,10.37,10.37475935828877,10.386209386281589,10.40331550802139
146,188,10.35,10.37,10.35,1179100.0,10.35,10.35,10.34569306930693,10.328156424581005,10.37,10.37475935828877,10.386209386281589,10.401621621621622
147,189,10.34,10.37,10.34,1190800.0,10.34,10.34,10.336752767527676,10.328156424581005,10.37,10.37475935828877,10.376436363636364,10.395543672014261
148,190,10.34,10.37,10.37,1199100.0,10.34,10.34,10.336752767527676,10.328156424581005,10.37,10.37475935828877,10.376436363636364,10.391318681318682
149,191,10.36,10.37,10.37,1199100.0,10.36,10.36,10.347247386759582,10.337532228360958,10.37,10.37475935828877,10.376436363636364,10.391318681318682
150,193,10.34,10.37,10.34,1210400.0,10.34,10.335217391304347,10.333609022556391,10.323370786516854,10.37,10.37475935828877,10.376436363636364,10.388303886925796
151,194,10.34,10.37,10.34,1218700.0,10.34,10.335217391304347,10.333609022556391,10.323370786516854,10.37,10.37475935828877,10.376436363636364,10.388303886925796
152,195,10.33,10.37,10.33,1218700.0,10.33,10.33,10.326640625,10.317802197802198,10.34,10.355,10.36280701754386,10.376655052264809
153,196,10.33,10.34,10.33,1230200.0,10.33,10.33,10.326640625,10.317802197802198,10.34,10.349791666666667,10.356620689655172,10.369947460595446
154,198,10.33,10.34,10.33,1239700.0,10.33,10.324880952380953,10.319398496240602,10.312553191489362,10.34,10.349791666666667,10.356620689655172,10.366355785837651
155,199,10.33,10.34,10.33,1239700.0,10.33,10.33,10.326826568265682,10.31812834224599,10.34,10.349791666666667,10.356620689655172,10.366355785837651
156,200,10.33,10.34,10.33,1239700.0,10.33,10.33,10.320174216027874,10.313179487179488,10.34,10.349791666666667,10.356620689655172,10.366355785837651
157,201,10.32,10.34,10.32,1249800.0,10.32,10.314673913043478,10.31320895522388,10.307843803056027,10.34,10.349791666666667,10.356620689655172,10.366355785837651
158,203,10.34,10.36,10.34,1270000.0,10.34,10.34,10.32376306620209,10.31494017094017,10.36,10.365104166666667,10.366907894736842,10.37497435897436
159,204,10.34,10.36,10.34,1270000.0,10.34,10.34,10.32376306620209,10.316661045531196,10.36,10.365104166666667,10.366907894736842,10.373102253032929
160,205,10.34,10.37,10.36,1279400.0,10.34,10.34,10.32376306620209,10.316661045531196,10.37,10.37,10.37,10.378194207836456
161,206,10.34,10.37,10.36,1279400.0,10.34,10.34,10.334746543778802,10.320505902192243,10.37,10.37,10.37,10.378194207836456
162,208,10.36,10.37,10.36,1279400.0,10.36,10.36,10.350048309178744,10.3384765625,10.37,10.37,10.37,10.378194207836456
163,209,10.36,10.37,10.36,1279400.0,10.36,10.36,10.350048309178744,10.3384765625,10.37,10.37,10.37,10.378194207836456
164,210,10.36,10.37,10.37,1279400.0,10.36,10.36,10.350034602076125,10.343464566929134,10.37,10.37,10.374427860696517,10.383174061433447
165,212,10.36,10.37,10.37,1289000.0,10.37,10.364468085106383,10.360074074074074,10.34722972972973,10.38,10.38,10.38,10.390070921985815
166,213,10.37,10.38,10.38,1303300.0,10.37,10.364468085106383,10.360074074074074,10.34722972972973,10.38,10.3852,10.3852,10.401749571183533
167,214,10.37,10.39,10.39,1324000.0,10.37,10.37,10.366190476190477,10.354156305506217,10.39,10.39,10.394825870646766,10.40804920913884
168,215,10.37,10.4,10.4,1324000.0,10.37,10.37,10.366190476190477,10.354156305506217,10.4,10.404812834224598,10.406420664206642,10.41336936936937
169,217,10.37,10.41,10.41,1341100.0,10.37,10.37,10.366190476190477,10.354156305506217,10.42,10.42,10.42,10.428360071301247
170,218,10.37,10.42,10.42,1351400.0,10.37,10.37,10.366190476190477,10.356010638297873,10.42,10.42,10.423435114503818,10.434122965641953
171,219,10.37,10.42,10.42,1362500.0,10.37,10.37,10.366190476190477,10.356010638297873,10.43,10.43,10.436931407942238,10.44705574912892
172,220,10.37,10.43,10.43,1400800.0,10.37,10.37,10.366190476190477,10.356010638297873,10.45,10.45,10.45,10.456434937611409
173,222,10.4,10.45,10.45,1400800.0,10.4,10.4,10.4,10.376977547495683,10.45,10.45,10.45,10.456434937611409
174,223,10.4,10.45,10.45,1400800.0,10.4,10.4,10.4,10.376977547495683,10.45,10.45,10.45,10.456434937611409
175,224,10.4,10.46,10.46,1409100.0,10.4,10.4,10.4,10.376977547495683,10.46,10.46,10.46,10.46
176,226,10.4,10.46,10.46,1437400.0,10.4,10.4,10.4,10.376977547495683,10.46,10.46,10.46,10.462003745318352
177,227,10.44,10.46,10.46,1437400.0,10.44,10.44,10.425490196078432,10.410497017892643,10.46,10.46,10.46,10.467310469314079
178,228,10.44,10.45,10.45,1448600.0,10.44,10.44,10.425490196078432,10.410497017892643,10.45,10.45,10.456049822064056,10.461333333333334
179,230,10.44,10.45,10.45,1458500.0,10.44,10.44,10.425490196078432,10.410497017892643,10.45,10.45,10.456049822064056,10.461333333333334
180,231,10.44,10.45,10.45,1458500.0,10.44,10.44,10.425490196078432,10.410497017892643,10.45,10.45,10.46,10.465230202578269
181,232,10.44,10.46,10.46,1478100.0,10.44,10.44,10.425490196078432,10.410497017892643,10.46,10.465459183673469,10.466751824817518,10.477852112676056
182,233,10.44,10.47,10.47,1487700.0,10.44,10.44,10.425490196078432,10.410497017892643,10.47,10.47,10.47,10.494307432432432
183,235,10.44,10.47,10.47,1507700.0,10.44,10.44,10.436521739130434,10.420879541108986,10.47,10.47,10.47383275261324,10.511088082901555
184,236,10.47,10.48,10.47,1516300.0,10.47,10.453240223463688,10.448649635036496,10.42732558139535,10.48,10.48,10.51672077922078,10.553924268502582
185,237,10.47,10.48,10.48,1521100.0,10.47,10.453240223463688,10.448649635036496,10.433079584775086,10.48,10.48,10.51672077922078,10.553924268502582
186,239,10.46,10.47,10.47,1543200.0,10.46,10.449361702127659,10.446219081272085,10.432146507666099,10.47,10.47,10.5143,10.553176265270507
187,240,10.46,10.55,10.55,1554100.0,10.46,10.449361702127659,10.446219081272085,10.432146507666099,10.55,10.55,10.559082125603865,10.598116438356165
188,241,10.46,10.52,10.55,1554100.0,10.46,10.449361702127659,10.446219081272085,10.432146507666099,10.52,10.52,10.535767441860465,10.5598
189,242,10.44,10.5,10.44,1554100.0,10.44,10.44,10.436521739130434,10.42220588235294,10.5,10.5,10.509807692307692,10.5493399339934
190,244,10.44,10.5,10.44,1563400.0,10.44,10.44,10.436521739130434,10.42220588235294,10.5,10.5,10.509807692307692,10.5493399339934
191,245,10.44,10.5,10.44,1563400.0,10.44,10.44,10.436521739130434,10.43166,10.5,10.5,10.509807692307692,10.5493399339934
192,246,10.46,10.5,10.44,1563400.0,10.46,10.46,10.450049751243782,10.436422628951748,10.5,10.5,10.509807692307692,10.5493399339934
193,248,10.46,10.5,10.5,1573200.0,10.46,10.46,10.450049751243782,10.436422628951748,10.5,10.5,10.509807692307692,10.535578747628083
194,249,10.51,10.52,10.5,1573200.0,10.51,10.481629213483146,10.466654676258992,10.449681978798587,10.52,10.52,10.527491638795986,10.540415019762845
195,250,10.51,10.52,10.52,1583200.0,10.51,10.481629213483146,10.466654676258992,10.449681978798587,10.52,10.52,10.523345195729537,10.53298418972332
196,251,10.48,10.5,10.51,1590100.0,10.48,10.469368421052632,10.459241379310345,10.446314878892734,10.5,10.5,10.509532710280373,10.521861386138614
197,252,10.46,10.48,10.48,1590100.0,10.46,10.46,10.450049751243782,10.436422628951748,10.48,10.48,10.490098039215686,10.506013628620103
198,254,10.46,10.48,10.46,1609000.0,10.46,10.46,10.450049751243782,10.436422628951748,10.48,10.48,10.490098039215686,10.499940476190476
199,255,10.44,10.48,10.44,1618300.0,10.44,10.44,10.436521739130434,10.43166,10.48,10.48,10.490098039215686,10.499940476190476
200,256,10.44,10.45,10.44,1618300.0,10.44,10.434773869346733,10.43329861111111,10.425474308300394,10.45,10.45,10.465280373831776,10.485562130177515
201,257,10.43,10.44,10.43,1628100.0,10.43,10.424427860696518,10.424427860696518,10.411242937853107,10.44,10.445526315789474,10.45809364548495,10.47902027027027
202,259,10.42,10.44,10.42,1648000.0,10.42,10.42,10.4151376146789,10.405989110707804,10.42,10.42,10.4285,10.4630441898527
203,260,10.41,10.42,10.41,1667000.0,10.41,10.41,10.404884792626728,10.397208413001913,10.42,10.42,10.4285,10.4630441898527
204,261,10.41,10.42,10.41,1667000.0,10.41,10.41,10.404884792626728,10.397208413001913,10.42,10.42,10.4285,10.4630441898527
205,262,10.4,10.42,10.4,1667000.0,10.4,10.4,10.4,10.389900398406375,10.42,10.42,10.4285,10.44595785440613
206,264,10.4,10.42,10.4,1677600.0,10.4,10.4,10.4,10.389900398406375,10.42,10.42,10.4285,10.446500829187396
207,265,10.4,10.44,10.44,1685000.0,10.4,10.4,10.4,10.391411764705882,10.44,10.44,10.443523489932886,10.4582722513089
208,266,10.4,10.41,10.44,1685000.0,10.4,10.4,10.4,10.391411764705882,10.41,10.42401098901099,10.42996551724138,10.443884156729132
209,267,10.4,10.44,10.44,1685000.0,10.4,10.4,10.4,10.392734225621416,10.44,10.44,10.443523489932886,10.45594323873122
210,269,10.4,10.44,10.4,1716100.0,10.4,10.4,10.390792079207921,10.379248658318426,10.44,10.44,10.443523489932886,10.45594323873122
211,270,10.4,10.44,10.4,1716100.0,10.4,10.4,10.390792079207921,10.379248658318426,10.44,10.44,10.443523489932886,10.450490693739425
212,271,10.4,10.41,10.4,1716100.0,10.4,10.4,10.390792079207921,10.379248658318426,10.41,10.41,10.425512367491166,10.436117850953206
213,272,10.38,10.41,10.38,1734800.0,10.38,10.3753591160221,10.373646616541354,10.368092691622103,10.41,10.41,10.425512367491166,10.436117850953206
214,274,10.38,10.41,10.38,1734800.0,10.38,10.3753591160221,10.373646616541354,10.369874100719425,10.41,10.41,10.41,10.429618573797677
215,275,10.37,10.38,10.38,1739000.0,10.37,10.37,10.37,10.366350626118068,10.38,10.395665024630542,10.395665024630542,10.417932773109243
216,276,10.37,10.38,10.37,1739000.0,10.37,10.37,10.37,10.363393177737882,10.38,10.395665024630542,10.39085324232082,10.407885615251299
217,278,10.37,10.38,10.37,1759800.0,10.37,10.37,10.366413793103447,10.359965397923876,10.38,10.38,10.39085324232082,10.407885615251299
218,279,10.37,10.38,10.38,1781100.0,10.37,10.364773869346733,10.363177257525084,10.354932203389831,10.38,10.396224489795918,10.401089108910892,10.418384353741496
219,280,10.36,10.38,10.36,1781100.0,10.36,10.36,10.36,10.349933333333333,10.38,10.396224489795918,10.401089108910892,10.416219512195122
220,281,10.36,10.38,10.36,1802300.0,10.36,10.36,10.353472222222223,10.346413223140496,10.38,10.385287958115184,10.394107744107744,10.408305084745763
221,283,10.36,10.38,10.36,1802300.0,10.36,10.36,10.353472222222223,10.346413223140496,10.38,10.38,10.38,10.39241610738255
222,284,10.35,10.36,10.35,1811000.0,10.35,10.35,10.345071770334929,10.339851024208565,10.36,10.369944751381215,10.373381818181818,10.384086206896551
223,285,10.34,10.36,10.34,1821800.0,10.34,10.34,10.34,10.336167315175098,10.36,10.364615384615385,10.36996138996139,10.377119565217392
224,287,10.34,10.36,10.34,1831000.0,10.34,10.34,10.34,10.332218370883883,10.36,10.364615384615385,10.36996138996139,10.377119565217392
225,288,10.33,10.36,10.33,1853100.0,10.33,10.33,10.33,10.323284403669724,10.36,10.364615384615385,10.36996138996139,10.377119565217392
226,289,10.33,10.36,10.33,1861700.0,10.33,10.33,10.33,10.323284403669724,10.36,10.36,10.353411764705882,10.365377176015475
227,290,10.33,10.34,10.33,1861700.0,10.33,10.33,10.33,10.323284403669724,10.34,10.34,10.346920152091254,10.358317025440313
228,292,10.33,10.34,10.33,1871500.0,10.33,10.324819277108434,10.3232,10.31611111111111,10.34,10.34,10.34,10.351162790697675
229,293,10.33,10.34,10.33,1871500.0,10.33,10.324819277108434,10.3232,10.318049713193117,10.34,10.34,10.34,10.351162790697675
230,294,10.32,10.34,10.32,1882300.0,10.32,10.32,10.316410256410256,10.313022452504319,10.34,10.34,10.346642335766424,10.357931034482759
231,295,10.32,10.34,10.32,1902200.0,10.32,10.314814814814815,10.313333333333333,10.31150912106136,10.34,10.349784946236559,10.352857142857143,10.364848484848485
232,297,10.31,10.32,10.32,1918500.0,10.31,10.31,10.31,10.31,10.32,10.32,10.339103448275862,10.353531598513012
233,298,10.31,10.32,10.31,1918500.0,10.31,10.31,10.31,10.31,10.32,10.32,10.339103448275862,10.353531598513012
234,299,10.31,10.34,10.34,1936400.0,10.31,10.31,10.31,10.31,10.34,10.349784946236559,10.352857142857143,10.364848484848485
235,0,0.0,0.0,10.34,1936400.0,,,,,,,,
