,Tick,BID,ASK,LAST,TOTAL_VOLUME,BID_VWAP_1000,BID_VWAP_10000,BID_VWAP_20000,BID_VWAP_50000,ASK_VWAP_1000,ASK_VWAP_10000,ASK_VWAP_20000,ASK_VWAP_50000
0,2,15.02,15.03,14.96,20200.0,14.96,14.928252427184466,14.890738916256158,14.854616695059626,15.2,15.205082872928177,15.24972972972973,15.386666666666667
1,9,14.88,15.2,14.88,84100.0,15.12,15.12,15.03277397260274,14.941313131313132,15.2,15.205082872928177,15.24972972972973,15.324249547920434
2,16,15.09,15.11,14.88,124800.0,14.9,14.9,14.87044585987261,14.849983164983165,14.96,14.96,15.038318584070796,15.096520076481836
3,21,14.86,14.96,14.86,124800.0,14.86,14.854285714285714,14.854285714285714,14.833481228668942,14.96,14.96,15.027040358744395,15.078378870673953
4,23,14.86,14.88,14.86,136500.0,14.86,14.854285714285714,14.854285714285714,14.833481228668942,14.86,14.86,14.86956937799043,14.95244741873805
5,24,14.85,14.86,14.85,144300.0,14.82,14.814475138121548,14.812852112676056,14.80024347826087,14.86,14.86,14.86956937799043,14.95244741873805
6,26,14.81,14.86,14.81,174400.0,14.81,14.81,14.81,14.799317803660566,14.86,14.86,14.86956937799043,14.95244741873805
7,27,14.81,14.86,14.81,174400.0,14.81,14.81,14.81,14.799317803660566,14.86,14.86,14.86956937799043,14.9084
8,29,14.81,14.86,14.81,182800.0,14.81,14.81,14.81,14.799317803660566,14.88,14.88,14.885391705069125,14.926035856573705
9,30,14.81,14.89,14.89,205700.0,14.81,14.81,14.81,14.804808652246257,14.89,14.89,14.915418719211823,14.971411992263056
10,32,14.81,14.84,14.81,215000.0,14.81,14.81,14.81,14.80377245508982,14.84,14.86910447761194,14.86910447761194,14.953044925124791
11,33,14.81,14.89,14.81,232900.0,14.81,14.81,14.806805555555556,14.793031496062993,14.89,14.89,14.915418719211823,14.971411992263056
12,34,14.9,14.95,14.89,234800.0,14.9,14.855745856353591,14.83875,14.809433333333333,14.95,14.955567010309279,14.95698245614035,15.021370656370657
13,36,14.9,14.95,14.89,234800.0,14.9,14.9,14.9,14.838900169204738,14.95,14.955567010309279,14.95698245614035,15.021370656370657
14,37,14.9,14.95,14.89,234800.0,14.9,14.9,14.9,14.838900169204738,14.95,14.9554,14.9554,14.99361328125
15,38,14.9,14.95,14.95,243900.0,14.9,14.9,14.841973684210526,14.820837438423645,14.95,14.9554,14.9554,14.99361328125
16,40,14.9,14.99,14.99,285500.0,14.9,14.9,14.841973684210526,14.820837438423645,14.99,14.99,15.042036199095023,15.084625228519196
17,41,14.81,14.99,14.81,297100.0,14.81,14.81,14.81,14.80377245508982,15.09,15.09,15.100128755364807,15.11131086142322
18,42,14.81,14.93,14.81,305900.0,14.81,14.81,14.81,14.793486590038315,14.93,15.023401015228426,15.05584126984127,15.079560229445507
19,44,14.91,14.93,14.81,315000.0,14.91,14.91,14.859528301886792,14.824274661508705,14.98,15.040526315789474,15.040526315789474,15.084990654205608
20,45,14.91,14.98,14.98,326100.0,14.91,14.91,14.859528301886792,14.824274661508705,15.09,15.09,15.100128755364807,15.11131086142322
21,46,14.91,15.11,15.11,345200.0,14.91,14.91,14.859528301886792,14.824274661508705,15.11,15.11,15.11,15.131673228346457
22,47,14.91,15.11,15.11,353500.0,14.91,14.91,14.859528301886792,14.885333333333334,15.11,15.11548076923077,15.11548076923077,15.161236933797909
23,49,14.91,15.11,14.91,376400.0,14.91,14.91,14.91,14.850268714011516,15.11,15.11548076923077,15.11548076923077,15.161236933797909
24,50,14.91,14.94,14.91,376400.0,14.91,14.91,14.91,14.850268714011516,14.94,15.028777777777778,15.055650557620817,15.103610619469027
25,51,14.91,14.94,14.91,376400.0,14.91,14.91,14.91,14.850268714011516,14.94,14.962885572139303,14.962885572139303,15.065042301184434
26,53,14.91,14.94,14.91,376400.0,14.91,14.91,14.91,14.854061895551258,14.94,14.962885572139303,14.962885572139303,15.065042301184434
27,54,14.91,14.94,14.94,384800.0,14.91,14.91,14.91,14.868053949903661,14.94,14.962885572139303,14.962885572139303,15.065042301184434
28,55,14.91,14.98,14.98,384800.0,14.91,14.91,14.91,14.888122529644269,15.11,15.11,15.113838383838385,15.14539404553415
29,57,14.91,15.11,14.91,407800.0,14.91,14.91,14.91,14.888122529644269,15.11,15.11,15.113838383838385,15.14539404553415
30,58,14.91,15.09,14.91,407800.0,14.91,14.91,14.91,14.867145669291338,15.09,15.09,15.099038461538461,15.111428571428572
31,59,14.91,15.09,14.91,416400.0,14.91,14.894170854271357,14.871428571428572,14.838370118845502,14.99,15.047,15.047,15.093728813559322
32,60,14.91,14.99,14.99,433900.0,14.91,14.894170854271357,14.871428571428572,14.838370118845502,14.99,15.00156862745098,15.00156862745098,15.06129740518962
33,62,14.88,14.91,14.91,439800.0,14.88,14.88,14.841799307958478,14.82399323181049,14.91,14.947189189189189,14.971650165016502,15.023502935420744
34,63,14.82,14.91,14.82,439800.0,14.82,14.82,14.816323024054983,14.807852348993288,14.91,14.947189189189189,14.971650165016502,15.023502935420744
35,64,14.82,14.91,14.82,451000.0,14.82,14.82,14.816323024054983,14.807852348993288,14.91,14.947189189189189,14.971650165016502,15.023502935420744
36,66,14.82,14.9,14.82,451000.0,14.82,14.82,14.816323024054983,14.807852348993288,14.9,14.905265957446808,14.931861313868612,14.97275929549902
37,67,14.82,14.91,14.91,462900.0,14.82,14.814729064039408,14.814729064039408,14.805748031496062,14.91,14.947189189189189,14.971650165016502,15.009776119402986
38,68,14.82,14.91,14.91,472000.0,14.82,14.814729064039408,14.814729064039408,14.805748031496062,14.84,14.84,14.87465,14.955246548323471
39,70,14.81,14.84,14.81,484100.0,14.81,14.81,14.79977049180328,14.78750980392157,14.84,14.84,14.87465,14.955246548323471
40,71,14.81,14.91,14.91,484100.0,14.81,14.81,14.79977049180328,14.791640926640927,14.91,14.947189189189189,14.971650165016502,14.994361904761904
41,72,14.81,15.02,15.02,495000.0,14.81,14.81,14.79977049180328,14.791640926640927,15.02,15.02,15.025360360360361,15.069402697495184
42,74,14.81,15.02,15.02,517600.0,14.81,14.81,14.79977049180328,14.791640926640927,15.02,15.02,15.025360360360361,15.069402697495184
43,75,14.92,15.02,15.02,517600.0,14.92,14.860368421052632,14.840673758865249,14.810099173553718,15.02,15.02,15.025360360360361,15.055103578154426
44,76,15.01,15.02,15.02,517600.0,15.01,15.01,14.948542372881356,14.872916666666667,15.02,15.02,15.025360360360361,15.055103578154426
45,77,14.92,14.93,15.01,517600.0,14.92,14.91457894736842,14.877815699658703,14.833559322033897,14.93,14.93,14.972916666666666,15.015675182481752
46,79,14.91,14.93,14.91,538800.0,14.91,14.91,14.86,14.818608349900597,14.93,14.93,14.972916666666666,15.014050632911392
47,80,14.91,15.02,14.91,539600.0,14.91,14.91,14.86,14.818608349900597,15.02,15.02,15.025360360360361,15.042608695652174
48,81,14.81,14.99,14.81,550700.0,14.81,14.81,14.79977049180328,14.791640926640927,14.99,14.99,15.004575471698113,15.026575591985429
49,83,14.96,15.02,15.02,571600.0,14.96,14.96,14.887464788732395,14.83064705882353,15.02,15.02,15.025360360360361,15.042608695652174
50,84,14.81,14.9,14.96,581100.0,14.81,14.81,14.79977049180328,14.791640926640927,14.9,14.96211055276382,14.987515723270441,15.01134328358209
51,85,14.81,14.99,14.99,582600.0,14.81,14.81,14.79977049180328,14.791640926640927,14.99,14.99,15.003918918918918,15.025921288014311
52,87,14.93,14.99,14.99,593600.0,14.93,14.8682,14.8682,14.813463414634146,14.99,14.99,15.003918918918918,15.025921288014311
53,88,14.93,15.03,15.03,593600.0,14.93,14.925449438202246,14.883131672597864,14.835224913494809,15.03,15.03,15.03,15.056341030195382
54,89,14.92,15.03,15.03,615100.0,14.92,14.858423913043477,14.83894927536232,14.808998330550919,15.03,15.03,15.03,15.056341030195382
55,90,15.02,15.03,15.03,625500.0,15.02,15.02,14.9825,14.887230769230769,15.03,15.03,15.03,15.056341030195382
56,92,15.02,15.03,15.03,634300.0,15.02,15.02,15.015721153846155,14.925567375886525,15.03,15.03,15.046100917431193,15.071542750929368
57,93,15.02,15.03,15.03,634300.0,15.02,15.02,15.015721153846155,14.925567375886525,15.03,15.03,15.046100917431193,15.062822429906541
58,94,15.01,15.03,15.01,646100.0,15.01,15.000532544378698,14.97444,14.878450450450451,15.03,15.03,15.046100917431193,15.062822429906541
59,96,15.01,15.06,15.06,663000.0,15.01,15.000532544378698,14.97444,14.878450450450451,15.06,15.06,15.06,15.0775
60,97,14.8,15.06,14.8,672100.0,14.8,14.794554455445544,14.794554455445544,14.785868263473054,15.06,15.06,15.06,15.0775
61,98,14.8,15.06,15.06,694200.0,14.8,14.794554455445544,14.794554455445544,14.785868263473054,15.06,15.065517241379311,15.065517241379311,15.08738
62,100,14.9,14.94,15.06,694200.0,14.9,14.84712643678161,14.825,14.801921097770155,14.94,14.998395721925133,15.025217391304349,15.055502958579881
63,101,14.9,15.07,15.07,713500.0,14.9,14.84712643678161,14.825,14.801921097770155,15.07,15.07,15.080088495575222,15.096640316205534
64,102,14.9,15.07,15.07,713500.0,14.9,14.9,14.866666666666667,14.821769616026712,15.07,15.07,15.080088495575222,15.096640316205534
65,103,15.04,15.07,14.9,722800.0,15.04,15.04,14.972322274881517,14.865669291338582,15.07,15.07,15.080088495575222,15.096640316205534
66,105,15.04,15.07,15.04,733500.0,15.04,15.04,14.972322274881517,14.865669291338582,15.07,15.07,15.080088495575222,15.096640316205534
67,106,15.04,15.06,15.04,733500.0,15.04,15.04,14.972322274881517,14.865669291338582,15.06,15.065384615384616,15.065384615384616,15.08710891089109
68,107,14.9,14.99,15.04,744200.0,14.9,14.9,14.829934210526316,14.80936170212766,14.99,14.99,15.031869158878505,15.072818003913895
69,109,14.97,14.99,15.04,744400.0,14.97,14.97,14.934827586206897,14.851890971039182,14.99,14.99,15.031869158878505,15.072818003913895
70,110,14.97,15.09,15.09,761300.0,14.97,14.97,14.934827586206897,14.851890971039182,15.09,15.09,15.099038461538461,15.105458167330678
71,111,14.97,15.11,15.11,761300.0,14.97,14.97,14.934827586206897,14.851890971039182,15.11,15.11,15.11,15.114178217821783
72,112,14.97,15.11,15.11,781400.0,14.97,14.97,14.934827586206897,14.851890971039182,15.06,15.06,15.085592417061612,15.107708737864078
73,114,14.97,15.06,15.11,791100.0,14.97,14.97,14.934827586206897,14.851890971039182,15.06,15.06,15.085592417061612,15.107708737864078
74,115,14.9,15.06,14.9,812700.0,14.9,14.9,14.85797153024911,14.818096026490066,15.06,15.06,15.085592417061612,15.107708737864078
75,116,14.94,15.06,14.9,812700.0,14.94,14.94,14.920478468899521,14.882729083665339,15.06,15.06,15.085592417061612,15.107708737864078
76,118,15.02,15.11,15.11,820700.0,15.02,14.975876288659794,14.94972972972973,14.903005093378608,15.11,15.11,15.115135135135136,15.133912175648703
77,119,14.94,15.01,15.02,829400.0,14.94,14.94,14.920478468899521,14.882729083665339,15.01,15.01,15.061428571428571,15.097879377431907
78,120,14.94,15.12,15.12,837400.0,14.94,14.94,14.920478468899521,14.882729083665339,15.12,15.124894736842105,15.148853046594983,15.177108655616943
79,122,14.94,15.03,14.94,855900.0,14.94,14.94,14.920478468899521,14.882729083665339,15.03,15.0785,15.096043956043957,15.148576779026218
80,123,14.94,15.03,14.94,855900.0,14.94,14.94,14.920478468899521,14.882729083665339,15.03,15.034907975460122,15.066653846153846,15.117518796992481
81,124,14.94,15.03,14.94,855900.0,14.94,14.94,14.920478468899521,14.882729083665339,15.03,15.034907975460122,15.066653846153846,15.117518796992481
82,125,14.94,15.03,14.94,855900.0,14.94,14.94,14.920478468899521,14.882729083665339,15.03,15.034907975460122,15.039959183673469,15.077528957528958
83,127,14.89,15.03,14.89,876300.0,14.89,14.89,14.881343283582089,14.81784090909091,15.03,15.034907975460122,14.953152709359605,15.02948623853211
84,128,14.87,14.88,14.89,876300.0,14.87,14.834022346368714,14.81726643598616,14.801454183266932,14.88,14.891374407582939,14.891374407582939,14.970982142857142
85,129,14.87,14.88,14.89,876500.0,14.87,14.834022346368714,14.81726643598616,14.801454183266932,14.88,14.891374407582939,14.891374407582939,14.959343971631206
86,131,14.79,14.88,14.79,895100.0,14.79,14.79,14.785365853658536,14.777880539499037,14.88,14.891374407582939,14.891374407582939,14.959343971631206
87,132,14.78,14.88,14.78,905000.0,14.78,14.78,14.78,14.765575048732943,14.88,14.891374407582939,14.891374407582939,14.959343971631206
88,133,14.78,14.88,14.78,916700.0,14.78,14.78,14.78,14.750563106796116,14.88,14.891374407582939,14.891374407582939,14.959343971631206
89,134,14.76,14.88,14.76,916700.0,14.76,14.76,14.745420560747663,14.717485265225934,14.88,14.891374407582939,14.891374407582939,14.959343971631206
90,136,14.79,14.88,14.76,937600.0,14.79,14.79,14.775067873303167,14.736635687732342,14.88,14.891374407582939,14.891374407582939,14.959343971631206
91,137,14.82,14.88,14.88,937600.0,14.82,14.82,14.805584415584416,14.762933579335794,14.88,14.891374407582939,14.891374407582939,14.959343971631206
92,138,14.82,14.84,14.88,946000.0,14.82,14.82,14.805584415584416,14.762933579335794,14.84,14.845197740112994,14.857014925373134,14.903079584775087
93,140,14.82,14.84,14.82,954900.0,14.82,14.82,14.805584415584416,14.762933579335794,14.84,14.845197740112994,14.850839160839161,14.885690515806989
94,141,14.79,14.84,14.79,965000.0,14.79,14.79,14.775067873303167,14.736635687732342,14.84,14.845197740112994,14.850839160839161,14.885690515806989
95,142,14.79,14.82,14.82,965000.0,14.79,14.79,14.775067873303167,14.736635687732342,14.85,14.855422885572139,14.855422885572139,14.893217054263566
96,144,14.79,14.81,14.85,986400.0,14.79,14.79,14.775067873303167,14.736635687732342,14.81,14.81,14.827196261682243,14.859250936329587
97,145,14.79,14.81,14.85,986400.0,14.79,14.79,14.775067873303167,14.736635687732342,14.81,14.81,14.827196261682243,14.859250936329587
98,146,14.79,14.81,14.81,997200.0,14.79,14.79,14.775067873303167,14.736635687732342,14.86,14.86,14.8691,14.902087286527514
99,148,14.79,14.86,14.86,1007300.0,14.79,14.79,14.775067873303167,14.736635687732342,14.86,14.86,14.8691,14.902087286527514
100,149,14.79,14.82,14.9,1018000.0,14.79,14.79,14.775067873303167,14.736635687732342,14.82,14.82,14.861921397379913,14.908773946360153
101,150,14.79,14.82,14.9,1018000.0,14.79,14.79,14.780090909090909,14.751970802919708,14.82,14.82,14.861921397379913,14.908773946360153
102,152,14.77,14.82,14.77,1026700.0,14.77,14.77,14.764977168949772,14.734625468164793,14.82,14.82,14.864182389937106,14.892171428571428
103,153,14.76,14.82,14.76,1037700.0,14.76,14.76,14.745420560747663,14.720073937153419,14.82,14.82,14.840960698689956,14.87007393715342
104,154,14.76,14.79,14.76,1037700.0,14.76,14.76,14.745420560747663,14.720073937153419,14.79,14.79,14.805209302325581,14.83554528650647
105,155,14.73,14.79,14.79,1037700.0,14.73,14.73,14.71954128440367,14.708068181818183,14.79,14.79,14.805209302325581,14.83554528650647
106,157,14.73,14.79,14.79,1050200.0,14.73,14.73,14.71954128440367,14.708068181818183,14.79,14.79,14.805209302325581,14.827213114754098
107,158,14.73,14.79,14.73,1050200.0,14.73,14.73,14.71954128440367,14.708068181818183,14.79,14.79,14.805209302325581,14.827213114754098
108,159,14.73,14.78,14.73,1059100.0,14.73,14.73,14.71954128440367,14.708068181818183,14.78,14.78,14.784669603524229,14.809672727272726
109,161,14.73,14.78,14.73,1059100.0,14.73,14.73,14.71954128440367,14.708068181818183,14.78,14.78,14.784669603524229,14.809672727272726
110,162,14.73,14.78,14.78,1069000.0,14.73,14.73,14.71954128440367,14.708068181818183,14.78,14.78,14.784669603524229,14.809672727272726
111,163,14.73,14.79,14.79,1069000.0,14.73,14.73,14.71954128440367,14.708068181818183,14.79,14.79,14.805209302325581,14.827213114754098
112,164,14.71,14.72,14.73,1079500.0,14.71,14.71,14.705402843601895,14.700632411067193,14.72,14.757664974619289,14.779869281045752,14.800884615384616
113,166,14.71,14.82,14.82,1091300.0,14.71,14.71,14.705402843601895,14.700632411067193,14.82,14.82,14.82,14.841174377224199
114,167,14.75,14.82,14.82,1091300.0,14.75,14.75,14.73008733624454,14.71278293135436,14.82,14.830934579439253,14.830934579439253,14.850166051660517
115,168,14.75,14.84,14.84,1111400.0,14.75,14.75,14.73008733624454,14.71278293135436,14.84,14.84,14.850126582278481,14.862992700729928
116,170,14.75,14.84,14.84,1120200.0,14.75,14.75,14.73008733624454,14.71278293135436,14.84,14.84,14.850126582278481,14.862992700729928
117,171,14.75,14.84,14.84,1120200.0,14.75,14.75,14.75,14.72279069767442,14.84,14.84,14.850126582278481,14.862992700729928
118,172,14.75,14.84,14.84,1120200.0,14.75,14.75,14.75,14.72279069767442,14.84,14.84,14.850126582278481,14.862992700729928
119,174,14.71,14.84,14.71,1138600.0,14.71,14.71,14.705402843601895,14.700632411067193,14.84,14.84,14.850126582278481,14.862992700729928
120,175,14.7,14.84,14.7,1150200.0,14.7,14.7,14.7,14.695236486486486,14.84,14.84,14.850126582278481,14.862992700729928
121,176,14.7,14.84,14.7,1161400.0,14.7,14.7,14.7,14.690016638935107,14.84,14.84,14.850126582278481,14.862992700729928
122,177,14.7,14.84,14.7,1161400.0,14.7,14.7,14.7,14.690016638935107,14.76,14.76,14.803133640552995,14.838990825688073
123,179,14.7,14.75,14.7,1161400.0,14.7,14.7,14.7,14.690016638935107,14.75,14.75,14.754878048780487,14.817415329768272
124,180,14.7,14.75,14.7,1161400.0,14.7,14.7,14.7,14.690016638935107,14.75,14.75,14.754878048780487,14.817415329768272
125,181,14.7,14.75,14.7,1169800.0,14.69,14.69,14.69,14.681190476190476,14.75,14.75,14.754878048780487,14.808148854961832
126,183,14.69,14.75,14.75,1187500.0,14.69,14.69,14.69,14.681190476190476,14.75,14.75,14.754878048780487,14.808148854961832
127,184,14.69,14.75,14.69,1199000.0,14.69,14.69,14.68045045045045,14.669893617021277,14.75,14.75,14.754878048780487,14.808148854961832
128,185,14.67,14.76,14.67,1217800.0,14.67,14.67,14.67,14.661604938271605,14.76,14.76,14.807759197324415,14.830966542750929
129,187,14.67,14.76,14.67,1238000.0,14.76,14.707272727272727,14.694196721311476,14.674825046040516,14.82,14.831758793969849,14.842382445141066,14.85102466793169
130,188,14.67,14.68,14.76,1246200.0,14.67,14.67,14.67,14.657676419965577,14.82,14.831758793969849,14.842382445141066,14.85102466793169
131,189,14.67,14.82,14.67,1267300.0,14.67,14.67,14.659469026548672,14.651567291311755,14.82,14.831758793969849,14.842382445141066,14.85102466793169
132,191,14.65,14.82,14.65,1279000.0,14.65,14.65,14.65,14.644131534569983,14.67,14.738715083798883,14.771337792642141,14.806175373134328
133,192,14.65,14.82,14.82,1279000.0,14.65,14.65,14.65,14.644131534569983,14.82,14.82,14.82,14.841326164874552
134,193,14.65,14.82,14.82,1299600.0,14.65,14.65,14.65,14.644131534569983,14.82,14.82,14.829873417721519,14.848938053097346
135,194,14.78,14.82,14.82,1299600.0,14.78,14.78,14.771666666666667,14.694163701067616,14.82,14.82,14.829873417721519,14.848938053097346
136,196,14.78,14.82,14.78,1309200.0,14.78,14.78,14.771666666666667,14.70275,14.82,14.82,14.829873417721519,14.848938053097346
137,197,14.78,14.82,14.78,1309200.0,14.78,14.78,14.771666666666667,14.733698630136987,14.82,14.82,14.829873417721519,14.848938053097346
138,198,14.78,14.82,14.78,1309200.0,14.78,14.78,14.771666666666667,14.733698630136987,14.82,14.82,14.829873417721519,14.845742397137746
139,200,14.76,14.82,14.76,1319100.0,14.76,14.738085106382979,14.732408759124088,14.703424657534246,14.82,14.82,14.829873417721519,14.845742397137746
140,201,14.72,14.82,14.72,1329800.0,14.72,14.69,14.669915611814346,14.655852842809365,14.82,14.82,14.829873417721519,14.845742397137746
141,202,14.69,14.71,14.69,1340100.0,14.69,14.69,14.669915611814346,14.655852842809365,14.71,14.772857142857143,14.772857142857143,14.819490566037736
142,203,14.72,14.84,14.84,1349100.0,14.72,14.72,14.704675324675325,14.671443123938879,14.84,14.84,14.84415,14.85430879712747
143,205,14.72,14.86,14.86,1377800.0,14.72,14.72,14.704675324675325,14.671443123938879,14.86,14.86,14.86,14.865102040816327
144,206,14.65,14.86,14.65,1388800.0,14.65,14.65,14.65,14.64048951048951,14.86,14.86,14.86,14.865102040816327
145,207,14.82,14.86,14.65,1399700.0,14.82,14.82,14.733175965665236,14.682544802867383,14.86,14.86,14.86,14.865102040816327
146,209,14.65,14.81,14.82,1411100.0,14.65,14.65,14.65,14.64375224416517,14.81,14.838436018957346,14.838436018957346,14.853184357541899
147,210,14.65,14.81,14.65,1411100.0,14.65,14.65,14.65,14.639850746268657,14.81,14.838436018957346,14.838436018957346,14.853184357541899
148,211,14.64,14.65,14.65,1435400.0,14.64,14.64,14.635191489361702,14.630543689320389,14.65,14.65,14.721024390243903,14.809306049822064
149,213,14.71,14.81,14.65,1446800.0,14.71,14.670093457943926,14.670093457943926,14.64672514619883,14.86,14.86,14.86,14.865102040816327
150,214,14.85,14.86,14.81,1455400.0,14.85,14.85,14.834045454545455,14.727751371115174,14.86,14.86,14.86,14.865102040816327
151,215,14.85,14.86,14.81,1455400.0,14.85,14.85,14.834045454545455,14.747343453510437,14.86,14.86,14.86,14.865102040816327
152,216,14.85,14.86,14.81,1455400.0,14.85,14.85,14.834045454545455,14.787790927021696,14.86,14.86,14.86,14.865102040816327
153,218,14.82,14.86,14.82,1466000.0,14.82,14.82,14.82,14.741330798479087,14.86,14.86,14.86,14.865102040816327
154,219,14.82,14.86,14.82,1476600.0,14.82,14.82,14.75233449477352,14.699597701149425,14.86,14.86,14.86,14.865102040816327
155,220,14.82,14.86,14.82,1476600.0,14.72,14.715027027027027,14.69450847457627,14.66820754716981,14.81,14.83803738317757,14.83803738317757,14.852944444444445
156,222,14.72,14.76,14.76,1479000.0,14.72,14.715027027027027,14.69450847457627,14.66820754716981,14.76,14.76,14.812681388012619,14.832924187725633
157,223,14.79,14.81,14.79,1489300.0,14.79,14.79,14.75943661971831,14.703463687150839,14.81,14.83803738317757,14.83803738317757,14.852944444444445
158,224,14.79,14.86,14.86,1510900.0,14.79,14.79,14.75943661971831,14.703463687150839,14.86,14.86,14.86,14.865102040816327
159,226,14.72,14.79,14.79,1511300.0,14.72,14.715027027027027,14.69450847457627,14.66820754716981,14.79,14.79,14.827668161434978,14.848488160291438
160,227,14.72,14.79,14.72,1520400.0,14.72,14.72,14.72,14.687148288973384,14.79,14.79,14.827668161434978,14.848488160291438
161,228,14.72,14.79,14.72,1520400.0,14.72,14.72,14.72,14.687148288973384,14.79,14.79,14.827668161434978,14.848488160291438
162,230,14.72,14.79,14.79,1530000.0,14.72,14.72,14.72,14.687148288973384,14.79,14.79,14.825463258785943,14.840345454545455
163,231,14.72,14.79,14.72,1539400.0,14.72,14.72,14.715422885572139,14.669725274725275,14.79,14.79,14.825463258785943,14.840345454545455
164,232,14.72,14.79,14.72,1539400.0,14.72,14.72,14.715422885572139,14.669725274725275,14.79,14.79,14.825463258785943,14.840345454545455
165,233,14.72,14.76,14.72,1539400.0,14.72,14.72,14.715422885572139,14.669725274725275,14.71,14.71,14.734780701754387,14.78724584103512
166,235,14.74,14.76,14.71,1550900.0,14.74,14.694166666666666,14.67312101910828,14.655790476190477,14.76,14.76,14.774305555555555,14.815064220183487
167,236,14.64,14.76,14.64,1562900.0,14.64,14.64,14.635191489361702,14.630543689320389,14.76,14.76,14.774305555555555,14.815064220183487
168,237,14.63,14.76,14.63,1562900.0,14.63,14.63,14.63,14.62590909090909,14.76,14.76,14.774305555555555,14.815064220183487
169,239,14.63,14.76,14.63,1584600.0,14.63,14.63,14.63,14.62590909090909,14.76,14.76,14.774305555555555,14.815064220183487
170,240,14.63,14.76,14.63,1584600.0,14.63,14.63,14.63,14.62590909090909,14.76,14.76,14.774305555555555,14.807423076923078
171,241,14.63,14.76,14.63,1584600.0,14.63,14.63,14.63,14.62590909090909,14.76,14.76,14.774305555555555,14.807423076923078
172,242,14.63,14.74,14.63,1584600.0,14.63,14.63,14.63,14.62590909090909,14.74,14.74,14.750511627906977,14.783173076923077
173,244,14.7,14.74,14.74,1584600.0,14.7,14.7,14.666051502145923,14.644541910331384,14.74,14.74,14.750511627906977,14.783173076923077
174,245,14.74,14.76,14.74,1594800.0,14.74,14.717033492822967,14.717033492822967,14.665807086614173,14.76,14.76,14.774305555555555,14.800428849902534
175,246,14.79,14.81,14.79,1603500.0,14.79,14.79,14.740964630225081,14.696111111111112,14.81,14.81,14.814455445544555,14.833078358208954
176,248,14.74,14.81,14.74,1615100.0,14.74,14.717033492822967,14.717033492822967,14.665807086614173,14.77,14.792626262626262,14.801180555555556,14.815836653386453
177,249,14.7,14.77,14.7,1623800.0,14.7,14.7,14.666051502145923,14.644541910331384,14.77,14.792626262626262,14.801180555555556,14.815836653386453
178,250,14.73,14.81,14.81,1623800.0,14.73,14.712857142857143,14.712857142857143,14.66418467583497,14.81,14.81,14.814455445544555,14.833078358208954
179,251,14.73,14.81,14.81,1634100.0,14.7,14.7,14.686438356164384,14.653861003861003,14.81,14.81,14.814455445544555,14.833078358208954
180,253,14.8,14.81,14.67,1653900.0,14.8,14.8,14.73628712871287,14.672854291417165,14.81,14.81,14.814455445544555,14.833078358208954
181,254,14.8,14.81,14.81,1653900.0,14.8,14.8,14.73628712871287,14.677067669172933,14.81,14.81,14.814455445544555,14.833078358208954
182,255,14.8,14.83,14.83,1673000.0,14.8,14.8,14.73628712871287,14.677067669172933,14.83,14.835560747663552,14.835560747663552,14.850840630472854
183,257,14.67,14.72,14.72,1683300.0,14.67,14.66454128440367,14.66454128440367,14.644564796905222,14.72,14.72,14.771732673267326,14.823910714285715
184,258,14.67,14.84,14.84,1691900.0,14.67,14.66454128440367,14.66454128440367,14.644564796905222,14.84,14.84,14.850041841004185,14.855972927241963
185,259,14.67,14.84,14.84,1701300.0,14.67,14.66454128440367,14.66454128440367,14.644564796905222,14.84,14.84,14.850041841004185,14.855972927241963
186,260,14.78,14.84,14.84,1712700.0,14.78,14.78,14.726902654867256,14.682836624775584,14.86,14.86,14.86,14.865149812734082
187,262,14.78,14.86,14.86,1733800.0,14.78,14.78,14.784726368159204,14.712801484230056,14.86,14.86,14.86,14.869388145315488
188,263,14.79,14.86,14.86,1733800.0,14.79,14.784726368159204,14.784726368159204,14.712801484230056,14.86,14.86,14.86436274509804,14.875748031496062
189,265,14.86,14.87,14.87,1761800.0,14.86,14.86,14.82675,14.754209523809523,14.87,14.87510989010989,14.876931034482759,14.88495126705653
190,266,14.86,14.87,14.87,1761800.0,14.86,14.86,14.833230088495576,14.7817915904936,14.87,14.87510989010989,14.876931034482759,14.88495126705653
191,267,14.86,14.88,14.88,1761800.0,14.86,14.86,14.839354838709678,14.81239332096475,14.88,14.88,14.88,14.890417457305503
192,268,14.86,14.88,14.88,1780500.0,14.86,14.86,14.839354838709678,14.816206261510128,14.88,14.88,14.884881516587678,14.894092592592592
193,270,14.86,14.89,14.89,1780500.0,14.86,14.86,14.854883720930232,14.827329749103942,14.89,14.89,14.895381165919282,14.900092592592593
194,272,14.86,14.9,14.9,1800400.0,14.86,14.86,14.854883720930232,14.827329749103942,14.9,14.9,14.9,14.90554716981132
195,273,14.86,14.9,14.9,1800400.0,14.86,14.86,14.854883720930232,14.827329749103942,14.9,14.9,14.9,14.909806201550387
196,275,14.86,14.91,14.91,1818000.0,14.86,14.86,14.854883720930232,14.827329749103942,14.91,14.91,14.914626865671641,14.917882352941177
197,276,14.86,14.91,14.91,1828900.0,14.86,14.86,14.854883720930232,14.827329749103942,14.91,14.91,14.914626865671641,14.917882352941177
198,277,14.86,14.91,14.91,1828900.0,14.86,14.86,14.854883720930232,14.827329749103942,14.91,14.91,14.914626865671641,14.917882352941177
199,279,14.86,14.91,14.91,1828900.0,14.86,14.86,14.854883720930232,14.835282685512368,14.91,14.91,14.914626865671641,14.917882352941177
200,280,14.86,14.92,14.92,1838900.0,14.86,14.86,14.854883720930232,14.835282685512368,14.92,14.92,14.92,14.92785854616896
201,281,14.86,14.92,14.92,1850200.0,14.86,14.86,14.854883720930232,14.835282685512368,14.92,14.92,14.92,14.936075731497418
202,283,14.86,14.92,14.94,1868800.0,14.86,14.86,14.86,14.845641952983724,14.94,14.94,14.94,14.950068728522337
203,284,14.86,14.94,14.94,1886400.0,14.86,14.86,14.86,14.845641952983724,14.94,14.94,14.946267605633803,14.955168918918918
204,286,14.92,14.95,14.95,1896700.0,14.92,14.92,14.890697674418604,14.865698729582578,14.95,14.95,14.953665480427047,14.96020979020979
205,287,14.92,14.95,14.95,1907800.0,14.92,14.92,14.890697674418604,14.865698729582578,14.95,14.955336787564766,14.956938775510205,14.963263157894737
206,288,14.92,14.96,14.96,1907800.0,14.92,14.92,14.890697674418604,14.865698729582578,14.96,14.96,14.96,14.968327645051195
207,290,14.92,14.96,14.96,1927200.0,14.92,14.92,14.890697674418604,14.865698729582578,14.96,14.96,14.965073170731708,14.97200668896321
208,291,14.92,14.97,14.97,1938200.0,14.92,14.92,14.90578947368421,14.875921052631579,14.97,14.97,14.97,14.979282218597064
209,292,14.92,14.97,14.97,1950100.0,14.92,14.92,14.90578947368421,14.875921052631579,14.97,14.97,14.973812949640287,14.981178781925344
210,294,14.92,14.97,14.97,1958700.0,14.92,14.92,14.90578947368421,14.875921052631579,14.97,14.975520833333333,14.977198697068404,14.987980392156862
211,295,14.97,14.98,14.98,1961800.0,14.97,14.941502590673576,14.924041095890411,14.897029702970297,14.98,14.98,14.99004329004329,15.008903846153846
212,297,14.97,14.98,14.98,1983700.0,14.97,14.97,14.95076923076923,14.908377926421405,14.98,14.98,14.99004329004329,15.008903846153846
213,298,14.97,14.98,14.98,1983700.0,14.97,14.97,14.97,14.943320079522863,14.98,14.98,14.99004329004329,15.008903846153846
214,299,14.97,15.01,15.01,1991700.0,14.97,14.97,14.97,14.943320079522863,15.01,15.019764705882354,15.023979238754325,15.031975736568457
215,0,0.0,0.0,15.01,2001000.0,,,,,,,,
