{
    "genesis.pod.ob.midpricechange": {
        "lookback_window": 10000,
        "sampling_freq": "100ms",     
        "raw_source": "../../parsed/ORDER_BOOK.%Y%m%d.csv",
        "backtest_source": "../backtests"
    }
}