{
  "type": "service_account",
  "project_id": "nice-plexus-422700-g2",
  "private_key_id": "9cbeee4f810ee8ef890f13458964f1e0fd3269ac",
  "private_key": "-----BEGIN PRIVATE KEY-----\nMIIEvAIBADANBgkqhkiG9w0BAQEFAASCBKYwggSiAgEAAoIBAQCO1Ew+mymdkSa/\nnZt5I4cMZzjCCjvIP9LsCdZZz2UkN2V+heoVAwCEwe5cIbgxq9WPsAsXWbqx47ha\nm6ZFs5Ocgj7GIaF8GH6pDz0gocoAcEhCvhfmsMuhePMqPQy2Pt8tvq5tE1LlQ7Rx\nhzHN6jWAN7GAmshAsxAGCl00EFaK/WyKEWyqX18jbDaIZjhLnFPisqXT3fMRdpw+\nLy3Aj1miYISQJapn9clKmd5JL/+k4K4nxrWHB+Hs+Io/XvA5lntwDUeOxAxR+4a4\nj4Z1fNdZfn1VT4Fr0gnZAAmQ/nUNO50j/DdSVgIWDA1sPEyDbsyhKqy9QlDvrn7n\nzSOyuYiPAgMBAAECggEAIODBxE+XXswA7W7sURBakAJa0F/mrwvyE5+YFghlsdaG\nqH9PCRMt1WGG6vJgIh76BB90DiX7keNnloPp3HWf7xEUPiuTrqs8zNHTMmXLyBoQ\nqDx16AaeeUcMQpbXDESgvzj7keQ22suhB9klH89gDWnElGQM4MfXUmykU83G/itL\n/CaxifIfsqaQ6qi9dJnFhxnYh/N/LX0Q1HMStoJKztkyb42tiBKBthZdfRoWbybp\nq4kftY349l4oh/82WXhlByBOTEsAVRbZp/eR5NcS45J6HHr24GOhQDRW/wv7vElv\n6pMEJTMInlQWvepuyE3CMPdY5WLYw2UvmivZ9EzDoQKBgQDBug9KogcIAV+pBgm+\nk+iz0iEqUlQSuQR46/fJNol43jzNjnJ5SaUOBie1ysIhk+D15kZ5kfV7lsLuznpW\n1QSP8rIzSo8lY9UKzcsCiMCuzLv5I3mSjiTS0aKvtmHt3hOpiO2+WtDxOzBVqgjj\nELT6Q2Uxv0IsiQbgjxuUGALg1wKBgQC8vdbvJcaUWGoYZlVqDI/IpAJEZJaeQAF9\nZx/Ry4qocULQnh8qo+57hTMkH/Nsnz9OmM/VWVUUo/GuNNwTHpwPIix1BAGk2Zjp\nse7w7darTg1BQE8sVwhyzDdjGH/Ex0iY4yBp9liKkfIiFrA6DqGdcYgWa1JW3SLD\n7XTXp1xHCQKBgCA/NV5p/BukBuVewO59NmYAW07tJ1t6erkaJkPTFS0OaTaaOInh\n7VyZP7DuEESAlhi4fRCtcBxjaw1PR2P+z2SatHj/Nza1GHhU6y7/znsKT1vYQNtZ\nV93T0W3IQSLULZex2EkwWslc3d3UkOgjFsz1vPl76ar6IC/vAlszZ/8/AoGALli7\nl7wB+FmBq/4tCT6ObCmB+QNuTOvQsdeJ472EjfpJ+uppItJgdGpv9XX3E3xDUmyJ\n1Iz8LHZZmXqXdAZ3MewlWJKkSLO6LeComPb+WNBwxs4g4vV4OKBXFXllno+FDy3u\nvrZkZZqTB7Xkjk0beIrxbPfrnzLsH4qGv5H0QekCgYALIDi13nDvmVVyX/FjduRU\nzpkx3mChrcqKGb9BuEIqmu4StjhcJFa/0hqXxvMH+wvp/geFaIewKQSbKRc4QFZP\njJK5JEjOU9FhCPJ6ps9WtHupvKlZ0muiio7ENRKZO84FLeggW6OZz5u1mBDM57CR\nI9Ihog87EpwPpzFvzOMUvQ==\n-----END PRIVATE KEY-----\n",
  "client_email": "testuser@nice-plexus-422700-g2.iam.gserviceaccount.com",
  "client_id": "107257621630269234367",
  "auth_uri": "https://accounts.google.com/o/oauth2/auth",
  "token_uri": "https://oauth2.googleapis.com/token",
  "auth_provider_x509_cert_url": "https://www.googleapis.com/oauth2/v1/certs",
  "client_x509_cert_url": "https://www.googleapis.com/robot/v1/metadata/x509/testuser%40nice-plexus-422700-g2.iam.gserviceaccount.com",
  "universe_domain": "googleapis.com"
}
