/home/a2w/dev/ex104/cliente/src/main/java/br/com/mastertech/cliente/service/ClienteService.java
/home/a2w/dev/ex104/cliente/src/main/java/br/com/mastertech/cliente/dto/ClienteDto.java
/home/a2w/dev/ex104/cliente/src/main/java/br/com/mastertech/cliente/repository/ClienteRepository.java
/home/a2w/dev/ex104/cliente/src/main/java/br/com/mastertech/cliente/entity/builder/ClienteBuilder.java
/home/a2w/dev/ex104/cliente/src/main/java/br/com/mastertech/cliente/exception/CartoesException.java
/home/a2w/dev/ex104/cliente/src/main/java/br/com/mastertech/cliente/entity/Cliente.java
/home/a2w/dev/ex104/cliente/src/main/java/br/com/mastertech/cliente/dto/builder/ClienteDtoBuilder.java
/home/a2w/dev/ex104/cliente/src/main/java/br/com/mastertech/cliente/mapper/DataMapper.java
/home/a2w/dev/ex104/cliente/src/main/java/br/com/mastertech/cliente/controller/ClienteController.java
/home/a2w/dev/ex104/cliente/src/main/java/br/com/mastertech/cliente/ClienteApplication.java
/home/a2w/dev/ex104/cliente/src/main/java/br/com/mastertech/cliente/exception/ClienteNotFoundException.java
