 ____               ____.____ ___  ________    _____ __________                                   
/_   |             |    |    |   \/  _____/   /  _  \\______   \                                  
 |   |  ______     |    |    |   /   \  ___  /  /_\  \|       _/                                  
 |   | /_____/ /\__|    |    |  /\    \_\  \/    |    \    |   \                                  
 |___|         \________|______/  \______  /\____|__  /____|_  /                                  
                                         \/         \/       \/                                   
________           .___________  .___________      _____      _____                               
\_____  \          |   \______ \ |   \_____  \    /     \    /  _  \                              
 /  ____/   ______ |   ||    |  \|   |/   |   \  /  \ /  \  /  /_\  \                             
/       \  /_____/ |   ||    `   \   /    |    \/    Y    \/    |    \                            
\_______ \         |___/_______  /___\_______  /\____|__  /\____|__  /                            
        \/                     \/            \/         \/         \/                             
________             ___ ___ .___  ____________________________ __________.___   _____  .____     
\_____  \           /   |   \|   |/   _____/\__    ___/\_____  \\______   \   | /  _  \ |    |    
  _(__  <   ______ /    ~    \   |\_____  \   |    |    /   |   \|       _/   |/  /_\  \|    |    
 /       \ /_____/ \    Y    /   |/        \  |    |   /    |    \    |   \   /    |    \    |___ 
/______  /          \___|_  /|___/_______  /  |____|   \_______  /____|_  /___\____|__  /_______ \
       \/                 \/             \/                    \/       \/            \/        \/
   _____             _________   _____  .____    ._____________                                   
  /  |  |           /   _____/  /  _  \ |    |   |   \______   \                                  
 /   |  |_  ______  \_____  \  /  /_\  \|    |   |   ||       _/                                  
/    ^   / /_____/  /        \/    |    \    |___|   ||    |   \                                  
\____   |          /_______  /\____|__  /_______ \___||____|_  /                                  
     |__|                  \/         \/        \/           \/