AISAFARM S.R.L.,"Zona San Miguel\nCalle Enrique Peñaranda, Bloque Q #11\nLa Paz - Bolivia ",(591 2) 279 5279,(591 2) 279 4452,aisatec@abendrothbolivia.com,www.abendrothbolivia.com/aisafarm,AISAFARM
GRUPO ALCOS S.A.,Zona Obrajes\nCalle 7 #235\nLa Paz - Bolivia ,(591 2) 2750075,,info@grupoalcos.com,www.grupoalcos.com,ALCOS
"ALFA, LABORATORIOS",Zona Miraflores\nAvenida Bush #1970\nLa Paz - Bolivia,(591 2) 2227910 / 2224217 / 2224237,(591 2) 224571,,www.alfabolivia.com,ALFA
AMORCA S.R.L,Zona Miraflores\nCalle Posnansky #1594\nLa Paz - Bolivia,(591 2) 2229369 / 2243818,(591 2) 2229369,info@amorca.com.bo,www.amorca.com.bo,AMORCA
ARGEBOL LTDA,Zona Central\nCalle Tumusla #291\nCochabamba - Bolivia,(591 4) 4259394,(591 4) 4580036,info@argebol.com.bo,www.argebol.com.bo,ARGEBOL
BAYER BOLIVIANA LTDA,"Zona Norte\nAvenida Las Ramblas #S/n, Edificio Tacuaral II, Piso 2\nSanta Cruz - Bolivia",(591 3) 3153300,(591 3) 3153349,,www.bayer.bo,BAYER
BIOFARMA S.A.,Zona Recoleta\nCalle Beni #358\nCochabamba - Bolivia,(591 4) 4487372,(591 4) 4487375,biofarma@sigmacorp.com.bo,,BIOFARMA
BRESKOT PHARMA,Calle Capitán Ravelo #S/n (entre Rosendo Gutierrez y Belisario Salinas)\n La Paz - Bolivia,(591 2) 2442105,,,www.breskotpharma.com,BRESKOT PHARMA
"COFAR S.A., LABORATORIOS",Zona Miraflores\nCalle Victor Eduardo #2293\nLa Paz - Bolivia,(591 2) 2220352,(591 2) 2221301,,www.cofar.com.bo,COFAR
COFARBOL,Zona San Miguel\nCalle Pablo Guillén #29\nLa Paz - Bolivia,(591 2) 2799727 / 2797070 / 2799904,(591 2) 2799727,ventas@cofarbol.com.bo,www.cofarbol.com,CORFABOL
CORMED,Zona Miraflores\nAvenida Busch #1759\nLa Paz - Bolivia,(591 2) 2914139,(591 2) 2914139,cormeddir@gmail.com,,CORMED
CORMESA LTDA,Zona Obrajes\nAvenida 14 de Septiembre #5299\nLa Paz - Bolivia,(591 2) 2750507,,info@cormesaltda.com,www.cormesaltda.com,CORMESA
CR FARMA S.R.L.,Zona Obrajes\nAvenida Hector Ormachea #1000\nLa Paz - Bolivia,(591 2) 2916632,(591 2) 2916632,,,CR FARMA
"CRESPAL S.A., LABORATORIOS",Calle Nicolás Acosta #784\nLa Paz - Bolivia,(591 2) 2491135,(591 2) 2488748,crespalpz@crespal.com,www.crespal.com,CRESPAL
"DELTA S.A., LABORATORIOS",Zona Sopocachi\nCalle Reseguin #2122\nLa Paz - Bolivia,(591 2) 2411516,(591 2) 2411845,consultas@laboratoriosdelta.net,www.laboratoriosdelta.net,DELTA
DIM S.R.L.,Zona Miraflores\nAvenida Busch #1569\nLa Paz - Bolivia,(591 2) 2220506,(591 2) 2226974,,,DIM
DROGUERÍA INTI S.A.,Zona Miraflores\nCalle Lucas Jaimes #1959\nLa Paz - Bolivia,(591 2) 2176600,(591 2) 2221981,drogueria@inti.com.bo,www.inti.com.bo,DROGUERÍA INTI
EFARMA,Zona Central\nCalle Rafael Peña #138\nSanta Cruz - Bolivia,(591 3) 3341199,(591 3) 3113703,efarma@efarma.com.bo,www.efarma.com.bo,EFARMA
"ENGELS, MERKEL Y CIA (BOLIVIA) S.A.",Zona Sopocachi\nCalle Rosendo Gutierrez #659\nLa Paz - Bolivia,(591 2) 2419004,(591 2) 2419097,engelsmerkel@emc-bol.com,,"ENGELS, MERKEL Y CIA"
EUROFARMA BOLIVIA S.A.FARMA,Zona Sur\nAvenida Doble Via La Guardia #5265\Santa Cruz - Bolivia,(591 3) 33518847,(591 3) 3583924,,,EUROFARMA
FARMAVAL BOLIVIA SRL,Zona Norte\nCalle Maria Luisa Castro #28\Santa Cruz - Bolivia,(591 3) 3413403 / 3413419,(591 3) 3413398,farmaval@farmaval.com.bo,www.farmaval.com.bo,FARMAVAL
FARMEDICAL S.R.L.,Zona Obrajes\nAvenida Hernando Siles #6007\nLa Paz - Bolivia,(591 2) 2788494,(591 2) 2782349,,www.farmedicalcorp.net,FARMEDICAL
GRAMON BOLIVIA LTDA,Calle Colpa #3060\nSanta Cruz - Bolivia,(591 3) 3433041 / 3436074,,info@gramon.com.bo,www.gramon.com.bo,GRAMON
HANSA LTDA,Avenida Cristo Redentor #470\nSanta Cruz - Bolivia,(591 3) 3424000,(591 3) 3423233,,www.hansa.com.bo,HANSA
HP MEDICAL,Zona Rio Piraí\nCalle Tucavaca #15\nSanta Cruz - Bolivia,(591 3) 3542525,(591 3) 3542526,hpmedical@hpmedical.com.bo,www.hpmedical.com.bo,HP MEDICAL
"IFA S.A., LABORATORIOS",Calle Moxos #441\nSanta Cruz - Bolivia,(591 3) 3431555,,info@laboratoriosifa.com,www.laboratoriosifa.com,IFA
IFARBO LTDA,Zona Santa Rosa Central\nCalle Caritas S/n\nCochabamba - Bolivia,(591 4) 4377238 / 4377239,(591 4) 4255407,ifarbo@ifarbo.com,www.ifarbo.com,IFARBO
INSUMOS MÉDICOS ESENCIALES IME,Zona Sopocachi\nCalle Luis de la Oliva #2895\nLa Paz - Bolivia,(591 2) 2420581 / 2420582,,,,IME
IMFAR S.R.L. IMPORTADORA DE PRODUCTOS FARMACEUTICOS,"Zona Parque Industrial\nPI 1, Mza 28, Lote 9\nSanta Cruz - Bolivia",(591 3) 362 6640,,info@imfar.com.bo,www.imfar.com.bo,IMFAR
ITA,Zona San Pedro\nCalle Pasteur #147\nCochabamba - Bolivia,(591 4) 4254200,,,www.itasalud.com,ITA
LABOFTA,Zona Canal Isuto\nAvenida La Salle C#9 B\nSanta Cruz - Bolivia,(591 3) 3413007,,,,LABOFTA
"LAFAR S.A., LABORATORIOS FARMACÉUTICOS",Zona Sopocachi\nCalle Luis Crespo #2213\nLa Paz - Bolivia,(591 2) 2410411,,info@lafar.net,www.lafar.net,LAFAR
LAQFAGAL FARMA INDUSTRIA S.R.L.,Zona Miraflores\n Avenida Carrrasco Pasaje Bocangel #1718\nLa Paz - Bolivia,(591 2) 2225511,(591 2) 2225511,,,LAQFAGAL
LATINMED MEDICAMENTOS LATINOAMERICANOS,Zona Miraflores\n Avenida Busch #1944\nLa Paz - Bolivia,(591 2) 2221020 / 2240739,(591 2) 2140826,,www.latinmedbo.com,LATINMED
LEMAITRE SRL,Zona Miraflores\nCalle Cuba #1406\nLa Paz - Bolivia,(591 2) 2243290,(591 2) 2243290,lemsrl@entelnet.bo,,LEMAITRE
"LKM BOLIVIA S.A., LABORATORIO",Zona Norte Equipetrol\nAvenida San Martin #150\nSanta Cruz - Bolivia,(591 3) 2441598,(591 3) 2443196,,,LKM
MEDIFARM S.R.L.,Zona Barrio Los Tusequis\n Calle Mapajo #2110\nSanta Cruz - Bolivia,(591 3) 3645444,(591 3) 3111260,medifarm@entelnet.bo,www.medifarmsrl.com,MEDIFARM
MHEDICAL PHARMA SRL,Zona Central\nCalle Lemoine #156\n Santa Cruz - Bolivia,(591 3) 3367170,(591 3) 3367170,mhedicalph@scz.net,,MHEDICAL PHARMA
"MINERVA S.R.L., LABORATORIOS",Zona Villa la Merced\nCalle Mururata #100\nLa Paz - Bolivia,(591 2) 2210161,(591 2) 22113035,info@laboratoriosminerva.com,www.laboratoriosminerva.com,MINERVA
ORSUD LTDA,Zona Sopocachi\nAvenida 6 de Agosto #2512\nLa Paz - Bolivia,(591 2) 2912657,(591 2) 2912658,orsud@entelnet.bo,,ORSUD
PHARMATECH BOLIVIANA S.A.,"Zona Equipetrol\nAvenida San Martin, Calle 9 Oeste #15\nSanta Cruz - Bolivia",(591 3) 3340150,(591 3) 3340147,,,PHARMATECH
PROCAPS S.A.,"Zona Equipetrol Norte\nCalle J, esquina Salvador\nSanta Cruz - Bolivia",(591 3) 3453060 / 3451090,,,,PROCAPS
PROMEDICAL S.A.,"5to Anillo, entre Radial 27 y Avenida Juan Pablo II\nSanta Cruz - Bolivia",(591 3) 3452565,(591 3) 3117660,info@promedical.com,www.promedical.com,PROMEDICAL
PROSALUD,Avenida Lucas Saucedo Sevilla #3595\nSanta Cruz - Bolivia,(591 3) 3474370,,info@prosalud.org,www.prosalud.org,PROSALUD
QUIMFA BOLIVIA S.A.,Zona El Paraiso\nCalle Fransisco Gutierrez #93\nSanta Cruz - Bolivia,(591 3) 3333346,(591 3) 3360400,,,QUIMFA
QUIMIZA LTDA,Zona Saguapac\nAvenida Grigota #4085\nSanta Cruz - Bolivia,(591 3) 3517090,(591 3) 3517091,,,QUIMIZA
RAICES IMPORT EXPORT LTDA,Zona Central\nCalle La Riva #364\nSanta Cruz - Bolivia,(591 3) 3334040,(591 3) 3365680,raices@cotas.com.bo,,RAICES
"RECALCINE, CORPORACIÓN FARMACÉUTICA","Zona Equipetrol\nAvenida San Martin, Calle 9 Oeste #15\nSanta Cruz - Bolivia",(591 3) 3340150,(591 3) 3340147,,,RECALCINE
"ROEMMERS, LABORATORIOS",Zona Central\nCalle Moldes #200\nSanta Cruz - Bolivia,(591 3) 3337556,(591 3) 3337566,,www.roemmers.com.bo,ROEMMERS
"SABIA SRL, BOLIVIANA MERCANTIL",Zona Calacoto\nAvenida Costanera #7\nLa Paz - Bolivia,(591 2) 2796565,(591 2) 2793538,mercantilsabia@gmail.com,,SABIA
SAE S.A.,Zonza Sopocachi\nCalle Victor Sanjinez #2608\nLa Paz - Bolivia,(591 2) 2410676,(591 2) 2411231,cpaz@saeboivia.com,www.saebolivia.com,SAE
SAN FERNANDO S.R.L.,Zona Norte\nCalle Seyeyé #2377\nSanta Cruz - Bolivia,(591 3) 3424941,(591 3) 3452333,,www.sanfernandosrl.com,SAN FERNANDO
SAVAL PHARMACEUTICAL,Zona Norte\nCalle Maria Luisa Castro #28\Santa Cruz - Bolivia,(591 3) 3413403 / 3413419,(591 3) 3413398,farmavalbolivia@savalcorp.com,www.savalbolivia.com,SAVAL
SCHMIDTS PHARMA SRL,"Zona Central\nAvenida Mariscal Santa Cruz #S/n, Edificio Hansa, Piso 6\nLa Paz - Bolivia",(591 2) 2406060,(591 2) 2125953,sp@schmidtspharma.com,,SCHMIDTS PHARMA
SIGMA CORP. S.R.L.,Avenida Blanco Galindo km 10\nCochabamba - Bolivia,(591 4) 4350121 / 4350626,,info@sigmacorp.com.bo,www.sigmacorp.com.bo,SIGMA
TECNOFARMA S.A.,Zona Trompillo\nAvenida Velarde #500\nSanta Cruz - Bolivia,(591 3) 3393757,(591 3) 3355987,,,TECNOFARMA
TERBODERM,Zona Hamacas\nCalle 2 Este #3205\nSanta Cruz - Bolivia,(591 3) 3426767,,info@terboderm.com.bo,www.terboderm.com.bo,TERBODERM
TERBOL S.A.,Zona Hamacas\nCalle 2 Este #3205\nSanta Cruz - Bolivia,(591 3) 3426767,,info@terbol.com.bo,www.terbol.com.bo,TERBOL
VALENCIA S.R.L.,"Zona San Jorge, Vinto\nCarretera Confital km 18\nCochabamba - Bolivia",(591 4) 4265641,(591 4) 4260265,gerencia@gruval.com,www.gruval.com,VALENCIA
"VITA S.A., LABORATORIOS",Zona Obrajes\nAvenida Héctor Ormachea #320\nLa Paz - Bolivia,(591 2) 2788060,(591 2) 2916428,info@vita.com.bo,www.vita.com.bo,VITA
"HAHNEMANN, LABORATORIO",Calle Pedro Salazar #692\nLa Paz - Bolivia,(591-2) 2415442/ 2415441,(591-2) 2415444,info@labhahnemann.com,www.labhahnemann.com,HAHNEMANN
IMBOLMED,Calle Salta N° 340\nZona Sur\nLa Paz - Bolivia,(591-2) 2795134,,info@imbolmed.com,www.imbolmed.com,IMBOLMED
