   1              		.syntax unified
   2              		.cpu cortex-m4
   3              		.eabi_attribute 27, 3
   4              		.eabi_attribute 28, 1
   5              		.fpu fpv4-sp-d16
   6              		.eabi_attribute 20, 1
   7              		.eabi_attribute 21, 1
   8              		.eabi_attribute 23, 3
   9              		.eabi_attribute 24, 1
  10              		.eabi_attribute 25, 1
  11              		.eabi_attribute 26, 1
  12              		.eabi_attribute 30, 6
  13              		.eabi_attribute 34, 1
  14              		.eabi_attribute 18, 4
  15              		.thumb
  16              		.file	"LM4F_startup.c"
  17              		.text
  18              	.Ltext0:
  19              		.cfi_sections	.debug_frame
  20              		.global	myvectors
  21              		.section	.nvic_table,"aw",%progbits
  22              		.align	2
  25              	myvectors:
  26 0000 00000000 		.word	_stack_top
  27 0004 00000000 		.word	rst_handler
  28 0008 00000000 		.word	nmi_handler
  29 000c 00000000 		.word	HardFault_Handler
  30 0010 00000000 		.word	empty_def_handler
  31 0014 00000000 		.word	empty_def_handler
  32 0018 00000000 		.word	empty_def_handler
  33 001c 00000000 		.word	0
  34 0020 00000000 		.word	0
  35 0024 00000000 		.word	0
  36 0028 00000000 		.word	0
  37 002c 00000000 		.word	empty_def_handler
  38 0030 00000000 		.word	empty_def_handler
  39 0034 00000000 		.word	0
  40 0038 00000000 		.word	empty_def_handler
  41 003c 00000000 		.word	SysTickIntHandler
  42 0040 00000000 		.word	empty_def_handler
  43 0044 00000000 		.word	empty_def_handler
  44 0048 00000000 		.word	empty_def_handler
  45 004c 00000000 		.word	empty_def_handler
  46 0050 00000000 		.word	empty_def_handler
  47 0054 00000000 		.word	UARTStdioIntHandler
  48 0058 00000000 		.word	empty_def_handler
  49 005c 00000000 		.word	empty_def_handler
  50 0060 00000000 		.word	empty_def_handler
  51 0064 00000000 		.word	0
  52 0068 00000000 		.word	0
  53 006c 00000000 		.word	0
  54 0070 00000000 		.word	0
  55 0074 00000000 		.word	0
  56 0078 00000000 		.word	empty_def_handler
  57 007c 00000000 		.word	empty_def_handler
  58 0080 00000000 		.word	empty_def_handler
  59 0084 00000000 		.word	empty_def_handler
  60 0088 00000000 		.word	empty_def_handler
  61 008c 00000000 		.word	empty_def_handler
  62 0090 00000000 		.word	empty_def_handler
  63 0094 00000000 		.word	empty_def_handler
  64 0098 00000000 		.word	empty_def_handler
  65 009c 00000000 		.word	empty_def_handler
  66 00a0 00000000 		.word	empty_def_handler
  67 00a4 00000000 		.word	empty_def_handler
  68 00a8 00000000 		.word	empty_def_handler
  69 00ac 00000000 		.word	0
  70 00b0 00000000 		.word	empty_def_handler
  71 00b4 00000000 		.word	empty_def_handler
  72 00b8 00000000 		.word	empty_def_handler
  73 00bc 00000000 		.word	0
  74 00c0 00000000 		.word	0
  75 00c4 00000000 		.word	empty_def_handler
  76 00c8 00000000 		.word	empty_def_handler
  77 00cc 00000000 		.word	empty_def_handler
  78 00d0 00000000 		.word	empty_def_handler
  79 00d4 00000000 		.word	empty_def_handler
  80 00d8 00000000 		.word	0
  81 00dc 00000000 		.word	empty_def_handler
  82 00e0 00000000 		.word	0
  83 00e4 00000000 		.word	0
  84 00e8 00000000 		.word	0
  85 00ec 00000000 		.word	empty_def_handler
  86 00f0 00000000 		.word	empty_def_handler
  87 00f4 00000000 		.word	0
  88 00f8 00000000 		.word	empty_def_handler
  89 00fc 00000000 		.word	empty_def_handler
  90 0100 00000000 		.word	empty_def_handler
  91 0104 00000000 		.word	empty_def_handler
  92 0108 00000000 		.word	empty_def_handler
  93 010c 00000000 		.word	empty_def_handler
  94 0110 00000000 		.word	0
  95 0114 00000000 		.word	0
  96 0118 00000000 		.word	0
  97 011c 00000000 		.word	0
  98 0120 00000000 		.word	0
  99 0124 00000000 		.word	empty_def_handler
 100 0128 00000000 		.word	empty_def_handler
 101 012c 00000000 		.word	empty_def_handler
 102 0130 00000000 		.word	empty_def_handler
 103 0134 00000000 		.word	empty_def_handler
 104 0138 00000000 		.word	empty_def_handler
 105 013c 00000000 		.word	empty_def_handler
 106 0140 00000000 		.word	0
 107 0144 00000000 		.word	0
 108 0148 00000000 		.word	0
 109 014c 00000000 		.word	0
 110 0150 00000000 		.word	empty_def_handler
 111 0154 00000000 		.word	empty_def_handler
 112 0158 00000000 		.word	empty_def_handler
 113 015c 00000000 		.word	empty_def_handler
 114 0160 00000000 		.word	0
 115 0164 00000000 		.word	0
 116 0168 00000000 		.word	0
 117 016c 00000000 		.word	0
 118 0170 00000000 		.word	0
 119 0174 00000000 		.word	0
 120 0178 00000000 		.word	0
 121 017c 00000000 		.word	0
 122 0180 00000000 		.word	0
 123 0184 00000000 		.word	0
 124 0188 00000000 		.word	0
 125 018c 00000000 		.word	0
 126 0190 00000000 		.word	0
 127 0194 00000000 		.word	0
 128 0198 00000000 		.word	0
 129 019c 00000000 		.word	0
 130 01a0 00000000 		.word	0
 131 01a4 00000000 		.word	0
 132 01a8 00000000 		.word	0
 133 01ac 00000000 		.word	0
 134 01b0 00000000 		.word	empty_def_handler
 135 01b4 00000000 		.word	empty_def_handler
 136 01b8 00000000 		.word	empty_def_handler
 137 01bc 00000000 		.word	empty_def_handler
 138 01c0 00000000 		.word	empty_def_handler
 139 01c4 00000000 		.word	empty_def_handler
 140 01c8 00000000 		.word	empty_def_handler
 141 01cc 00000000 		.word	empty_def_handler
 142 01d0 00000000 		.word	empty_def_handler
 143 01d4 00000000 		.word	empty_def_handler
 144 01d8 00000000 		.word	empty_def_handler
 145 01dc 00000000 		.word	empty_def_handler
 146 01e0 00000000 		.word	empty_def_handler
 147 01e4 00000000 		.word	empty_def_handler
 148 01e8 00000000 		.word	empty_def_handler
 149 01ec 00000000 		.word	0
 150 01f0 00000000 		.word	0
 151 01f4 00000000 		.word	0
 152 01f8 00000000 		.word	0
 153 01fc 00000000 		.word	0
 154 0200 00000000 		.word	0
 155 0204 00000000 		.word	0
 156 0208 00000000 		.word	0
 157 020c 00000000 		.word	0
 158 0210 00000000 		.word	0
 159 0214 00000000 		.word	0
 160 0218 00000000 		.word	0
 161 021c 00000000 		.word	0
 162 0220 00000000 		.word	0
 163 0224 00000000 		.word	0
 164 0228 00000000 		.word	0
 165 022c 00000000 		.word	0
 166 0230 00000000 		.word	0
 167 0234 00000000 		.word	0
 168 0238 00000000 		.word	0
 169 023c 00000000 		.word	0
 170 0240 00000000 		.word	0
 171 0244 00000000 		.word	0
 172 0248 00000000 		.word	0
 173 024c 00000000 		.word	0
 174 0250 00000000 		.word	0
 175 0254 00000000 		.word	0
 176 0258 00000000 		.word	0
 177 025c 00000000 		.word	0
 178 0260 00000000 		.word	0
 179 0264 00000000 		.word	0
 180 0268 00000000 		.word	0
 181              		.section	.text.rst_handler,"ax",%progbits
 182              		.align	2
 183              		.global	rst_handler
 184              		.thumb
 185              		.thumb_func
 187              	rst_handler:
 188              	.LFB0:
 189              		.file 1 "../LM4F_startup.c"
   1:../LM4F_startup.c **** /*
   2:../LM4F_startup.c **** * Copyright (c) 2012, Mauro Scomparin
   3:../LM4F_startup.c **** * All rights reserved.
   4:../LM4F_startup.c **** *
   5:../LM4F_startup.c **** * Redistribution and use in source and binary forms, with or without
   6:../LM4F_startup.c **** * modification, are permitted provided that the following conditions are met:
   7:../LM4F_startup.c **** *     * Redistributions of source code must retain the above copyright
   8:../LM4F_startup.c **** *       notice, this list of conditions and the following disclaimer.
   9:../LM4F_startup.c **** *     * Redistributions in binary form must reproduce the above copyright
  10:../LM4F_startup.c **** *       notice, this list of conditions and the following disclaimer in the
  11:../LM4F_startup.c **** *       documentation and/or other materials provided with the distribution.
  12:../LM4F_startup.c **** *     * Neither the name of Mauro Scomparin nor the
  13:../LM4F_startup.c **** *       names of its contributors may be used to endorse or promote products
  14:../LM4F_startup.c **** *       derived from this software without specific prior written permission.
  15:../LM4F_startup.c **** *
  16:../LM4F_startup.c **** * THIS SOFTWARE IS PROVIDED BY Mauro Scomparin ``AS IS'' AND ANY
  17:../LM4F_startup.c **** * EXPRESS OR IMPLIED WARRANTIES, INCLUDING, BUT NOT LIMITED TO, THE IMPLIED
  18:../LM4F_startup.c **** * WARRANTIES OF MERCHANTABILITY AND FITNESS FOR A PARTICULAR PURPOSE ARE
  19:../LM4F_startup.c **** * DISCLAIMED. IN NO EVENT SHALL Mauro Scomparin BE LIABLE FOR ANY
  20:../LM4F_startup.c **** * DIRECT, INDIRECT, INCIDENTAL, SPECIAL, EXEMPLARY, OR CONSEQUENTIAL DAMAGES
  21:../LM4F_startup.c **** * (INCLUDING, BUT NOT LIMITED TO, PROCUREMENT OF SUBSTITUTE GOODS OR SERVICES;
  22:../LM4F_startup.c **** * LOSS OF USE, DATA, OR PROFITS; OR BUSINESS INTERRUPTION) HOWEVER CAUSED AND
  23:../LM4F_startup.c **** * ON ANY THEORY OF LIABILITY, WHETHER IN CONTRACT, STRICT LIABILITY, OR TORT
  24:../LM4F_startup.c **** * (INCLUDING NEGLIGENCE OR OTHERWISE) ARISING IN ANY WAY OUT OF THE USE OF THIS
  25:../LM4F_startup.c **** * SOFTWARE, EVEN IF ADVISED OF THE POSSIBILITY OF SUCH DAMAGE.
  26:../LM4F_startup.c **** *
  27:../LM4F_startup.c **** * File:			LM4F_startup.c.
  28:../LM4F_startup.c **** * Author:		Mauro Scomparin <http://scompoprojects.worpress.com>.
  29:../LM4F_startup.c **** * Version:		1.0.0.
  30:../LM4F_startup.c **** * Description:	LM4F120H5QR startup code.
  31:../LM4F_startup.c **** */
  32:../LM4F_startup.c **** 
  33:../LM4F_startup.c **** //-----------------------------------------------------------------------------
  34:../LM4F_startup.c **** // 							 Functions declarations
  35:../LM4F_startup.c **** //-----------------------------------------------------------------------------
  36:../LM4F_startup.c **** 
  37:../LM4F_startup.c **** // Main should be defined on your main file so it's extern.
  38:../LM4F_startup.c **** extern int main(void);
  39:../LM4F_startup.c **** // rst_handler contains the code to run on reset.
  40:../LM4F_startup.c **** void rst_handler(void);
  41:../LM4F_startup.c **** // nmi_handler it's the code for an non maskerable interrupt.
  42:../LM4F_startup.c **** void nmi_handler(void);
  43:../LM4F_startup.c **** // this is just the default handler.
  44:../LM4F_startup.c **** void empty_def_handler(void);
  45:../LM4F_startup.c **** // this is the code for an hard fault.
  46:../LM4F_startup.c **** void hardfault_handler(void);
  47:../LM4F_startup.c **** 
  48:../LM4F_startup.c **** /* The prototype shows it is a naked function - in effect this is just an
  49:../LM4F_startup.c **** assembly function. */
  50:../LM4F_startup.c **** static void HardFault_Handler( void ) __attribute__( ( naked ) );
  51:../LM4F_startup.c **** 
  52:../LM4F_startup.c **** 
  53:../LM4F_startup.c **** extern void SysTickIntHandler(void);
  54:../LM4F_startup.c **** extern void UARTStdioIntHandler(void);
  55:../LM4F_startup.c **** 
  56:../LM4F_startup.c **** 
  57:../LM4F_startup.c **** //-----------------------------------------------------------------------------
  58:../LM4F_startup.c **** // 						     Variables declarations
  59:../LM4F_startup.c **** //-----------------------------------------------------------------------------
  60:../LM4F_startup.c **** 
  61:../LM4F_startup.c **** // defined by the linker it's the stack top variable (End of ram)
  62:../LM4F_startup.c **** extern unsigned long _stack_top;
  63:../LM4F_startup.c **** // defined by the liker, this are just start and end marker for each section.
  64:../LM4F_startup.c **** // .text (code)
  65:../LM4F_startup.c **** extern unsigned long _start_text;
  66:../LM4F_startup.c **** extern unsigned long _end_text;
  67:../LM4F_startup.c **** // .data (data to be copied on ram)
  68:../LM4F_startup.c **** extern unsigned long _start_data;
  69:../LM4F_startup.c **** extern unsigned long _end_data;
  70:../LM4F_startup.c **** // .bss (uninitialized data to set to 0);
  71:../LM4F_startup.c **** extern unsigned long _start_bss;
  72:../LM4F_startup.c **** extern unsigned long _end_bss;
  73:../LM4F_startup.c **** 
  74:../LM4F_startup.c **** // NVIC ISR table
  75:../LM4F_startup.c **** // the funny looking void(* myvectors[])(void) basically it's a way to make cc accept an array of f
  76:../LM4F_startup.c **** __attribute__ ((section(".nvic_table")))
  77:../LM4F_startup.c **** void(* myvectors[])(void) = {
  78:../LM4F_startup.c **** 	// This are the fixed priority interrupts and the stack pointer loaded at startup at R13 (SP).
  79:../LM4F_startup.c **** 	//												VECTOR N (Check Datasheet)
  80:../LM4F_startup.c **** 	// here the compiler it's boring.. have to figure that out
  81:../LM4F_startup.c ****     (void (*)) &_stack_top, 
  82:../LM4F_startup.c ****     						// stack pointer should be 
  83:../LM4F_startup.c **** 							// placed here at startup.			0
  84:../LM4F_startup.c ****     rst_handler,			// code entry point					1
  85:../LM4F_startup.c ****     nmi_handler,			// NMI handler.						2
  86:../LM4F_startup.c ****     HardFault_Handler,		// hard fault handler.				3
  87:../LM4F_startup.c ****     // Configurable priority interruts handler start here.
  88:../LM4F_startup.c ****     empty_def_handler,		// Memory Management Fault			4
  89:../LM4F_startup.c ****     empty_def_handler,		// Bus Fault						5
  90:../LM4F_startup.c ****     empty_def_handler,		// Usage Fault 						6
  91:../LM4F_startup.c ****     0,						// Reserved							7
  92:../LM4F_startup.c ****     0,						// Reserved							8
  93:../LM4F_startup.c ****     0,						// Reserved							9
  94:../LM4F_startup.c ****     0,						// Reserved							10
  95:../LM4F_startup.c ****     empty_def_handler,		// SV call							11
  96:../LM4F_startup.c ****     empty_def_handler,		// Debug monitor					12
  97:../LM4F_startup.c ****     0,						// Reserved							13
  98:../LM4F_startup.c ****     empty_def_handler,		// PendSV							14
  99:../LM4F_startup.c ****     SysTickIntHandler,		// SysTick							15
 100:../LM4F_startup.c ****     // Peripherial interrupts start here.
 101:../LM4F_startup.c **** 	empty_def_handler,		// GPIO Port A						16
 102:../LM4F_startup.c **** 	empty_def_handler,		// GPIO Port B						17
 103:../LM4F_startup.c **** 	empty_def_handler,		// GPIO Port C						18
 104:../LM4F_startup.c **** 	empty_def_handler,		// GPIO Port D						19
 105:../LM4F_startup.c **** 	empty_def_handler,		// GPIO Port E						20
 106:../LM4F_startup.c **** 	UARTStdioIntHandler,	// UART 0							21
 107:../LM4F_startup.c **** 	empty_def_handler,		// UART 1							22
 108:../LM4F_startup.c **** 	empty_def_handler,		// SSI 0							23
 109:../LM4F_startup.c **** 	empty_def_handler,		// I2C 0							24
 110:../LM4F_startup.c **** 	0,						// Reserved							25
 111:../LM4F_startup.c **** 	0,						// Reserved							26
 112:../LM4F_startup.c **** 	0,						// Reserved							27
 113:../LM4F_startup.c **** 	0,						// Reserved							28
 114:../LM4F_startup.c **** 	0,						// Reserved							29
 115:../LM4F_startup.c **** 	empty_def_handler,		// ADC 0 Seq 0						30
 116:../LM4F_startup.c **** 	empty_def_handler,		// ADC 0 Seq 1						31
 117:../LM4F_startup.c **** 	empty_def_handler,		// ADC 0 Seq 2						32
 118:../LM4F_startup.c **** 	empty_def_handler,		// ADC 0 Seq 3						33
 119:../LM4F_startup.c **** 	empty_def_handler,		// WDT 0 and 1						34
 120:../LM4F_startup.c **** 	empty_def_handler,		// 16/32 bit timer 0 A				35
 121:../LM4F_startup.c **** 	empty_def_handler,		// 16/32 bit timer 0 B				36
 122:../LM4F_startup.c **** 	empty_def_handler,		// 16/32 bit timer 1 A				37
 123:../LM4F_startup.c **** 	empty_def_handler,		// 16/32 bit timer 1 B				38
 124:../LM4F_startup.c **** 	empty_def_handler,		// 16/32 bit timer 2 A				39
 125:../LM4F_startup.c **** 	empty_def_handler,		// 16/32 bit timer 2 B				40
 126:../LM4F_startup.c **** 	empty_def_handler,		// Analog comparator 0				41
 127:../LM4F_startup.c **** 	empty_def_handler,		// Analog comparator 1				42
 128:../LM4F_startup.c **** 	0,						// Reserved							43
 129:../LM4F_startup.c **** 	empty_def_handler,		// System control					44
 130:../LM4F_startup.c **** 	empty_def_handler,		// Flash + EEPROM control			45
 131:../LM4F_startup.c **** 	empty_def_handler,		// GPIO Port F						46
 132:../LM4F_startup.c **** 	0,						// Reserved							47
 133:../LM4F_startup.c **** 	0,						// Reserved							48
 134:../LM4F_startup.c **** 	empty_def_handler,		// UART 2							49
 135:../LM4F_startup.c **** 	empty_def_handler,		// SSI 1							50
 136:../LM4F_startup.c **** 	empty_def_handler,		// 16/32 bit timer 3 A				51
 137:../LM4F_startup.c **** 	empty_def_handler,		// 16/32 bit timer 3 B				52
 138:../LM4F_startup.c **** 	empty_def_handler,		// I2C 1							53
 139:../LM4F_startup.c **** 	0,						// Reserved							54
 140:../LM4F_startup.c **** 	empty_def_handler,		// CAN 0							55
 141:../LM4F_startup.c **** 	0,						// Reserved							56
 142:../LM4F_startup.c **** 	0,						// Reserved							57
 143:../LM4F_startup.c **** 	0,						// Reserved							58
 144:../LM4F_startup.c **** 	empty_def_handler,		// Hibernation module				59
 145:../LM4F_startup.c **** 	empty_def_handler,		// USB								60
 146:../LM4F_startup.c **** 	0,						// Reserved							61
 147:../LM4F_startup.c **** 	empty_def_handler,		// UDMA SW							62
 148:../LM4F_startup.c **** 	empty_def_handler,		// UDMA Error						63
 149:../LM4F_startup.c **** 	empty_def_handler,		// ADC 1 Seq 0						64
 150:../LM4F_startup.c **** 	empty_def_handler,		// ADC 1 Seq 1						65
 151:../LM4F_startup.c **** 	empty_def_handler,		// ADC 1 Seq 2						66
 152:../LM4F_startup.c **** 	empty_def_handler,		// ADC 1 Seq 3						67
 153:../LM4F_startup.c **** 	0,						// Reserved							68
 154:../LM4F_startup.c **** 	0,						// Reserved							69
 155:../LM4F_startup.c **** 	0,						// Reserved							70
 156:../LM4F_startup.c **** 	0,						// Reserved							71
 157:../LM4F_startup.c **** 	0,						// Reserved							72
 158:../LM4F_startup.c **** 	empty_def_handler,		// SSI 2							73
 159:../LM4F_startup.c **** 	empty_def_handler,		// SSI 2							74
 160:../LM4F_startup.c **** 	empty_def_handler,		// UART 3							75
 161:../LM4F_startup.c **** 	empty_def_handler,		// UART 4							76
 162:../LM4F_startup.c **** 	empty_def_handler,		// UART 5							77
 163:../LM4F_startup.c **** 	empty_def_handler,		// UART 6							78
 164:../LM4F_startup.c **** 	empty_def_handler,		// UART 7							79
 165:../LM4F_startup.c **** 	0,						// Reserved							80
 166:../LM4F_startup.c **** 	0,						// Reserved							81
 167:../LM4F_startup.c **** 	0,						// Reserved							82
 168:../LM4F_startup.c **** 	0,						// Reserved							83
 169:../LM4F_startup.c **** 	empty_def_handler,		// I2C 2							84
 170:../LM4F_startup.c **** 	empty_def_handler,		// I2C 4							85
 171:../LM4F_startup.c **** 	empty_def_handler,		// 16/32 bit timer 4 A				86
 172:../LM4F_startup.c **** 	empty_def_handler,		// 16/32 bit timer 4 B				87
 173:../LM4F_startup.c **** 	0,						// Reserved							88
 174:../LM4F_startup.c **** 	0,						// Reserved							89
 175:../LM4F_startup.c **** 	0,						// Reserved							90
 176:../LM4F_startup.c **** 	0,						// Reserved							91
 177:../LM4F_startup.c **** 	0,						// Reserved							92
 178:../LM4F_startup.c **** 	0,						// Reserved							93
 179:../LM4F_startup.c **** 	0,						// Reserved							94
 180:../LM4F_startup.c **** 	0,						// Reserved							95
 181:../LM4F_startup.c **** 	0,						// Reserved							96
 182:../LM4F_startup.c **** 	0,						// Reserved							97
 183:../LM4F_startup.c **** 	0,						// Reserved							98
 184:../LM4F_startup.c **** 	0,						// Reserved							99
 185:../LM4F_startup.c **** 	0,						// Reserved							100
 186:../LM4F_startup.c **** 	0,						// Reserved							101
 187:../LM4F_startup.c **** 	0,						// Reserved							102
 188:../LM4F_startup.c **** 	0,						// Reserved							103
 189:../LM4F_startup.c **** 	0,						// Reserved							104
 190:../LM4F_startup.c **** 	0,						// Reserved							105
 191:../LM4F_startup.c **** 	0,						// Reserved							106
 192:../LM4F_startup.c **** 	0,						// Reserved							107
 193:../LM4F_startup.c **** 	empty_def_handler,		// 16/32 bit timer 5 A				108
 194:../LM4F_startup.c **** 	empty_def_handler,		// 16/32 bit timer 5 B				109
 195:../LM4F_startup.c **** 	empty_def_handler,		// 32/64 bit timer 0 A				110
 196:../LM4F_startup.c **** 	empty_def_handler,		// 32/64 bit timer 0 B				111
 197:../LM4F_startup.c **** 	empty_def_handler,		// 32/64 bit timer 1 A				112
 198:../LM4F_startup.c **** 	empty_def_handler,		// 32/64 bit timer 1 B				113
 199:../LM4F_startup.c **** 	empty_def_handler,		// 32/64 bit timer 2 A				114
 200:../LM4F_startup.c **** 	empty_def_handler,		// 32/64 bit timer 2 B				115
 201:../LM4F_startup.c **** 	empty_def_handler,		// 32/64 bit timer 3 A				116
 202:../LM4F_startup.c **** 	empty_def_handler,		// 32/64 bit timer 3 B				117
 203:../LM4F_startup.c **** 	empty_def_handler,		// 32/64 bit timer 4 A				118
 204:../LM4F_startup.c **** 	empty_def_handler,		// 32/64 bit timer 4 B				119
 205:../LM4F_startup.c **** 	empty_def_handler,		// 32/64 bit timer 5 A				120
 206:../LM4F_startup.c **** 	empty_def_handler,		// 32/64 bit timer 5 B				121
 207:../LM4F_startup.c **** 	empty_def_handler,		// System Exception					122
 208:../LM4F_startup.c **** 	0,						// Reserved							123
 209:../LM4F_startup.c **** 	0,						// Reserved							124
 210:../LM4F_startup.c **** 	0,						// Reserved							125
 211:../LM4F_startup.c **** 	0,						// Reserved							126
 212:../LM4F_startup.c **** 	0,						// Reserved							127
 213:../LM4F_startup.c **** 	0,						// Reserved							128
 214:../LM4F_startup.c **** 	0,						// Reserved							129
 215:../LM4F_startup.c **** 	0,						// Reserved							130
 216:../LM4F_startup.c **** 	0,						// Reserved							131
 217:../LM4F_startup.c **** 	0,						// Reserved							132
 218:../LM4F_startup.c **** 	0,						// Reserved							133
 219:../LM4F_startup.c **** 	0,						// Reserved							134
 220:../LM4F_startup.c **** 	0,						// Reserved							135
 221:../LM4F_startup.c **** 	0,						// Reserved							136
 222:../LM4F_startup.c **** 	0,						// Reserved							137
 223:../LM4F_startup.c **** 	0,						// Reserved							138
 224:../LM4F_startup.c **** 	0,						// Reserved							139
 225:../LM4F_startup.c **** 	0,						// Reserved							140
 226:../LM4F_startup.c **** 	0,						// Reserved							141
 227:../LM4F_startup.c **** 	0,						// Reserved							142
 228:../LM4F_startup.c **** 	0,						// Reserved							143
 229:../LM4F_startup.c **** 	0,						// Reserved							144
 230:../LM4F_startup.c **** 	0,						// Reserved							145
 231:../LM4F_startup.c **** 	0,						// Reserved							146
 232:../LM4F_startup.c **** 	0,						// Reserved							147
 233:../LM4F_startup.c **** 	0,						// Reserved							148
 234:../LM4F_startup.c **** 	0,						// Reserved							149
 235:../LM4F_startup.c **** 	0,						// Reserved							150
 236:../LM4F_startup.c **** 	0,						// Reserved							151
 237:../LM4F_startup.c **** 	0,						// Reserved							152
 238:../LM4F_startup.c **** 	0,						// Reserved							153
 239:../LM4F_startup.c **** 	0						// Reserved							154
 240:../LM4F_startup.c **** };
 241:../LM4F_startup.c **** 
 242:../LM4F_startup.c **** //-----------------------------------------------------------------------------
 243:../LM4F_startup.c **** // 							Function implementations.
 244:../LM4F_startup.c **** //-----------------------------------------------------------------------------
 245:../LM4F_startup.c **** 
 246:../LM4F_startup.c **** /* 
 247:../LM4F_startup.c **** * System on reset code. NVIC 1
 248:../LM4F_startup.c **** * Here I prepare the memory for the c compiler.
 249:../LM4F_startup.c **** * The stack pointer should be set at the beginning with the NVIC table already.
 250:../LM4F_startup.c **** * Copy the .data segment from flash into ram.
 251:../LM4F_startup.c **** * 0 to the .bss segment 
 252:../LM4F_startup.c **** */
 253:../LM4F_startup.c **** 	
 254:../LM4F_startup.c **** void rst_handler(void){	
 190              		.loc 1 254 0
 191              		.cfi_startproc
 192              		@ args = 0, pretend = 0, frame = 8
 193              		@ frame_needed = 1, uses_anonymous_args = 0
 194 0000 80B5     		push	{r7, lr}
 195              	.LCFI0:
 196              		.cfi_def_cfa_offset 8
 197              		.cfi_offset 7, -8
 198              		.cfi_offset 14, -4
 199 0002 82B0     		sub	sp, sp, #8
 200              	.LCFI1:
 201              		.cfi_def_cfa_offset 16
 202 0004 00AF     		add	r7, sp, #0
 203              	.LCFI2:
 204              		.cfi_def_cfa_register 7
 255:../LM4F_startup.c **** 	// Copy the .data section pointers to ram from flash.
 256:../LM4F_startup.c **** 	// Look at LD manual (Optional Section Attributes).
 257:../LM4F_startup.c **** 	
 258:../LM4F_startup.c **** 	// source and destination pointers
 259:../LM4F_startup.c **** 	unsigned long *src;
 260:../LM4F_startup.c **** 	unsigned long *dest;
 261:../LM4F_startup.c **** 	
 262:../LM4F_startup.c **** 	//this should be good!
 263:../LM4F_startup.c **** 	src = &_end_text;
 205              		.loc 1 263 0
 206 0006 40F20003 		movw	r3, #:lower16:_end_text
 207 000a C0F20003 		movt	r3, #:upper16:_end_text
 208 000e 7B60     		str	r3, [r7, #4]
 264:../LM4F_startup.c **** 	dest = &_start_data;
 209              		.loc 1 264 0
 210 0010 40F20003 		movw	r3, #:lower16:_start_data
 211 0014 C0F20003 		movt	r3, #:upper16:_start_data
 212 0018 3B60     		str	r3, [r7, #0]
 265:../LM4F_startup.c **** 	
 266:../LM4F_startup.c **** 	//this too
 267:../LM4F_startup.c ****     while(dest < &_end_data)
 213              		.loc 1 267 0
 214 001a 09E0     		b	.L2
 215              	.L3:
 268:../LM4F_startup.c ****     {
 269:../LM4F_startup.c ****         *dest++ = *src++;
 216              		.loc 1 269 0
 217 001c 7B68     		ldr	r3, [r7, #4]
 218 001e 1A68     		ldr	r2, [r3, #0]
 219 0020 3B68     		ldr	r3, [r7, #0]
 220 0022 1A60     		str	r2, [r3, #0]
 221 0024 3B68     		ldr	r3, [r7, #0]
 222 0026 0433     		adds	r3, r3, #4
 223 0028 3B60     		str	r3, [r7, #0]
 224 002a 7B68     		ldr	r3, [r7, #4]
 225 002c 0433     		adds	r3, r3, #4
 226 002e 7B60     		str	r3, [r7, #4]
 227              	.L2:
 267:../LM4F_startup.c ****     while(dest < &_end_data)
 228              		.loc 1 267 0 discriminator 1
 229 0030 3A68     		ldr	r2, [r7, #0]
 230 0032 40F20003 		movw	r3, #:lower16:_end_data
 231 0036 C0F20003 		movt	r3, #:upper16:_end_data
 232 003a 9A42     		cmp	r2, r3
 233 003c EED3     		bcc	.L3
 270:../LM4F_startup.c ****     }
 271:../LM4F_startup.c **** 	
 272:../LM4F_startup.c ****     // now set the .bss segment to 0!
 273:../LM4F_startup.c ****     dest = &_start_bss;
 234              		.loc 1 273 0
 235 003e 40F20003 		movw	r3, #:lower16:_start_bss
 236 0042 C0F20003 		movt	r3, #:upper16:_start_bss
 237 0046 3B60     		str	r3, [r7, #0]
 274:../LM4F_startup.c **** 	while(dest < &_end_bss){
 238              		.loc 1 274 0
 239 0048 05E0     		b	.L4
 240              	.L5:
 275:../LM4F_startup.c **** 		*dest++ = 0;
 241              		.loc 1 275 0
 242 004a 3B68     		ldr	r3, [r7, #0]
 243 004c 0022     		movs	r2, #0
 244 004e 1A60     		str	r2, [r3, #0]
 245 0050 3B68     		ldr	r3, [r7, #0]
 246 0052 0433     		adds	r3, r3, #4
 247 0054 3B60     		str	r3, [r7, #0]
 248              	.L4:
 274:../LM4F_startup.c **** 	while(dest < &_end_bss){
 249              		.loc 1 274 0 discriminator 1
 250 0056 3A68     		ldr	r2, [r7, #0]
 251 0058 40F20003 		movw	r3, #:lower16:_end_bss
 252 005c C0F20003 		movt	r3, #:upper16:_end_bss
 253 0060 9A42     		cmp	r2, r3
 254 0062 F2D3     		bcc	.L5
 276:../LM4F_startup.c **** 	}
 277:../LM4F_startup.c **** 	
 278:../LM4F_startup.c **** 	// after setting copying .data to ram and "zero-ing" .bss we are good
 279:../LM4F_startup.c **** 	// to start the main() method!
 280:../LM4F_startup.c **** 	// There you go!
 281:../LM4F_startup.c **** 	main();
 255              		.loc 1 281 0
 256 0064 FFF7FEFF 		bl	main
 282:../LM4F_startup.c **** }
 257              		.loc 1 282 0
 258 0068 07F10807 		add	r7, r7, #8
 259 006c BD46     		mov	sp, r7
 260 006e 80BD     		pop	{r7, pc}
 261              		.cfi_endproc
 262              	.LFE0:
 264              		.section	.text.nmi_handler,"ax",%progbits
 265              		.align	2
 266              		.global	nmi_handler
 267              		.thumb
 268              		.thumb_func
 270              	nmi_handler:
 271              	.LFB1:
 283:../LM4F_startup.c **** 
 284:../LM4F_startup.c **** // NMI Exception handler code NVIC 2
 285:../LM4F_startup.c **** void nmi_handler(void){
 272              		.loc 1 285 0
 273              		.cfi_startproc
 274              		@ args = 0, pretend = 0, frame = 0
 275              		@ frame_needed = 1, uses_anonymous_args = 0
 276              		@ link register save eliminated.
 277 0000 80B4     		push	{r7}
 278              	.LCFI3:
 279              		.cfi_def_cfa_offset 4
 280              		.cfi_offset 7, -4
 281 0002 00AF     		add	r7, sp, #0
 282              	.LCFI4:
 283              		.cfi_def_cfa_register 7
 284              	.L7:
 286:../LM4F_startup.c **** 	// Just loop forever, so if you want to debug the processor it's running.
 287:../LM4F_startup.c ****     while(1){
 288:../LM4F_startup.c ****     }
 285              		.loc 1 288 0 discriminator 1
 286 0004 FEE7     		b	.L7
 287              		.cfi_endproc
 288              	.LFE1:
 290 0006 00BF     		.section	.text.prvGetRegistersFromStack,"ax",%progbits
 291              		.align	2
 292              		.global	prvGetRegistersFromStack
 293              		.thumb
 294              		.thumb_func
 296              	prvGetRegistersFromStack:
 297              	.LFB2:
 289:../LM4F_startup.c **** }
 290:../LM4F_startup.c **** 
 291:../LM4F_startup.c **** typedef int uint32_t;
 292:../LM4F_startup.c **** 
 293:../LM4F_startup.c **** void prvGetRegistersFromStack( uint32_t *pulFaultStackAddress ) {
 298              		.loc 1 293 0
 299              		.cfi_startproc
 300              		@ args = 0, pretend = 0, frame = 40
 301              		@ frame_needed = 1, uses_anonymous_args = 0
 302              		@ link register save eliminated.
 303 0000 80B4     		push	{r7}
 304              	.LCFI5:
 305              		.cfi_def_cfa_offset 4
 306              		.cfi_offset 7, -4
 307 0002 8BB0     		sub	sp, sp, #44
 308              	.LCFI6:
 309              		.cfi_def_cfa_offset 48
 310 0004 00AF     		add	r7, sp, #0
 311              	.LCFI7:
 312              		.cfi_def_cfa_register 7
 313 0006 7860     		str	r0, [r7, #4]
 294:../LM4F_startup.c **** /* These are volatile to try and prevent the compiler/linker optimising them
 295:../LM4F_startup.c **** away as the variables never actually get used.  If the debugger won't show the
 296:../LM4F_startup.c **** values of the variables, make them global my moving their declaration outside
 297:../LM4F_startup.c **** of this function. */
 298:../LM4F_startup.c **** volatile uint32_t r0;
 299:../LM4F_startup.c **** volatile uint32_t r1;
 300:../LM4F_startup.c **** volatile uint32_t r2;
 301:../LM4F_startup.c **** volatile uint32_t r3;
 302:../LM4F_startup.c **** volatile uint32_t r12;
 303:../LM4F_startup.c **** volatile uint32_t lr; /* Link register. */
 304:../LM4F_startup.c **** volatile uint32_t pc; /* Program counter. */
 305:../LM4F_startup.c **** volatile uint32_t psr;/* Program status register. */
 306:../LM4F_startup.c **** 
 307:../LM4F_startup.c ****     r0 = pulFaultStackAddress[ 0 ];
 314              		.loc 1 307 0
 315 0008 7B68     		ldr	r3, [r7, #4]
 316 000a 1B68     		ldr	r3, [r3, #0]
 317 000c 7B62     		str	r3, [r7, #36]
 308:../LM4F_startup.c ****     r1 = pulFaultStackAddress[ 1 ];
 318              		.loc 1 308 0
 319 000e 7B68     		ldr	r3, [r7, #4]
 320 0010 5B68     		ldr	r3, [r3, #4]
 321 0012 3B62     		str	r3, [r7, #32]
 309:../LM4F_startup.c ****     r2 = pulFaultStackAddress[ 2 ];
 322              		.loc 1 309 0
 323 0014 7B68     		ldr	r3, [r7, #4]
 324 0016 9B68     		ldr	r3, [r3, #8]
 325 0018 FB61     		str	r3, [r7, #28]
 310:../LM4F_startup.c ****     r3 = pulFaultStackAddress[ 3 ];
 326              		.loc 1 310 0
 327 001a 7B68     		ldr	r3, [r7, #4]
 328 001c DB68     		ldr	r3, [r3, #12]
 329 001e BB61     		str	r3, [r7, #24]
 311:../LM4F_startup.c **** 
 312:../LM4F_startup.c ****     r12 = pulFaultStackAddress[ 4 ];
 330              		.loc 1 312 0
 331 0020 7B68     		ldr	r3, [r7, #4]
 332 0022 1B69     		ldr	r3, [r3, #16]
 333 0024 7B61     		str	r3, [r7, #20]
 313:../LM4F_startup.c ****     lr = pulFaultStackAddress[ 5 ];
 334              		.loc 1 313 0
 335 0026 7B68     		ldr	r3, [r7, #4]
 336 0028 5B69     		ldr	r3, [r3, #20]
 337 002a 3B61     		str	r3, [r7, #16]
 314:../LM4F_startup.c ****     pc = pulFaultStackAddress[ 6 ];
 338              		.loc 1 314 0
 339 002c 7B68     		ldr	r3, [r7, #4]
 340 002e 9B69     		ldr	r3, [r3, #24]
 341 0030 FB60     		str	r3, [r7, #12]
 315:../LM4F_startup.c ****     psr = pulFaultStackAddress[ 7 ];
 342              		.loc 1 315 0
 343 0032 7B68     		ldr	r3, [r7, #4]
 344 0034 DB69     		ldr	r3, [r3, #28]
 345 0036 BB60     		str	r3, [r7, #8]
 346              	.L9:
 316:../LM4F_startup.c **** 
 317:../LM4F_startup.c ****     /* When the following line is hit, the variables contain the register values. */
 318:../LM4F_startup.c ****     for( ;; );
 347              		.loc 1 318 0 discriminator 1
 348 0038 FEE7     		b	.L9
 349              		.cfi_endproc
 350              	.LFE2:
 352 003a 00BF     		.section	.text.HardFault_Handler,"ax",%progbits
 353              		.align	2
 354              		.thumb
 355              		.thumb_func
 357              	HardFault_Handler:
 358              	.LFB3:
 319:../LM4F_startup.c **** }
 320:../LM4F_startup.c **** 
 321:../LM4F_startup.c **** /* The fault handler implementation calls a function called
 322:../LM4F_startup.c **** prvGetRegistersFromStack(). */
 323:../LM4F_startup.c **** static void HardFault_Handler(void)
 324:../LM4F_startup.c **** {
 359              		.loc 1 324 0
 360              		.cfi_startproc
 361              		@ Naked Function: prologue and epilogue provided by programmer.
 362              		@ args = 0, pretend = 0, frame = 0
 363              		@ frame_needed = 1, uses_anonymous_args = 0
 325:../LM4F_startup.c ****     __asm volatile
 364              		.loc 1 325 0
 365              	@ 325 "../LM4F_startup.c" 1
 366 0000 1EF0040F 		 tst lr, #4                                                
 367 0004 0CBF     	 ite eq                                                    
 368 0006 EFF30880 	 mrseq r0, msp                                             
 369 000a EFF30980 	 mrsne r0, psp                                             
 370 000e 8169     	 ldr r1, [r0, #24]                                         
 371 0010 004A     	 ldr r2, handler2_address_const                            
 372 0012 1047     	 bx r2                                                     
 373 0014 00000000 	 handler2_address_const: .word prvGetRegistersFromStack    
 374              	
 375              	@ 0 "" 2
 326:../LM4F_startup.c ****     (
 327:../LM4F_startup.c ****         " tst lr, #4                                                \n"
 328:../LM4F_startup.c ****         " ite eq                                                    \n"
 329:../LM4F_startup.c ****         " mrseq r0, msp                                             \n"
 330:../LM4F_startup.c ****         " mrsne r0, psp                                             \n"
 331:../LM4F_startup.c ****         " ldr r1, [r0, #24]                                         \n"
 332:../LM4F_startup.c ****         " ldr r2, handler2_address_const                            \n"
 333:../LM4F_startup.c ****         " bx r2                                                     \n"
 334:../LM4F_startup.c ****         " handler2_address_const: .word prvGetRegistersFromStack    \n"
 335:../LM4F_startup.c ****     );
 336:../LM4F_startup.c **** }
 376              		.loc 1 336 0
 377              		.thumb
 378              		.cfi_endproc
 379              	.LFE3:
 381              		.section	.text.hardfault_handler,"ax",%progbits
 382              		.align	2
 383              		.global	hardfault_handler
 384              		.thumb
 385              		.thumb_func
 387              	hardfault_handler:
 388              	.LFB4:
 337:../LM4F_startup.c **** 
 338:../LM4F_startup.c **** // Hard fault handler code NVIC 3
 339:../LM4F_startup.c **** void hardfault_handler(void){
 389              		.loc 1 339 0
 390              		.cfi_startproc
 391              		@ args = 0, pretend = 0, frame = 0
 392              		@ frame_needed = 1, uses_anonymous_args = 0
 393              		@ link register save eliminated.
 394 0000 80B4     		push	{r7}
 395              	.LCFI8:
 396              		.cfi_def_cfa_offset 4
 397              		.cfi_offset 7, -4
 398 0002 00AF     		add	r7, sp, #0
 399              	.LCFI9:
 400              		.cfi_def_cfa_register 7
 401              	.L12:
 340:../LM4F_startup.c **** 	// Just loop forever, so if you want to debug the processor it's running.
 341:../LM4F_startup.c ****     while(1){
 342:../LM4F_startup.c ****     }
 402              		.loc 1 342 0 discriminator 1
 403 0004 FEE7     		b	.L12
 404              		.cfi_endproc
 405              	.LFE4:
 407 0006 00BF     		.section	.text.empty_def_handler,"ax",%progbits
 408              		.align	2
 409              		.global	empty_def_handler
 410              		.thumb
 411              		.thumb_func
 413              	empty_def_handler:
 414              	.LFB5:
 343:../LM4F_startup.c **** }
 344:../LM4F_startup.c **** 
 345:../LM4F_startup.c **** // Empty handler used as default.
 346:../LM4F_startup.c **** void empty_def_handler(void){
 415              		.loc 1 346 0
 416              		.cfi_startproc
 417              		@ args = 0, pretend = 0, frame = 0
 418              		@ frame_needed = 1, uses_anonymous_args = 0
 419              		@ link register save eliminated.
 420 0000 80B4     		push	{r7}
 421              	.LCFI10:
 422              		.cfi_def_cfa_offset 4
 423              		.cfi_offset 7, -4
 424 0002 00AF     		add	r7, sp, #0
 425              	.LCFI11:
 426              		.cfi_def_cfa_register 7
 427              	.L14:
 347:../LM4F_startup.c **** 	// Just loop forever, so if you want to debug the processor it's running.
 348:../LM4F_startup.c ****     while(1){
 349:../LM4F_startup.c ****     }
 428              		.loc 1 349 0 discriminator 1
 429 0004 FEE7     		b	.L14
 430              		.cfi_endproc
 431              	.LFE5:
 433 0006 00BF     		.text
 434              	.Letext0:
DEFINED SYMBOLS
                            *ABS*:0000000000000000 LM4F_startup.c
     /tmp/ccl3C91Q.s:25     .nvic_table:0000000000000000 myvectors
     /tmp/ccl3C91Q.s:22     .nvic_table:0000000000000000 $d
     /tmp/ccl3C91Q.s:187    .text.rst_handler:0000000000000000 rst_handler
     /tmp/ccl3C91Q.s:270    .text.nmi_handler:0000000000000000 nmi_handler
     /tmp/ccl3C91Q.s:357    .text.HardFault_Handler:0000000000000000 HardFault_Handler
     /tmp/ccl3C91Q.s:413    .text.empty_def_handler:0000000000000000 empty_def_handler
     /tmp/ccl3C91Q.s:182    .text.rst_handler:0000000000000000 $t
     /tmp/ccl3C91Q.s:265    .text.nmi_handler:0000000000000000 $t
     /tmp/ccl3C91Q.s:291    .text.prvGetRegistersFromStack:0000000000000000 $t
     /tmp/ccl3C91Q.s:296    .text.prvGetRegistersFromStack:0000000000000000 prvGetRegistersFromStack
     /tmp/ccl3C91Q.s:353    .text.HardFault_Handler:0000000000000000 $t
     /tmp/ccl3C91Q.s:373    .text.HardFault_Handler:0000000000000014 handler2_address_const
     /tmp/ccl3C91Q.s:373    .text.HardFault_Handler:0000000000000014 $d
     /tmp/ccl3C91Q.s:382    .text.hardfault_handler:0000000000000000 $t
     /tmp/ccl3C91Q.s:387    .text.hardfault_handler:0000000000000000 hardfault_handler
     /tmp/ccl3C91Q.s:408    .text.empty_def_handler:0000000000000000 $t
                     .debug_frame:0000000000000010 $d
                           .group:0000000000000000 wm4.1.d6277083df0ab2a59c59ab976b63114d

UNDEFINED SYMBOLS
_stack_top
SysTickIntHandler
UARTStdioIntHandler
_end_text
_start_data
_end_data
_start_bss
_end_bss
main
