EESchema Schematic File Version 4
LIBS:TivaStepperControllerAdapterBoard-cache
EELAYER 26 0
EELAYER END
$Descr A4 11693 8268
encoding utf-8
Sheet 1 1
Title ""
Date ""
Rev ""
Comp ""
Comment1 ""
Comment2 ""
Comment3 ""
Comment4 ""
$EndDescr
$Comp
L Connector_Generic:Conn_02x10_Odd_Even X8
U 1 1 5AA8D527
P 3600 2000
F 0 "X8" H 3650 2617 50  0000 C CNN
F 1 "Conn_02x10_Odd_Even" H 3650 2526 50  0000 C CNN
F 2 "Pin_Headers:Pin_Header_Straight_2x10_Pitch2.54mm" H 3600 2000 50  0001 C CNN
F 3 "~" H 3600 2000 50  0001 C CNN
	1    3600 2000
	1    0    0    -1  
$EndComp
$Comp
L Connector_Generic:Conn_02x10_Odd_Even X9
U 1 1 5AA8D5A8
P 6400 1950
F 0 "X9" H 6450 2567 50  0000 C CNN
F 1 "Conn_02x10_Odd_Even" H 6450 2476 50  0000 C CNN
F 2 "Pin_Headers:Pin_Header_Straight_2x10_Pitch2.54mm" H 6400 1950 50  0001 C CNN
F 3 "~" H 6400 1950 50  0001 C CNN
	1    6400 1950
	1    0    0    -1  
$EndComp
$Comp
L Connector_Generic:Conn_02x10_Odd_Even X6
U 1 1 5AA8D5F6
P 3550 4000
F 0 "X6" H 3600 4617 50  0000 C CNN
F 1 "Conn_02x10_Odd_Even" H 3600 4526 50  0000 C CNN
F 2 "Pin_Headers:Pin_Header_Straight_2x10_Pitch2.54mm" H 3550 4000 50  0001 C CNN
F 3 "~" H 3550 4000 50  0001 C CNN
	1    3550 4000
	1    0    0    -1  
$EndComp
$Comp
L Connector_Generic:Conn_02x10_Odd_Even X7
U 1 1 5AA8D67F
P 6350 4000
F 0 "X7" H 6400 4617 50  0000 C CNN
F 1 "Conn_02x10_Odd_Even" H 6400 4526 50  0000 C CNN
F 2 "Pin_Headers:Pin_Header_Straight_2x10_Pitch2.54mm" H 6350 4000 50  0001 C CNN
F 3 "~" H 6350 4000 50  0001 C CNN
	1    6350 4000
	1    0    0    -1  
$EndComp
$Comp
L Connector_Generic:Conn_01x05 J1
U 1 1 5AA8D6EA
P 11000 900
F 0 "J1" H 11080 942 50  0000 L CNN
F 1 "Conn_01x05" H 11080 851 50  0000 L CNN
F 2 "Pin_Headers:Pin_Header_Straight_1x05_Pitch2.54mm" H 11000 900 50  0001 C CNN
F 3 "~" H 11000 900 50  0001 C CNN
	1    11000 900 
	1    0    0    -1  
$EndComp
$Comp
L Connector_Generic:Conn_01x05 J2
U 1 1 5AA8D779
P 11000 1650
F 0 "J2" H 11080 1692 50  0000 L CNN
F 1 "Conn_01x05" H 11080 1601 50  0000 L CNN
F 2 "Pin_Headers:Pin_Header_Straight_1x05_Pitch2.54mm" H 11000 1650 50  0001 C CNN
F 3 "~" H 11000 1650 50  0001 C CNN
	1    11000 1650
	1    0    0    -1  
$EndComp
$Comp
L Connector_Generic:Conn_01x05 J3
U 1 1 5AA8D7E9
P 11000 2400
F 0 "J3" H 11080 2442 50  0000 L CNN
F 1 "Conn_01x05" H 11080 2351 50  0000 L CNN
F 2 "Pin_Headers:Pin_Header_Straight_1x05_Pitch2.54mm" H 11000 2400 50  0001 C CNN
F 3 "~" H 11000 2400 50  0001 C CNN
	1    11000 2400
	1    0    0    -1  
$EndComp
$Comp
L Connector_Generic:Conn_01x05 J4
U 1 1 5AA8D87E
P 11000 3100
F 0 "J4" H 11080 3142 50  0000 L CNN
F 1 "Conn_01x05" H 11080 3051 50  0000 L CNN
F 2 "Pin_Headers:Pin_Header_Straight_1x05_Pitch2.54mm" H 11000 3100 50  0001 C CNN
F 3 "~" H 11000 3100 50  0001 C CNN
	1    11000 3100
	1    0    0    -1  
$EndComp
$Comp
L Connector_Generic:Conn_01x05 J5
U 1 1 5AA8D8FE
P 11000 3800
F 0 "J5" H 11080 3842 50  0000 L CNN
F 1 "Conn_01x05" H 11080 3751 50  0000 L CNN
F 2 "Pin_Headers:Pin_Header_Straight_1x05_Pitch2.54mm" H 11000 3800 50  0001 C CNN
F 3 "~" H 11000 3800 50  0001 C CNN
	1    11000 3800
	1    0    0    -1  
$EndComp
$Comp
L Connector_Generic:Conn_01x05 J6
U 1 1 5AA8D96B
P 11000 4500
F 0 "J6" H 11080 4542 50  0000 L CNN
F 1 "Conn_01x05" H 11080 4451 50  0000 L CNN
F 2 "Pin_Headers:Pin_Header_Straight_1x05_Pitch2.54mm" H 11000 4500 50  0001 C CNN
F 3 "~" H 11000 4500 50  0001 C CNN
	1    11000 4500
	1    0    0    -1  
$EndComp
$Comp
L Logic_74xx:74HC244 U1
U 1 1 5AA8D9E4
P 8000 2100
F 0 "U1" H 8000 3078 50  0000 C CNN
F 1 "74HC244" H 8000 2987 50  0000 C CNN
F 2 "Housings_DIP:DIP-20_W7.62mm_Socket" H 8000 2100 50  0001 C CNN
F 3 "http://www.nxp.com/documents/data_sheet/74HC_HCT244.pdf" H 8000 2100 50  0001 C CNN
	1    8000 2100
	1    0    0    -1  
$EndComp
$Comp
L Logic_74xx:74HC244 U2
U 1 1 5AA8DB09
P 8000 4250
F 0 "U2" H 8000 5228 50  0000 C CNN
F 1 "74HC244" H 8000 5137 50  0000 C CNN
F 2 "Housings_DIP:DIP-20_W7.62mm_Socket" H 8000 4250 50  0001 C CNN
F 3 "http://www.nxp.com/documents/data_sheet/74HC_HCT244.pdf" H 8000 4250 50  0001 C CNN
	1    8000 4250
	1    0    0    -1  
$EndComp
$Comp
L Logic_74xx:74HC244 U3
U 1 1 5AA8DB97
P 5850 5900
F 0 "U3" H 5850 6878 50  0000 C CNN
F 1 "74HC244" H 5850 6787 50  0000 C CNN
F 2 "Housings_DIP:DIP-20_W7.62mm_Socket" H 5850 5900 50  0001 C CNN
F 3 "http://www.nxp.com/documents/data_sheet/74HC_HCT244.pdf" H 5850 5900 50  0001 C CNN
	1    5850 5900
	1    0    0    -1  
$EndComp
$Comp
L power:GND #PWR0101
U 1 1 5AA8EEEB
P 10700 6150
F 0 "#PWR0101" H 10700 5900 50  0001 C CNN
F 1 "GND" H 10705 5977 50  0000 C CNN
F 2 "" H 10700 6150 50  0001 C CNN
F 3 "" H 10700 6150 50  0001 C CNN
	1    10700 6150
	1    0    0    -1  
$EndComp
Wire Wire Line
	10700 6150 10700 5300
Wire Wire Line
	10700 4600 10800 4600
Wire Wire Line
	10700 4600 10700 3900
Wire Wire Line
	10700 3900 10800 3900
Connection ~ 10700 4600
Wire Wire Line
	10700 3900 10700 3200
Wire Wire Line
	10700 3200 10800 3200
Connection ~ 10700 3900
Wire Wire Line
	10700 3200 10700 2500
Wire Wire Line
	10700 2500 10800 2500
Connection ~ 10700 3200
Wire Wire Line
	10700 2500 10700 1750
Wire Wire Line
	10700 1750 10800 1750
Connection ~ 10700 2500
Wire Wire Line
	10700 1750 10700 1000
Wire Wire Line
	10700 1000 10800 1000
Connection ~ 10700 1750
Wire Wire Line
	8000 5050 8000 5300
Wire Wire Line
	8000 5300 10700 5300
Connection ~ 10700 5300
Wire Wire Line
	10700 5300 10700 4600
Wire Wire Line
	8000 2900 8000 3200
Wire Wire Line
	8000 3200 10700 3200
Wire Wire Line
	3850 3700 5100 3700
Wire Wire Line
	5100 3700 5100 3200
Wire Wire Line
	5100 3200 6900 3200
Connection ~ 8000 3200
Connection ~ 6900 3200
Wire Wire Line
	6900 3200 7400 3200
Wire Wire Line
	3900 1700 5100 1700
Wire Wire Line
	5100 1700 5100 3200
Connection ~ 5100 3200
Wire Wire Line
	6700 1550 6900 1550
Wire Wire Line
	6900 1550 6900 3200
Wire Wire Line
	3850 3600 5000 3600
Wire Wire Line
	5000 3600 5000 3350
Wire Wire Line
	5000 3350 5850 3350
Wire Wire Line
	8000 3350 8000 3450
Wire Wire Line
	5100 1600 5100 1150
Wire Wire Line
	5100 1150 8000 1150
Wire Wire Line
	8000 1150 8000 1300
Wire Wire Line
	3900 1600 5000 1600
Wire Wire Line
	5000 1600 5000 3350
Connection ~ 5000 1600
Wire Wire Line
	5000 1600 5100 1600
Connection ~ 5000 3350
Wire Wire Line
	5850 5100 5850 4900
Connection ~ 5850 3350
Wire Wire Line
	5850 3350 8000 3350
Wire Wire Line
	8000 5300 8000 6400
Wire Wire Line
	6600 6400 6600 6900
Wire Wire Line
	6600 6900 5850 6900
Wire Wire Line
	5850 6900 5850 6700
Connection ~ 8000 5300
Wire Wire Line
	6900 3600 6650 3600
Wire Wire Line
	6900 3200 6900 3600
Wire Wire Line
	8500 1600 9800 1600
Wire Wire Line
	9800 700  10800 700 
Wire Wire Line
	9800 700  9800 1600
Wire Wire Line
	8500 1700 9850 1700
Wire Wire Line
	9850 1700 9850 800 
Wire Wire Line
	9850 800  10800 800 
Wire Wire Line
	8500 1800 9900 1800
Wire Wire Line
	9900 1800 9900 900 
Wire Wire Line
	9900 900  10800 900 
Wire Wire Line
	8500 2000 9950 2000
Wire Wire Line
	9950 2000 9950 1450
Wire Wire Line
	9950 1450 10800 1450
Wire Wire Line
	8500 2100 10000 2100
Wire Wire Line
	10000 2100 10000 1550
Wire Wire Line
	10000 1550 10800 1550
Wire Wire Line
	8500 2200 10050 2200
Wire Wire Line
	10050 2200 10050 1650
Wire Wire Line
	10050 1650 10800 1650
Wire Wire Line
	10800 2200 10100 2200
Wire Wire Line
	10100 2200 10100 2300
Wire Wire Line
	10100 2300 9650 2300
Wire Wire Line
	9650 2300 9650 3750
Wire Wire Line
	9650 3750 8500 3750
Wire Wire Line
	8500 3850 9700 3850
Wire Wire Line
	9700 3850 9700 2400
Wire Wire Line
	9700 2400 10150 2400
Wire Wire Line
	10150 2400 10150 2300
Wire Wire Line
	10150 2300 10800 2300
Wire Wire Line
	10800 2400 10200 2400
Wire Wire Line
	10200 2400 10200 2500
Wire Wire Line
	10200 2500 9750 2500
Wire Wire Line
	9750 2500 9750 3950
Wire Wire Line
	9750 3950 8500 3950
Wire Wire Line
	10800 2900 9800 2900
Wire Wire Line
	9800 2900 9800 4150
Wire Wire Line
	9800 4150 8500 4150
Wire Wire Line
	10800 3000 9850 3000
Wire Wire Line
	9850 3000 9850 4250
Wire Wire Line
	9850 4250 8500 4250
Wire Wire Line
	10800 3100 9900 3100
Wire Wire Line
	9900 3100 9900 4350
Wire Wire Line
	9900 4350 8500 4350
Wire Wire Line
	10800 3600 9950 3600
Wire Wire Line
	9950 3600 9950 5400
Wire Wire Line
	9950 5400 6350 5400
Wire Wire Line
	10800 3700 10000 3700
Wire Wire Line
	10000 3700 10000 5500
Wire Wire Line
	10000 5500 6350 5500
Wire Wire Line
	10800 3800 10050 3800
Wire Wire Line
	10050 3800 10050 5600
Wire Wire Line
	10050 5600 6350 5600
Wire Wire Line
	10800 4300 10100 4300
Wire Wire Line
	10100 4300 10100 5800
Wire Wire Line
	10100 5800 6350 5800
Wire Wire Line
	10800 4400 10150 4400
Wire Wire Line
	10150 4400 10150 5900
Wire Wire Line
	10150 5900 6350 5900
Wire Wire Line
	10800 4500 10200 4500
Wire Wire Line
	10200 4500 10200 6000
Wire Wire Line
	10200 6000 6350 6000
Wire Wire Line
	7500 4650 7400 4650
Wire Wire Line
	7400 4650 7400 4750
Wire Wire Line
	7400 5300 8000 5300
Wire Wire Line
	7500 4750 7400 4750
Connection ~ 7400 4750
Wire Wire Line
	7400 4750 7400 5300
Wire Wire Line
	7500 2500 7400 2500
Wire Wire Line
	7400 2500 7400 2600
Connection ~ 7400 3200
Wire Wire Line
	7400 3200 8000 3200
Wire Wire Line
	7500 2600 7400 2600
Connection ~ 7400 2600
Wire Wire Line
	7400 2600 7400 3200
Wire Wire Line
	5850 6900 5250 6900
Wire Wire Line
	5250 6300 5350 6300
Connection ~ 5850 6900
Wire Wire Line
	5350 6400 5250 6400
Wire Wire Line
	5250 6300 5250 6400
Connection ~ 5250 6400
Wire Wire Line
	5250 6400 5250 6900
Wire Wire Line
	6700 2150 6750 2150
Wire Wire Line
	7200 2150 7200 1600
Wire Wire Line
	7200 1600 7500 1600
Wire Wire Line
	6700 2050 6750 2050
Wire Wire Line
	6750 2050 6750 2150
Connection ~ 6750 2150
Wire Wire Line
	6750 2150 7200 2150
Wire Wire Line
	3900 1800 5200 1800
Wire Wire Line
	5200 1800 5200 1300
Wire Wire Line
	5200 1300 7250 1300
Wire Wire Line
	7250 1300 7250 1700
Wire Wire Line
	7250 1700 7500 1700
Wire Wire Line
	6200 2150 5950 2150
Wire Wire Line
	5950 2150 5950 1400
Wire Wire Line
	5950 1400 7100 1400
Wire Wire Line
	7100 1400 7100 1800
Wire Wire Line
	7100 1800 7500 1800
Wire Wire Line
	7400 2500 7400 2300
Wire Wire Line
	7400 1900 7500 1900
Connection ~ 7400 2500
Wire Wire Line
	7500 2300 7400 2300
Connection ~ 7400 2300
Wire Wire Line
	7400 2300 7400 1900
Wire Wire Line
	3350 3700 3200 3700
Wire Wire Line
	3200 3700 3200 3100
Wire Wire Line
	3200 3100 7250 3100
Wire Wire Line
	7250 3100 7250 2000
Wire Wire Line
	7250 2000 7500 2000
Wire Wire Line
	3200 3100 3200 2200
Wire Wire Line
	3200 2200 3400 2200
Connection ~ 3200 3100
Wire Wire Line
	3900 1900 5200 1900
Wire Wire Line
	5200 1900 5200 2800
Wire Wire Line
	5200 2800 7300 2800
Wire Wire Line
	7300 2800 7300 2100
Wire Wire Line
	7300 2100 7500 2100
Wire Wire Line
	6200 2250 5950 2250
Wire Wire Line
	5950 2250 5950 2900
Wire Wire Line
	5950 2900 7350 2900
Wire Wire Line
	7350 2900 7350 2200
Wire Wire Line
	7350 2200 7500 2200
Wire Wire Line
	3850 4400 3900 4400
Wire Wire Line
	5200 4400 5200 3250
Wire Wire Line
	5200 3250 7250 3250
Wire Wire Line
	7250 3250 7250 3750
Wire Wire Line
	7250 3750 7500 3750
Wire Wire Line
	3850 4500 3900 4500
Wire Wire Line
	3900 4500 3900 4400
Connection ~ 3900 4400
Wire Wire Line
	3900 4400 5200 4400
Wire Wire Line
	3900 2000 4900 2000
Wire Wire Line
	4900 2000 4900 3300
Wire Wire Line
	4900 3300 7200 3300
Wire Wire Line
	7200 3300 7200 3850
Wire Wire Line
	7200 3850 7500 3850
Wire Wire Line
	6200 2350 6000 2350
Wire Wire Line
	6000 2350 6000 3400
Wire Wire Line
	6000 3400 7150 3400
Wire Wire Line
	7150 3400 7150 3950
Wire Wire Line
	7150 3950 7500 3950
Wire Wire Line
	7400 4650 7400 4450
Wire Wire Line
	7400 4050 7500 4050
Connection ~ 7400 4650
Wire Wire Line
	7500 4450 7400 4450
Connection ~ 7400 4450
Wire Wire Line
	7400 4450 7400 4050
Wire Wire Line
	3900 2300 4850 2300
Wire Wire Line
	4850 2300 4850 4600
Wire Wire Line
	4850 4600 7150 4600
Wire Wire Line
	7150 4600 7150 4150
Wire Wire Line
	7150 4150 7500 4150
Wire Wire Line
	6650 3900 7100 3900
Wire Wire Line
	7100 3900 7100 4150
Wire Wire Line
	7100 4150 7150 4150
Connection ~ 7150 4150
Wire Wire Line
	3900 2100 4800 2100
Wire Wire Line
	4800 2100 4800 4700
Wire Wire Line
	4800 4700 7200 4700
Wire Wire Line
	7200 4700 7200 4250
Wire Wire Line
	7200 4250 7500 4250
Wire Wire Line
	6200 2450 6150 2450
Wire Wire Line
	6150 2450 6150 2600
Wire Wire Line
	6150 2600 7050 2600
Wire Wire Line
	7050 2600 7050 4350
Wire Wire Line
	7050 4350 7500 4350
Wire Wire Line
	5250 6300 5250 6100
Wire Wire Line
	5250 6100 5350 6100
Connection ~ 5250 6300
Wire Wire Line
	5250 6100 5250 5700
Wire Wire Line
	5250 5700 5350 5700
Connection ~ 5250 6100
Wire Wire Line
	3900 2400 3950 2400
Wire Wire Line
	4750 2400 4750 5400
Wire Wire Line
	4750 5400 5350 5400
Wire Wire Line
	3900 2500 3950 2500
Wire Wire Line
	3950 2500 3950 2400
Connection ~ 3950 2400
Wire Wire Line
	3950 2400 4750 2400
Wire Wire Line
	3400 1700 3150 1700
Wire Wire Line
	3150 1700 3150 5500
Wire Wire Line
	3150 5500 5350 5500
Wire Wire Line
	6200 1950 5250 1950
Wire Wire Line
	5250 1950 5250 5600
Wire Wire Line
	5250 5600 5350 5600
Wire Wire Line
	6650 4500 6700 4500
Wire Wire Line
	6700 4500 6700 4800
Wire Wire Line
	6700 4800 5150 4800
Wire Wire Line
	5150 4800 5150 5800
Wire Wire Line
	5150 5800 5350 5800
Wire Wire Line
	6650 3700 6700 3700
Wire Wire Line
	6700 3700 6700 4500
Connection ~ 6700 4500
Wire Wire Line
	3400 2100 3100 2100
Wire Wire Line
	3100 2100 3100 5900
Wire Wire Line
	3100 5900 5350 5900
Wire Wire Line
	6200 2050 5300 2050
Wire Wire Line
	5300 2050 5300 6000
Wire Wire Line
	5300 6000 5350 6000
Wire Wire Line
	10800 1100 3050 1100
Wire Wire Line
	3050 1100 3050 3800
Wire Wire Line
	3050 3800 3350 3800
Wire Wire Line
	10800 1850 10250 1850
Wire Wire Line
	10250 1850 10250 2850
Wire Wire Line
	10250 2850 7500 2850
Wire Wire Line
	7500 2850 7500 3000
Wire Wire Line
	7500 3000 3000 3000
Wire Wire Line
	3000 3000 3000 3900
Wire Wire Line
	3000 3900 3350 3900
Wire Wire Line
	10800 2600 8400 2600
Wire Wire Line
	8400 2600 8400 2950
Wire Wire Line
	8400 2950 6800 2950
Wire Wire Line
	6800 2950 6800 2450
Wire Wire Line
	6800 2450 6700 2450
Wire Wire Line
	10800 3300 7300 3300
Wire Wire Line
	7300 3300 7300 4300
Wire Wire Line
	7300 4300 6650 4300
Wire Wire Line
	10800 4000 8700 4000
Wire Wire Line
	8700 4000 8700 5150
Wire Wire Line
	8700 5150 3300 5150
Wire Wire Line
	3300 5150 3300 4300
Wire Wire Line
	3300 4300 3350 4300
Wire Wire Line
	10800 4700 8450 4700
Wire Wire Line
	8450 4700 8450 5000
Wire Wire Line
	8450 5000 6800 5000
Wire Wire Line
	6800 5000 6800 3800
Wire Wire Line
	6800 3800 6650 3800
Wire Wire Line
	3400 1600 3300 1600
Wire Wire Line
	3300 3600 3350 3600
$Comp
L Connector_Generic:Conn_02x07_Odd_Even J7
U 1 1 5AF2052D
P 1400 4100
F 0 "J7" H 1450 4617 50  0000 C CNN
F 1 "Conn_02x07_Odd_Even" H 1450 4526 50  0000 C CNN
F 2 "Pin_Headers:Pin_Header_Straight_2x07_Pitch2.54mm" H 1400 4100 50  0001 C CNN
F 3 "~" H 1400 4100 50  0001 C CNN
	1    1400 4100
	1    0    0    -1  
$EndComp
Wire Wire Line
	3300 1600 3300 3600
Wire Wire Line
	3850 4000 3950 4000
Wire Wire Line
	3950 4000 3950 3450
Wire Wire Line
	3950 3450 1150 3450
Wire Wire Line
	1150 3450 1150 3800
Wire Wire Line
	1150 3800 1200 3800
Wire Wire Line
	3850 4100 4000 4100
Wire Wire Line
	4000 4100 4000 3400
Wire Wire Line
	4000 3400 1800 3400
Wire Wire Line
	1800 3400 1800 3800
Wire Wire Line
	1800 3800 1700 3800
Wire Wire Line
	3850 4200 4050 4200
Wire Wire Line
	4050 4200 4050 3350
Wire Wire Line
	4050 3350 1100 3350
Wire Wire Line
	1100 3350 1100 3900
Wire Wire Line
	1100 3900 1200 3900
Wire Wire Line
	3850 4300 4100 4300
Wire Wire Line
	4100 4300 4100 3300
Wire Wire Line
	4100 3300 1850 3300
Wire Wire Line
	1850 3300 1850 3900
Wire Wire Line
	1850 3900 1700 3900
Wire Wire Line
	6150 3700 5450 3700
Wire Wire Line
	5450 3700 5450 3400
Wire Wire Line
	5450 3400 4700 3400
Wire Wire Line
	4700 3400 4700 3150
Wire Wire Line
	4700 3150 1050 3150
Wire Wire Line
	1050 3150 1050 4000
Wire Wire Line
	1050 4000 1200 4000
Wire Wire Line
	6150 3800 5400 3800
Wire Wire Line
	5400 3800 5400 3450
Wire Wire Line
	5400 3450 4650 3450
Wire Wire Line
	4650 3450 4650 3200
Wire Wire Line
	4650 3200 1900 3200
Wire Wire Line
	1900 3200 1900 4000
Wire Wire Line
	1900 4000 1700 4000
Wire Wire Line
	6150 4400 5350 4400
Wire Wire Line
	5350 4400 5350 4650
Wire Wire Line
	5350 4650 1000 4650
Wire Wire Line
	1000 4650 1000 4100
Wire Wire Line
	1000 4100 1200 4100
Wire Wire Line
	6150 4500 5400 4500
Wire Wire Line
	5400 4500 5400 4750
Wire Wire Line
	5400 4750 1900 4750
Wire Wire Line
	1900 4750 1900 4100
Wire Wire Line
	1900 4100 1700 4100
Wire Wire Line
	6150 3900 4150 3900
Wire Wire Line
	4150 3900 4150 4600
Wire Wire Line
	4150 4600 1050 4600
Wire Wire Line
	1050 4600 1050 4200
Wire Wire Line
	1050 4200 1200 4200
Wire Wire Line
	6150 4000 4200 4000
Wire Wire Line
	4200 4000 4200 4700
Wire Wire Line
	4200 4700 1850 4700
Wire Wire Line
	1850 4700 1850 4200
Wire Wire Line
	1850 4200 1700 4200
Wire Wire Line
	6150 4100 4250 4100
Wire Wire Line
	4250 4100 4250 4800
Wire Wire Line
	1100 4800 1100 4300
Wire Wire Line
	1100 4300 1200 4300
Wire Wire Line
	6700 1650 6850 1650
Wire Wire Line
	6850 1650 6850 3150
Wire Wire Line
	6850 3150 5500 3150
Wire Wire Line
	5500 3150 5500 4850
Wire Wire Line
	5500 4850 1800 4850
Wire Wire Line
	1800 4850 1800 4300
Wire Wire Line
	1800 4300 1700 4300
Wire Wire Line
	1150 4550 1150 4400
Wire Wire Line
	1150 4400 1200 4400
Wire Wire Line
	5250 6900 1750 6900
Wire Wire Line
	1750 4400 1700 4400
Connection ~ 5250 6900
Wire Wire Line
	3300 3600 2950 3600
Wire Wire Line
	2950 3600 2950 4550
Connection ~ 3300 3600
Wire Wire Line
	2950 4550 1450 4550
Wire Wire Line
	6600 6100 6600 4900
Wire Wire Line
	6600 4900 5850 4900
Connection ~ 5850 4900
Wire Wire Line
	5850 4900 5850 3350
Wire Wire Line
	6600 6100 7050 6100
Wire Wire Line
	6600 6400 7050 6400
$Comp
L Device:CP C3
U 1 1 5AC55A2C
P 6600 6250
F 0 "C3" H 6718 6296 50  0000 L CNN
F 1 "4.7uF" H 6718 6205 50  0000 L CNN
F 2 "Capacitors_SMD:C_1206" H 6638 6100 50  0001 C CNN
F 3 "~" H 6600 6250 50  0001 C CNN
	1    6600 6250
	1    0    0    -1  
$EndComp
Connection ~ 6600 6100
Connection ~ 6600 6400
$Comp
L Device:C C4
U 1 1 5AC55D34
P 7050 6250
F 0 "C4" H 7165 6296 50  0000 L CNN
F 1 "100n" H 7165 6205 50  0000 L CNN
F 2 "Capacitors_SMD:C_0805" H 7088 6100 50  0001 C CNN
F 3 "~" H 7050 6250 50  0001 C CNN
	1    7050 6250
	1    0    0    -1  
$EndComp
Connection ~ 7050 6100
Connection ~ 7050 6400
$Comp
L Device:C C5
U 1 1 5AC55DB0
P 7400 6250
F 0 "C5" H 7515 6296 50  0000 L CNN
F 1 "100n" H 7515 6205 50  0000 L CNN
F 2 "Capacitors_SMD:C_0805" H 7438 6100 50  0001 C CNN
F 3 "~" H 7400 6250 50  0001 C CNN
	1    7400 6250
	1    0    0    -1  
$EndComp
$Comp
L Device:C C6
U 1 1 5AC55E39
P 7700 6250
F 0 "C6" H 7815 6296 50  0000 L CNN
F 1 "100n" H 7815 6205 50  0000 L CNN
F 2 "Capacitors_SMD:C_0805" H 7738 6100 50  0001 C CNN
F 3 "~" H 7700 6250 50  0001 C CNN
	1    7700 6250
	1    0    0    -1  
$EndComp
Connection ~ 7700 6400
Wire Wire Line
	7700 6400 8000 6400
Wire Wire Line
	7050 6100 7400 6100
Wire Wire Line
	7050 6400 7400 6400
Connection ~ 7400 6100
Wire Wire Line
	7400 6100 7700 6100
Connection ~ 7400 6400
Wire Wire Line
	7400 6400 7700 6400
$Comp
L Device:CP C1
U 1 1 5ACCA6DC
P 1600 5600
F 0 "C1" H 1718 5646 50  0000 L CNN
F 1 "4.7uF" H 1718 5555 50  0000 L CNN
F 2 "Capacitors_SMD:C_1206" H 1638 5450 50  0001 C CNN
F 3 "~" H 1600 5600 50  0001 C CNN
	1    1600 5600
	0    -1   -1   0   
$EndComp
$Comp
L Device:C C2
U 1 1 5ACCA770
P 1600 5150
F 0 "C2" H 1715 5196 50  0000 L CNN
F 1 "100n" H 1715 5105 50  0000 L CNN
F 2 "Capacitors_SMD:C_0805" H 1638 5000 50  0001 C CNN
F 3 "~" H 1600 5150 50  0001 C CNN
	1    1600 5150
	0    -1   -1   0   
$EndComp
Wire Wire Line
	1750 4400 1750 5150
Wire Wire Line
	1100 4800 4250 4800
Connection ~ 1750 5150
Wire Wire Line
	1750 5150 1750 5600
Connection ~ 1750 5600
Wire Wire Line
	1750 5600 1750 6900
Wire Wire Line
	1450 5600 1450 5150
Wire Wire Line
	1450 5150 1450 4550
Connection ~ 1450 5150
Connection ~ 1450 4550
Wire Wire Line
	1450 4550 1150 4550
$EndSCHEMATC
