EESchema Schematic File Version 4
EELAYER 26 0
EELAYER END
$Descr A4 11693 8268
encoding utf-8
Sheet 1 1
Title ""
Date ""
Rev ""
Comp ""
Comment1 ""
Comment2 ""
Comment3 ""
Comment4 ""
$EndDescr
$Comp
L power:GND #PWR0101
U 1 1 5ABA4F28
P 4850 2850
F 0 "#PWR0101" H 4850 2600 50  0001 C CNN
F 1 "GND" H 4855 2677 50  0000 C CNN
F 2 "" H 4850 2850 50  0001 C CNN
F 3 "" H 4850 2850 50  0001 C CNN
	1    4850 2850
	1    0    0    -1  
$EndComp
$Comp
L Device:R R3
U 1 1 5ABA4F89
P 4700 2550
F 0 "R3" H 4770 2596 50  0000 L CNN
F 1 "100" H 4770 2505 50  0000 L CNN
F 2 "Resistors_SMD:R_1206" V 4630 2550 50  0001 C CNN
F 3 "~" H 4700 2550 50  0001 C CNN
	1    4700 2550
	1    0    0    -1  
$EndComp
$Comp
L Device:R R4
U 1 1 5ABA5009
P 5000 2550
F 0 "R4" H 5070 2596 50  0000 L CNN
F 1 "100" H 5070 2505 50  0000 L CNN
F 2 "Resistors_SMD:R_1206" V 4930 2550 50  0001 C CNN
F 3 "~" H 5000 2550 50  0001 C CNN
	1    5000 2550
	1    0    0    -1  
$EndComp
Wire Wire Line
	4700 2700 4850 2700
Wire Wire Line
	4850 2850 4850 2800
Connection ~ 4850 2700
Wire Wire Line
	4850 2700 5000 2700
Wire Wire Line
	4700 2400 4850 2400
Wire Wire Line
	4850 2250 4850 2400
Connection ~ 4850 2400
Wire Wire Line
	4850 2400 5000 2400
$Comp
L Connector_Specialized:Conn_Coaxial J1
U 1 1 5ABA539C
P 5450 1950
F 0 "J1" H 5549 1926 50  0000 L CNN
F 1 "Conn_Coaxial" H 5549 1835 50  0000 L CNN
F 2 "Connect:SMA_THT_Jack_Straight" H 5450 1950 50  0001 C CNN
F 3 "" H 5450 1950 50  0001 C CNN
	1    5450 1950
	1    0    0    -1  
$EndComp
Wire Wire Line
	5450 2150 5450 2800
Wire Wire Line
	5450 2800 4850 2800
Connection ~ 4850 2800
Wire Wire Line
	4850 2800 4850 2700
$Comp
L Connector_Generic:Conn_01x01 J3
U 1 1 5ABA59A0
P 4850 2050
F 0 "J3" V 4816 1962 50  0000 R CNN
F 1 "Conn_01x01" V 4725 1962 50  0000 R CNN
F 2 "SMD_Packages:1Pin" H 4850 2050 50  0001 C CNN
F 3 "~" H 4850 2050 50  0001 C CNN
	1    4850 2050
	0    -1   -1   0   
$EndComp
$Comp
L Connector_Generic:Conn_01x01 J2
U 1 1 5ABA5BC1
P 5100 1950
F 0 "J2" H 5020 1725 50  0000 C CNN
F 1 "Conn_01x01" H 5020 1816 50  0000 C CNN
F 2 "SMD_Packages:1Pin" H 5100 1950 50  0001 C CNN
F 3 "~" H 5100 1950 50  0001 C CNN
	1    5100 1950
	-1   0    0    1   
$EndComp
$EndSCHEMATC
