[
    {
        "name": "@nativescript/theme",
        "directory": "../../node_modules/@nativescript/theme"
    },
    {
        "name": "nativescript-geolocation",
        "directory": "../../node_modules/nativescript-geolocation"
    },
    {
        "name": "nativescript-permissions",
        "directory": "../../node_modules/nativescript-permissions"
    },
    {
        "name": "nativescript-vue",
        "directory": "../../node_modules/nativescript-vue"
    },
    {
        "name": "tns-core-modules",
        "directory": "../../node_modules/tns-core-modules"
    },
    {
        "name": "@nativescript/core",
        "directory": "../../node_modules/@nativescript/core"
    },
    {
        "name": "tns-core-modules-widgets",
        "directory": "../../node_modules/tns-core-modules-widgets"
    }
]