{
	"info": {
		"_postman_id": "f8b8a13f-7a3a-4dec-afb4-f6e7b9cf7d46",
		"name": "S37-S41",
		"schema": "https://schema.getpostman.com/json/collection/v2.1.0/collection.json",
		"_exporter_id": "24730708"
	},
	"item": [
		{
			"name": "Check Email",
			"request": {
				"method": "POST",
				"header": [],
				"body": {
					"mode": "raw",
					"raw": "",
					"options": {
						"raw": {
							"language": "json"
						}
					}
				},
				"url": {
					"raw": "localhost:4000/users/checkEmail",
					"host": [
						"localhost"
					],
					"port": "4000",
					"path": [
						"users",
						"checkEmail"
					]
				}
			},
			"response": []
		},
		{
			"name": "Register USer",
			"request": {
				"method": "POST",
				"header": [],
				"body": {
					"mode": "raw",
					"raw": "{\r\n    \"firstName\" : \"Renan\",\r\n    \"lastName\": \"Rodriguez\",\r\n    \"email\": \"nan@mail.com\",\r\n    \"mobileNo\" :\"0912345678\",\r\n    \"password\" : \"nan12345\",\r\n    \"isAdmin\" : true\r\n\r\n}",
					"options": {
						"raw": {
							"language": "json"
						}
					}
				},
				"url": {
					"raw": "localhost:4000/users/register",
					"host": [
						"localhost"
					],
					"port": "4000",
					"path": [
						"users",
						"register"
					]
				}
			},
			"response": []
		},
		{
			"name": "User Auth",
			"request": {
				"auth": {
					"type": "noauth"
				},
				"method": "POST",
				"header": [],
				"body": {
					"mode": "raw",
					"raw": "{\r\n    \"email\": \"george@mail.com\",\r\n    \"password\": \"george1234\"\r\n}",
					"options": {
						"raw": {
							"language": "json"
						}
					}
				},
				"url": {
					"raw": "localhost:4000/users/login",
					"host": [
						"localhost"
					],
					"port": "4000",
					"path": [
						"users",
						"login"
					]
				}
			},
			"response": []
		},
		{
			"name": "Get Profile",
			"request": {
				"auth": {
					"type": "bearer",
					"bearer": [
						{
							"key": "token",
							"value": "eyJhbGciOiJIUzI1NiIsInR5cCI6IkpXVCJ9.eyJpZCI6IjYzYzhiODU1NjI2YTRlYmVjMDQwMzQ0MiIsImVtYWlsIjoibmFuQG1haWwuY29tIiwiaXNBZG1pbiI6dHJ1ZSwiaWF0IjoxNjc0MDk4OTQ2fQ.Oazdpd26ieCddsWwVJsa5cO2Y6d0rj3hvP05lR94h3E",
							"type": "string"
						}
					]
				},
				"method": "POST",
				"header": [],
				"body": {
					"mode": "raw",
					"raw": "{\r\n    \"id\" : \"63c8b855626a4ebec0403442\"\r\n}",
					"options": {
						"raw": {
							"language": "json"
						}
					}
				},
				"url": {
					"raw": "localhost:4000/users/details",
					"host": [
						"localhost"
					],
					"port": "4000",
					"path": [
						"users",
						"details"
					]
				}
			},
			"response": []
		},
		{
			"name": "Create Course",
			"request": {
				"auth": {
					"type": "bearer",
					"bearer": [
						{
							"key": "token",
							"value": "eyJhbGciOiJIUzI1NiIsInR5cCI6IkpXVCJ9.eyJpZCI6IjYzYzhiODU1NjI2YTRlYmVjMDQwMzQ0MiIsImVtYWlsIjoibmFuQG1haWwuY29tIiwiaXNBZG1pbiI6dHJ1ZSwiaWF0IjoxNjc0MTA2NjE2fQ.tG2YO23tysIC6tqI2bBQ_mMmkWiuURAeKtohMFPipoU",
							"type": "string"
						}
					]
				},
				"method": "POST",
				"header": [],
				"body": {
					"mode": "raw",
					"raw": "{\r\n    \"name\": \"CSS\",\r\n    \"description\" :\"intro to CSS\",\r\n    \"price\" : 4000\r\n}\r\n",
					"options": {
						"raw": {
							"language": "json"
						}
					}
				},
				"url": {
					"raw": "localhost:4000/courses",
					"host": [
						"localhost"
					],
					"port": "4000",
					"path": [
						"courses"
					]
				}
			},
			"response": []
		},
		{
			"name": "Get all Courses",
			"protocolProfileBehavior": {
				"disableBodyPruning": true
			},
			"request": {
				"auth": {
					"type": "noauth"
				},
				"method": "GET",
				"header": [],
				"body": {
					"mode": "raw",
					"raw": "",
					"options": {
						"raw": {
							"language": "json"
						}
					}
				},
				"url": {
					"raw": "localhost:4000/courses/AllCourses/",
					"host": [
						"localhost"
					],
					"port": "4000",
					"path": [
						"courses",
						"AllCourses",
						""
					]
				}
			},
			"response": []
		},
		{
			"name": "Get All Users",
			"request": {
				"method": "GET",
				"header": [],
				"url": {
					"raw": "localhost:4000/users/allUsers",
					"host": [
						"localhost"
					],
					"port": "4000",
					"path": [
						"users",
						"allUsers"
					]
				}
			},
			"response": []
		},
		{
			"name": "Get all active courses",
			"request": {
				"method": "GET",
				"header": [],
				"url": {
					"raw": "localhost:4000/courses/getAllActiveCourses",
					"host": [
						"localhost"
					],
					"port": "4000",
					"path": [
						"courses",
						"getAllActiveCourses"
					]
				}
			},
			"response": []
		},
		{
			"name": "Retrieve specific Course",
			"request": {
				"method": "GET",
				"header": [],
				"url": {
					"raw": "localhost:4000/courses/63c8b510753be612d67bb44e",
					"host": [
						"localhost"
					],
					"port": "4000",
					"path": [
						"courses",
						"63c8b510753be612d67bb44e"
					]
				}
			},
			"response": []
		},
		{
			"name": "Update a Course",
			"request": {
				"auth": {
					"type": "bearer",
					"bearer": [
						{
							"key": "token",
							"value": "eyJhbGciOiJIUzI1NiIsInR5cCI6IkpXVCJ9.eyJpZCI6IjYzYzhiODU1NjI2YTRlYmVjMDQwMzQ0MiIsImVtYWlsIjoibmFuQG1haWwuY29tIiwiaXNBZG1pbiI6dHJ1ZSwiaWF0IjoxNjc0MTA2NjE2fQ.tG2YO23tysIC6tqI2bBQ_mMmkWiuURAeKtohMFPipoU",
							"type": "string"
						}
					]
				},
				"method": "PUT",
				"header": [],
				"body": {
					"mode": "raw",
					"raw": "{\r\n    \"name\" : \"MongoDB\",\r\n    \"description\" : \"intro to MongoDB\",\r\n    \"price\": 2000\r\n}",
					"options": {
						"raw": {
							"language": "json"
						}
					}
				},
				"url": {
					"raw": "localhost:4000/courses/63c8c213630a9ad84807fc0b",
					"host": [
						"localhost"
					],
					"port": "4000",
					"path": [
						"courses",
						"63c8c213630a9ad84807fc0b"
					]
				}
			},
			"response": []
		},
		{
			"name": "Archive a Course",
			"request": {
				"auth": {
					"type": "bearer",
					"bearer": [
						{
							"key": "token",
							"value": "eyJhbGciOiJIUzI1NiIsInR5cCI6IkpXVCJ9.eyJpZCI6IjYzYzhiODU1NjI2YTRlYmVjMDQwMzQ0MiIsImVtYWlsIjoibmFuQG1haWwuY29tIiwiaXNBZG1pbiI6dHJ1ZSwiaWF0IjoxNjc0MTA2NjE2fQ.tG2YO23tysIC6tqI2bBQ_mMmkWiuURAeKtohMFPipoU",
							"type": "string"
						}
					]
				},
				"method": "PUT",
				"header": [],
				"body": {
					"mode": "raw",
					"raw": "{\r\n   \"isActive\" : true\r\n}",
					"options": {
						"raw": {
							"language": "json"
						}
					}
				},
				"url": {
					"raw": "localhost:4000/courses/archive/63c8c213630a9ad84807fc0b",
					"host": [
						"localhost"
					],
					"port": "4000",
					"path": [
						"courses",
						"archive",
						"63c8c213630a9ad84807fc0b"
					]
				}
			},
			"response": []
		},
		{
			"name": "Enroll",
			"request": {
				"auth": {
					"type": "bearer",
					"bearer": [
						{
							"key": "token",
							"value": "eyJhbGciOiJIUzI1NiIsInR5cCI6IkpXVCJ9.eyJpZCI6IjYzYzdhYTI5Yjg0NTUzZmVjNjQzOGNjYiIsImVtYWlsIjoiZ2VvcmdlQG1haWwuY29tIiwiaXNBZG1pbiI6ZmFsc2UsImlhdCI6MTY3NDE4MjQyMn0.MC_KYdzpRlnqkIcSORW7O8JUS55lrcAWxszpGh74NHg",
							"type": "string"
						}
					]
				},
				"method": "POST",
				"header": [],
				"body": {
					"mode": "raw",
					"raw": "{\r\n    \"courseId\": \"63c8c213630a9ad84807fc0b\"\r\n\r\n}",
					"options": {
						"raw": {
							"language": "json"
						}
					}
				},
				"url": {
					"raw": "localhost:4000/users/enroll",
					"host": [
						"localhost"
					],
					"port": "4000",
					"path": [
						"users",
						"enroll"
					]
				}
			},
			"response": []
		}
	]
}