2021-04-26T15:18:32.376-0300	INFO	instance/beat.go:660	Home path: [/Users/rodrigo.schamber/_PROJECTS/api-product/filebeat-7.12.0-darwin-x86_64] Config path: [/Users/rodrigo.schamber/_PROJECTS/api-product/filebeat-7.12.0-darwin-x86_64] Data path: [/Users/rodrigo.schamber/_PROJECTS/api-product/filebeat-7.12.0-darwin-x86_64/data] Logs path: [/Users/rodrigo.schamber/_PROJECTS/api-product/filebeat-7.12.0-darwin-x86_64/logs]
2021-04-26T15:18:32.381-0300	INFO	instance/beat.go:668	Beat ID: 387c5d78-1d6c-435a-8499-ad1ac28212d3
2021-04-26T15:18:32.411-0300	INFO	[beat]	instance/beat.go:996	Beat info	{"system_info": {"beat": {"path": {"config": "/Users/rodrigo.schamber/_PROJECTS/api-product/filebeat-7.12.0-darwin-x86_64", "data": "/Users/rodrigo.schamber/_PROJECTS/api-product/filebeat-7.12.0-darwin-x86_64/data", "home": "/Users/rodrigo.schamber/_PROJECTS/api-product/filebeat-7.12.0-darwin-x86_64", "logs": "/Users/rodrigo.schamber/_PROJECTS/api-product/filebeat-7.12.0-darwin-x86_64/logs"}, "type": "filebeat", "uuid": "387c5d78-1d6c-435a-8499-ad1ac28212d3"}}}
2021-04-26T15:18:32.411-0300	INFO	[beat]	instance/beat.go:1005	Build info	{"system_info": {"build": {"commit": "08e20483a651ea5ad60115f68ff0e53e6360573a", "libbeat": "7.12.0", "time": "2021-03-18T06:16:51.000Z", "version": "7.12.0"}}}
2021-04-26T15:18:32.411-0300	INFO	[beat]	instance/beat.go:1008	Go runtime info	{"system_info": {"go": {"os":"darwin","arch":"amd64","max_procs":8,"version":"go1.15.8"}}}
2021-04-26T15:18:32.412-0300	INFO	[beat]	instance/beat.go:1012	Host info	{"system_info": {"host": {"architecture":"x86_64","boot_time":"2021-04-26T09:29:24.449491-03:00","name":"AC-LPT-00336.local","ip":["127.0.0.1/8","::1/128","fe80::1/64","fe80::aede:48ff:fe00:1122/64","fe80::44a:ae2c:1963:9f3/64","192.168.0.102/24","fe80::3c4e:a9ff:fea6:3faf/64","fe80::3c4e:a9ff:fea6:3faf/64","fe80::35c8:553a:ac0a:32bc/64","fe80::5c93:4274:acaf:a98b/64"],"kernel_version":"19.6.0","mac":["ac:de:48:00:11:22","aa:66:5a:14:b1:9f","88:66:5a:14:b1:9f","0a:66:5a:14:b1:9f","3e:4e:a9:a6:3f:af","3e:4e:a9:a6:3f:af","ee:49:e5:e0:19:c4","ee:49:e5:e0:19:c5","ee:49:e5:e0:19:c1","ee:49:e5:e0:19:c0","ee:49:e5:e0:19:c5"],"os":{"type":"macos","family":"darwin","platform":"darwin","name":"Mac OS X","version":"10.15.7","major":10,"minor":15,"patch":7,"build":"19H524"},"timezone":"-03","timezone_offset_sec":-10800,"id":"F5E7E386-9343-5C3D-822C-9C34CB055BB1"}}}
2021-04-26T15:18:32.412-0300	INFO	[beat]	instance/beat.go:1041	Process info	{"system_info": {"process": {"cwd": "/Users/rodrigo.schamber/_PROJECTS/api-product/filebeat-7.12.0-darwin-x86_64", "exe": "./filebeat", "name": "filebeat", "pid": 59980, "ppid": 54204, "start_time": "2021-04-26T15:18:32.288-0300"}}}
2021-04-26T15:18:32.412-0300	INFO	instance/beat.go:304	Setup Beat: filebeat; Version: 7.12.0
2021-04-26T15:18:32.412-0300	INFO	[index-management]	idxmgmt/std.go:184	Set output.elasticsearch.index to 'filebeat-7.12.0' as ILM is enabled.
2021-04-26T15:18:32.412-0300	INFO	eslegclient/connection.go:99	elasticsearch url: http://localhost:9200
2021-04-26T15:18:32.413-0300	INFO	[publisher]	pipeline/module.go:113	Beat name: AC-LPT-00336.local
2021-04-26T15:18:32.414-0300	INFO	eslegclient/connection.go:99	elasticsearch url: http://localhost:9200
2021-04-26T15:18:32.417-0300	INFO	[esclientleg]	eslegclient/connection.go:314	Attempting to connect to Elasticsearch version 7.12.0
2021-04-26T15:18:32.432-0300	INFO	[index-management]	idxmgmt/std.go:261	Auto ILM enable success.
2021-04-26T15:18:32.432-0300	INFO	[index-management.ilm]	ilm/std.go:139	do not generate ilm policy: exists=true, overwrite=false
2021-04-26T15:18:32.432-0300	INFO	[index-management]	idxmgmt/std.go:274	ILM policy successfully loaded.
2021-04-26T15:18:32.432-0300	INFO	[index-management]	idxmgmt/std.go:407	Set setup.template.name to '{filebeat-7.12.0 {now/d}-000001}' as ILM is enabled.
2021-04-26T15:18:32.432-0300	INFO	[index-management]	idxmgmt/std.go:412	Set setup.template.pattern to 'filebeat-7.12.0-*' as ILM is enabled.
2021-04-26T15:18:32.432-0300	INFO	[index-management]	idxmgmt/std.go:446	Set settings.index.lifecycle.rollover_alias in template to {filebeat-7.12.0 {now/d}-000001} as ILM is enabled.
2021-04-26T15:18:32.433-0300	INFO	[index-management]	idxmgmt/std.go:450	Set settings.index.lifecycle.name in template to {filebeat {"policy":{"phases":{"hot":{"actions":{"rollover":{"max_age":"30d","max_size":"50gb"}}}}}}} as ILM is enabled.
2021-04-26T15:18:32.434-0300	INFO	template/load.go:183	Existing template will be overwritten, as overwrite is enabled.
2021-04-26T15:18:33.382-0300	INFO	template/load.go:117	Try loading template filebeat-7.12.0 to Elasticsearch
2021-04-26T15:18:33.752-0300	INFO	template/load.go:109	template with name 'filebeat-7.12.0' loaded.
2021-04-26T15:18:33.752-0300	INFO	[index-management]	idxmgmt/std.go:298	Loaded index template.
2021-04-26T15:18:33.754-0300	INFO	[index-management]	idxmgmt/std.go:309	Write alias successfully generated.
2021-04-26T15:18:33.754-0300	INFO	kibana/client.go:119	Kibana url: http://localhost:5601
2021-04-26T15:18:35.009-0300	INFO	kibana/client.go:119	Kibana url: http://localhost:5601
2021-04-26T15:18:35.383-0300	INFO	[add_cloud_metadata]	add_cloud_metadata/add_cloud_metadata.go:101	add_cloud_metadata: hosting provider type not detected.
2021-04-26T15:19:52.048-0300	INFO	instance/beat.go:830	Kibana dashboards successfully loaded.
2021-04-26T15:19:52.058-0300	WARN	[cfgwarn]	instance/beat.go:569	DEPRECATED: Setting up ML using Filebeat is going to be removed. Please use the ML app to setup jobs. Will be removed in version: 8.0.0
2021-04-26T15:19:52.058-0300	INFO	eslegclient/connection.go:99	elasticsearch url: http://localhost:9200
2021-04-26T15:19:52.061-0300	INFO	[esclientleg]	eslegclient/connection.go:314	Attempting to connect to Elasticsearch version 7.12.0
2021-04-26T15:19:52.061-0300	INFO	kibana/client.go:119	Kibana url: http://localhost:5601
2021-04-26T15:19:52.083-0300	WARN	fileset/modules.go:425	X-Pack Machine Learning is not enabled
2021-04-26T15:19:52.104-0300	WARN	fileset/modules.go:425	X-Pack Machine Learning is not enabled
2021-04-26T15:19:52.120-0300	WARN	fileset/modules.go:425	X-Pack Machine Learning is not enabled
2021-04-26T15:19:52.120-0300	INFO	eslegclient/connection.go:99	elasticsearch url: http://localhost:9200
2021-04-26T15:19:52.122-0300	INFO	[esclientleg]	eslegclient/connection.go:314	Attempting to connect to Elasticsearch version 7.12.0
2021-04-26T15:19:52.123-0300	INFO	eslegclient/connection.go:99	elasticsearch url: http://localhost:9200
2021-04-26T15:19:52.125-0300	INFO	[esclientleg]	eslegclient/connection.go:314	Attempting to connect to Elasticsearch version 7.12.0
2021-04-26T15:19:52.221-0300	INFO	[modules]	fileset/pipelines.go:133	Elasticsearch pipeline loaded.	{"pipeline": "filebeat-7.12.0-apache-access-pipeline"}
2021-04-26T15:19:52.315-0300	INFO	[modules]	fileset/pipelines.go:133	Elasticsearch pipeline loaded.	{"pipeline": "filebeat-7.12.0-apache-error-pipeline"}
2021-04-26T15:19:52.316-0300	INFO	eslegclient/connection.go:99	elasticsearch url: http://localhost:9200
2021-04-26T15:19:52.318-0300	INFO	[esclientleg]	eslegclient/connection.go:314	Attempting to connect to Elasticsearch version 7.12.0
2021-04-26T15:19:52.405-0300	INFO	[modules]	fileset/pipelines.go:133	Elasticsearch pipeline loaded.	{"pipeline": "filebeat-7.12.0-mongodb-log-pipeline"}
2021-04-26T15:19:52.405-0300	INFO	cfgfile/reload.go:262	Loading of config files completed.
2021-04-26T15:19:52.405-0300	INFO	[load]	cfgfile/list.go:129	Stopping 2 runners ...
