2021-04-26T13:56:43.806-0300	INFO	instance/beat.go:660	Home path: [/Users/rodrigo.schamber/_PROJECTS/api-product/filebeat-7.12.0-darwin-x86_64] Config path: [/Users/rodrigo.schamber/_PROJECTS/api-product/filebeat-7.12.0-darwin-x86_64] Data path: [/Users/rodrigo.schamber/_PROJECTS/api-product/filebeat-7.12.0-darwin-x86_64/data] Logs path: [/Users/rodrigo.schamber/_PROJECTS/api-product/filebeat-7.12.0-darwin-x86_64/logs]
2021-04-26T13:56:43.811-0300	INFO	instance/beat.go:668	Beat ID: 387c5d78-1d6c-435a-8499-ad1ac28212d3
2021-04-26T13:56:43.813-0300	INFO	[add_cloud_metadata]	add_cloud_metadata/add_cloud_metadata.go:101	add_cloud_metadata: hosting provider type not detected.
