2021-04-23T16:10:10.203-0300	INFO	instance/beat.go:660	Home path: [/Users/rodrigo.schamber/_PROJECTS/api-product/heartbeat-7.12.0-darwin-x86_64] Config path: [/Users/rodrigo.schamber/_PROJECTS/api-product/heartbeat-7.12.0-darwin-x86_64] Data path: [/Users/rodrigo.schamber/_PROJECTS/api-product/heartbeat-7.12.0-darwin-x86_64/data] Logs path: [/Users/rodrigo.schamber/_PROJECTS/api-product/heartbeat-7.12.0-darwin-x86_64/logs]
2021-04-23T16:10:10.246-0300	INFO	instance/beat.go:668	Beat ID: 70a66e5a-cc07-4b7c-a80c-3da22e5f2716
2021-04-23T16:10:10.255-0300	INFO	[beat]	instance/beat.go:996	Beat info	{"system_info": {"beat": {"path": {"config": "/Users/rodrigo.schamber/_PROJECTS/api-product/heartbeat-7.12.0-darwin-x86_64", "data": "/Users/rodrigo.schamber/_PROJECTS/api-product/heartbeat-7.12.0-darwin-x86_64/data", "home": "/Users/rodrigo.schamber/_PROJECTS/api-product/heartbeat-7.12.0-darwin-x86_64", "logs": "/Users/rodrigo.schamber/_PROJECTS/api-product/heartbeat-7.12.0-darwin-x86_64/logs"}, "type": "heartbeat", "uuid": "70a66e5a-cc07-4b7c-a80c-3da22e5f2716"}}}
2021-04-23T16:10:10.255-0300	INFO	[beat]	instance/beat.go:1005	Build info	{"system_info": {"build": {"commit": "08e20483a651ea5ad60115f68ff0e53e6360573a", "libbeat": "7.12.0", "time": "2021-03-18T06:22:35.000Z", "version": "7.12.0"}}}
2021-04-23T16:10:10.255-0300	INFO	[beat]	instance/beat.go:1008	Go runtime info	{"system_info": {"go": {"os":"darwin","arch":"amd64","max_procs":8,"version":"go1.15.8"}}}
2021-04-23T16:10:10.256-0300	INFO	[beat]	instance/beat.go:1012	Host info	{"system_info": {"host": {"architecture":"x86_64","boot_time":"2021-04-17T07:12:13.973154-03:00","name":"AC-LPT-00336.local","ip":["127.0.0.1/8","::1/128","fe80::1/64","fe80::aede:48ff:fe00:1122/64","fe80::81:e099:bf5b:3499/64","192.168.0.106/24","fe80::b8e8:beff:feb1:f2ea/64","fe80::b8e8:beff:feb1:f2ea/64","fe80::46e2:d5e2:476c:1a26/64","fe80::692e:c721:29ed:d359/64"],"kernel_version":"19.6.0","mac":["ac:de:48:00:11:22","aa:66:5a:14:b1:9f","88:66:5a:14:b1:9f","ee:49:e5:e0:19:c4","ee:49:e5:e0:19:c5","ee:49:e5:e0:19:c1","ee:49:e5:e0:19:c0","ee:49:e5:e0:19:c5","0a:66:5a:14:b1:9f","ba:e8:be:b1:f2:ea","ba:e8:be:b1:f2:ea"],"os":{"type":"macos","family":"darwin","platform":"darwin","name":"Mac OS X","version":"10.15.7","major":10,"minor":15,"patch":7,"build":"19H524"},"timezone":"-03","timezone_offset_sec":-10800,"id":"F5E7E386-9343-5C3D-822C-9C34CB055BB1"}}}
2021-04-23T16:10:10.257-0300	INFO	[beat]	instance/beat.go:1041	Process info	{"system_info": {"process": {"cwd": "/Users/rodrigo.schamber/_PROJECTS/api-product/heartbeat-7.12.0-darwin-x86_64", "exe": "./heartbeat", "name": "heartbeat", "pid": 42987, "ppid": 545, "start_time": "2021-04-23T16:10:08.913-0300"}}}
2021-04-23T16:10:10.257-0300	INFO	instance/beat.go:304	Setup Beat: heartbeat; Version: 7.12.0
2021-04-23T16:10:10.258-0300	INFO	[index-management]	idxmgmt/std.go:184	Set output.elasticsearch.index to 'heartbeat-7.12.0' as ILM is enabled.
2021-04-23T16:10:10.259-0300	INFO	eslegclient/connection.go:99	elasticsearch url: https://ce0c83eb93894b099ebc4b882f6d67e8.us-west1.gcp.cloud.es.io:443
2021-04-23T16:10:10.261-0300	INFO	[publisher]	pipeline/module.go:113	Beat name: AC-LPT-00336.local
2021-04-23T16:10:10.261-0300	INFO	eslegclient/connection.go:99	elasticsearch url: https://ce0c83eb93894b099ebc4b882f6d67e8.us-west1.gcp.cloud.es.io:443
2021-04-23T16:10:11.444-0300	INFO	[esclientleg]	eslegclient/connection.go:314	Attempting to connect to Elasticsearch version 7.12.0
2021-04-23T16:10:11.636-0300	INFO	[index-management]	idxmgmt/std.go:261	Auto ILM enable success.
2021-04-23T16:10:12.109-0300	INFO	[index-management]	idxmgmt/std.go:274	ILM policy successfully loaded.
2021-04-23T16:10:12.110-0300	INFO	[index-management]	idxmgmt/std.go:407	Set setup.template.name to '{heartbeat-7.12.0 {now/d}-000001}' as ILM is enabled.
2021-04-23T16:10:12.110-0300	INFO	[index-management]	idxmgmt/std.go:412	Set setup.template.pattern to 'heartbeat-7.12.0-*' as ILM is enabled.
2021-04-23T16:10:12.110-0300	INFO	[index-management]	idxmgmt/std.go:446	Set settings.index.lifecycle.rollover_alias in template to {heartbeat-7.12.0 {now/d}-000001} as ILM is enabled.
2021-04-23T16:10:12.110-0300	INFO	[index-management]	idxmgmt/std.go:450	Set settings.index.lifecycle.name in template to {heartbeat {"policy":{"phases":{"hot":{"actions":{"rollover":{"max_age":"30d","max_size":"50gb"}}}}}}} as ILM is enabled.
2021-04-23T16:10:12.302-0300	INFO	template/load.go:183	Existing template will be overwritten, as overwrite is enabled.
2021-04-23T16:10:12.366-0300	INFO	template/load.go:117	Try loading template heartbeat-7.12.0 to Elasticsearch
2021-04-23T16:10:14.606-0300	INFO	template/load.go:109	template with name 'heartbeat-7.12.0' loaded.
2021-04-23T16:10:14.606-0300	INFO	[index-management]	idxmgmt/std.go:298	Loaded index template.
2021-04-23T16:10:15.356-0300	INFO	[index-management]	idxmgmt/std.go:309	Write alias successfully generated.
