2021-04-26T15:57:50.882-0300	INFO	instance/beat.go:660	Home path: [/Users/rodrigo.schamber/_PROJECTS/api-product/filebeat-7.12.0-darwin-x86_64] Config path: [/Users/rodrigo.schamber/_PROJECTS/api-product/filebeat-7.12.0-darwin-x86_64] Data path: [/Users/rodrigo.schamber/_PROJECTS/api-product/filebeat-7.12.0-darwin-x86_64/data] Logs path: [/Users/rodrigo.schamber/_PROJECTS/api-product/filebeat-7.12.0-darwin-x86_64/logs]
2021-04-26T15:57:50.887-0300	INFO	instance/beat.go:668	Beat ID: 387c5d78-1d6c-435a-8499-ad1ac28212d3
2021-04-26T15:57:50.916-0300	INFO	[beat]	instance/beat.go:996	Beat info	{"system_info": {"beat": {"path": {"config": "/Users/rodrigo.schamber/_PROJECTS/api-product/filebeat-7.12.0-darwin-x86_64", "data": "/Users/rodrigo.schamber/_PROJECTS/api-product/filebeat-7.12.0-darwin-x86_64/data", "home": "/Users/rodrigo.schamber/_PROJECTS/api-product/filebeat-7.12.0-darwin-x86_64", "logs": "/Users/rodrigo.schamber/_PROJECTS/api-product/filebeat-7.12.0-darwin-x86_64/logs"}, "type": "filebeat", "uuid": "387c5d78-1d6c-435a-8499-ad1ac28212d3"}}}
2021-04-26T15:57:50.916-0300	INFO	[beat]	instance/beat.go:1005	Build info	{"system_info": {"build": {"commit": "08e20483a651ea5ad60115f68ff0e53e6360573a", "libbeat": "7.12.0", "time": "2021-03-18T06:16:51.000Z", "version": "7.12.0"}}}
2021-04-26T15:57:50.916-0300	INFO	[beat]	instance/beat.go:1008	Go runtime info	{"system_info": {"go": {"os":"darwin","arch":"amd64","max_procs":8,"version":"go1.15.8"}}}
2021-04-26T15:57:50.917-0300	INFO	[beat]	instance/beat.go:1012	Host info	{"system_info": {"host": {"architecture":"x86_64","boot_time":"2021-04-26T09:29:24.449491-03:00","name":"AC-LPT-00336.local","ip":["127.0.0.1/8","::1/128","fe80::1/64","fe80::aede:48ff:fe00:1122/64","fe80::44a:ae2c:1963:9f3/64","192.168.0.102/24","fe80::3c4e:a9ff:fea6:3faf/64","fe80::3c4e:a9ff:fea6:3faf/64","fe80::35c8:553a:ac0a:32bc/64","fe80::5c93:4274:acaf:a98b/64"],"kernel_version":"19.6.0","mac":["ac:de:48:00:11:22","aa:66:5a:14:b1:9f","88:66:5a:14:b1:9f","0a:66:5a:14:b1:9f","3e:4e:a9:a6:3f:af","3e:4e:a9:a6:3f:af","ee:49:e5:e0:19:c4","ee:49:e5:e0:19:c5","ee:49:e5:e0:19:c1","ee:49:e5:e0:19:c0","ee:49:e5:e0:19:c5"],"os":{"type":"macos","family":"darwin","platform":"darwin","name":"Mac OS X","version":"10.15.7","major":10,"minor":15,"patch":7,"build":"19H524"},"timezone":"-03","timezone_offset_sec":-10800,"id":"F5E7E386-9343-5C3D-822C-9C34CB055BB1"}}}
2021-04-26T15:57:50.917-0300	INFO	[beat]	instance/beat.go:1041	Process info	{"system_info": {"process": {"cwd": "/Users/rodrigo.schamber/_PROJECTS/api-product/filebeat-7.12.0-darwin-x86_64", "exe": "./filebeat", "name": "filebeat", "pid": 61380, "ppid": 54204, "start_time": "2021-04-26T15:57:50.782-0300"}}}
2021-04-26T15:57:50.917-0300	INFO	instance/beat.go:304	Setup Beat: filebeat; Version: 7.12.0
2021-04-26T15:57:50.917-0300	INFO	[index-management]	idxmgmt/std.go:184	Set output.elasticsearch.index to 'filebeat-7.12.0' as ILM is enabled.
2021-04-26T15:57:50.917-0300	INFO	eslegclient/connection.go:99	elasticsearch url: http://localhost:5601
2021-04-26T15:57:50.918-0300	INFO	[publisher]	pipeline/module.go:113	Beat name: AC-LPT-00336.local
2021-04-26T15:57:50.919-0300	INFO	eslegclient/connection.go:99	elasticsearch url: http://localhost:5601
2021-04-26T15:57:50.957-0300	ERROR	[esclientleg]	eslegclient/connection.go:261	error connecting to Elasticsearch at http://localhost:5601: Failed to parse JSON response: invalid character '<' looking for beginning of value
2021-04-26T15:57:50.957-0300	ERROR	instance/beat.go:971	Exiting: couldn't connect to any of the configured Elasticsearch hosts. Errors: [error connecting to Elasticsearch at http://localhost:5601: Failed to parse JSON response: invalid character '<' looking for beginning of value]
