# Blender v2.79 (sub 0) OBJ File: ''
# www.blender.org
mtllib key.mtl
o pPlane3
v 3.860774 0.069525 -0.809290
v 3.896204 0.074673 -0.289864
v 4.622406 0.065690 -0.809938
v 4.659542 0.080954 0.696511
v 1.409529 0.095891 0.560365
v 3.675194 0.075814 -0.286893
v 3.222972 0.075808 -0.509211
v 3.257203 0.078896 -0.191252
v 3.678050 0.073391 -0.521775
v 1.416322 0.088493 -0.157522
v 3.221535 -0.210302 -0.506277
v 3.676612 -0.212718 -0.518841
v 3.255765 -0.207212 -0.188319
v 3.673756 -0.210294 -0.283959
v 3.859337 -0.216584 -0.806356
v 4.620969 -0.220418 -0.807004
v 3.894766 -0.211435 -0.286930
v 4.658104 -0.205155 0.699447
v 1.408091 -0.190218 0.563298
v 1.414886 -0.197615 -0.154588
v 1.517261 -0.316083 0.920994
v 1.480529 -0.331258 -0.576558
v 1.519995 0.227961 0.915414
v 1.483263 0.212786 -0.582138
v 0.868318 0.216458 -0.525428
v 0.825921 0.231619 0.931955
v 0.823187 -0.312425 0.937535
v 0.865584 -0.327585 -0.519848
v -0.576393 -0.458292 -0.536146
v -0.407821 -0.459433 -0.564759
v -0.572275 0.361287 -0.544551
v -0.403702 0.360147 -0.573165
v -0.731968 -0.456763 -0.463304
v -0.727849 0.362816 -0.471711
v -0.863944 -0.454950 -0.351202
v -0.859825 0.364629 -0.359608
v -0.963326 -0.452976 -0.207474
v -0.959207 0.366603 -0.215880
v -1.023342 -0.450977 -0.041919
v -1.019223 0.368603 -0.050326
v -1.039902 -0.449088 0.134182
v -1.035783 0.370492 0.125776
v -1.011877 -0.447437 0.308828
v -1.007758 0.372143 0.300423
v -0.941179 -0.446138 0.470118
v -0.937060 0.373442 0.461713
v -0.832623 -0.445279 0.607060
v -0.828504 0.374300 0.598654
v -0.693608 -0.444918 0.710320
v -0.689489 0.374661 0.701915
v -0.533608 -0.445081 0.772863
v -0.529489 0.374498 0.764458
v -0.363526 -0.445756 0.790427
v -0.359408 0.373824 0.782021
v -0.194955 -0.446896 0.761813
v -0.190836 0.372683 0.753407
v -0.039381 -0.448426 0.688973
v -0.035261 0.371154 0.680566
v 0.092596 -0.450238 0.576869
v 0.096714 0.369341 0.568463
v 0.191977 -0.452212 0.433142
v 0.196096 0.367368 0.424736
v 0.251994 -0.454212 0.267586
v 0.256112 0.365368 0.259181
v 0.268554 -0.456101 0.091486
v 0.272673 0.363479 0.083080
v 0.240529 -0.457751 -0.083161
v 0.244648 0.361829 -0.091566
v 0.169830 -0.459051 -0.244451
v 0.173949 0.360529 -0.252856
v 0.061274 -0.459909 -0.381392
v 0.065393 0.359670 -0.389798
v -0.077741 -0.460270 -0.484653
v -0.073622 0.359310 -0.493058
v -0.237740 -0.460108 -0.547196
v -0.233622 0.359472 -0.555601
v -0.808514 0.353351 -1.434176
v -0.434034 0.350782 -1.501163
v -1.153899 0.356849 -1.262335
v -1.446649 0.361038 -0.997353
v -1.666815 0.365632 -0.657284
v -1.799392 0.370319 -0.265308
v -1.835346 0.374777 0.151867
v -1.772226 0.378706 0.565808
v -1.614336 0.381836 0.948307
v -1.372432 0.383953 1.273297
v -1.063003 0.384915 1.518630
v -0.707133 0.384653 1.667588
v -0.329077 0.383189 1.710019
v 0.045405 0.380620 1.643032
v 0.390789 0.377122 1.471192
v 0.683538 0.372934 1.206208
v 0.903704 0.368338 0.866141
v 1.036282 0.363652 0.474163
v 1.072235 0.359193 0.056989
v 1.009116 0.355265 -0.356952
v 0.851225 0.352135 -0.739451
v 0.609323 0.350018 -1.064441
v 0.299893 0.349056 -1.309774
v -0.055978 0.349317 -1.458732
v -0.812633 -0.466229 -1.425771
v -0.438153 -0.468798 -1.492757
v -1.158017 -0.462731 -1.253930
v -1.450768 -0.458542 -0.988946
v -1.670934 -0.453948 -0.648879
v -1.803511 -0.449261 -0.256901
v -1.839465 -0.444801 0.160273
v -1.776346 -0.440873 0.574214
v -1.618454 -0.437745 0.956712
v -1.376551 -0.435627 1.281703
v -1.067121 -0.434665 1.527037
v -0.711252 -0.434925 1.675994
v -0.333195 -0.436391 1.718425
v 0.041286 -0.438960 1.651438
v 0.386670 -0.442458 1.479597
v 0.679421 -0.446647 1.214614
v 0.899586 -0.451241 0.874546
v 1.032163 -0.455928 0.482570
v 1.068117 -0.460386 0.065395
v 1.004997 -0.464315 -0.348546
v 0.847107 -0.467444 -0.731045
v 0.605204 -0.469562 -1.056035
v 0.295773 -0.470524 -1.301368
v -0.060096 -0.470263 -1.450327
v 3.860774 0.069525 -0.809290
v 3.896204 0.074673 -0.289864
v 4.622406 0.065690 -0.809938
v 4.659542 0.080954 0.696511
v 1.409529 0.095891 0.560365
v 3.675194 0.075814 -0.286893
v 3.222972 0.075808 -0.509211
v 3.257203 0.078896 -0.191252
v 3.678050 0.073391 -0.521775
v 1.416322 0.088493 -0.157522
v 3.221535 -0.210302 -0.506277
v 3.676612 -0.212718 -0.518841
v 3.255765 -0.207212 -0.188319
v 3.673756 -0.210294 -0.283959
v 3.859337 -0.216584 -0.806356
v 4.620969 -0.220418 -0.807004
v 3.894766 -0.211435 -0.286930
v 4.658104 -0.205155 0.699447
v 1.408091 -0.190218 0.563298
v 1.414886 -0.197615 -0.154588
v 1.517261 -0.316083 0.920994
v 1.480529 -0.331258 -0.576558
v 1.519995 0.227961 0.915414
v 1.483263 0.212786 -0.582138
v 0.868318 0.216458 -0.525428
v 0.825921 0.231619 0.931955
v 0.823187 -0.312425 0.937535
v 0.865584 -0.327585 -0.519848
v -0.576393 -0.458292 -0.536146
v -0.407821 -0.459433 -0.564759
v -0.572275 0.361287 -0.544551
v -0.403702 0.360147 -0.573165
v -0.731968 -0.456763 -0.463304
v -0.727849 0.362816 -0.471711
v -0.863944 -0.454950 -0.351202
v -0.859825 0.364629 -0.359608
v -0.963326 -0.452976 -0.207474
v -0.959207 0.366603 -0.215880
v -1.023342 -0.450977 -0.041919
v -1.019223 0.368603 -0.050326
v -1.039902 -0.449088 0.134182
v -1.035783 0.370492 0.125776
v -1.011877 -0.447437 0.308828
v -1.007758 0.372143 0.300423
v -0.941179 -0.446138 0.470118
v -0.937060 0.373442 0.461713
v -0.832623 -0.445279 0.607060
v -0.828504 0.374300 0.598654
v -0.693608 -0.444918 0.710320
v -0.689489 0.374661 0.701915
v -0.533608 -0.445081 0.772863
v -0.529489 0.374498 0.764458
v -0.363526 -0.445756 0.790427
v -0.359408 0.373824 0.782021
v -0.194955 -0.446896 0.761813
v -0.190836 0.372683 0.753407
v -0.039381 -0.448426 0.688973
v -0.035261 0.371154 0.680566
v 0.092596 -0.450238 0.576869
v 0.096714 0.369341 0.568463
v 0.191977 -0.452212 0.433142
v 0.196096 0.367368 0.424736
v 0.251994 -0.454212 0.267586
v 0.256112 0.365368 0.259181
v 0.268554 -0.456101 0.091486
v 0.272673 0.363479 0.083080
v 0.240529 -0.457751 -0.083161
v 0.244648 0.361829 -0.091566
v 0.169830 -0.459051 -0.244451
v 0.173949 0.360529 -0.252856
v 0.061274 -0.459909 -0.381392
v 0.065393 0.359670 -0.389798
v -0.077741 -0.460270 -0.484653
v -0.073622 0.359310 -0.493058
v -0.237740 -0.460108 -0.547196
v -0.233622 0.359472 -0.555601
v -0.808514 0.353351 -1.434176
v -0.434034 0.350782 -1.501163
v -1.153899 0.356849 -1.262335
v -1.446649 0.361038 -0.997353
v -1.666815 0.365632 -0.657284
v -1.799392 0.370319 -0.265308
v -1.835346 0.374777 0.151867
v -1.772226 0.378706 0.565808
v -1.614336 0.381836 0.948307
v -1.372432 0.383953 1.273297
v -1.063003 0.384915 1.518630
v -0.707133 0.384653 1.667588
v -0.329077 0.383189 1.710019
v 0.045405 0.380620 1.643032
v 0.390789 0.377122 1.471192
v 0.683538 0.372934 1.206208
v 0.903704 0.368338 0.866141
v 1.036282 0.363652 0.474163
v 1.072235 0.359193 0.056989
v 1.009116 0.355265 -0.356952
v 0.851225 0.352135 -0.739451
v 0.609323 0.350018 -1.064441
v 0.299893 0.349056 -1.309774
v -0.055978 0.349317 -1.458732
v -0.812633 -0.466229 -1.425771
v -0.438153 -0.468798 -1.492757
v -1.158017 -0.462731 -1.253930
v -1.450768 -0.458542 -0.988946
v -1.670934 -0.453948 -0.648879
v -1.803511 -0.449261 -0.256901
v -1.839465 -0.444801 0.160273
v -1.776346 -0.440873 0.574214
v -1.618454 -0.437745 0.956712
v -1.376551 -0.435627 1.281703
v -1.067121 -0.434665 1.527037
v -0.711252 -0.434925 1.675994
v -0.333195 -0.436391 1.718425
v 0.041286 -0.438960 1.651438
v 0.386670 -0.442458 1.479597
v 0.679421 -0.446647 1.214614
v 0.899586 -0.451241 0.874546
v 1.032163 -0.455928 0.482570
v 1.068117 -0.460386 0.065395
v 1.004997 -0.464315 -0.348546
v 0.847107 -0.467444 -0.731045
v 0.605204 -0.469562 -1.056035
v 0.295773 -0.470524 -1.301368
v -0.060096 -0.470263 -1.450327
vt 0.379384 0.684881
vt 0.373258 0.787730
vt 0.223720 0.686103
vt 0.219362 0.984272
vt 0.883309 0.973043
vt 0.418434 0.787926
vt 0.510382 0.743131
vt 0.504068 0.806111
vt 0.417346 0.741452
vt 0.880381 0.830997
vt 0.510382 0.743131
vt 0.417346 0.741452
vt 0.504068 0.806111
vt 0.418434 0.787926
vt 0.379384 0.684881
vt 0.223720 0.686103
vt 0.373258 0.787730
vt 0.219362 0.984272
vt 0.883309 0.973043
vt 0.880381 0.830997
vt 0.925541 0.598861
vt 0.925541 0.422669
vt 0.989045 0.598600
vt 0.989045 0.422669
vt 0.925541 0.337730
vt 0.989045 0.337730
vt 0.925541 0.279910
vt 0.989045 0.279910
vt 0.925541 0.255616
vt 0.989045 0.255617
vt 0.925541 0.231975
vt 0.989045 0.231975
vt 0.925541 0.191115
vt 0.989045 0.191115
vt 0.925541 0.163178
vt 0.989045 0.163178
vt 0.925541 0.008308
vt 0.989045 0.008554
vt 0.925541 0.987630
vt 0.989045 0.987620
vt 0.768135 0.645110
vt 0.498641 0.648005
vt 0.767086 0.547243
vt 0.497586 0.550133
vt 0.645676 0.797411
vt 0.645151 0.663363
vt 0.895677 0.797707
vt 0.894842 0.663361
vt 0.895678 0.797707
vt 0.645676 0.797411
vt 0.894842 0.663361
vt 0.645151 0.663363
vt 0.359313 0.649488
vt 0.358266 0.551623
vt 0.909460 0.643630
vt 0.908401 0.545716
vt 0.341735 0.641270
vt 0.341735 0.668690
vt 0.198352 0.641270
vt 0.198352 0.668690
vt 0.341735 0.613850
vt 0.198352 0.613850
vt 0.341735 0.586430
vt 0.198352 0.586430
vt 0.341735 0.559010
vt 0.198352 0.559010
vt 0.341735 0.531590
vt 0.198352 0.531590
vt 0.341735 0.504170
vt 0.198352 0.504170
vt 0.341735 0.476750
vt 0.198352 0.476750
vt 0.341735 0.449330
vt 0.198352 0.449330
vt 0.341735 0.421910
vt 0.198352 0.421910
vt 0.341735 0.394490
vt 0.198352 0.394490
vt 0.341735 0.367070
vt 0.198352 0.367070
vt 0.341735 0.339651
vt 0.198352 0.339650
vt 0.341735 0.312230
vt 0.198352 0.312230
vt 0.341735 0.284810
vt 0.198352 0.284810
vt 0.341735 0.257390
vt 0.198352 0.257390
vt 0.341735 0.229971
vt 0.198352 0.229971
vt 0.341735 0.202550
vt 0.198352 0.202550
vt 0.341735 0.175130
vt 0.198352 0.175130
vt 0.341735 0.147710
vt 0.198352 0.147710
vt 0.341735 0.120290
vt 0.198352 0.120290
vt 0.341735 0.092870
vt 0.198352 0.092870
vt 0.341735 0.065451
vt 0.198352 0.065450
vt 0.341735 0.038030
vt 0.198352 0.038030
vt 0.341735 0.010611
vt 0.198352 0.010611
vt 0.720851 0.304521
vt 0.724582 0.274296
vt 0.865729 0.341461
vt 0.874572 0.274296
vt 0.709910 0.332687
vt 0.839805 0.404049
vt 0.692506 0.356873
vt 0.798564 0.457795
vt 0.669824 0.375432
vt 0.744818 0.499035
vt 0.643410 0.387098
vt 0.682230 0.524960
vt 0.615065 0.391077
vt 0.615065 0.533802
vt 0.586720 0.387098
vt 0.547900 0.524960
vt 0.560307 0.375432
vt 0.485312 0.499035
vt 0.537625 0.356873
vt 0.431566 0.457795
vt 0.520221 0.332687
vt 0.390326 0.404049
vt 0.509280 0.304521
vt 0.364401 0.341461
vt 0.505548 0.274296
vt 0.355558 0.274296
vt 0.509280 0.244070
vt 0.364401 0.207130
vt 0.520221 0.215905
vt 0.390326 0.144542
vt 0.537625 0.191718
vt 0.431566 0.090797
vt 0.560307 0.173159
vt 0.485312 0.049556
vt 0.586720 0.161493
vt 0.547900 0.023631
vt 0.615065 0.157514
vt 0.615065 0.014789
vt 0.643410 0.161493
vt 0.682230 0.023631
vt 0.669824 0.173159
vt 0.744818 0.049556
vt 0.692505 0.191718
vt 0.798564 0.090797
vt 0.709910 0.215905
vt 0.839805 0.144542
vt 0.720851 0.244070
vt 0.865729 0.207130
vt 0.188816 0.944223
vt 0.188816 0.984638
vt 0.014052 0.944223
vt 0.014052 0.984638
vt 0.188816 0.903806
vt 0.014052 0.903807
vt 0.188816 0.863391
vt 0.014052 0.863391
vt 0.188816 0.822975
vt 0.014052 0.822975
vt 0.188816 0.782559
vt 0.014052 0.782559
vt 0.188816 0.742143
vt 0.014052 0.742143
vt 0.188816 0.701727
vt 0.014052 0.701727
vt 0.188816 0.661311
vt 0.014052 0.661311
vt 0.188816 0.620895
vt 0.014052 0.620895
vt 0.188816 0.580479
vt 0.014052 0.580480
vt 0.188816 0.540064
vt 0.014052 0.540064
vt 0.188816 0.499648
vt 0.014052 0.499648
vt 0.188816 0.459232
vt 0.014052 0.459232
vt 0.188816 0.418816
vt 0.014052 0.418816
vt 0.188816 0.378400
vt 0.014052 0.378400
vt 0.188816 0.337984
vt 0.014052 0.337984
vt 0.188816 0.297568
vt 0.014052 0.297568
vt 0.188816 0.257152
vt 0.014052 0.257152
vt 0.188815 0.216736
vt 0.014052 0.216736
vt 0.188816 0.176320
vt 0.014052 0.176320
vt 0.188816 0.135904
vt 0.014052 0.135904
vt 0.188816 0.095488
vt 0.014052 0.095488
vt 0.188815 0.055073
vt 0.014052 0.055073
vt 0.188816 0.014657
vt 0.014052 0.014657
vt 0.874572 0.274296
vt 0.724582 0.274296
vt 0.865729 0.341461
vt 0.720851 0.304521
vt 0.839805 0.404049
vt 0.709910 0.332687
vt 0.798564 0.457795
vt 0.692506 0.356873
vt 0.744818 0.499035
vt 0.669824 0.375432
vt 0.682230 0.524960
vt 0.643410 0.387098
vt 0.615065 0.533802
vt 0.615065 0.391077
vt 0.547900 0.524960
vt 0.586720 0.387098
vt 0.485312 0.499035
vt 0.560307 0.375432
vt 0.431566 0.457795
vt 0.537625 0.356873
vt 0.390326 0.404049
vt 0.520221 0.332687
vt 0.364401 0.341461
vt 0.509280 0.304521
vt 0.355558 0.274296
vt 0.505548 0.274296
vt 0.364401 0.207130
vt 0.509280 0.244070
vt 0.390326 0.144542
vt 0.520221 0.215905
vt 0.431566 0.090797
vt 0.537625 0.191718
vt 0.485312 0.049556
vt 0.560307 0.173159
vt 0.547900 0.023631
vt 0.586720 0.161493
vt 0.615065 0.014789
vt 0.615065 0.157514
vt 0.682230 0.023631
vt 0.643410 0.161493
vt 0.744818 0.049556
vt 0.669824 0.173159
vt 0.798564 0.090797
vt 0.692505 0.191718
vt 0.839805 0.144542
vt 0.709910 0.215905
vt 0.865729 0.207130
vt 0.720851 0.244070
vt 0.379384 0.684881
vt 0.373258 0.787730
vt 0.223720 0.686103
vt 0.219362 0.984272
vt 0.883309 0.973043
vt 0.418434 0.787926
vt 0.510382 0.743131
vt 0.504068 0.806111
vt 0.417346 0.741452
vt 0.880381 0.830997
vt 0.510382 0.743131
vt 0.417346 0.741452
vt 0.504068 0.806111
vt 0.418434 0.787926
vt 0.379384 0.684881
vt 0.223720 0.686103
vt 0.373258 0.787730
vt 0.219362 0.984272
vt 0.883309 0.973043
vt 0.880381 0.830997
vt 0.925541 0.598861
vt 0.925541 0.422669
vt 0.989045 0.598600
vt 0.989045 0.422669
vt 0.925541 0.337730
vt 0.989045 0.337730
vt 0.925541 0.279910
vt 0.989045 0.279910
vt 0.925541 0.255616
vt 0.989045 0.255617
vt 0.925541 0.231975
vt 0.989045 0.231975
vt 0.925541 0.191115
vt 0.989045 0.191115
vt 0.925541 0.163178
vt 0.989045 0.163178
vt 0.925541 0.008308
vt 0.989045 0.008554
vt 0.925541 0.987630
vt 0.989045 0.987620
vt 0.768135 0.645110
vt 0.498641 0.648005
vt 0.767086 0.547243
vt 0.497586 0.550133
vt 0.645676 0.797411
vt 0.645151 0.663363
vt 0.895677 0.797707
vt 0.894842 0.663361
vt 0.895678 0.797707
vt 0.645676 0.797411
vt 0.894842 0.663361
vt 0.645151 0.663363
vt 0.359313 0.649488
vt 0.358266 0.551623
vt 0.909460 0.643630
vt 0.908401 0.545716
vt 0.341735 0.641270
vt 0.341735 0.668690
vt 0.198352 0.641270
vt 0.198352 0.668690
vt 0.341735 0.613850
vt 0.198352 0.613850
vt 0.341735 0.586430
vt 0.198352 0.586430
vt 0.341735 0.559010
vt 0.198352 0.559010
vt 0.341735 0.531590
vt 0.198352 0.531590
vt 0.341735 0.504170
vt 0.198352 0.504170
vt 0.341735 0.476750
vt 0.198352 0.476750
vt 0.341735 0.449330
vt 0.198352 0.449330
vt 0.341735 0.421910
vt 0.198352 0.421910
vt 0.341735 0.394490
vt 0.198352 0.394490
vt 0.341735 0.367070
vt 0.198352 0.367070
vt 0.341735 0.339651
vt 0.198352 0.339650
vt 0.341735 0.312230
vt 0.198352 0.312230
vt 0.341735 0.284810
vt 0.198352 0.284810
vt 0.341735 0.257390
vt 0.198352 0.257390
vt 0.341735 0.229971
vt 0.198352 0.229971
vt 0.341735 0.202550
vt 0.198352 0.202550
vt 0.341735 0.175130
vt 0.198352 0.175130
vt 0.341735 0.147710
vt 0.198352 0.147710
vt 0.341735 0.120290
vt 0.198352 0.120290
vt 0.341735 0.092870
vt 0.198352 0.092870
vt 0.341735 0.065451
vt 0.198352 0.065450
vt 0.341735 0.038030
vt 0.198352 0.038030
vt 0.341735 0.010611
vt 0.198352 0.010611
vt 0.720851 0.304521
vt 0.724582 0.274296
vt 0.865729 0.341461
vt 0.874572 0.274296
vt 0.709910 0.332687
vt 0.839805 0.404049
vt 0.692506 0.356873
vt 0.798564 0.457795
vt 0.669824 0.375432
vt 0.744818 0.499035
vt 0.643410 0.387098
vt 0.682230 0.524960
vt 0.615065 0.391077
vt 0.615065 0.533802
vt 0.586720 0.387098
vt 0.547900 0.524960
vt 0.560307 0.375432
vt 0.485312 0.499035
vt 0.537625 0.356873
vt 0.431566 0.457795
vt 0.520221 0.332687
vt 0.390326 0.404049
vt 0.509280 0.304521
vt 0.364401 0.341461
vt 0.505548 0.274296
vt 0.355558 0.274296
vt 0.509280 0.244070
vt 0.364401 0.207130
vt 0.520221 0.215905
vt 0.390326 0.144542
vt 0.537625 0.191718
vt 0.431566 0.090797
vt 0.560307 0.173159
vt 0.485312 0.049556
vt 0.586720 0.161493
vt 0.547900 0.023631
vt 0.615065 0.157514
vt 0.615065 0.014789
vt 0.643410 0.161493
vt 0.682230 0.023631
vt 0.669824 0.173159
vt 0.744818 0.049556
vt 0.692505 0.191718
vt 0.798564 0.090797
vt 0.709910 0.215905
vt 0.839805 0.144542
vt 0.720851 0.244070
vt 0.865729 0.207130
vt 0.188816 0.944223
vt 0.188816 0.984638
vt 0.014052 0.944223
vt 0.014052 0.984638
vt 0.188816 0.903806
vt 0.014052 0.903807
vt 0.188816 0.863391
vt 0.014052 0.863391
vt 0.188816 0.822975
vt 0.014052 0.822975
vt 0.188816 0.782559
vt 0.014052 0.782559
vt 0.188816 0.742143
vt 0.014052 0.742143
vt 0.188816 0.701727
vt 0.014052 0.701727
vt 0.188816 0.661311
vt 0.014052 0.661311
vt 0.188816 0.620895
vt 0.014052 0.620895
vt 0.188816 0.580479
vt 0.014052 0.580480
vt 0.188816 0.540064
vt 0.014052 0.540064
vt 0.188816 0.499648
vt 0.014052 0.499648
vt 0.188816 0.459232
vt 0.014052 0.459232
vt 0.188816 0.418816
vt 0.014052 0.418816
vt 0.188816 0.378400
vt 0.014052 0.378400
vt 0.188816 0.337984
vt 0.014052 0.337984
vt 0.188816 0.297568
vt 0.014052 0.297568
vt 0.188816 0.257152
vt 0.014052 0.257152
vt 0.188815 0.216736
vt 0.014052 0.216736
vt 0.188816 0.176320
vt 0.014052 0.176320
vt 0.188816 0.135904
vt 0.014052 0.135904
vt 0.188816 0.095488
vt 0.014052 0.095488
vt 0.188815 0.055073
vt 0.014052 0.055073
vt 0.188816 0.014657
vt 0.014052 0.014657
vt 0.874572 0.274296
vt 0.724582 0.274296
vt 0.865729 0.341461
vt 0.720851 0.304521
vt 0.839805 0.404049
vt 0.709910 0.332687
vt 0.798564 0.457795
vt 0.692506 0.356873
vt 0.744818 0.499035
vt 0.669824 0.375432
vt 0.682230 0.524960
vt 0.643410 0.387098
vt 0.615065 0.533802
vt 0.615065 0.391077
vt 0.547900 0.524960
vt 0.586720 0.387098
vt 0.485312 0.499035
vt 0.560307 0.375432
vt 0.431566 0.457795
vt 0.537625 0.356873
vt 0.390326 0.404049
vt 0.520221 0.332687
vt 0.364401 0.341461
vt 0.509280 0.304521
vt 0.355558 0.274296
vt 0.505548 0.274296
vt 0.364401 0.207130
vt 0.509280 0.244070
vt 0.390326 0.144542
vt 0.520221 0.215905
vt 0.431566 0.090797
vt 0.537625 0.191718
vt 0.485312 0.049556
vt 0.560307 0.173159
vt 0.547900 0.023631
vt 0.586720 0.161493
vt 0.615065 0.014789
vt 0.615065 0.157514
vt 0.682230 0.023631
vt 0.643410 0.161493
vt 0.744818 0.049556
vt 0.669824 0.173159
vt 0.798564 0.090797
vt 0.692505 0.191718
vt 0.839805 0.144542
vt 0.709910 0.215905
vt 0.865729 0.207130
vt 0.720851 0.244070
vn 0.0050 0.9999 -0.0103
vn -0.0050 -0.9999 0.0103
vn 0.9997 -0.0053 -0.0246
vn -0.0009 -0.0102 -0.9999
vn -0.0009 -0.0103 -0.9999
vn -0.9977 0.0057 0.0680
vn -0.0135 -0.0102 -0.9999
vn 0.9999 -0.0049 0.0122
vn -0.0277 -0.0101 -0.9996
vn -0.9942 0.0061 0.1070
vn -0.0184 -0.0102 -0.9998
vn -0.0418 0.0105 0.9991
vn 0.9997 -0.0053 -0.0245
vn -0.0919 -0.0098 -0.9957
vn 0.0239 0.0101 0.9997
vn 0.2989 0.0083 0.9542
vn 0.0327 0.0101 0.9994
vn 0.5410 0.0059 0.8410
vn 0.5411 0.0059 0.8409
vn 0.7416 0.0032 0.6708
vn 0.7416 0.0032 0.6709
vn 0.8888 0.0002 0.4582
vn 0.8889 0.0002 0.4581
vn 0.9757 -0.0027 0.2190
vn 0.9995 -0.0054 -0.0326
vn 0.9593 -0.0077 -0.2822
vn 0.8568 -0.0096 -0.5155
vn 0.6963 -0.0109 -0.7177
vn 0.6959 -0.0109 -0.7181
vn 0.4849 -0.0114 -0.8745
vn 0.2358 -0.0112 -0.9717
vn 0.2355 -0.0111 -0.9718
vn -0.0327 -0.0101 -0.9994
vn -0.2989 -0.0083 -0.9542
vn -0.2988 -0.0083 -0.9543
vn -0.5410 -0.0059 -0.8410
vn -0.7416 -0.0032 -0.6709
vn -0.8887 -0.0002 -0.4586
vn -0.9757 0.0027 -0.2190
vn -0.9995 0.0054 0.0326
vn -0.9593 0.0077 0.2822
vn -0.8570 0.0096 0.5152
vn -0.8568 0.0096 0.5155
vn -0.6963 0.0109 0.7177
vn -0.4848 0.0114 0.8746
vn -0.4849 0.0114 0.8745
vn -0.2355 0.0111 0.9718
vn -0.2355 0.0112 0.9718
vn -0.3149 -0.0082 -0.9491
vn -0.3148 -0.0082 -0.9491
vn -0.5649 -0.0056 -0.8252
vn -0.7628 -0.0028 -0.6466
vn -0.9009 0.0001 -0.4341
vn -0.9790 0.0028 -0.2040
vn -0.9789 0.0028 -0.2041
vn -0.9636 0.0076 0.2673
vn -0.8706 0.0094 0.4920
vn -0.8706 0.0094 0.4919
vn -0.7190 0.0107 0.6949
vn -0.7189 0.0107 0.6950
vn -0.5098 0.0114 0.8602
vn -0.2523 0.0112 0.9676
vn 0.3149 0.0082 0.9491
vn 0.5649 0.0056 0.8252
vn 0.7628 0.0028 0.6466
vn 0.7627 0.0028 0.6467
vn 0.9009 -0.0001 0.4341
vn 0.9789 -0.0028 0.2043
vn 0.9790 -0.0028 0.2040
vn 0.9636 -0.0076 -0.2673
vn 0.8706 -0.0094 -0.4919
vn 0.8705 -0.0094 -0.4920
vn 0.7190 -0.0107 -0.6949
vn 0.5097 -0.0114 -0.8603
vn 0.5098 -0.0114 -0.8602
vn 0.2522 -0.0112 -0.9676
vn 0.2523 -0.0112 -0.9676
usemtl initialShadingGroup
s 1
f 1/1/1 2/2/1 3/3/1
f 3/3/1 2/2/1 4/4/1
f 4/4/1 2/2/1 5/5/1
f 2/2/1 6/6/1 5/5/1
f 7/7/1 8/8/1 9/9/1
f 9/9/1 8/8/1 6/6/1
f 6/6/1 8/8/1 5/5/1
f 8/8/1 10/10/1 5/5/1
f 11/11/2 12/12/2 13/13/2
f 12/12/2 14/14/2 13/13/2
f 15/15/2 16/16/2 17/17/2
f 16/16/2 18/18/2 17/17/2
f 18/18/2 19/19/2 17/17/2
f 17/17/2 19/19/2 14/14/2
f 14/14/2 19/19/2 13/13/2
f 19/19/2 20/20/2 13/13/2
f 18/21/3 16/22/3 4/23/3
f 4/23/3 16/22/3 3/24/3
f 16/22/4 15/25/4 3/24/4
f 3/24/4 15/25/4 1/26/5
f 15/25/6 17/27/6 1/26/6
f 1/26/6 17/27/6 2/28/6
f 17/27/7 14/29/7 2/28/7
f 2/28/7 14/29/7 6/30/7
f 14/29/8 12/31/8 6/30/8
f 6/30/8 12/31/8 9/32/8
f 12/31/9 11/33/9 9/32/9
f 9/32/9 11/33/9 7/34/9
f 11/33/10 13/35/10 7/34/10
f 7/34/10 13/35/10 8/36/10
f 13/35/11 20/37/11 8/36/11
f 8/36/11 20/37/11 10/38/11
f 19/39/12 18/21/12 5/40/12
f 5/40/12 18/21/12 4/23/12
f 21/41/13 22/42/13 23/43/13
f 23/43/13 22/42/13 24/44/13
f 24/45/1 25/46/1 23/47/1
f 23/47/1 25/46/1 26/48/1
f 27/49/2 28/50/2 21/51/2
f 21/51/2 28/50/2 22/52/2
f 22/42/14 28/53/14 24/44/14
f 24/44/14 28/53/14 25/54/14
f 27/55/15 21/41/15 26/56/15
f 26/56/15 21/41/15 23/43/15
f 29/57/16 30/58/17 31/59/16
f 31/59/16 30/58/17 32/60/17
f 33/61/18 29/57/16 34/62/19
f 34/62/19 29/57/16 31/59/16
f 35/63/20 33/61/18 36/64/21
f 36/64/21 33/61/18 34/62/19
f 37/65/22 35/63/20 38/66/23
f 38/66/23 35/63/20 36/64/21
f 39/67/24 37/65/22 40/68/24
f 40/68/24 37/65/22 38/66/23
f 41/69/25 39/67/24 42/70/25
f 42/70/25 39/67/24 40/68/24
f 43/71/26 41/69/25 44/72/26
f 44/72/26 41/69/25 42/70/25
f 45/73/27 43/71/26 46/74/27
f 46/74/27 43/71/26 44/72/26
f 47/75/28 45/73/27 48/76/29
f 48/76/29 45/73/27 46/74/27
f 49/77/30 47/75/28 50/78/30
f 50/78/30 47/75/28 48/76/29
f 51/79/31 49/77/30 52/80/32
f 52/80/32 49/77/30 50/78/30
f 53/81/33 51/79/31 54/82/33
f 54/82/33 51/79/31 52/80/32
f 55/83/34 53/81/33 56/84/35
f 56/84/35 53/81/33 54/82/33
f 57/85/36 55/83/34 58/86/36
f 58/86/36 55/83/34 56/84/35
f 59/87/37 57/85/36 60/88/37
f 60/88/37 57/85/36 58/86/36
f 61/89/38 59/87/37 62/90/38
f 62/90/38 59/87/37 60/88/37
f 63/91/39 61/89/38 64/92/39
f 64/92/39 61/89/38 62/90/38
f 65/93/40 63/91/39 66/94/40
f 66/94/40 63/91/39 64/92/39
f 67/95/41 65/93/40 68/96/41
f 68/96/41 65/93/40 66/94/40
f 69/97/42 67/95/41 70/98/43
f 70/98/43 67/95/41 68/96/41
f 71/99/44 69/97/42 72/100/44
f 72/100/44 69/97/42 70/98/43
f 73/101/45 71/99/44 74/102/46
f 74/102/46 71/99/44 72/100/44
f 75/103/47 73/101/45 76/104/48
f 76/104/48 73/101/45 74/102/46
f 30/105/17 75/103/47 32/106/17
f 32/106/17 75/103/47 76/104/48
f 31/107/1 32/108/1 77/109/1
f 77/109/1 32/108/1 78/110/1
f 34/111/1 31/107/1 79/112/1
f 79/112/1 31/107/1 77/109/1
f 36/113/1 34/111/1 80/114/1
f 80/114/1 34/111/1 79/112/1
f 38/115/1 36/113/1 81/116/1
f 81/116/1 36/113/1 80/114/1
f 40/117/1 38/115/1 82/118/1
f 82/118/1 38/115/1 81/116/1
f 42/119/1 40/117/1 83/120/1
f 83/120/1 40/117/1 82/118/1
f 42/119/1 83/120/1 44/121/1
f 44/121/1 83/120/1 84/122/1
f 44/121/1 84/122/1 46/123/1
f 46/123/1 84/122/1 85/124/1
f 46/123/1 85/124/1 48/125/1
f 48/125/1 85/124/1 86/126/1
f 48/125/1 86/126/1 50/127/1
f 50/127/1 86/126/1 87/128/1
f 50/127/1 87/128/1 52/129/1
f 52/129/1 87/128/1 88/130/1
f 52/129/1 88/130/1 54/131/1
f 54/131/1 88/130/1 89/132/1
f 56/133/1 54/131/1 90/134/1
f 90/134/1 54/131/1 89/132/1
f 58/135/1 56/133/1 91/136/1
f 91/136/1 56/133/1 90/134/1
f 60/137/1 58/135/1 92/138/1
f 92/138/1 58/135/1 91/136/1
f 62/139/1 60/137/1 93/140/1
f 93/140/1 60/137/1 92/138/1
f 64/141/1 62/139/1 94/142/1
f 94/142/1 62/139/1 93/140/1
f 66/143/1 64/141/1 95/144/1
f 95/144/1 64/141/1 94/142/1
f 66/143/1 95/144/1 68/145/1
f 68/145/1 95/144/1 96/146/1
f 68/145/1 96/146/1 70/147/1
f 70/147/1 96/146/1 97/148/1
f 70/147/1 97/148/1 72/149/1
f 72/149/1 97/148/1 98/150/1
f 72/149/1 98/150/1 74/151/1
f 74/151/1 98/150/1 99/152/1
f 74/151/1 99/152/1 76/153/1
f 76/153/1 99/152/1 100/154/1
f 76/153/1 100/154/1 32/108/1
f 32/108/1 100/154/1 78/110/1
f 77/155/49 78/156/33 101/157/50
f 101/157/50 78/156/33 102/158/33
f 79/159/51 77/155/49 103/160/51
f 103/160/51 77/155/49 101/157/50
f 80/161/52 79/159/51 104/162/52
f 104/162/52 79/159/51 103/160/51
f 81/163/53 80/161/52 105/164/53
f 105/164/53 80/161/52 104/162/52
f 82/165/54 81/163/53 106/166/55
f 106/166/55 81/163/53 105/164/53
f 83/167/40 82/165/54 107/168/40
f 107/168/40 82/165/54 106/166/55
f 84/169/56 83/167/40 108/170/56
f 108/170/56 83/167/40 107/168/40
f 85/171/57 84/169/56 109/172/58
f 109/172/58 84/169/56 108/170/56
f 86/173/59 85/171/57 110/174/60
f 110/174/60 85/171/57 109/172/58
f 87/175/61 86/173/59 111/176/61
f 111/176/61 86/173/59 110/174/60
f 88/177/62 87/175/61 112/178/62
f 112/178/62 87/175/61 111/176/61
f 89/179/17 88/177/62 113/180/17
f 113/180/17 88/177/62 112/178/62
f 90/181/63 89/179/17 114/182/63
f 114/182/63 89/179/17 113/180/17
f 91/183/64 90/181/63 115/184/64
f 115/184/64 90/181/63 114/182/63
f 92/185/65 91/183/64 116/186/66
f 116/186/66 91/183/64 115/184/64
f 93/187/67 92/185/65 117/188/67
f 117/188/67 92/185/65 116/186/66
f 94/189/68 93/187/67 118/190/69
f 118/190/69 93/187/67 117/188/67
f 95/191/25 94/189/68 119/192/25
f 119/192/25 94/189/68 118/190/69
f 96/193/70 95/191/25 120/194/70
f 120/194/70 95/191/25 119/192/25
f 97/195/71 96/193/70 121/196/72
f 121/196/72 96/193/70 120/194/70
f 98/197/73 97/195/71 122/198/73
f 122/198/73 97/195/71 121/196/72
f 99/199/74 98/197/73 123/200/75
f 123/200/75 98/197/73 122/198/73
f 100/201/76 99/199/74 124/202/77
f 124/202/77 99/199/74 123/200/75
f 78/203/33 100/201/76 102/204/33
f 102/204/33 100/201/76 124/202/77
f 102/205/2 30/206/2 101/207/2
f 101/207/2 30/206/2 29/208/2
f 101/207/2 29/208/2 103/209/2
f 103/209/2 29/208/2 33/210/2
f 103/209/2 33/210/2 104/211/2
f 104/211/2 33/210/2 35/212/2
f 104/211/2 35/212/2 105/213/2
f 105/213/2 35/212/2 37/214/2
f 105/213/2 37/214/2 106/215/2
f 106/215/2 37/214/2 39/216/2
f 106/215/2 39/216/2 107/217/2
f 107/217/2 39/216/2 41/218/2
f 108/219/2 107/217/2 43/220/2
f 43/220/2 107/217/2 41/218/2
f 109/221/2 108/219/2 45/222/2
f 45/222/2 108/219/2 43/220/2
f 110/223/2 109/221/2 47/224/2
f 47/224/2 109/221/2 45/222/2
f 111/225/2 110/223/2 49/226/2
f 49/226/2 110/223/2 47/224/2
f 112/227/2 111/225/2 51/228/2
f 51/228/2 111/225/2 49/226/2
f 113/229/2 112/227/2 53/230/2
f 53/230/2 112/227/2 51/228/2
f 113/229/2 53/230/2 114/231/2
f 114/231/2 53/230/2 55/232/2
f 114/231/2 55/232/2 115/233/2
f 115/233/2 55/232/2 57/234/2
f 115/233/2 57/234/2 116/235/2
f 116/235/2 57/234/2 59/236/2
f 116/235/2 59/236/2 117/237/2
f 117/237/2 59/236/2 61/238/2
f 117/237/2 61/238/2 118/239/2
f 118/239/2 61/238/2 63/240/2
f 118/239/2 63/240/2 119/241/2
f 119/241/2 63/240/2 65/242/2
f 120/243/2 119/241/2 67/244/2
f 67/244/2 119/241/2 65/242/2
f 121/245/2 120/243/2 69/246/2
f 69/246/2 120/243/2 67/244/2
f 122/247/2 121/245/2 71/248/2
f 71/248/2 121/245/2 69/246/2
f 123/249/2 122/247/2 73/250/2
f 73/250/2 122/247/2 71/248/2
f 124/251/2 123/249/2 75/252/2
f 75/252/2 123/249/2 73/250/2
f 102/205/2 124/251/2 30/206/2
f 30/206/2 124/251/2 75/252/2
f 125/253/1 126/254/1 127/255/1
f 127/255/1 126/254/1 128/256/1
f 128/256/1 126/254/1 129/257/1
f 126/254/1 130/258/1 129/257/1
f 131/259/1 132/260/1 133/261/1
f 133/261/1 132/260/1 130/258/1
f 130/258/1 132/260/1 129/257/1
f 132/260/1 134/262/1 129/257/1
f 135/263/2 136/264/2 137/265/2
f 136/264/2 138/266/2 137/265/2
f 139/267/2 140/268/2 141/269/2
f 140/268/2 142/270/2 141/269/2
f 142/270/2 143/271/2 141/269/2
f 141/269/2 143/271/2 138/266/2
f 138/266/2 143/271/2 137/265/2
f 143/271/2 144/272/2 137/265/2
f 142/273/3 140/274/3 128/275/3
f 128/275/3 140/274/3 127/276/3
f 140/274/4 139/277/4 127/276/4
f 127/276/4 139/277/4 125/278/5
f 139/277/6 141/279/6 125/278/6
f 125/278/6 141/279/6 126/280/6
f 141/279/7 138/281/7 126/280/7
f 126/280/7 138/281/7 130/282/7
f 138/281/8 136/283/8 130/282/8
f 130/282/8 136/283/8 133/284/8
f 136/283/9 135/285/9 133/284/9
f 133/284/9 135/285/9 131/286/9
f 135/285/10 137/287/10 131/286/10
f 131/286/10 137/287/10 132/288/10
f 137/287/11 144/289/11 132/288/11
f 132/288/11 144/289/11 134/290/11
f 143/291/12 142/273/12 129/292/12
f 129/292/12 142/273/12 128/275/12
f 145/293/13 146/294/13 147/295/13
f 147/295/13 146/294/13 148/296/13
f 148/297/1 149/298/1 147/299/1
f 147/299/1 149/298/1 150/300/1
f 151/301/2 152/302/2 145/303/2
f 145/303/2 152/302/2 146/304/2
f 146/294/14 152/305/14 148/296/14
f 148/296/14 152/305/14 149/306/14
f 151/307/15 145/293/15 150/308/15
f 150/308/15 145/293/15 147/295/15
f 153/309/16 154/310/17 155/311/16
f 155/311/16 154/310/17 156/312/17
f 157/313/18 153/309/16 158/314/19
f 158/314/19 153/309/16 155/311/16
f 159/315/20 157/313/18 160/316/21
f 160/316/21 157/313/18 158/314/19
f 161/317/22 159/315/20 162/318/23
f 162/318/23 159/315/20 160/316/21
f 163/319/24 161/317/22 164/320/24
f 164/320/24 161/317/22 162/318/23
f 165/321/25 163/319/24 166/322/25
f 166/322/25 163/319/24 164/320/24
f 167/323/26 165/321/25 168/324/26
f 168/324/26 165/321/25 166/322/25
f 169/325/27 167/323/26 170/326/27
f 170/326/27 167/323/26 168/324/26
f 171/327/28 169/325/27 172/328/29
f 172/328/29 169/325/27 170/326/27
f 173/329/30 171/327/28 174/330/30
f 174/330/30 171/327/28 172/328/29
f 175/331/31 173/329/30 176/332/32
f 176/332/32 173/329/30 174/330/30
f 177/333/33 175/331/31 178/334/33
f 178/334/33 175/331/31 176/332/32
f 179/335/34 177/333/33 180/336/35
f 180/336/35 177/333/33 178/334/33
f 181/337/36 179/335/34 182/338/36
f 182/338/36 179/335/34 180/336/35
f 183/339/37 181/337/36 184/340/37
f 184/340/37 181/337/36 182/338/36
f 185/341/38 183/339/37 186/342/38
f 186/342/38 183/339/37 184/340/37
f 187/343/39 185/341/38 188/344/39
f 188/344/39 185/341/38 186/342/38
f 189/345/40 187/343/39 190/346/40
f 190/346/40 187/343/39 188/344/39
f 191/347/41 189/345/40 192/348/41
f 192/348/41 189/345/40 190/346/40
f 193/349/42 191/347/41 194/350/43
f 194/350/43 191/347/41 192/348/41
f 195/351/44 193/349/42 196/352/44
f 196/352/44 193/349/42 194/350/43
f 197/353/45 195/351/44 198/354/46
f 198/354/46 195/351/44 196/352/44
f 199/355/47 197/353/45 200/356/48
f 200/356/48 197/353/45 198/354/46
f 154/357/17 199/355/47 156/358/17
f 156/358/17 199/355/47 200/356/48
f 155/359/1 156/360/1 201/361/1
f 201/361/1 156/360/1 202/362/1
f 158/363/1 155/359/1 203/364/1
f 203/364/1 155/359/1 201/361/1
f 160/365/1 158/363/1 204/366/1
f 204/366/1 158/363/1 203/364/1
f 162/367/1 160/365/1 205/368/1
f 205/368/1 160/365/1 204/366/1
f 164/369/1 162/367/1 206/370/1
f 206/370/1 162/367/1 205/368/1
f 166/371/1 164/369/1 207/372/1
f 207/372/1 164/369/1 206/370/1
f 166/371/1 207/372/1 168/373/1
f 168/373/1 207/372/1 208/374/1
f 168/373/1 208/374/1 170/375/1
f 170/375/1 208/374/1 209/376/1
f 170/375/1 209/376/1 172/377/1
f 172/377/1 209/376/1 210/378/1
f 172/377/1 210/378/1 174/379/1
f 174/379/1 210/378/1 211/380/1
f 174/379/1 211/380/1 176/381/1
f 176/381/1 211/380/1 212/382/1
f 176/381/1 212/382/1 178/383/1
f 178/383/1 212/382/1 213/384/1
f 180/385/1 178/383/1 214/386/1
f 214/386/1 178/383/1 213/384/1
f 182/387/1 180/385/1 215/388/1
f 215/388/1 180/385/1 214/386/1
f 184/389/1 182/387/1 216/390/1
f 216/390/1 182/387/1 215/388/1
f 186/391/1 184/389/1 217/392/1
f 217/392/1 184/389/1 216/390/1
f 188/393/1 186/391/1 218/394/1
f 218/394/1 186/391/1 217/392/1
f 190/395/1 188/393/1 219/396/1
f 219/396/1 188/393/1 218/394/1
f 190/395/1 219/396/1 192/397/1
f 192/397/1 219/396/1 220/398/1
f 192/397/1 220/398/1 194/399/1
f 194/399/1 220/398/1 221/400/1
f 194/399/1 221/400/1 196/401/1
f 196/401/1 221/400/1 222/402/1
f 196/401/1 222/402/1 198/403/1
f 198/403/1 222/402/1 223/404/1
f 198/403/1 223/404/1 200/405/1
f 200/405/1 223/404/1 224/406/1
f 200/405/1 224/406/1 156/360/1
f 156/360/1 224/406/1 202/362/1
f 201/407/49 202/408/33 225/409/50
f 225/409/50 202/408/33 226/410/33
f 203/411/51 201/407/49 227/412/51
f 227/412/51 201/407/49 225/409/50
f 204/413/52 203/411/51 228/414/52
f 228/414/52 203/411/51 227/412/51
f 205/415/53 204/413/52 229/416/53
f 229/416/53 204/413/52 228/414/52
f 206/417/54 205/415/53 230/418/55
f 230/418/55 205/415/53 229/416/53
f 207/419/40 206/417/54 231/420/40
f 231/420/40 206/417/54 230/418/55
f 208/421/56 207/419/40 232/422/56
f 232/422/56 207/419/40 231/420/40
f 209/423/57 208/421/56 233/424/58
f 233/424/58 208/421/56 232/422/56
f 210/425/59 209/423/57 234/426/60
f 234/426/60 209/423/57 233/424/58
f 211/427/61 210/425/59 235/428/61
f 235/428/61 210/425/59 234/426/60
f 212/429/62 211/427/61 236/430/62
f 236/430/62 211/427/61 235/428/61
f 213/431/17 212/429/62 237/432/17
f 237/432/17 212/429/62 236/430/62
f 214/433/63 213/431/17 238/434/63
f 238/434/63 213/431/17 237/432/17
f 215/435/64 214/433/63 239/436/64
f 239/436/64 214/433/63 238/434/63
f 216/437/65 215/435/64 240/438/66
f 240/438/66 215/435/64 239/436/64
f 217/439/67 216/437/65 241/440/67
f 241/440/67 216/437/65 240/438/66
f 218/441/68 217/439/67 242/442/69
f 242/442/69 217/439/67 241/440/67
f 219/443/25 218/441/68 243/444/25
f 243/444/25 218/441/68 242/442/69
f 220/445/70 219/443/25 244/446/70
f 244/446/70 219/443/25 243/444/25
f 221/447/71 220/445/70 245/448/72
f 245/448/72 220/445/70 244/446/70
f 222/449/73 221/447/71 246/450/73
f 246/450/73 221/447/71 245/448/72
f 223/451/74 222/449/73 247/452/75
f 247/452/75 222/449/73 246/450/73
f 224/453/76 223/451/74 248/454/77
f 248/454/77 223/451/74 247/452/75
f 202/455/33 224/453/76 226/456/33
f 226/456/33 224/453/76 248/454/77
f 226/457/2 154/458/2 225/459/2
f 225/459/2 154/458/2 153/460/2
f 225/459/2 153/460/2 227/461/2
f 227/461/2 153/460/2 157/462/2
f 227/461/2 157/462/2 228/463/2
f 228/463/2 157/462/2 159/464/2
f 228/463/2 159/464/2 229/465/2
f 229/465/2 159/464/2 161/466/2
f 229/465/2 161/466/2 230/467/2
f 230/467/2 161/466/2 163/468/2
f 230/467/2 163/468/2 231/469/2
f 231/469/2 163/468/2 165/470/2
f 232/471/2 231/469/2 167/472/2
f 167/472/2 231/469/2 165/470/2
f 233/473/2 232/471/2 169/474/2
f 169/474/2 232/471/2 167/472/2
f 234/475/2 233/473/2 171/476/2
f 171/476/2 233/473/2 169/474/2
f 235/477/2 234/475/2 173/478/2
f 173/478/2 234/475/2 171/476/2
f 236/479/2 235/477/2 175/480/2
f 175/480/2 235/477/2 173/478/2
f 237/481/2 236/479/2 177/482/2
f 177/482/2 236/479/2 175/480/2
f 237/481/2 177/482/2 238/483/2
f 238/483/2 177/482/2 179/484/2
f 238/483/2 179/484/2 239/485/2
f 239/485/2 179/484/2 181/486/2
f 239/485/2 181/486/2 240/487/2
f 240/487/2 181/486/2 183/488/2
f 240/487/2 183/488/2 241/489/2
f 241/489/2 183/488/2 185/490/2
f 241/489/2 185/490/2 242/491/2
f 242/491/2 185/490/2 187/492/2
f 242/491/2 187/492/2 243/493/2
f 243/493/2 187/492/2 189/494/2
f 244/495/2 243/493/2 191/496/2
f 191/496/2 243/493/2 189/494/2
f 245/497/2 244/495/2 193/498/2
f 193/498/2 244/495/2 191/496/2
f 246/499/2 245/497/2 195/500/2
f 195/500/2 245/497/2 193/498/2
f 247/501/2 246/499/2 197/502/2
f 197/502/2 246/499/2 195/500/2
f 248/503/2 247/501/2 199/504/2
f 199/504/2 247/501/2 197/502/2
f 226/457/2 248/503/2 154/458/2
f 154/458/2 248/503/2 199/504/2
