<?xml version="1.0" encoding="utf-8"?>
<!-- Generator: Adobe Illustrator 24.0.0, SVG Export Plug-In . SVG Version: 6.00 Build 0)  -->
<svg version="1.1" id="Capa_1" xmlns="http://www.w3.org/2000/svg" xmlns:xlink="http://www.w3.org/1999/xlink" x="0px" y="0px"
	 viewBox="0 0 220.6 68" style="enable-background:new 0 0 220.6 68;" xml:space="preserve">
<style type="text/css">
	.st0{fill:#FFFFFF;}
	.st1{fill:#4199A0;}
	.st2{fill:#D3097F;}
</style>
<title>Mesa de trabajo 1</title>
<g>
	<path class="st0" d="M94.3,12h6.8v27.7c0,3.8-1.1,6.8-3.5,9S92.1,52,88.3,52c-4.1,0-7.3-1.1-9.5-3.1s-3.3-4.9-3.3-8.6h6.9
		C82.3,42,82.8,43.7,84,45c1.2,1.1,2.8,1.7,4.5,1.6c1.7,0.1,3.3-0.6,4.4-1.9c1.1-1.4,1.8-3.3,1.6-5L94.3,12z"/>
	<path class="st0" d="M126,48.6c-1.9,2.3-4.7,3.4-8.2,3.4c-3.2,0-5.6-1-7.2-2.8c-1.7-1.9-2.5-4.6-2.5-8v-19h6.6v18.9
		c0,3.7,1.6,5.6,4.6,5.6c3.2,0,5.4-1.1,6.4-3.4v-21h6.6v29.3h-6.2L126,48.6z"/>
	<path class="st0" d="M145.2,22.2l0.2,3.3c2.1-2.6,5.2-4.1,8.5-4c6.1,0,9.2,3.5,9.3,10.5v19.4h-6.6V32.5c0.1-1.5-0.4-2.9-1.2-4.1
		c-1.1-1-2.5-1.5-4-1.3c-2.6-0.1-4.8,1.3-5.9,3.6v20.8h-6.6V22.2H145.2z"/>
	<path class="st0" d="M178.2,15v7.1h5.2v4.8h-5.2v16.4c-0.1,0.9,0.2,1.8,0.7,2.5c0.6,0.5,1.5,0.8,2.4,0.7c0.8,0,1.6-0.1,2.3-0.3v5.1
		c-1.4,0.4-2.8,0.6-4.3,0.6c-5,0-7.6-2.8-7.6-8.4V27h-4.8v-4.8h4.8v-7.1C171.7,15,178.2,15,178.2,15z"/>
	<path class="st0" d="M205.9,51.4c-0.4-0.9-0.6-1.8-0.8-2.7c-4.1,4.1-10.5,4.4-14.9,0.8c-1.9-1.6-2.8-3.9-2.8-6.3
		c-0.2-2.8,1.1-5.6,3.4-7.2c2.3-1.7,5.6-2.5,10-2.5h4.1v-1.9c0.1-1.3-0.4-2.6-1.2-3.6c-1.1-1-2.5-1.5-3.9-1.3
		c-1.3-0.1-2.6,0.4-3.7,1.1c-0.9,0.7-1.4,1.8-1.4,2.8h-6.6c0-1.7,0.5-3.3,1.6-4.5c1.1-1.4,2.6-2.6,4.3-3.3c1.9-0.8,4.1-1.2,6.2-1.2
		c3.4,0,6.2,0.9,8.2,2.6c2.1,1.9,3.3,4.5,3.2,7.2v13.2c-0.1,2.1,0.3,4.3,1.1,6.3v0.4L205.9,51.4z M198.6,46.7c1.3,0,2.6-0.4,3.7-1
		c1.1-0.6,2-1.5,2.6-2.6v-5.6h-3.5c-2.5,0-4.2,0.4-5.5,1.2c-1.2,0.8-1.9,2.2-1.9,3.6c-0.1,1.1,0.4,2.2,1.2,3
		C196.2,46.4,197.4,46.7,198.6,46.7z"/>
	<g>
		<path class="st1" d="M56.9,37.4c1.7-1.6,2.8-3.8,2.8-6.3c0-4.7-3.8-8.5-8.5-8.5c-2.1,0-4.1,0.8-5.6,2.1c-1.3-1.4-2.9-2.7-4.8-3.7
			c1.6-1.5,2.6-3.7,2.6-6.1c0-4.7-3.8-8.5-8.5-8.5c-4.7,0-8.5,3.8-8.5,8.5c0,2.3,0.9,4.4,2.4,5.9c-1.8,0.8-3.4,2-4.6,3.5
			c-1.4-1.1-3.2-1.8-5.2-1.8c-4.7,0-8.5,3.8-8.5,8.5c0,2.5,1.1,4.8,2.8,6.3c-3.3,1.9-5.5,5.5-5.5,9.5c0,1.1,0.9,1.9,1.9,1.9
			c1.1,0,1.9-0.9,1.9-1.9c0-3.9,3.2-7.1,7.1-7.1c1.3,0,2.7,0.5,3.9,1.3c-6,3.8-10.1,10.3-10.4,18c0,1.1,0.8,2,1.9,2
			c1.1,0,2-0.8,2-1.9c0.4-9.9,8.4-17.6,18.3-17.6c9.9,0,17.9,7.7,18.3,17.6c0,1,0.9,1.9,1.9,1.9c0,0,0.1,0,0.1,0
			c1.1,0,1.9-0.9,1.9-2c-0.3-7.4-4.1-13.8-9.8-17.6c1.2-0.9,2.8-1.7,4.4-1.7c4,0,7.2,3.2,7.2,7.1c0,1.1,0.9,1.9,1.9,1.9
			c1.1,0,1.9-0.9,1.9-1.9C62.4,42.8,60.2,39.3,56.9,37.4z M51.2,26.4c2.6,0,4.6,2.1,4.6,4.6c0,2.5-2.1,4.6-4.6,4.6
			c-2.5,0-4.6-2.1-4.6-4.6c0-0.7,0.1-1.3,0.4-1.9c0.2-0.2,0.4-0.5,0.5-0.8C48.2,27.2,49.6,26.4,51.2,26.4z M34.9,10.3
			c2.6,0,4.6,2.1,4.6,4.6c0,2.5-2.1,4.6-4.6,4.6c-2.5,0-4.6-2.1-4.6-4.6C30.3,12.4,32.4,10.3,34.9,10.3z M19.1,26.4
			c2.6,0,4.6,2.1,4.6,4.6c0,2.5-2.1,4.6-4.6,4.6c-2.6,0-4.6-2.1-4.6-4.6C14.4,28.5,16.5,26.4,19.1,26.4z M34.5,37.7
			c-2.8,0-5.5,0.5-8,1.5c-0.6-0.6-1.3-1.2-2.1-1.6c1.9-1.6,3.1-3.9,3.1-6.5c0-1.3-0.3-2.6-0.8-3.6c1.9-2.5,4.9-4,8.2-4
			c3.6,0,6.7,2.2,8.4,4.5c-0.4,1-0.6,2-0.6,3.1c0,2.6,1.2,5,3.1,6.5c-0.9,0.5-1.7,1.2-2.4,1.9C40.6,38.3,37.7,37.7,34.5,37.7z"/>
		<path class="st2" d="M57.6,59.4L57.6,59.4c0,1.1-1,2.2-2.2,2.2h-7.1c-1.1,0-2.1-0.9-2.2-2.1v-0.1c-0.5-6.3-6-11-12.2-10.4
			c-5.6,0.4-10,4.9-10.4,10.4l0,0c0,1.1-1,2.2-2.2,2.2h-7.1c-1.1,0-2.2-1-2.2-2.2l0,0c0.5-12.6,11.1-22.5,23.6-21.9
			C47.7,37.9,57.2,47.3,57.6,59.4L57.6,59.4z"/>
	</g>
</g>
</svg>
