<?xml version="1.0" encoding="utf-8"?>
<!-- Generator: Adobe Illustrator 24.0.0, SVG Export Plug-In . SVG Version: 6.00 Build 0)  -->
<svg version="1.1" id="Capa_1" xmlns="http://www.w3.org/2000/svg" xmlns:xlink="http://www.w3.org/1999/xlink" x="0px" y="0px"
	 viewBox="0 0 286 92" style="enable-background:new 0 0 286 92;" xml:space="preserve">
<style type="text/css">
	.st0{fill:#D3097F;}
	.st1{fill:#4A4A4A;}
	.st2{fill:#4199A0;}
</style>
<title>Mesa de trabajo 1</title>
<path class="st0" d="M35.1,86.7c0-0.6-0.3-1.3-0.8-1.7c-0.8-0.6-1.8-1-2.7-1.2c-1-0.2-2-0.7-2.9-1.2c-1.3-0.9-1.7-2.7-0.8-4.1
	c0.2-0.3,0.4-0.5,0.7-0.7c0.9-0.6,2-1,3.1-0.9c0.8,0,1.6,0.2,2.3,0.5c0.6,0.3,1.2,0.8,1.5,1.4c0.4,0.6,0.6,1.3,0.6,2H35
	c0-0.8-0.3-1.6-0.9-2.1c-0.7-0.6-1.5-0.8-2.4-0.8c-0.8,0-1.6,0.2-2.3,0.7c-0.5,0.4-0.9,1-0.9,1.7c0,0.6,0.3,1.2,0.8,1.6
	c0.8,0.5,1.6,0.9,2.5,1.1c0.9,0.2,1.8,0.6,2.6,1c0.5,0.3,1,0.7,1.4,1.2c0.3,0.5,0.5,1.1,0.4,1.7c0,1-0.4,1.9-1.2,2.4
	c-0.9,0.6-2,1-3.2,0.9c-0.9,0-1.7-0.2-2.5-0.5c-0.7-0.3-1.3-0.7-1.7-1.3c-0.4-0.6-0.6-1.3-0.6-2h1.1c0,0.8,0.3,1.6,1,2.1
	c0.8,0.6,1.7,0.8,2.7,0.8c0.8,0,1.7-0.2,2.4-0.7C34.8,88,35.1,87.4,35.1,86.7z"/>
<path class="st0" d="M38.2,77.6c0-0.2,0.1-0.4,0.2-0.5c0.1-0.1,0.3-0.2,0.5-0.2s0.4,0.1,0.5,0.2s0.2,0.3,0.2,0.5s-0.1,0.4-0.2,0.5
	c-0.1,0.1-0.3,0.2-0.5,0.2C38.5,78.3,38.2,78,38.2,77.6L38.2,77.6z M39.4,89.8h-1.1v-9.5h1L39.4,89.8z"/>
<path class="st0" d="M48,87.4c0-0.5-0.2-1-0.6-1.2c-0.6-0.4-1.2-0.6-1.8-0.7c-0.7-0.1-1.4-0.3-2-0.6c-0.4-0.2-0.7-0.5-1-0.8
	c-0.2-0.4-0.3-0.8-0.3-1.2c0-0.7,0.3-1.4,0.9-1.9c0.7-0.5,1.5-0.8,2.4-0.8s1.8,0.2,2.5,0.8c0.6,0.5,1,1.2,1,2h-1
	c0-0.5-0.3-1.1-0.7-1.4c-0.5-0.4-1.2-0.6-1.8-0.5c-0.6,0-1.2,0.1-1.7,0.5c-0.4,0.3-0.6,0.7-0.6,1.2c0,0.4,0.2,0.8,0.5,1.1
	c0.6,0.4,1.2,0.6,1.9,0.7s1.4,0.4,2.1,0.7c0.4,0.2,0.8,0.5,1,0.9s0.4,0.8,0.3,1.2c0,0.8-0.4,1.5-1,1.9c-0.7,0.5-1.6,0.8-2.5,0.7
	c-1,0-1.9-0.2-2.7-0.8c-0.6-0.5-1-1.2-1-2H43c0,0.6,0.3,1.1,0.8,1.4c0.6,0.4,1.2,0.5,1.9,0.5c0.6,0,1.2-0.1,1.8-0.5
	C47.7,88.4,48,87.9,48,87.4z"/>
<path class="st0" d="M53,77.9v2.4h2v0.9h-2v6.3c0,0.4,0.1,0.8,0.3,1.2c0.2,0.3,0.6,0.4,1,0.4c0.3,0,0.6,0,0.8-0.1v0.8
	C54.8,90,54.4,90,54,90c-0.6,0-1.1-0.2-1.5-0.6c-0.4-0.5-0.5-1.2-0.5-1.8v-6.3h-1.8v-0.9H52V78L53,77.9L53,77.9z"/>
<path class="st0" d="M60.8,90c-0.8,0-1.5-0.2-2.2-0.6s-1.2-1-1.5-1.7c-0.4-0.7-0.6-1.6-0.5-2.4V85c0-0.8,0.2-1.7,0.5-2.5
	c0.3-0.7,0.8-1.3,1.5-1.7c0.6-0.4,1.3-0.6,2-0.6c1,0,2.1,0.4,2.7,1.2c0.7,0.9,1.1,2.1,1,3.2v0.6h-6.7v0.2c0,1,0.3,1.9,0.9,2.6
	c0.6,0.7,1.4,1.1,2.3,1.1c1,0,2-0.4,2.6-1.2l0.7,0.5C63.4,89.4,62.2,90.1,60.8,90z M60.6,81c-0.8,0-1.5,0.3-2,0.9
	c-0.6,0.6-0.9,1.5-1,2.3h5.7v-0.1c0-0.8-0.3-1.6-0.8-2.2C62.1,81.3,61.4,81,60.6,81L60.6,81z"/>
<path class="st0" d="M67.4,80.3v1.6c0.3-0.5,0.8-1,1.3-1.3s1.2-0.4,1.8-0.4c1.3-0.2,2.5,0.6,2.8,1.8c0.3-0.6,0.8-1,1.4-1.4
	c0.6-0.3,1.2-0.5,1.9-0.5c2,0,3,1.1,3.1,3.3v6.3h-1v-6.2c0.1-0.7-0.1-1.3-0.5-1.9c-0.5-0.4-1.1-0.7-1.8-0.6c-0.7,0-1.4,0.3-1.9,0.7
	c-0.5,0.4-0.8,1.1-0.9,1.7v6.3h-1.1v-6.3c0-0.7-0.2-1.3-0.6-1.8c-0.5-0.4-1.1-0.7-1.7-0.6c-0.6,0-1.2,0.2-1.7,0.6s-0.9,1-1.1,1.7
	v6.5h-1v-9.5C66.4,80.3,67.4,80.3,67.4,80.3z"/>
<path class="st0" d="M88.3,89.8c-0.1-0.4-0.2-0.9-0.2-1.3c-0.4,0.5-0.9,0.9-1.4,1.1c-0.6,0.3-1.2,0.4-1.8,0.4
	c-0.8,0-1.6-0.2-2.2-0.8c-0.6-0.5-0.9-1.2-0.8-1.9c0-0.9,0.4-1.7,1.2-2.2c1-0.6,2.1-0.9,3.2-0.8h1.9v-1.1c0-0.6-0.2-1.2-0.6-1.6
	C87,81.2,86.3,81,85.7,81c-0.7,0-1.3,0.2-1.8,0.6c-0.5,0.3-0.7,0.9-0.7,1.4h-1.1c0-0.8,0.4-1.5,1.1-2c0.7-0.6,1.7-0.9,2.6-0.8
	c0.9-0.1,1.8,0.2,2.5,0.8c0.6,0.6,1,1.4,0.9,2.2v4.5c0,0.7,0.1,1.4,0.3,2.1v0.1L88.3,89.8L88.3,89.8z M85,89.1
	c0.7,0,1.3-0.2,1.9-0.5c0.5-0.3,1-0.8,1.2-1.4v-2.1h-1.9c-0.9,0-1.7,0.2-2.4,0.6c-0.6,0.3-0.9,0.9-0.9,1.5c0,0.5,0.2,1,0.6,1.3
	C83.9,88.9,84.5,89.1,85,89.1z"/>
<path class="st0" d="M95.9,85c-0.1-1.3,0.3-2.5,1-3.5c0.6-0.9,1.6-1.3,2.7-1.3c1.2,0,2.3,0.5,2.9,1.5v-5.3h1v13.5h-1v-1.3
	c-0.7,1-1.8,1.5-3,1.4c-1,0-2-0.5-2.7-1.3C96.1,87.7,95.7,86.4,95.9,85L95.9,85z M97,85.2c0,1,0.2,2,0.7,2.8c0.5,0.6,1.2,1,2,1
	c1.2,0.1,2.3-0.6,2.8-1.6v-4.5c-0.4-1.1-1.5-1.9-2.7-1.8c-0.8,0-1.6,0.3-2.1,1C97.1,83,96.9,84.1,97,85.2L97,85.2z"/>
<path class="st0" d="M110,90c-0.8,0-1.5-0.2-2.2-0.6s-1.2-1-1.5-1.7c-0.4-0.7-0.6-1.6-0.5-2.4V85c0-0.9,0.2-1.7,0.5-2.5
	c0.3-0.7,0.8-1.3,1.5-1.7c0.6-0.4,1.3-0.6,2.1-0.6c1,0,2.1,0.4,2.7,1.2c0.7,0.9,1.1,2.1,1,3.2v0.6h-6.8v0.2c0,1,0.3,1.9,0.9,2.6
	s1.4,1.1,2.3,1.1c0.5,0,1-0.1,1.5-0.3c0.5-0.2,0.9-0.6,1.2-1l0.7,0.5C112.6,89.4,111.4,90.1,110,90z M109.8,81c-0.8,0-1.5,0.3-2,0.9
	c-0.6,0.6-0.9,1.5-1,2.3h5.7v-0.1c0-0.8-0.3-1.6-0.8-2.2C111.2,81.3,110.5,81,109.8,81L109.8,81z"/>
<path class="st0" d="M127.5,86.7c0-0.6-0.3-1.3-0.8-1.7c-0.8-0.6-1.8-1-2.7-1.2c-1-0.2-2-0.7-2.9-1.2c-1.3-0.9-1.7-2.7-0.8-4.1
	c0.2-0.3,0.4-0.5,0.7-0.7c0.9-0.6,2-1,3.1-0.9c0.8,0,1.6,0.2,2.3,0.5c0.6,0.3,1.2,0.8,1.6,1.4s0.6,1.3,0.6,2h-1.1
	c0-0.8-0.3-1.6-0.9-2.1c-0.7-0.6-1.5-0.8-2.4-0.8c-0.8,0-1.6,0.2-2.3,0.7c-0.6,0.4-0.9,1-0.9,1.7c0,0.6,0.3,1.2,0.8,1.6
	c0.8,0.5,1.6,0.9,2.5,1.1s1.8,0.6,2.6,1c0.5,0.3,1,0.6,1.3,1.1c0.3,0.5,0.5,1.1,0.4,1.7c0,1-0.4,1.9-1.2,2.4c-0.9,0.6-2,1-3.2,0.9
	c-0.9,0-1.7-0.2-2.5-0.5c-0.7-0.3-1.3-0.7-1.7-1.3c-0.4-0.6-0.6-1.3-0.6-2h1.1c0,0.8,0.3,1.6,1,2.1c0.8,0.6,1.7,0.8,2.7,0.8
	c0.8,0,1.7-0.2,2.4-0.7C127.2,88,127.5,87.4,127.5,86.7z"/>
<path class="st0" d="M134.3,90c-0.8,0-1.5-0.2-2.2-0.6s-1.2-1-1.5-1.7c-0.4-0.7-0.6-1.6-0.5-2.4V85c0-0.9,0.2-1.7,0.5-2.5
	c0.3-0.7,0.8-1.3,1.5-1.7c0.6-0.4,1.3-0.6,2.1-0.6c1,0,2.1,0.4,2.7,1.2c0.7,0.9,1.1,2.1,1,3.2v0.6h-6.8v0.2c0,1,0.3,1.9,0.9,2.7
	c0.6,0.7,1.4,1.1,2.3,1.1c0.5,0,1-0.1,1.5-0.3c0.5-0.2,0.9-0.6,1.2-1l0.7,0.5C136.9,89.4,135.6,90.1,134.3,90z M134.1,81
	c-0.8,0-1.5,0.3-2,0.9c-0.6,0.6-0.9,1.5-1,2.3h5.7v-0.1c0-0.8-0.3-1.6-0.8-2.2C135.5,81.3,134.8,81,134.1,81L134.1,81z"/>
<path class="st0" d="M145.6,87.4c0-0.5-0.2-1-0.6-1.2c-0.6-0.4-1.2-0.6-1.9-0.7s-1.4-0.3-2-0.6c-0.4-0.2-0.7-0.5-1-0.8
	c-0.2-0.4-0.4-0.8-0.3-1.2c0-0.7,0.3-1.4,0.9-1.9c0.7-0.5,1.5-0.8,2.4-0.7c0.9,0,1.8,0.2,2.5,0.8c0.6,0.5,1,1.2,1,2h-1.1
	c0-0.5-0.3-1.1-0.7-1.4c-1-0.7-2.4-0.7-3.4-0.1c-0.4,0.3-0.6,0.7-0.6,1.2c0,0.4,0.2,0.8,0.5,1.1c0.6,0.4,1.2,0.6,1.9,0.7
	s1.4,0.4,2.1,0.7c0.4,0.2,0.7,0.5,1,0.9c0.6,1.1,0.3,2.4-0.6,3.2c-0.7,0.5-1.6,0.8-2.5,0.7c-1,0-1.9-0.2-2.7-0.8c-0.6-0.5-1-1.2-1-2
	h1c0,0.6,0.3,1.1,0.8,1.4c0.6,0.4,1.2,0.5,1.9,0.5c0.6,0,1.2-0.1,1.8-0.5C145.3,88.4,145.6,87.9,145.6,87.4z"/>
<path class="st0" d="M148.9,77.6c0-0.2,0.1-0.4,0.2-0.5c0.1-0.1,0.3-0.2,0.5-0.2s0.4,0.1,0.5,0.2s0.2,0.3,0.2,0.5s-0.1,0.4-0.2,0.5
	c-0.1,0.1-0.3,0.2-0.5,0.2s-0.4-0.1-0.5-0.2C149,78,148.9,77.8,148.9,77.6z M150.2,89.8h-1.1v-9.5h1.1V89.8z"/>
<path class="st0" d="M152.5,84.9c0-0.9,0.2-1.7,0.5-2.5c0.3-0.7,0.8-1.3,1.5-1.7c0.7-0.4,1.4-0.6,2.2-0.6c1.2,0,2.3,0.4,3.1,1.3
	c0.8,1,1.2,2.2,1.1,3.5v0.2c0,0.9-0.2,1.7-0.5,2.5c-0.3,0.7-0.8,1.3-1.5,1.7c-0.7,0.4-1.4,0.6-2.2,0.6c-1.2,0-2.3-0.4-3.1-1.3
	c-0.8-1-1.2-2.2-1.1-3.5V84.9z M153.6,85.2c0,1,0.3,2,0.9,2.8c1.1,1.3,2.9,1.5,4.2,0.4c0.1-0.1,0.3-0.3,0.4-0.4
	c0.6-0.8,0.9-1.8,0.9-2.9v-0.2c0-0.7-0.1-1.4-0.4-2c-0.2-0.6-0.6-1.1-1.1-1.4s-1.1-0.5-1.7-0.5c-0.9,0-1.7,0.4-2.3,1.1
	c-0.6,0.8-1,1.8-0.9,2.9L153.6,85.2z"/>
<path class="st0" d="M164.1,80.3V82c0.3-0.6,0.8-1,1.4-1.3c0.5-0.3,1.1-0.5,1.8-0.5c0.8-0.1,1.7,0.2,2.2,0.8
	c0.6,0.7,0.8,1.7,0.8,2.6v6.2h-1.1v-6.2c0.1-0.7-0.1-1.4-0.5-1.9c-0.4-0.4-1.1-0.7-1.7-0.6c-0.6,0-1.2,0.2-1.7,0.6s-0.9,1-1.1,1.6
	v6.5h-1v-9.5C163.2,80.3,164.1,80.3,164.1,80.3z"/>
<path class="st0" d="M176.6,90c-0.8,0-1.5-0.2-2.2-0.6s-1.2-1-1.5-1.7c-0.4-0.7-0.6-1.6-0.5-2.4V85c0-0.9,0.2-1.7,0.5-2.5
	c0.3-0.7,0.8-1.3,1.5-1.7c0.6-0.4,1.3-0.6,2.1-0.6c1,0,2.1,0.4,2.7,1.2c0.7,0.9,1.1,2.1,1,3.2v0.6h-6.8v0.2c0,1,0.3,1.9,0.9,2.7
	c0.6,0.7,1.4,1.1,2.3,1.1c0.5,0,1-0.1,1.5-0.3c0.5-0.2,0.9-0.6,1.2-1l0.7,0.5C179.2,89.4,178,90.1,176.6,90z M176.4,81
	c-0.8,0-1.5,0.3-2,0.9c-0.6,0.6-0.9,1.5-1,2.3h5.7v-0.1c0-0.8-0.3-1.6-0.8-2.2C177.9,81.3,177.2,81,176.4,81L176.4,81z"/>
<path class="st0" d="M187.9,87.4c0-0.5-0.2-1-0.6-1.2c-0.6-0.4-1.2-0.6-1.9-0.7s-1.4-0.3-2-0.6c-0.4-0.2-0.7-0.5-1-0.8
	c-0.2-0.4-0.4-0.8-0.3-1.2c0-0.7,0.3-1.4,0.9-1.9c0.7-0.5,1.5-0.8,2.4-0.7c0.9,0,1.8,0.2,2.6,0.8c0.6,0.5,1,1.2,1,2h-1
	c0-0.5-0.3-1.1-0.7-1.4c-0.5-0.4-1.1-0.6-1.8-0.6c-0.6,0-1.2,0.1-1.7,0.5c-0.4,0.3-0.6,0.7-0.6,1.2c0,0.4,0.2,0.8,0.5,1.1
	c0.6,0.4,1.2,0.6,1.9,0.7s1.4,0.4,2.1,0.7c0.4,0.2,0.8,0.5,1,0.9c0.6,1.1,0.3,2.4-0.6,3.2c-0.7,0.5-1.7,0.8-2.6,0.8
	c-1,0-1.9-0.2-2.7-0.8c-0.6-0.5-1-1.2-1-2h1.1c0,0.6,0.3,1.1,0.8,1.4c0.6,0.4,1.2,0.5,1.9,0.5c0.6,0,1.3-0.1,1.8-0.5
	C187.7,88.4,187.9,87.9,187.9,87.4z"/>
<path class="st0" d="M195.3,85c-0.1-1.3,0.3-2.5,1-3.5c0.6-0.9,1.6-1.3,2.7-1.3c1.2-0.1,2.3,0.5,2.9,1.5v-5.3h1v13.5h-1v-1.3
	c-0.7,1-1.8,1.5-3,1.4c-1,0-2-0.5-2.6-1.3C195.6,87.7,195.2,86.4,195.3,85L195.3,85z M196.3,85.2c-0.1,1,0.2,2,0.7,2.9
	c0.5,0.7,1.2,1,2.1,1c1.2,0.1,2.3-0.6,2.8-1.7V83c-0.4-1.1-1.5-1.9-2.7-1.8c-0.8,0-1.6,0.3-2.1,1C196.5,83,196.3,84.1,196.3,85.2
	L196.3,85.2z"/>
<path class="st0" d="M209.4,90c-0.8,0-1.5-0.2-2.2-0.6s-1.2-1-1.5-1.7c-0.4-0.7-0.6-1.6-0.5-2.4V85c0-0.9,0.2-1.7,0.5-2.5
	c0.3-0.7,0.8-1.3,1.5-1.7c0.6-0.4,1.3-0.6,2.1-0.6c1,0,2.1,0.4,2.7,1.2c0.7,0.9,1.1,2.1,1,3.2v0.6h-6.8v0.2c0,1,0.3,1.9,0.9,2.7
	c0.6,0.7,1.4,1.1,2.3,1.1c0.5,0,1-0.1,1.5-0.3c0.5-0.2,0.9-0.6,1.2-1l0.7,0.5C212,89.4,210.7,90.1,209.4,90z M209.2,81
	c-0.8,0-1.5,0.3-2,0.9c-0.6,0.6-0.9,1.5-1,2.3h5.7v-0.1c0-0.8-0.3-1.6-0.8-2.2C210.6,81.3,209.9,81,209.2,81L209.2,81z"/>
<path class="st0" d="M225.2,77.1h1.1v9c0,1.1-0.3,2.1-1.1,2.9c-0.7,0.7-1.7,1.1-2.8,1.1c-1,0.1-2.1-0.3-2.9-1
	c-0.7-0.7-1.1-1.7-1-2.7h1.1c-0.1,0.8,0.2,1.5,0.7,2.1c0.6,0.5,1.3,0.7,2,0.7c0.8,0,1.5-0.3,2-0.8c0.5-0.6,0.8-1.4,0.8-2.2
	L225.2,77.1z"/>
<path class="st0" d="M235.3,88.6c-0.7,0.9-1.8,1.5-3,1.4c-0.9,0.1-1.7-0.3-2.3-0.9c-0.6-0.7-0.9-1.7-0.8-2.6v-6.2h1v6
	c0,1.8,0.7,2.7,2.2,2.7c1.3,0.1,2.5-0.6,2.9-1.9v-6.8h1.1v9.5h-1L235.3,88.6z"/>
<path class="st0" d="M240.1,80.3V82c0.3-0.6,0.8-1,1.4-1.3c0.5-0.3,1.1-0.5,1.8-0.5c0.8-0.1,1.7,0.2,2.2,0.8
	c0.6,0.7,0.8,1.7,0.8,2.6v6.2h-1.1v-6.2c0.1-0.7-0.1-1.4-0.5-1.9c-0.4-0.4-1.1-0.7-1.7-0.6c-0.6,0-1.2,0.2-1.7,0.6s-0.9,1-1.1,1.6
	v6.5h-1v-9.5C239.2,80.3,240.1,80.3,240.1,80.3z"/>
<path class="st0" d="M250.6,77.9v2.4h2v0.9h-2v6.3c0,0.4,0.1,0.8,0.3,1.2c0.2,0.3,0.6,0.4,1,0.4c0.3,0,0.6,0,0.9-0.1v0.8
	c-0.4,0.1-0.7,0.2-1.1,0.2c-0.6,0.1-1.2-0.2-1.6-0.6c-0.4-0.5-0.5-1.2-0.5-1.8v-6.3h-1.8v-0.9h1.7V78L250.6,77.9L250.6,77.9z"/>
<path class="st0" d="M260.7,89.8c-0.1-0.4-0.2-0.9-0.2-1.3c-0.4,0.5-0.9,0.9-1.4,1.1c-0.6,0.3-1.2,0.4-1.8,0.4
	c-0.8,0-1.6-0.2-2.2-0.8c-0.6-0.5-0.9-1.2-0.8-1.9c0-0.9,0.4-1.7,1.1-2.2c1-0.6,2.1-0.9,3.2-0.8h1.9v-1.1c0-0.6-0.2-1.2-0.6-1.6
	c-0.5-0.4-1.2-0.6-1.8-0.6c-0.7,0-1.3,0.2-1.8,0.6c-0.5,0.3-0.7,0.8-0.7,1.4h-1c0-0.8,0.4-1.5,1-2c0.7-0.6,1.7-0.9,2.6-0.8
	c0.9-0.1,1.8,0.2,2.5,0.8c0.6,0.6,1,1.4,0.9,2.2v4.5c0,0.7,0.1,1.4,0.3,2.1v0.1L260.7,89.8z M257.4,89.1c0.7,0,1.3-0.2,1.9-0.5
	c0.5-0.3,1-0.8,1.2-1.4v-2.1h-1.9c-0.9,0-1.7,0.2-2.5,0.6c-0.8,0.5-1.1,1.6-0.7,2.4c0.1,0.2,0.2,0.3,0.4,0.4
	C256.3,88.9,256.9,89.1,257.4,89.1z"/>
<path class="st1" d="M127.2,9.2h7.7v31.4c0,4.3-1.3,7.7-4,10.2s-6.2,3.8-10.6,3.8c-4.7,0-8.3-1.2-10.8-3.5s-3.8-5.6-3.8-9.8h7.8
	c-0.1,1.9,0.5,3.9,1.8,5.3c1.4,1.3,3.2,1.9,5.1,1.8c1.9,0.1,3.7-0.7,5-2.1c1.3-1.6,2-3.7,1.8-5.7V9.2z"/>
<path class="st1" d="M163.2,50.7c-2.2,2.6-5.3,3.9-9.3,3.9c-3.6,0-6.3-1.1-8.2-3.2s-2.8-5.2-2.8-9.1V20.7h7.5v21.4
	c0,4.2,1.8,6.3,5.2,6.3c3.6,0,6.1-1.3,7.3-3.9V20.7h7.5v33.2h-7L163.2,50.7z"/>
<path class="st1" d="M184.9,20.7l0.2,3.8c2.4-2.9,5.9-4.6,9.7-4.5c6.9,0,10.4,4,10.6,11.9v22h-7.5V32.4c0.1-1.7-0.3-3.3-1.4-4.7
	c-0.9-1-2.4-1.5-4.5-1.5c-2.9-0.1-5.5,1.5-6.7,4.1v23.6h-7.5V20.7H184.9z"/>
<path class="st1" d="M222.4,12.6v8.1h5.9v5.5h-5.9v18.5c-0.1,1,0.2,2,0.8,2.8c0.7,0.6,1.7,0.9,2.7,0.8c0.9,0,1.8-0.1,2.6-0.3v5.8
	c-1.6,0.5-3.2,0.7-4.9,0.7c-5.7,0-8.6-3.2-8.6-9.5V26.2h-5.5v-5.5h5.5v-8.1H222.4z"/>
<path class="st1" d="M253.8,53.9c-0.4-1-0.7-2-0.9-3.1c-4.6,4.6-11.9,5-16.9,0.9c-2-1.8-3.2-4.4-3.2-7.1c-0.2-3.2,1.3-6.3,3.9-8.2
	c2.6-1.9,6.4-2.8,11.3-2.8h4.6v-2.2c0.1-1.5-0.4-3-1.4-4.1c-1.2-1.1-2.8-1.7-4.4-1.5c-1.5-0.1-3,0.4-4.2,1.2c-1,0.8-1.6,2-1.6,3.2
	h-7.5c0-1.9,0.6-3.7,1.8-5.1c1.3-1.6,3-2.9,4.9-3.7c2.2-0.9,4.6-1.4,7-1.4c3.9,0,7,1,9.3,2.9c2.4,2.1,3.7,5.1,3.6,8.2v15
	c-0.1,2.4,0.3,4.9,1.3,7.2v0.5L253.8,53.9z M245.6,48.5c1.5,0,2.9-0.4,4.2-1.1c1.2-0.7,2.3-1.7,2.9-2.9v-6.3h-4
	c-2.8,0-4.8,0.5-6.2,1.4s-2.2,2.5-2.1,4.1c-0.1,1.3,0.5,2.5,1.4,3.4C242.8,48.2,244.2,48.6,245.6,48.5z"/>
<g>
	<path class="st2" d="M82.3,39.7c1.9-1.8,3.1-4.2,3.1-7c0-5.2-4.2-9.5-9.5-9.5c-2.3,0-4.6,0.9-6.2,2.3c-1.4-1.6-3.2-3-5.3-4.1
		c1.8-1.7,2.9-4.1,2.9-6.8c0-5.2-4.2-9.5-9.5-9.5s-9.5,4.2-9.5,9.5c0,2.6,1,4.9,2.7,6.6c-2,0.9-3.8,2.2-5.1,3.9
		c-1.6-1.2-3.6-2-5.8-2c-5.2,0-9.5,4.2-9.5,9.5c0,2.8,1.2,5.3,3.1,7c-3.7,2.1-6.1,6.1-6.1,10.6c0,1.2,1,2.1,2.1,2.1
		c1.2,0,2.1-1,2.1-2.1c0-4.3,3.6-7.9,7.9-7.9c1.4,0,3,0.6,4.3,1.4C37.4,48,32.8,55.2,32.5,63.8c0,1.2,0.9,2.2,2.1,2.2
		c1.2,0,2.2-0.9,2.2-2.1c0.4-11,9.4-19.6,20.4-19.6s19.9,8.6,20.4,19.6c0,1.1,1,2.1,2.1,2.1h0.1c1.2,0,2.1-1,2.1-2.2
		c-0.3-8.2-4.6-15.4-10.9-19.6c1.3-1,3.1-1.9,4.9-1.9c4.5,0,8,3.6,8,7.9c0,1.2,1,2.1,2.1,2.1c1.2,0,2.1-1,2.1-2.1
		C88.4,45.8,86,41.9,82.3,39.7z M75.9,27.5c2.9,0,5.1,2.3,5.1,5.1c0,2.8-2.3,5.1-5.1,5.1c-2.8,0-5.1-2.3-5.1-5.1
		c0-0.8,0.1-1.4,0.4-2.1c0.2-0.2,0.4-0.6,0.6-0.9C72.6,28.4,74.2,27.5,75.9,27.5z M57.8,9.5c2.9,0,5.1,2.3,5.1,5.1s-2.3,5.1-5.1,5.1
		c-2.8,0-5.1-2.3-5.1-5.1S55,9.5,57.8,9.5z M40.2,27.5c2.9,0,5.1,2.3,5.1,5.1c0,2.8-2.3,5.1-5.1,5.1c-2.9,0-5.1-2.3-5.1-5.1
		C34.9,29.8,37.3,27.5,40.2,27.5z M57.3,40.1c-3.1,0-6.1,0.6-8.9,1.7c-0.7-0.7-1.4-1.3-2.3-1.8c2.1-1.8,3.5-4.3,3.5-7.2
		c0-1.4-0.3-2.9-0.9-4c2.1-2.8,5.5-4.5,9.1-4.5c4,0,7.5,2.5,9.4,5c-0.4,1.1-0.7,2.2-0.7,3.5c0,2.9,1.3,5.6,3.5,7.2
		c-1,0.6-1.9,1.3-2.7,2.1C64.1,40.7,60.9,40.1,57.3,40.1z"/>
	<path class="st0" d="M83.1,64.2L83.1,64.2c0,1.2-1.1,2.5-2.5,2.5h-7.9c-1.2,0-2.3-1-2.5-2.3v-0.1c-0.6-7-6.7-12.3-13.6-11.6
		c-6.2,0.4-11.1,5.5-11.6,11.6l0,0c0,1.2-1.1,2.5-2.5,2.5h-7.9c-1.2,0-2.5-1.1-2.5-2.5l0,0c0.6-14,12.4-25.1,26.3-24.4
		C72,40.3,82.6,50.8,83.1,64.2L83.1,64.2z"/>
</g>
</svg>
