<?xml version="1.0" encoding="utf-8"?>
<!-- Generator: Adobe Illustrator 24.0.0, SVG Export Plug-In . SVG Version: 6.00 Build 0)  -->
<svg version="1.1" id="Capa_1" xmlns="http://www.w3.org/2000/svg" xmlns:xlink="http://www.w3.org/1999/xlink" x="0px" y="0px"
	 viewBox="0 0 286 92" style="enable-background:new 0 0 286 92;" xml:space="preserve">
<style type="text/css">
	.st0{fill:#D3097F;}
	.st1{fill:#4A4A4A;}
	.st2{fill:#4199A0;}
</style>
<title>Mesa de trabajo 1</title>
<g>
	<path class="st0" d="M37.7,83.2c0-0.6-0.2-1.1-0.7-1.5c-0.7-0.5-1.6-0.8-2.4-1c-0.9-0.2-1.8-0.6-2.6-1.1c-1.2-0.8-1.5-2.5-0.7-3.7
		c0.2-0.3,0.4-0.5,0.6-0.7c0.8-0.6,1.8-0.9,2.8-0.8c0.7,0,1.4,0.1,2,0.4c0.6,0.3,1.1,0.7,1.4,1.2c0.3,0.5,0.5,1.1,0.5,1.8h-1
		c0-0.7-0.3-1.4-0.8-1.9c-0.6-0.5-1.4-0.8-2.2-0.7c-0.7,0-1.5,0.2-2.1,0.6c-0.5,0.3-0.8,0.9-0.8,1.5c0,0.6,0.3,1.1,0.7,1.4
		c0.7,0.5,1.4,0.8,2.2,1c0.8,0.2,1.6,0.5,2.3,0.9c0.5,0.3,0.9,0.6,1.2,1.1c0.3,0.4,0.4,1,0.4,1.5c0,0.9-0.4,1.7-1.1,2.2
		c-0.8,0.6-1.8,0.9-2.8,0.8c-0.8,0-1.5-0.1-2.2-0.4c-0.6-0.3-1.1-0.7-1.5-1.2c-0.4-0.5-0.5-1.2-0.5-1.8h1c0,0.7,0.3,1.5,0.9,1.9
		c0.7,0.5,1.6,0.7,2.4,0.7c0.8,0,1.5-0.2,2.1-0.6C37.4,84.5,37.7,83.9,37.7,83.2z"/>
	<path class="st0" d="M40.5,75.1c0-0.2,0.1-0.3,0.2-0.4c0.1-0.1,0.3-0.2,0.5-0.2c0.2,0,0.4,0.1,0.5,0.2c0.1,0.1,0.2,0.3,0.2,0.4
		c0,0.2-0.1,0.3-0.2,0.4c-0.1,0.1-0.3,0.2-0.5,0.2c-0.2,0-0.3-0.1-0.5-0.2C40.6,75.4,40.5,75.3,40.5,75.1z M41.6,86.1h-1v-8.5h1
		V86.1z"/>
	<path class="st0" d="M49.3,83.9c0-0.4-0.2-0.9-0.6-1.1c-0.5-0.3-1.1-0.6-1.7-0.7c-0.6-0.1-1.2-0.3-1.8-0.6
		c-0.4-0.2-0.7-0.4-0.9-0.8c-0.2-0.3-0.3-0.7-0.3-1.1c0-0.7,0.3-1.3,0.8-1.7c1.3-0.9,3.1-0.9,4.4,0c0.6,0.4,0.9,1.1,0.9,1.8h-0.9
		c0-0.5-0.2-1-0.6-1.2c-0.5-0.3-1-0.5-1.6-0.4c-0.5,0-1,0.1-1.5,0.4c-0.3,0.3-0.5,0.7-0.5,1.1c0,0.4,0.1,0.8,0.5,1
		c0.5,0.3,1.1,0.5,1.7,0.6c0.6,0.1,1.3,0.3,1.9,0.6c0.4,0.2,0.7,0.5,0.9,0.8c0.2,0.3,0.3,0.7,0.3,1.1c0,0.7-0.3,1.3-0.9,1.7
		c-0.7,0.5-1.5,0.7-2.3,0.6c-0.9,0-1.7-0.2-2.4-0.7c-0.6-0.4-0.9-1.1-0.9-1.8h0.9c0,0.5,0.3,1,0.7,1.3c0.5,0.3,1.1,0.5,1.7,0.5
		c0.6,0,1.1-0.1,1.6-0.5C49,84.8,49.3,84.3,49.3,83.9z"/>
	<path class="st0" d="M53.8,75.4v2.2h1.8v0.8h-1.8V84c0,0.4,0,0.7,0.2,1.1c0.2,0.2,0.5,0.4,0.9,0.3c0.3,0,0.5,0,0.8-0.1v0.8
		c-0.3,0.1-0.7,0.1-1,0.1c-0.5,0-1.1-0.2-1.4-0.6c-0.3-0.5-0.4-1.1-0.4-1.7v-5.7h-1.6v-0.8h1.6v-2.2H53.8z"/>
	<path class="st0" d="M60.8,86.2c-0.7,0-1.4-0.2-2-0.5c-0.6-0.4-1.1-0.9-1.4-1.5c-0.3-0.7-0.5-1.4-0.4-2.2v-0.3
		c0-0.8,0.2-1.5,0.5-2.2c0.3-0.6,0.7-1.1,1.3-1.5c0.5-0.4,1.2-0.6,1.8-0.6c0.9,0,1.8,0.3,2.5,1.1c0.6,0.8,1,1.8,0.9,2.8v0.5h-6.1V82
		c0,0.9,0.3,1.7,0.8,2.4c0.5,0.6,1.3,1,2.1,1c0.5,0,0.9-0.1,1.3-0.3c0.4-0.2,0.8-0.5,1-0.9l0.6,0.4C63.1,85.7,62,86.3,60.8,86.2z
		 M60.6,78.2c-0.7,0-1.3,0.3-1.8,0.8c-0.5,0.6-0.8,1.3-0.9,2.1H63V81c0-0.7-0.2-1.4-0.7-2C61.9,78.5,61.3,78.2,60.6,78.2L60.6,78.2z
		"/>
	<path class="st0" d="M66.7,77.6v1.4c0.3-0.5,0.7-0.9,1.2-1.2c0.5-0.3,1-0.4,1.6-0.4c1.1-0.1,2.2,0.6,2.6,1.7
		c0.3-0.5,0.7-0.9,1.2-1.2c0.5-0.3,1.1-0.4,1.7-0.4c1.8,0,2.8,1,2.8,3v5.7h-0.9v-5.6c0-0.6-0.1-1.2-0.5-1.7c-0.4-0.4-1-0.6-1.6-0.6
		c-0.6,0-1.2,0.2-1.7,0.7c-0.4,0.4-0.7,1-0.8,1.6v5.6h-0.9v-5.7c0-0.6-0.1-1.2-0.5-1.6c-0.4-0.4-1-0.6-1.6-0.5
		c-0.6,0-1.1,0.2-1.5,0.5c-0.5,0.4-0.8,0.9-0.9,1.5v5.8h-0.9v-8.5L66.7,77.6z"/>
	<path class="st0" d="M85.4,86.1c-0.1-0.4-0.2-0.8-0.2-1.2c-0.3,0.4-0.8,0.8-1.3,1c-0.5,0.2-1.1,0.4-1.6,0.3c-0.7,0-1.4-0.2-2-0.7
		c-0.5-0.4-0.8-1.1-0.8-1.7c0-0.8,0.3-1.6,1-2c0.9-0.5,1.9-0.8,2.9-0.7h1.7v-1c0-0.5-0.2-1.1-0.6-1.4c-0.5-0.4-1-0.6-1.6-0.5
		c-0.6,0-1.2,0.2-1.6,0.5c-0.4,0.3-0.6,0.7-0.6,1.2h-0.9c0-0.7,0.4-1.4,0.9-1.8c0.7-0.5,1.5-0.8,2.3-0.7c0.8,0,1.6,0.2,2.2,0.7
		c0.6,0.5,0.9,1.2,0.8,2v4c0,0.7,0.1,1.3,0.3,1.9v0.1L85.4,86.1z M82.4,85.4c0.6,0,1.2-0.1,1.7-0.5c0.5-0.3,0.9-0.7,1.1-1.2v-1.9
		h-1.6c-0.8,0-1.5,0.1-2.2,0.5c-0.5,0.3-0.8,0.8-0.8,1.4c0,0.5,0.2,0.9,0.5,1.2C81.5,85.2,82,85.4,82.4,85.4L82.4,85.4z"/>
	<path class="st0" d="M92.2,81.7c-0.1-1.1,0.3-2.2,0.9-3.2c0.6-0.8,1.5-1.2,2.4-1.2c1.1,0,2.1,0.5,2.6,1.4V74h0.9v12.1h-0.9v-1.1
		c-0.6,0.9-1.6,1.4-2.7,1.3c-1,0-1.9-0.4-2.4-1.2C92.5,84.1,92.2,82.9,92.2,81.7L92.2,81.7z M93.2,81.9c0,0.9,0.2,1.8,0.7,2.6
		c0.4,0.6,1.1,1,1.8,0.9c1.1,0.1,2-0.6,2.5-1.5v-4c-0.4-1-1.4-1.7-2.4-1.7c-0.7,0-1.4,0.3-1.8,0.9C93.4,80,93.1,80.9,93.2,81.9
		L93.2,81.9z"/>
	<path class="st0" d="M104.9,86.2c-1.4,0-2.7-0.7-3.3-2c-0.3-0.7-0.5-1.4-0.5-2.2v-0.3c0-0.8,0.2-1.5,0.5-2.2
		c0.3-0.6,0.8-1.1,1.3-1.5c0.5-0.4,1.2-0.6,1.8-0.6c0.9,0,1.8,0.3,2.4,1.1c0.6,0.8,1,1.8,0.9,2.9v0.5H102v0.2c0,0.9,0.3,1.7,0.8,2.4
		c0.5,0.6,1.3,1,2.1,1c0.5,0,0.9-0.1,1.3-0.3c0.4-0.2,0.8-0.5,1.1-0.9l0.6,0.4C107.2,85.8,106.1,86.3,104.9,86.2z M104.7,78.2
		c-0.7,0-1.3,0.3-1.8,0.8c-0.5,0.6-0.8,1.3-0.9,2.1h5.1V81c0-0.7-0.2-1.4-0.7-2C106,78.5,105.4,78.2,104.7,78.2L104.7,78.2z"/>
	<path class="st0" d="M120.5,83.2c0-0.6-0.2-1.1-0.7-1.5c-0.7-0.5-1.6-0.8-2.4-1c-0.9-0.2-1.8-0.6-2.6-1.1c-1.2-0.8-1.5-2.5-0.7-3.7
		c0.2-0.3,0.4-0.5,0.6-0.7c0.8-0.6,1.8-0.9,2.8-0.8c0.7,0,1.4,0.1,2,0.4c0.6,0.3,1.1,0.7,1.4,1.2c0.3,0.5,0.5,1.1,0.5,1.8h-1
		c0-0.7-0.3-1.4-0.8-1.9c-0.6-0.5-1.4-0.8-2.2-0.7c-0.7,0-1.5,0.2-2.1,0.6c-0.5,0.3-0.8,0.9-0.8,1.5c0,0.6,0.2,1.1,0.7,1.4
		c0.7,0.5,1.4,0.8,2.2,1c0.8,0.2,1.6,0.5,2.3,0.9c0.5,0.3,0.9,0.6,1.2,1.1c0.3,0.4,0.4,1,0.4,1.5c0,0.9-0.4,1.7-1.1,2.2
		c-0.8,0.6-1.8,0.9-2.8,0.8c-0.8,0-1.5-0.1-2.2-0.4c-0.6-0.2-1.1-0.7-1.5-1.2c-0.4-0.5-0.5-1.2-0.5-1.8h1c0,0.7,0.3,1.5,0.9,1.9
		c0.7,0.5,1.5,0.7,2.4,0.7c0.8,0,1.5-0.2,2.2-0.6C120.2,84.5,120.5,83.9,120.5,83.2z"/>
	<path class="st0" d="M126.6,86.2c-0.7,0-1.4-0.2-2-0.5c-0.6-0.4-1.1-0.9-1.4-1.5c-0.3-0.7-0.5-1.4-0.5-2.2v-0.3
		c0-0.8,0.2-1.5,0.5-2.2c0.3-0.6,0.8-1.1,1.4-1.5c0.5-0.4,1.2-0.6,1.8-0.6c0.9,0,1.8,0.3,2.5,1.1c0.6,0.8,1,1.8,0.9,2.9v0.5h-6.1
		v0.2c0,0.9,0.3,1.7,0.8,2.4c0.5,0.6,1.3,1,2.1,1c0.5,0,0.9-0.1,1.3-0.3c0.4-0.2,0.7-0.5,1-0.9l0.6,0.4
		C128.9,85.7,127.8,86.3,126.6,86.2z M126.5,78.2c-0.7,0-1.3,0.3-1.8,0.8c-0.5,0.6-0.8,1.3-0.9,2.1h5.1V81c0-0.7-0.2-1.4-0.7-2
		C127.8,78.5,127.1,78.2,126.5,78.2L126.5,78.2z"/>
	<path class="st0" d="M136.8,83.9c0-0.4-0.2-0.9-0.6-1.1c-0.5-0.3-1.1-0.6-1.7-0.7c-0.6-0.1-1.2-0.3-1.8-0.6
		c-0.4-0.2-0.7-0.4-0.9-0.8c-0.2-0.3-0.3-0.7-0.3-1.1c0-0.7,0.3-1.3,0.8-1.7c0.6-0.5,1.4-0.7,2.1-0.7c0.8,0,1.6,0.2,2.3,0.7
		c0.6,0.4,0.9,1.1,0.9,1.8h-0.9c0-0.5-0.2-1-0.6-1.2c-0.5-0.3-1-0.5-1.6-0.5c-0.5,0-1,0.1-1.5,0.4c-0.4,0.2-0.6,0.6-0.6,1.1
		c0,0.4,0.2,0.8,0.5,1c0.5,0.3,1.1,0.5,1.7,0.6c0.6,0.1,1.3,0.3,1.9,0.6c0.4,0.2,0.7,0.5,0.9,0.8c0.2,0.3,0.3,0.7,0.3,1.1
		c0,0.7-0.3,1.3-0.9,1.7c-0.7,0.5-1.5,0.7-2.3,0.6c-0.9,0-1.7-0.2-2.4-0.7c-0.6-0.4-0.9-1.1-0.9-1.8h0.9c0,0.5,0.3,1,0.7,1.3
		c0.5,0.3,1.1,0.5,1.7,0.5c0.6,0,1.1-0.1,1.6-0.4C136.5,84.8,136.8,84.3,136.8,83.9z"/>
	<path class="st0" d="M139.8,75.1c0-0.2,0.1-0.3,0.2-0.4c0.1-0.1,0.3-0.2,0.5-0.2c0.2,0,0.4,0.1,0.5,0.2c0.1,0.1,0.2,0.3,0.2,0.4
		c0,0.2-0.1,0.3-0.2,0.4c-0.1,0.1-0.3,0.2-0.5,0.2c-0.2,0-0.3-0.1-0.5-0.2C139.8,75.4,139.8,75.3,139.8,75.1z M140.9,86.1h-0.9v-8.5
		h0.9V86.1z"/>
	<path class="st0" d="M142.9,81.7c0-0.8,0.2-1.5,0.5-2.2c0.3-0.6,0.8-1.2,1.3-1.5c0.6-0.4,1.3-0.6,2-0.5c1.1,0,2.1,0.4,2.8,1.2
		c0.7,0.9,1.1,2,1,3.2v0.2c0,0.8-0.2,1.5-0.5,2.2c-0.3,0.6-0.8,1.2-1.3,1.5c-0.6,0.4-1.3,0.5-2,0.5c-1,0-2-0.4-2.7-1.2
		c-0.7-0.9-1.1-2-1.1-3.2L142.9,81.7z M143.9,81.9c0,0.9,0.2,1.8,0.8,2.5c0.9,1.1,2.6,1.3,3.8,0.4c0.1-0.1,0.3-0.2,0.4-0.4
		c0.6-0.7,0.8-1.7,0.8-2.6v-0.2c0-0.6-0.1-1.2-0.4-1.8c-0.2-0.5-0.6-0.9-1-1.3c-0.4-0.3-1-0.4-1.5-0.4c-0.8,0-1.5,0.4-2,1
		c-0.6,0.7-0.8,1.7-0.8,2.6L143.9,81.9z"/>
	<path class="st0" d="M153.4,77.6V79c0.3-0.5,0.7-0.9,1.2-1.2c0.5-0.3,1-0.4,1.6-0.4c0.7-0.1,1.5,0.2,2,0.8c0.5,0.7,0.7,1.5,0.7,2.3
		v5.6h-0.9v-5.6c0-0.6-0.1-1.2-0.5-1.7c-0.4-0.4-1-0.6-1.5-0.6c-0.6,0-1.1,0.2-1.6,0.5c-0.5,0.4-0.8,0.9-1,1.5v5.8h-0.9v-8.5
		L153.4,77.6z"/>
	<path class="st0" d="M164.6,86.2c-0.7,0-1.4-0.2-2-0.5c-0.6-0.4-1.1-0.9-1.4-1.5c-0.3-0.7-0.5-1.4-0.5-2.2v-0.3
		c0-0.8,0.2-1.5,0.5-2.2c0.3-0.6,0.8-1.1,1.4-1.5c0.5-0.4,1.2-0.6,1.8-0.6c0.9,0,1.8,0.3,2.5,1.1c0.6,0.8,1,1.8,0.9,2.9v0.5h-6.1
		v0.2c0,0.9,0.3,1.7,0.8,2.4c0.5,0.6,1.3,1,2.1,1c0.5,0,0.9-0.1,1.3-0.3c0.4-0.2,0.8-0.5,1.1-0.9l0.6,0.4
		C166.9,85.8,165.8,86.3,164.6,86.2z M164.4,78.2c-0.7,0-1.3,0.3-1.8,0.8c-0.5,0.6-0.8,1.3-0.9,2.1h5.1V81c0-0.7-0.2-1.4-0.7-2
		C165.7,78.5,165.1,78.2,164.4,78.2L164.4,78.2z"/>
	<path class="st0" d="M174.7,83.9c0-0.4-0.2-0.9-0.6-1.1c-0.5-0.3-1.1-0.6-1.7-0.7c-0.6-0.1-1.2-0.3-1.8-0.6
		c-0.4-0.2-0.7-0.4-0.9-0.8c-0.2-0.3-0.3-0.7-0.3-1.1c0-0.7,0.3-1.3,0.8-1.7c0.6-0.5,1.4-0.7,2.1-0.7c0.8,0,1.6,0.2,2.3,0.7
		c0.6,0.4,0.9,1.1,0.9,1.8h-0.9c0-0.5-0.3-1-0.7-1.2c-0.5-0.3-1-0.5-1.6-0.5c-0.5,0-1,0.1-1.5,0.4c-0.4,0.2-0.6,0.6-0.6,1.1
		c0,0.4,0.2,0.8,0.5,1c0.5,0.3,1.1,0.5,1.7,0.6c0.6,0.1,1.3,0.3,1.9,0.6c0.4,0.2,0.7,0.5,0.9,0.8c0.2,0.3,0.3,0.7,0.3,1.1
		c0,0.7-0.3,1.3-0.9,1.7c-0.7,0.5-1.5,0.7-2.3,0.6c-0.9,0-1.7-0.2-2.4-0.7c-0.6-0.4-0.9-1.1-0.9-1.8h0.9c0,0.5,0.3,1,0.7,1.3
		c0.5,0.3,1.1,0.5,1.7,0.5c0.6,0,1.1-0.1,1.6-0.4C174.5,84.8,174.7,84.4,174.7,83.9z"/>
	<path class="st0" d="M181.3,81.7c-0.1-1.1,0.3-2.2,0.9-3.2c0.6-0.8,1.5-1.2,2.4-1.2c1.1,0,2.1,0.5,2.6,1.4V74h0.9v12.1h-0.9v-1.1
		c-0.6,0.9-1.6,1.4-2.7,1.3c-1,0-1.9-0.4-2.4-1.2C181.6,84.1,181.2,82.9,181.3,81.7L181.3,81.7z M182.3,81.9c0,0.9,0.2,1.8,0.7,2.6
		c0.4,0.6,1.1,1,1.8,0.9c1.1,0.1,2-0.6,2.5-1.5v-4c-0.4-1-1.4-1.7-2.5-1.7c-0.7,0-1.4,0.3-1.9,0.9C182.4,80,182.2,80.9,182.3,81.9z"
		/>
	<path class="st0" d="M193.9,86.2c-0.7,0-1.4-0.2-2-0.5c-0.6-0.4-1.1-0.9-1.4-1.5c-0.3-0.7-0.5-1.4-0.5-2.2v-0.3
		c0-0.8,0.2-1.5,0.5-2.2c0.3-0.6,0.8-1.1,1.4-1.5c0.5-0.4,1.2-0.6,1.8-0.6c0.9,0,1.8,0.3,2.5,1.1c0.6,0.8,1,1.8,0.9,2.9v0.5h-6.1
		v0.2c0,0.9,0.3,1.7,0.8,2.4c0.5,0.6,1.3,1,2.1,1c0.5,0,0.9-0.1,1.3-0.3c0.4-0.2,0.7-0.5,1-0.9l0.6,0.4
		C196.2,85.7,195.1,86.3,193.9,86.2z M193.8,78.2c-0.7,0-1.3,0.3-1.8,0.8c-0.5,0.6-0.8,1.3-0.9,2.1h5.1V81c0-0.7-0.2-1.4-0.7-2
		C195.1,78.5,194.4,78.2,193.8,78.2L193.8,78.2z"/>
	<path class="st0" d="M211.2,82.5c-0.1,1.1-0.5,2-1.3,2.8c-0.8,0.7-1.9,1-2.9,1c-0.8,0-1.6-0.2-2.3-0.6c-0.7-0.4-1.2-1.1-1.5-1.8
		c-0.4-0.8-0.6-1.8-0.5-2.7v-1.5c0-0.9,0.2-1.8,0.5-2.7c0.3-0.7,0.9-1.4,1.5-1.8c0.7-0.4,1.5-0.7,2.3-0.6c2.1-0.2,4,1.4,4.1,3.5
		c0,0.1,0,0.2,0,0.2h-1c0-1.6-1.3-2.9-2.9-2.9c-0.1,0-0.2,0-0.3,0c-1,0-1.9,0.4-2.5,1.2c-0.7,0.9-1,2.1-0.9,3.2v1.4
		c-0.1,1.1,0.3,2.2,0.9,3.2c0.6,0.8,1.5,1.2,2.5,1.2c0.8,0.1,1.6-0.2,2.3-0.7c0.6-0.6,0.9-1.4,1-2.2H211.2z"/>
	<path class="st0" d="M212.8,81.7c0-0.8,0.2-1.5,0.5-2.2c0.3-0.6,0.8-1.2,1.3-1.5c0.6-0.4,1.3-0.6,2-0.5c1.1,0,2.1,0.4,2.8,1.2
		c0.7,0.9,1.1,2,1,3.2v0.2c0,0.8-0.2,1.5-0.5,2.2c-0.3,0.6-0.8,1.2-1.3,1.5c-0.6,0.4-1.3,0.5-2,0.5c-1,0-2-0.4-2.7-1.2
		c-0.7-0.9-1.1-2-1.1-3.2V81.7z M213.8,81.9c0,0.9,0.2,1.8,0.8,2.5c0.9,1.1,2.6,1.3,3.8,0.4c0.1-0.1,0.3-0.2,0.4-0.4
		c0.6-0.7,0.8-1.7,0.8-2.6v-0.2c0-0.6-0.1-1.2-0.4-1.8c-0.2-0.5-0.6-0.9-1-1.3c-0.4-0.3-1-0.4-1.5-0.4c-0.8,0-1.5,0.4-2,1
		c-0.6,0.7-0.8,1.7-0.8,2.6L213.8,81.9z"/>
	<path class="st0" d="M223.2,77.6V79c0.3-0.5,0.7-0.9,1.2-1.2c0.5-0.3,1-0.4,1.6-0.4c0.7-0.1,1.5,0.2,2,0.8c0.5,0.7,0.7,1.5,0.7,2.3
		v5.6h-0.9v-5.6c0-0.6-0.1-1.2-0.5-1.7c-0.4-0.4-1-0.6-1.5-0.6c-0.6,0-1.1,0.2-1.6,0.5c-0.5,0.4-0.8,0.9-1,1.5v5.8h-0.9v-8.5
		L223.2,77.6z"/>
	<path class="st0" d="M236.3,83.9c0-0.4-0.2-0.9-0.6-1.1c-0.5-0.3-1.1-0.6-1.7-0.7c-0.6-0.1-1.2-0.3-1.8-0.6
		c-0.4-0.2-0.7-0.4-0.9-0.8c-0.2-0.3-0.3-0.7-0.3-1.1c0-0.7,0.3-1.3,0.8-1.7c0.6-0.5,1.4-0.7,2.2-0.7c0.8,0,1.6,0.2,2.3,0.7
		c0.6,0.4,0.9,1.1,0.9,1.8h-0.9c0-0.5-0.2-1-0.6-1.2c-0.4-0.3-1-0.5-1.6-0.5c-0.5,0-1,0.1-1.5,0.4c-0.4,0.2-0.6,0.6-0.6,1.1
		c0,0.4,0.2,0.8,0.5,1c0.5,0.3,1.1,0.5,1.7,0.6c0.6,0.1,1.3,0.3,1.9,0.6c0.4,0.2,0.7,0.5,0.9,0.8c0.2,0.3,0.3,0.7,0.3,1.1
		c0,0.7-0.3,1.3-0.9,1.7c-0.7,0.5-1.5,0.7-2.3,0.6c-0.9,0-1.7-0.2-2.4-0.7c-0.6-0.4-0.9-1.1-0.9-1.8h0.9c0,0.5,0.3,1,0.7,1.3
		c0.5,0.3,1.1,0.5,1.7,0.5c0.6,0,1.1-0.1,1.6-0.4C236.1,84.8,236.3,84.3,236.3,83.9z"/>
	<path class="st0" d="M242.6,86.2c-1.4,0-2.7-0.7-3.3-2c-0.3-0.7-0.5-1.4-0.5-2.2v-0.3c0-0.8,0.2-1.5,0.5-2.2
		c0.3-0.6,0.8-1.1,1.3-1.5c0.5-0.4,1.2-0.6,1.8-0.6c0.9,0,1.8,0.3,2.4,1.1c0.6,0.8,1,1.8,0.9,2.9v0.5h-6.1v0.2
		c0,0.9,0.3,1.7,0.8,2.4c0.5,0.6,1.3,1,2.1,1c0.5,0,0.9-0.1,1.3-0.3c0.4-0.2,0.7-0.5,1-0.9l0.6,0.4
		C244.9,85.7,243.8,86.3,242.6,86.2z M242.5,78.2c-0.7,0-1.3,0.3-1.8,0.8c-0.5,0.6-0.8,1.3-0.9,2.1h5.1V81c0-0.7-0.2-1.4-0.7-2
		C243.8,78.5,243.1,78.2,242.5,78.2L242.5,78.2z"/>
	<path class="st0" d="M248.7,77.6v9.5c0,0.7-0.2,1.3-0.6,1.8c-0.4,0.4-1.1,0.7-1.7,0.6c-0.3,0-0.6-0.1-0.8-0.2v-0.8
		c0.2,0.1,0.5,0.1,0.7,0.1c0.9,0,1.4-0.5,1.4-1.6v-9.5H248.7z M248.2,74.5c0.2,0,0.4,0.1,0.5,0.2c0.1,0.1,0.2,0.3,0.2,0.4
		c0,0.2-0.1,0.3-0.2,0.4c-0.1,0.1-0.3,0.2-0.5,0.2c-0.2,0-0.3-0.1-0.5-0.2c-0.1-0.1-0.2-0.3-0.2-0.4c0-0.2,0.1-0.3,0.2-0.4
		C247.9,74.5,248,74.5,248.2,74.5z"/>
	<path class="st0" d="M250.8,81.7c0-0.8,0.1-1.5,0.5-2.2c0.3-0.6,0.8-1.2,1.4-1.5c0.6-0.4,1.3-0.6,2-0.5c1,0,2.1,0.4,2.8,1.2
		c0.7,0.9,1.1,2,1,3.2v0.2c0,0.8-0.1,1.5-0.5,2.2c-0.3,0.6-0.8,1.2-1.3,1.5c-0.6,0.4-1.3,0.5-2,0.5c-1.1,0-2.1-0.4-2.8-1.2
		c-0.7-0.9-1.1-2-1-3.2L250.8,81.7z M251.8,81.9c0,0.9,0.2,1.8,0.8,2.5c0.9,1.1,2.6,1.3,3.8,0.4c0.1-0.1,0.3-0.2,0.4-0.4
		c0.6-0.7,0.8-1.7,0.8-2.6v-0.2c0-0.6-0.1-1.2-0.4-1.8c-0.2-0.5-0.6-0.9-1-1.3c-0.4-0.3-1-0.4-1.5-0.4c-0.8,0-1.6,0.4-2.1,1
		c-0.6,0.7-0.8,1.7-0.8,2.6L251.8,81.9z"/>
	<path class="st1" d="M111.8,38c-0.2,3.8-1.9,7.4-4.7,10c-2.7,2.4-6.4,3.6-11,3.6c-3,0.1-5.9-0.7-8.4-2.3c-2.5-1.5-4.4-3.8-5.6-6.4
		c-1.4-3.1-2-6.4-2-9.7v-3.7c-0.1-3.4,0.6-6.9,2-10c1.2-2.7,3.2-5.1,5.8-6.7c2.6-1.6,5.6-2.4,8.7-2.3c4.4,0,8,1.2,10.7,3.6
		s4.3,5.8,4.7,10.2h-6.9c-0.3-2.9-1.2-5-2.5-6.2C101,16.7,99,16,96.4,16c-2.7-0.2-5.4,1.1-7,3.3c-1.6,2.2-2.4,5.5-2.4,9.7v3.6
		c0,4.3,0.8,7.6,2.3,9.9c1.5,2.3,4.1,3.6,6.8,3.4c2.7,0,4.8-0.6,6.2-1.8s2.2-3.3,2.6-6.1L111.8,38z"/>
	<path class="st1" d="M116.1,35.9c0-2.7,0.6-5.4,1.7-7.9c1.1-2.2,2.8-4.1,4.9-5.4c2.2-1.3,4.7-1.9,7.2-1.9c3.7-0.1,7.2,1.3,9.8,3.9
		c2.6,2.8,4,6.5,4.1,10.3v1.6c0,2.7-0.5,5.4-1.7,7.9c-1.1,2.2-2.7,4.1-4.9,5.4c-2.2,1.3-4.7,1.9-7.3,1.9c-3.8,0.2-7.5-1.4-10.1-4.2
		c-2.5-2.8-3.8-6.5-3.8-11.2L116.1,35.9z M122.8,36.5c-0.1,2.5,0.5,5.1,1.9,7.2c2.2,2.9,6.4,3.5,9.3,1.3c0.5-0.4,0.9-0.8,1.3-1.3
		c1.3-1.8,1.9-4.3,1.9-7.7c0.1-2.5-0.5-5-1.9-7.2c-2.2-2.9-6.3-3.5-9.2-1.3c-0.5,0.4-0.9,0.8-1.3,1.3
		C123.5,30.5,122.8,33,122.8,36.5z"/>
	<path class="st1" d="M155.7,21.3l0.2,3.4c2.1-2.6,5.3-4.1,8.7-4c6.2,0,9.4,3.6,9.5,10.7V51h-6.7V31.8c0.1-1.5-0.3-3-1.2-4.2
		c-1.1-1-2.5-1.5-4-1.4c-2.5-0.1-4.9,1.4-6,3.7V51h-6.7V21.3H155.7z"/>
	<path class="st1" d="M197.5,43c0.1-1.1-0.5-2.2-1.5-2.7c-1.5-0.8-3.2-1.4-4.9-1.7c-2-0.4-3.9-1-5.7-1.8c-3.3-1.6-5-3.9-5-7
		c0-2.5,1.2-4.9,3.2-6.4c2.4-1.8,5.3-2.8,8.3-2.6c3.1-0.1,6.1,0.8,8.6,2.6c2.1,1.6,3.4,4.2,3.3,6.9h-6.7c0-1.2-0.5-2.4-1.4-3.2
		c-1.1-0.9-2.4-1.3-3.8-1.3c-1.3-0.1-2.5,0.3-3.6,1c-0.9,0.6-1.4,1.7-1.4,2.8c0,1,0.5,1.9,1.3,2.4c1.6,0.8,3.4,1.4,5.2,1.7
		c2.1,0.4,4.2,1.1,6.2,2.1c1.3,0.7,2.5,1.6,3.3,2.9c0.8,1.2,1.1,2.6,1.1,4.1c0,2.6-1.2,5-3.3,6.5c-2.6,1.8-5.6,2.6-8.7,2.5
		c-2.2,0-4.5-0.4-6.5-1.3c-1.8-0.8-3.3-2-4.5-3.6c-1-1.5-1.6-3.2-1.6-5h6.6c0,1.4,0.7,2.8,1.8,3.7c1.3,0.9,2.8,1.4,4.4,1.3
		c1.4,0.1,2.8-0.3,4-1C197,45,197.5,44,197.5,43z"/>
	<path class="st1" d="M223,51.6c-3.8,0.2-7.6-1.3-10.3-4c-2.6-2.7-3.9-6.2-3.9-10.7v-0.8c-0.1-2.8,0.5-5.5,1.7-8
		c1.1-2.2,2.7-4.1,4.8-5.5c2.1-1.3,4.5-2,6.9-2c4.1,0,7.2,1.3,9.4,3.9s3.3,6.3,3.3,11v2.7h-19.4c0.1,2.2,0.9,4.3,2.5,5.9
		c1.4,1.4,3.4,2.2,5.4,2.2c3,0.1,5.7-1.3,7.5-3.7l3.6,3.5c-1.2,1.8-2.8,3.2-4.8,4.1C227.6,51.1,225.3,51.6,223,51.6z M222.2,26.1
		c-1.7-0.1-3.3,0.6-4.4,1.9c-1.2,1.5-2,3.4-2.2,5.4h12.7v-0.5c0-1.8-0.6-3.6-1.8-5.1C225.5,26.6,223.9,26,222.2,26.1L222.2,26.1z"/>
	<path class="st1" d="M247.1,21.3v32.4c0,3-0.8,5.4-2.3,7s-3.7,2.4-6.6,2.4c-1.2,0-2.4-0.2-3.6-0.5v-5.3c0.8,0.2,1.6,0.3,2.4,0.2
		c2.2,0,3.4-1.2,3.4-3.6V21.3H247.1z M239.9,13.5c0-1,0.3-1.9,1-2.6c1.6-1.4,4-1.4,5.6,0c0.7,0.7,1,1.6,1,2.6c0,0.9-0.3,1.9-1,2.5
		c-1.6,1.3-4,1.3-5.6,0C240.2,15.4,239.9,14.5,239.9,13.5z"/>
	<path class="st1" d="M253,35.9c0-2.7,0.6-5.4,1.8-7.9c1.1-2.2,2.8-4.1,4.9-5.4c2.2-1.3,4.7-1.9,7.2-1.9c3.7-0.1,7.2,1.3,9.8,3.9
		c2.6,2.8,4,6.5,4.1,10.3v1.6c0,2.7-0.5,5.4-1.7,7.9c-1.1,2.2-2.7,4.1-4.9,5.4c-2.2,1.3-4.7,1.9-7.3,1.9c-3.8,0.2-7.5-1.4-10.1-4.2
		c-2.5-2.8-3.8-6.5-3.8-11.2V35.9z M259.7,36.5c-0.1,2.5,0.5,5.1,1.9,7.2c1.2,1.7,3.2,2.7,5.3,2.6c2.1,0.1,4.1-0.9,5.3-2.7
		c1.3-1.8,1.9-4.3,1.9-7.7c0.1-2.5-0.5-5-1.9-7.2c-2.2-2.9-6.3-3.5-9.2-1.3c-0.5,0.4-0.9,0.8-1.3,1.3
		C260.4,30.4,259.7,33,259.7,36.5L259.7,36.5z"/>
	<path class="st2" d="M47.5,39.9c1.3-1,2.8-1.5,4.5-1.6c4.2,0,7.7,3.4,7.7,7.7c0,0,0,0,0,0.1c0,1.1,0.9,2.1,2.1,2.1
		c1.1,0,2.1-0.9,2.1-2.1c0-4.2-2.3-8.2-6-10.3c3.8-3.3,4.1-9.1,0.8-12.9c-3.3-3.8-9.1-4.1-12.9-0.8l0,0c-1.4-1.6-3.2-3-5.1-3.9
		c3.6-3.5,3.7-9.3,0.1-12.9S31.6,1.6,28,5.1s-3.7,9.3-0.1,12.9c0,0,0,0,0,0c-1.9,0.9-3.6,2.1-5,3.7c-1.6-1.2-3.5-1.9-5.6-1.9
		c-5,0-9.1,4.1-9.1,9.1c0,2.6,1.1,5.1,3,6.8c-3.7,2.1-5.9,6-5.9,10.3c0,1.1,0.9,2.1,2.1,2.1s2.1-0.9,2.1-2.1c0-4.2,3.4-7.7,7.7-7.7
		c1.2,0,2.5,0.4,3.5,1l2.5-3.3c3.2-2.7,4.2-7.2,2.4-11c2.1-2.7,5.3-4.3,8.8-4.3c3.6,0.1,6.9,1.9,9,4.8c-1.5,3.7-0.4,7.9,2.7,10.4
		 M17.3,33.9c-2.8,0-5-2.2-5-5s2.2-5,5-5s5,2.2,5,5C22.3,31.7,20,33.9,17.3,33.9L17.3,33.9z M52,33.9c-2.8,0-5-2.2-5-5s2.2-5,5-5
		s5,2.2,5,5C57,31.7,54.7,33.9,52,33.9L52,33.9z M34.3,16.6c-2.8,0-5-2.2-5-5s2.2-5,5-5s5,2.2,5,5S37.1,16.6,34.3,16.6z"/>
	<path class="st2" d="M16.9,38.3c4.2,0,7.7,3.4,7.7,7.7c0,0,0,0,0,0c0,1.1,0.9,2.1,2.1,2.1c1.1,0,2.1-0.9,2.1-2.1c0,0,0,0,0,0
		c0-4.2-2.3-8.2-6-10.2"/>
	<path class="st2" d="M46.3,35.7c-3.7,2.1-6,6-6,10.3c0,1.1,0.9,2.1,2.1,2.1s2.1-0.9,2.1-2.1c0,0,0,0,0,0c0-4.2,3.4-7.7,7.7-7.7"/>
	<path class="st0" d="M34.2,63.6c0.4,0.4,1.2,0.4,1.6,0c0,0,0,0,0,0l3.9-3.9h-9.4L34.2,63.6z"/>
	<path class="st0" d="M50,53.8h-4.4l5-5c0.2-0.2,0.3-0.5,0.3-0.8c0-0.3-0.1-0.6-0.3-0.8L35.8,32.6c-0.4-0.4-1.2-0.4-1.6,0
		c0,0,0,0,0,0L19.5,47.3c-0.2,0.2-0.3,0.5-0.3,0.8c0,0.3,0.1,0.6,0.3,0.8l4.9,5h-4.3c-0.6-0.1-1.2,0.4-1.2,1c-0.1,0.6,0.4,1.2,1,1.2
		c0.1,0,0.1,0,0.2,0H50c0.6-0.1,1.1-0.6,1-1.2C51,54.3,50.5,53.9,50,53.8L50,53.8z"/>
</g>
</svg>
