{
  "cookieDomain": ".ine.mx",
  "_wsUrlPath": "https://pru-pef21-sesiones-deoe.ine.mx/centralSesiones/ws",
  "_urlLogin": "http://www.sesiones-login.sesp.com",
  "_urlJuntas": "http://www.sesiones-junta.sesp.com",
  "_urlConsejo": "http://www.sesiones-consejo.sesp.com",
  "_idSistema": "227",
  "serverConsejo": "https://pru-pef21-sesiones-deoe.ine.mx/centralSesiones/asociaciones",
  "_urlApache": "http://localhost:3001",
  "_cookieDomain": ".ine.mx",
  "wsUrlPath": "https://localhost:8443/centralSesiones/ws",
  "serverGeneral": "https://localhost:8443/centralSesiones/general",
  "urlLogin": "http://www.sesiones-login.sesp.com",
  "urlJuntas": "http://www.sesiones-junta.sesp.com",
  "urlConsejo": "http://www.sesiones-consejo.sesp.com",
  "idSistema": "227",
  "_serverConsejo": "https://localhost:8443/centralSesiones/asociaciones",
  "urlApache": "http://localhost:3001",
  "centralSesiones": "https://localhost:8443/centralSesiones"
}