{
	"info": {
		"_postman_id": "80c6032a-e6a0-4d1f-b312-c8b2302ccdbb",
		"name": "TestTrabajo",
		"schema": "https://schema.getpostman.com/json/collection/v2.1.0/collection.json"
	},
	"item": [
		{
			"name": "ejerccio01",
			"request": {
				"method": "POST",
				"header": [],
				"body": {
					"mode": "raw",
					"raw": "{\n    \"gender_id\": 1,\n    \"job_id\": 1, \n    \"name\": \"Juan1\", \n    \"last_name\": \"Pérez1\",\n    \"birthdate\": \"2000-01-01\" \n}",
					"options": {
						"raw": {
							"language": "json"
						}
					}
				},
				"url": {
					"raw": "localhost:8080/ejerccio/example01",
					"host": [
						"localhost"
					],
					"port": "8080",
					"path": [
						"ejerccio",
						"example01"
					]
				}
			},
			"response": []
		},
		{
			"name": "ejerccio03",
			"protocolProfileBehavior": {
				"disableBodyPruning": true
			},
			"request": {
				"method": "GET",
				"header": [],
				"body": {
					"mode": "raw",
					"raw": "{\n\"employee_id\": [1,3,2],\n\"start_date\": \"2019-01-01\",\n\"end_date\": \"2019-06-30\"\n}\n",
					"options": {
						"raw": {
							"language": "json"
						}
					}
				},
				"url": {
					"raw": "localhost:8080/ejerccio/example03",
					"host": [
						"localhost"
					],
					"port": "8080",
					"path": [
						"ejerccio",
						"example03"
					]
				}
			},
			"response": []
		},
		{
			"name": "ejerccio02",
			"protocolProfileBehavior": {
				"disableBodyPruning": true
			},
			"request": {
				"method": "GET",
				"header": [],
				"body": {
					"mode": "raw",
					"raw": "{\n\"employee_id\": [1,3,2],\n\"start_date\": \"2019-01-01\",\n\"end_date\": \"2019-06-30\"\n}\n",
					"options": {
						"raw": {
							"language": "json"
						}
					}
				},
				"url": {
					"raw": "localhost:8080/ejerccio/example03",
					"host": [
						"localhost"
					],
					"port": "8080",
					"path": [
						"ejerccio",
						"example03"
					]
				}
			},
			"response": []
		},
		{
			"name": "ejerccio04",
			"request": {
				"method": "GET",
				"header": [],
				"url": {
					"raw": "localhost:8080/ejerccio/04",
					"host": [
						"localhost"
					],
					"port": "8080",
					"path": [
						"ejerccio",
						"04"
					]
				}
			},
			"response": []
		},
		{
			"name": "ejerccio05",
			"protocolProfileBehavior": {
				"disableBodyPruning": true
			},
			"request": {
				"method": "GET",
				"header": [],
				"body": {
					"mode": "raw",
					"raw": "{\n\"employee_id\": 1, \n\"start_date\": \"2022-01-01\",\n\"end_date\": \"2022-06-30\"\n}\n",
					"options": {
						"raw": {
							"language": "json"
						}
					}
				},
				"url": {
					"raw": "localhost:8080/ejerccio/example05",
					"host": [
						"localhost"
					],
					"port": "8080",
					"path": [
						"ejerccio",
						"example05"
					]
				}
			},
			"response": []
		}
	]
}