\relax 
\providecommand\hyper@newdestlabel[2]{}
\AC@reset@newl@bel
\providecommand\HyperFirstAtBeginDocument{\AtBeginDocument}
\HyperFirstAtBeginDocument{\ifx\hyper@anchor\@undefined
\global\let\oldcontentsline\contentsline
\gdef\contentsline#1#2#3#4{\oldcontentsline{#1}{#2}{#3}}
\global\let\oldnewlabel\newlabel
\gdef\newlabel#1#2{\newlabelxx{#1}#2}
\gdef\newlabelxx#1#2#3#4#5#6{\oldnewlabel{#1}{{#2}{#3}}}
\AtEndDocument{\ifx\hyper@anchor\@undefined
\let\contentsline\oldcontentsline
\let\newlabel\oldnewlabel
\fi}
\fi}
\global\let\hyper@last\relax 
\gdef\HyperFirstAtBeginDocument#1{#1}
\providecommand\HyField@AuxAddToFields[1]{}
\providecommand\HyField@AuxAddToCoFields[2]{}
\providecommand \oddpage@label [2]{}
\citation{Keyes2012}
\citation{Jaure2013}
\citation{Dawes2010}
\citation{Schlottke-Lakemper2016}
\citation{Schlottke-Lakemper2017}
\citation{Schlottke-Lakemper2016}
\citation{Schlottke-Lakemper2017}
\citation{Schlottke-Lakemper2018}
\@writefile{toc}{\contentsline {chapter}{\numberline {1}Introduction}{1}{chapter.1}}
\@writefile{lof}{\addvspace {10\p@ }}
\@writefile{lot}{\addvspace {10\p@ }}
\citation{Lintermann2014}
\citation{Schlottke-Lakemper2016}
\citation{Schlottke-Lakemper2017}
\citation{Schlottke-Lakemper2017}
\@writefile{toc}{\contentsline {chapter}{\numberline {2}The direct-hybrid method}{2}{chapter.2}}
\@writefile{lof}{\addvspace {10\p@ }}
\@writefile{lot}{\addvspace {10\p@ }}
\newlabel{sec:The direct-hybrid method}{{2}{2}{The direct-hybrid method}{chapter.2}{}}
\@writefile{toc}{\contentsline {section}{\numberline {2.1}Topology of the hierarchical Cartesian mesh}{2}{section.2.1}}
\@writefile{lof}{\contentsline {figure}{\numberline {1}{\ignorespaces Cell refinement of a 2D grid.\relax }}{2}{figure.caption.2}}
\providecommand*\caption@xref[2]{\@setref\relax\@undefined{#1}}
\newlabel{fig:cell-refinement}{{1}{2}{Cell refinement of a 2D grid.\relax }{figure.caption.2}{}}
\citation{Schlottke-Lakemper2017}
\citation{Schlottke-Lakemper2017}
\newlabel{fig:aeroacoustics1}{{2a}{3}{Exploded view.\relax }{figure.caption.3}{}}
\newlabel{sub@fig:aeroacoustics1}{{a}{3}{Exploded view.\relax }{figure.caption.3}{}}
\newlabel{fig:aeroacoustics2}{{2b}{3}{Top view.\relax }{figure.caption.3}{}}
\newlabel{sub@fig:aeroacoustics2}{{b}{3}{Top view.\relax }{figure.caption.3}{}}
\@writefile{lof}{\contentsline {figure}{\numberline {2}{\ignorespaces Example of a 2D joint Cartesian grid \cite  {Schlottke-Lakemper2017}.\relax }}{3}{figure.caption.3}}
\@writefile{toc}{\contentsline {section}{\numberline {2.2}Domain decomposition}{3}{section.2.2}}
\@writefile{lof}{\contentsline {figure}{\numberline {3}{\ignorespaces Domain decomposition \cite  {Schlottke-Lakemper2017}.\relax }}{3}{figure.caption.4}}
\newlabel{fig:tree-decomposition}{{3}{3}{Domain decomposition \cite {Schlottke-Lakemper2017}.\relax }{figure.caption.4}{}}
\citation{Schlottke-Lakemper2018}
\citation{Schlottke-Lakemper2018}
\citation{Schlottke-Lakemper2018}
\citation{Schlottke-Lakemper2018}
\@writefile{toc}{\contentsline {section}{\numberline {2.3}Parallel Algorithm}{4}{section.2.3}}
\@writefile{lof}{\contentsline {figure}{\numberline {4}{\ignorespaces Simple parallel algorithm \cite  {Schlottke-Lakemper2018}.\relax }}{4}{figure.caption.5}}
\newlabel{fig:para-idle}{{4}{4}{Simple parallel algorithm \cite {Schlottke-Lakemper2018}.\relax }{figure.caption.5}{}}
\@writefile{lof}{\contentsline {figure}{\numberline {5}{\ignorespaces Efficient parallel algorithm \cite  {Schlottke-Lakemper2018}.\relax }}{5}{figure.caption.6}}
\newlabel{fig:para-performance}{{5}{5}{Efficient parallel algorithm \cite {Schlottke-Lakemper2018}.\relax }{figure.caption.6}{}}
\@writefile{toc}{\contentsline {chapter}{\numberline {3}Numerical Methods}{6}{chapter.3}}
\@writefile{lof}{\addvspace {10\p@ }}
\@writefile{lot}{\addvspace {10\p@ }}
\newlabel{sec:Numerical Methods}{{3}{6}{Numerical Methods}{chapter.3}{}}
\@writefile{toc}{\contentsline {section}{\numberline {3.1}Flow simulation}{6}{section.3.1}}
\citation{Schlottke-Lakemper2018}
\@writefile{toc}{\contentsline {section}{\numberline {3.2}Acoustics simulation}{7}{section.3.2}}
\@writefile{toc}{\contentsline {section}{\numberline {3.3}Spatial interpolation}{7}{section.3.3}}
\citation{Schlottke-Lakemper2017}
\citation{Schlottke-Lakemper2017}
\citation{Schlottke-Lakemper2017}
\citation{Schlottke-Lakemper2017}
\citation{Schlottke-Lakemper2017}
\@writefile{toc}{\contentsline {chapter}{\numberline {4}Numerical Results}{9}{chapter.4}}
\@writefile{lof}{\addvspace {10\p@ }}
\@writefile{lot}{\addvspace {10\p@ }}
\newlabel{sec:Numerical Results}{{4}{9}{Numerical Results}{chapter.4}{}}
\@writefile{toc}{\contentsline {section}{\numberline {4.1}Spinning vortex pair setup}{9}{section.4.1}}
\@writefile{lof}{\contentsline {figure}{\numberline {6}{\ignorespaces Spinning vortex setup \cite  {Schlottke-Lakemper2017}.\relax }}{10}{figure.caption.7}}
\newlabel{fig:vortex}{{6}{10}{Spinning vortex setup \cite {Schlottke-Lakemper2017}.\relax }{figure.caption.7}{}}
\@writefile{lof}{\contentsline {figure}{\numberline {7}{\ignorespaces Computational domain \cite  {Schlottke-Lakemper2017}.\relax }}{10}{figure.caption.8}}
\newlabel{fig:c-domain}{{7}{10}{Computational domain \cite {Schlottke-Lakemper2017}.\relax }{figure.caption.8}{}}
\citation{Muller1967}
\citation{Schlottke-Lakemper2017}
\citation{Schlottke-Lakemper2017}
\citation{Schlottke-Lakemper2017}
\citation{Schlottke-Lakemper2017}
\@writefile{toc}{\contentsline {section}{\numberline {4.2}Spinning vortex pair results}{11}{section.4.2}}
\@writefile{lof}{\contentsline {figure}{\numberline {8}{\ignorespaces Acoustic pressure contour at ${t=7 T_a}$ \cite  {Schlottke-Lakemper2017}.\relax }}{11}{figure.caption.9}}
\newlabel{fig:ac-pressure1}{{8}{11}{Acoustic pressure contour at ${t=7 T_a}$ \cite {Schlottke-Lakemper2017}.\relax }{figure.caption.9}{}}
\newlabel{fig:res-comp1}{{9a}{12}{Comparisson at ${t=7 T_a}$ along ${r}$ on ${y=-x}$.\relax }{figure.caption.10}{}}
\newlabel{sub@fig:res-comp1}{{a}{12}{Comparisson at ${t=7 T_a}$ along ${r}$ on ${y=-x}$.\relax }{figure.caption.10}{}}
\newlabel{fig:res-comp2}{{9b}{12}{Comparisson on ${y=0}$ over the time.\relax }{figure.caption.10}{}}
\newlabel{sub@fig:res-comp2}{{b}{12}{Comparisson on ${y=0}$ over the time.\relax }{figure.caption.10}{}}
\@writefile{lof}{\contentsline {figure}{\numberline {9}{\ignorespaces Perturbed pressure results ${p'}$ \cite  {Schlottke-Lakemper2017}.\relax }}{12}{figure.caption.10}}
\@writefile{toc}{\contentsline {section}{\numberline {4.3}Parallel performance results}{12}{section.4.3}}
\citation{Schlottke-Lakemper2017}
\citation{Schlottke-Lakemper2017}
\@writefile{lof}{\contentsline {figure}{\numberline {10}{\ignorespaces Wall timings for the direct-hybrid and classic hybrid methods \cite  {Schlottke-Lakemper2017}.\relax }}{13}{figure.caption.11}}
\newlabel{fig:timing}{{10}{13}{Wall timings for the direct-hybrid and classic hybrid methods \cite {Schlottke-Lakemper2017}.\relax }{figure.caption.11}{}}
\@writefile{lof}{\contentsline {figure}{\numberline {11}{\ignorespaces Strong scaling speed up for the the direct-hybrid and classic hybrid methods.\relax }}{13}{figure.caption.12}}
\newlabel{fig:speedup}{{11}{13}{Strong scaling speed up for the the direct-hybrid and classic hybrid methods.\relax }{figure.caption.12}{}}
\@writefile{toc}{\contentsline {chapter}{\numberline {5}Conclusions}{14}{chapter.5}}
\@writefile{lof}{\addvspace {10\p@ }}
\@writefile{lot}{\addvspace {10\p@ }}
\bibdata{bibitems}
\bibcite{Keyes2012}{1}
\bibcite{Jaure2013}{2}
\bibcite{Dawes2010}{3}
\bibcite{Schlottke-Lakemper2016}{4}
\bibcite{Schlottke-Lakemper2017}{5}
\bibcite{Schlottke-Lakemper2018}{6}
\bibcite{Lintermann2014}{7}
\bibcite{Muller1967}{8}
\bibstyle{unsrt}
\@writefile{toc}{\contentsline {chapter}{\numberline {6}Bibliography}{15}{chapter.6}}
\@writefile{lof}{\addvspace {10\p@ }}
\@writefile{lot}{\addvspace {10\p@ }}
