-100,0.2
-90.25273,0.2163265
-81.21434,0.2326531
-72.78872,0.2489796
-64.89806,0.2653061
-57.47847,0.2816327
-50.47687,0.2979592
-43.84867,0.3142857
-37.55607,0.3306122
-31.5667,0.3469388
-25.85269,0.3632653
-20.38982,0.3795918
-15.15695,0.3959184
-10.13548,0.4122449
-5.308994,0.4285714
-0.6629144,0.444898
3.815764,0.4612245
8.138689,0.477551
12.31633,0.4938776
16.35815,0.5102041
20.27268,0.5265306
24.06772,0.5428571
27.75034,0.5591837
31.32701,0.5755102
34.80367,0.5918367
38.18574,0.6081633
41.47826,0.6244898
44.68583,0.6408163
47.81273,0.6571429
50.86292,0.6734694
53.84008,0.6897959
56.74762,0.7061224
59.58873,0.722449
62.36637,0.7387755
65.08331,0.755102
67.74216,0.7714286
70.34534,0.7877551
72.89515,0.8040816
75.39371,0.8204082
77.84306,0.8367347
80.24509,0.8530612
82.6016,0.8693878
84.91427,0.8857143
87.18472,0.9020408
89.41445,0.9183673
91.60489,0.9346939
93.75741,0.9510204
95.87329,0.9673469
97.95377,0.9836735
100,1
