\relax 
\select@language{english}
\@writefile{toc}{\select@language{english}}
\@writefile{lof}{\select@language{english}}
\@writefile{lot}{\select@language{english}}
\@writefile{lof}{\contentsline {figure}{\numberline {1}{\ignorespaces Communication pattern PEs = 2, nn = 64.}}{4}}
\@writefile{lof}{\contentsline {figure}{\numberline {2}{\ignorespaces Communication pattern PEs = 4, nn = 64.}}{4}}
\@writefile{lof}{\contentsline {figure}{\numberline {3}{\ignorespaces Communication pattern PEs = 8, nn = 64.}}{4}}
\@writefile{lof}{\contentsline {figure}{\numberline {4}{\ignorespaces Communication pattern PEs = 16, nn = 64.}}{5}}
\@writefile{lof}{\contentsline {figure}{\numberline {5}{\ignorespaces Communication pattern PEs = 32, nn = 64.}}{5}}
\@writefile{lof}{\contentsline {figure}{\numberline {6}{\ignorespaces Communication pattern PEs = 32, nn = 9600.}}{5}}
\bibstyle{}
\bibdata{}
