This is BibTeX, Version 0.99d (TeX Live 2015/Debian)
Capacity: max_strings=35307, hash_size=35307, hash_prime=30011
The top-level auxiliary file: main.aux
The style file: unsrt.bst
Database file #1: literature.bib
Warning--empty booktitle in auth5
You've used 6 entries,
            1791 wiz_defined-function locations,
            484 strings with 4517 characters,
and the built_in function-call counts, 1311 in all, are:
= -- 115
> -- 42
< -- 0
+ -- 17
- -- 11
* -- 87
:= -- 214
add.period$ -- 18
call.type$ -- 6
change.case$ -- 6
chr.to.int$ -- 0
cite$ -- 7
duplicate$ -- 56
empty$ -- 142
format.name$ -- 11
if$ -- 293
int.to.chr$ -- 0
int.to.str$ -- 6
missing$ -- 6
newline$ -- 33
num.names$ -- 6
pop$ -- 13
preamble$ -- 1
purify$ -- 0
quote$ -- 0
skip$ -- 19
stack$ -- 0
substring$ -- 111
swap$ -- 6
text.length$ -- 0
text.prefix$ -- 0
top$ -- 0
type$ -- 0
warning$ -- 1
while$ -- 11
width$ -- 7
write$ -- 66
(There was 1 warning)
