\relax 
\citation{auth1}
\citation{auth2}
\citation{auth3}
\citation{auth4}
\citation{auth5}
\citation{auth6}
\select@language{english}
\@writefile{toc}{\select@language{english}}
\@writefile{lof}{\select@language{english}}
\@writefile{lot}{\select@language{english}}
\@writefile{toc}{\contentsline {section}{\numberline {1}Introduction}{1}}
\@writefile{toc}{\contentsline {section}{\numberline {2}Implementation and Results}{1}}
\@writefile{lof}{\contentsline {figure}{\numberline {1}{\ignorespaces Temperature distribution over the domain.}}{8}}
\@writefile{lof}{\contentsline {figure}{\numberline {2}{\ignorespaces Triangular mesh generated.}}{8}}
\@writefile{lof}{\contentsline {figure}{\numberline {3}{\ignorespaces Line of interest being created in paraview.}}{9}}
\@writefile{lof}{\contentsline {figure}{\numberline {4}{\ignorespaces Temperature distribution over the line created.}}{9}}
\@writefile{lof}{\contentsline {figure}{\numberline {5}{\ignorespaces Triangular mesh generated.}}{10}}
\@writefile{lof}{\contentsline {figure}{\numberline {6}{\ignorespaces Temperature distributions in the radial direction for numerical and exact solutions.}}{10}}
\@writefile{lof}{\contentsline {figure}{\numberline {7}{\ignorespaces RMS error.}}{11}}
\@writefile{toc}{\contentsline {section}{\numberline {3}Conclusion}{12}}
\bibstyle{unsrt}
\bibdata{literature}
\bibcite{auth1}{1}
\bibcite{auth2}{2}
\bibcite{auth3}{3}
\bibcite{auth4}{4}
\bibcite{auth5}{5}
\bibcite{auth6}{6}
