\relax 
\citation{auth1}
\citation{auth3}
\citation{auth4}
\citation{auth2}
\select@language{english}
\@writefile{toc}{\select@language{english}}
\@writefile{lof}{\select@language{english}}
\@writefile{lot}{\select@language{english}}
\@writefile{toc}{\contentsline {section}{\numberline {1}Introduction}{1}}
\@writefile{toc}{\contentsline {section}{\numberline {2}Implementation and Results}{1}}
\bibstyle{unsrt}
\bibdata{literature}
\bibcite{auth1}{1}
\bibcite{auth3}{2}
\bibcite{auth4}{3}
\bibcite{auth2}{4}
\@writefile{lof}{\contentsline {figure}{\numberline {1}{\ignorespaces Plotted object.}}{3}}
\@writefile{lof}{\contentsline {figure}{\numberline {2}{\ignorespaces Triangular mesh generated.}}{3}}
\@writefile{toc}{\contentsline {section}{\numberline {3}Conclusion}{3}}
