\relax 
\select@language{english}
\@writefile{toc}{\select@language{english}}
\@writefile{lof}{\select@language{english}}
\@writefile{lot}{\select@language{english}}
\@writefile{lof}{\contentsline {figure}{\numberline {1}{\ignorespaces Temperature distribution plot.}}{7}}
\@writefile{lof}{\contentsline {figure}{\numberline {2}{\ignorespaces RMS error.}}{7}}
\@writefile{lof}{\contentsline {figure}{\numberline {3}{\ignorespaces Temperature distributions in the radial direction for numerical (64 ranks) and exact solution.}}{8}}
\@writefile{lof}{\contentsline {figure}{\numberline {4}{\ignorespaces Timing pattern for 1 rank.}}{8}}
\@writefile{lof}{\contentsline {figure}{\numberline {5}{\ignorespaces Timing pattern for 2 ranks.}}{9}}
\@writefile{lof}{\contentsline {figure}{\numberline {6}{\ignorespaces Timing pattern for 4 ranks.}}{9}}
\@writefile{lof}{\contentsline {figure}{\numberline {7}{\ignorespaces Timing pattern for 8 ranks.}}{9}}
\@writefile{lof}{\contentsline {figure}{\numberline {8}{\ignorespaces Timing pattern for 16 ranks.}}{10}}
\@writefile{lof}{\contentsline {figure}{\numberline {9}{\ignorespaces Timing pattern for 32 ranks.}}{10}}
\@writefile{lof}{\contentsline {figure}{\numberline {10}{\ignorespaces Timing pattern for 64 ranks.}}{10}}
\@writefile{lof}{\contentsline {figure}{\numberline {11}{\ignorespaces Run times for a increasing number of ranks.}}{11}}
\bibstyle{}
\bibdata{}
