\relax 
\select@language{english}
\@writefile{toc}{\select@language{english}}
\@writefile{lof}{\select@language{english}}
\@writefile{lot}{\select@language{english}}
\@writefile{toc}{\contentsline {section}{\numberline {1}Introduction}{1}}
\@writefile{toc}{\contentsline {section}{\numberline {2}Implementation and Results}{1}}
\@writefile{lot}{\contentsline {table}{\numberline {1}{\ignorespaces Code timings.}}{5}}
\@writefile{lot}{\contentsline {table}{\numberline {2}{\ignorespaces Compiler flag timings.}}{5}}
\@writefile{lof}{\contentsline {figure}{\numberline {1}{\ignorespaces Timings obtained using reduction.}}{10}}
\@writefile{lof}{\contentsline {figure}{\numberline {2}{\ignorespaces Timings obtained using atomic.}}{10}}
\@writefile{lof}{\contentsline {figure}{\numberline {3}{\ignorespaces Temperature distribution over the domain.}}{11}}
\@writefile{toc}{\contentsline {section}{\numberline {3}Conclusion}{12}}
