D:\Proyectos\fpuna\Final2UDP\ProyectoJava\src\main\java\py\una\server\udp\UDPClient.java
D:\Proyectos\fpuna\Final2UDP\ProyectoJava\src\main\java\py\una\server\udp\UDPServer.java
D:\Proyectos\fpuna\Final2UDP\ProyectoJava\src\main\java\py\una\entidad\Sensor.java
