Monte Carlo vs Random :
- Nb games on each simulation = 100
- Sb = 10$ , Bb = 20$ , Start money = 1000$
- Iterations MC [1 to 300]
MC(1) vs Random : [55/45]
MC(2) vs Random : [62/38]
MC(3) vs Random : [81/19]
MC(4) vs Random : [88/12]
MC(5) vs Random : [87/13]
MC(6) vs Random : [89/11]
MC(7) vs Random : [97/3]
MC(8) vs Random : [96/4]
MC(9) vs Random : [95/5]
MC(10) vs Random : [96/4]
MC(11) vs Random : [97/3]
MC(12) vs Random : [93/7]
MC(13) vs Random : [97/3]
MC(14) vs Random : [96/4]
MC(15) vs Random : [100/0]
MC(16) vs Random : [98/2]
MC(17) vs Random : [98/2]
MC(18) vs Random : [98/2]
MC(19) vs Random : [96/4]
MC(20) vs Random : [96/4]
MC(21) vs Random : [100/0]
MC(22) vs Random : [97/3]
MC(23) vs Random : [96/4]
MC(24) vs Random : [98/2]
MC(25) vs Random : [97/3]
MC(26) vs Random : [100/0]
MC(27) vs Random : [98/2]
MC(28) vs Random : [97/3]
MC(29) vs Random : [98/2]
MC(30) vs Random : [100/0]
MC(31) vs Random : [97/3]
MC(32) vs Random : [99/1]
MC(33) vs Random : [97/3]
MC(34) vs Random : [99/1]
MC(35) vs Random : [97/3]
MC(36) vs Random : [98/2]
MC(37) vs Random : [99/1]
MC(38) vs Random : [95/5]
MC(39) vs Random : [99/1]
MC(40) vs Random : [98/2]
MC(41) vs Random : [98/2]
MC(42) vs Random : [98/2]
MC(43) vs Random : [98/2]
MC(44) vs Random : [98/2]
MC(45) vs Random : [98/2]
MC(46) vs Random : [94/6]
MC(47) vs Random : [98/2]
MC(48) vs Random : [98/2]
MC(49) vs Random : [99/1]
MC(50) vs Random : [99/1]
MC(51) vs Random : [100/0]
MC(52) vs Random : [98/2]
MC(53) vs Random : [96/4]
MC(54) vs Random : [98/2]
MC(55) vs Random : [99/1]
MC(56) vs Random : [100/0]
MC(57) vs Random : [99/1]
MC(58) vs Random : [96/4]
MC(59) vs Random : [99/1]
MC(60) vs Random : [96/4]
MC(61) vs Random : [100/0]
MC(62) vs Random : [95/5]
MC(63) vs Random : [100/0]
MC(64) vs Random : [98/2]
MC(65) vs Random : [99/1]
MC(66) vs Random : [99/1]
MC(67) vs Random : [97/3]
MC(68) vs Random : [99/1]
MC(69) vs Random : [97/3]
MC(70) vs Random : [97/3]
MC(71) vs Random : [97/3]
MC(72) vs Random : [98/2]
MC(73) vs Random : [97/3]
MC(74) vs Random : [98/2]
MC(75) vs Random : [99/1]
MC(76) vs Random : [98/2]
MC(77) vs Random : [99/1]
MC(78) vs Random : [97/3]
MC(79) vs Random : [98/2]
MC(80) vs Random : [100/0]
MC(81) vs Random : [99/1]
MC(82) vs Random : [99/1]
MC(83) vs Random : [98/2]
MC(84) vs Random : [100/0]
MC(85) vs Random : [99/1]
MC(86) vs Random : [98/2]
MC(87) vs Random : [100/0]
MC(88) vs Random : [100/0]
MC(89) vs Random : [98/2]
MC(90) vs Random : [99/1]
MC(91) vs Random : [98/2]
MC(92) vs Random : [97/3]
MC(93) vs Random : [99/1]
MC(94) vs Random : [99/1]
MC(95) vs Random : [98/2]
MC(96) vs Random : [99/1]
MC(97) vs Random : [99/1]
MC(98) vs Random : [98/2]
MC(99) vs Random : [98/2]
MC(100) vs Random : [99/1]
MC(101) vs Random : [98/2]
MC(102) vs Random : [96/4]
MC(103) vs Random : [100/0]
MC(104) vs Random : [98/2]
MC(105) vs Random : [96/4]
MC(106) vs Random : [96/4]
MC(107) vs Random : [99/1]
MC(108) vs Random : [96/4]
MC(109) vs Random : [98/2]
MC(110) vs Random : [100/0]
MC(111) vs Random : [96/4]
MC(112) vs Random : [100/0]
MC(113) vs Random : [100/0]
MC(114) vs Random : [99/1]
MC(115) vs Random : [100/0]
MC(116) vs Random : [99/1]
MC(117) vs Random : [97/3]
MC(118) vs Random : [99/1]
MC(119) vs Random : [98/2]
MC(120) vs Random : [99/1]
MC(121) vs Random : [98/2]
MC(122) vs Random : [98/2]
MC(123) vs Random : [99/1]
MC(124) vs Random : [99/1]
MC(125) vs Random : [98/2]
MC(126) vs Random : [99/1]
MC(127) vs Random : [99/1]
MC(128) vs Random : [99/1]
MC(129) vs Random : [97/3]
MC(130) vs Random : [95/5]
MC(131) vs Random : [100/0]
MC(132) vs Random : [100/0]
MC(133) vs Random : [99/1]
MC(134) vs Random : [98/2]
MC(135) vs Random : [97/3]
MC(136) vs Random : [100/0]
MC(137) vs Random : [100/0]
MC(138) vs Random : [98/2]
MC(139) vs Random : [99/1]
MC(140) vs Random : [99/1]
MC(141) vs Random : [97/3]
MC(142) vs Random : [100/0]
MC(143) vs Random : [99/1]
MC(144) vs Random : [99/1]
MC(145) vs Random : [98/2]
MC(146) vs Random : [96/4]
MC(147) vs Random : [98/2]
MC(148) vs Random : [98/2]
MC(149) vs Random : [98/2]
MC(150) vs Random : [100/0]
MC(151) vs Random : [98/2]
MC(152) vs Random : [98/2]
MC(153) vs Random : [99/1]
MC(154) vs Random : [98/2]
MC(155) vs Random : [97/3]
MC(156) vs Random : [98/2]
MC(157) vs Random : [100/0]
MC(158) vs Random : [98/2]
MC(159) vs Random : [100/0]
MC(160) vs Random : [98/2]
MC(161) vs Random : [100/0]
MC(162) vs Random : [99/1]
MC(163) vs Random : [96/4]
MC(164) vs Random : [98/2]
MC(165) vs Random : [99/1]
MC(166) vs Random : [100/0]
MC(167) vs Random : [100/0]
MC(168) vs Random : [98/2]
MC(169) vs Random : [98/2]
MC(170) vs Random : [98/2]
MC(171) vs Random : [100/0]
MC(172) vs Random : [98/2]
MC(173) vs Random : [94/6]
MC(174) vs Random : [97/3]
MC(175) vs Random : [100/0]
MC(176) vs Random : [100/0]
MC(177) vs Random : [98/2]
MC(178) vs Random : [99/1]
MC(179) vs Random : [99/1]
MC(180) vs Random : [98/2]
MC(181) vs Random : [98/2]
MC(182) vs Random : [98/2]
MC(183) vs Random : [99/1]
MC(184) vs Random : [97/3]
MC(185) vs Random : [99/1]
MC(186) vs Random : [98/2]
MC(187) vs Random : [99/1]
MC(188) vs Random : [99/1]
MC(189) vs Random : [97/3]
MC(190) vs Random : [98/2]
MC(191) vs Random : [100/0]
MC(192) vs Random : [96/4]
MC(193) vs Random : [99/1]
MC(194) vs Random : [99/1]
MC(195) vs Random : [99/1]
MC(196) vs Random : [96/4]
MC(197) vs Random : [100/0]
MC(198) vs Random : [100/0]
MC(199) vs Random : [99/1]
MC(200) vs Random : [98/2]
MC(201) vs Random : [100/0]
MC(202) vs Random : [98/2]
MC(203) vs Random : [97/3]
MC(204) vs Random : [100/0]
MC(205) vs Random : [99/1]
MC(206) vs Random : [99/1]
MC(207) vs Random : [100/0]
MC(208) vs Random : [99/1]
MC(209) vs Random : [99/1]
MC(210) vs Random : [98/2]
MC(211) vs Random : [97/3]
MC(212) vs Random : [98/2]
MC(213) vs Random : [98/2]
MC(214) vs Random : [98/2]
MC(215) vs Random : [99/1]
MC(216) vs Random : [99/1]
MC(217) vs Random : [97/3]
MC(218) vs Random : [98/2]
MC(219) vs Random : [100/0]
MC(220) vs Random : [98/2]
MC(221) vs Random : [99/1]
MC(222) vs Random : [98/2]
MC(223) vs Random : [97/3]
MC(224) vs Random : [99/1]
MC(225) vs Random : [100/0]
MC(226) vs Random : [98/2]
MC(227) vs Random : [99/1]
MC(228) vs Random : [98/2]
MC(229) vs Random : [98/2]
MC(230) vs Random : [98/2]
MC(231) vs Random : [99/1]
MC(232) vs Random : [98/2]
MC(233) vs Random : [97/3]
MC(234) vs Random : [99/1]
MC(235) vs Random : [100/0]
MC(236) vs Random : [99/1]
MC(237) vs Random : [97/3]
MC(238) vs Random : [98/2]
MC(239) vs Random : [99/1]
MC(240) vs Random : [99/1]
MC(241) vs Random : [99/1]
MC(242) vs Random : [99/1]
MC(243) vs Random : [97/3]
MC(244) vs Random : [98/2]
MC(245) vs Random : [99/1]
MC(246) vs Random : [100/0]
MC(247) vs Random : [98/2]
MC(248) vs Random : [100/0]
MC(249) vs Random : [98/2]
MC(250) vs Random : [99/1]
MC(251) vs Random : [97/3]
MC(252) vs Random : [98/2]
MC(253) vs Random : [98/2]
MC(254) vs Random : [100/0]
MC(255) vs Random : [100/0]
MC(256) vs Random : [99/1]
MC(257) vs Random : [99/1]
MC(258) vs Random : [99/1]
MC(259) vs Random : [98/2]
MC(260) vs Random : [100/0]
MC(261) vs Random : [100/0]
MC(262) vs Random : [99/1]
MC(263) vs Random : [98/2]
MC(264) vs Random : [98/2]
MC(265) vs Random : [100/0]
MC(266) vs Random : [100/0]
MC(267) vs Random : [100/0]
MC(268) vs Random : [99/1]
MC(269) vs Random : [97/3]
MC(270) vs Random : [97/3]
MC(271) vs Random : [97/3]
MC(272) vs Random : [99/1]
MC(273) vs Random : [97/3]
MC(274) vs Random : [100/0]
MC(275) vs Random : [94/6]
MC(276) vs Random : [98/2]
MC(277) vs Random : [98/2]
MC(278) vs Random : [99/1]
MC(279) vs Random : [99/1]
MC(280) vs Random : [97/3]
MC(281) vs Random : [98/2]
MC(282) vs Random : [99/1]
MC(283) vs Random : [98/2]
MC(284) vs Random : [99/1]
MC(285) vs Random : [100/0]
MC(286) vs Random : [98/2]
MC(287) vs Random : [98/2]
MC(288) vs Random : [98/2]
MC(289) vs Random : [100/0]
MC(290) vs Random : [99/1]
MC(291) vs Random : [100/0]
MC(292) vs Random : [100/0]
MC(293) vs Random : [98/2]
MC(294) vs Random : [100/0]
MC(295) vs Random : [99/1]
MC(296) vs Random : [100/0]
MC(297) vs Random : [99/1]
MC(298) vs Random : [98/2]
MC(299) vs Random : [96/4]
MC(300) vs Random : [99/1]
