/home/rodolfo/opt/spring-pfa-desafio-1/src/main/java/pfa/com/entity/ModuloEntity.java
/home/rodolfo/opt/spring-pfa-desafio-1/src/main/java/pfa/com/config/SwaggerConfiguration.java
/home/rodolfo/opt/spring-pfa-desafio-1/src/main/java/pfa/com/repository/ModuloRepository.java
/home/rodolfo/opt/spring-pfa-desafio-1/src/main/java/pfa/com/service/ModuloService.java
/home/rodolfo/opt/spring-pfa-desafio-1/src/main/java/pfa/com/SpringPfaDesafio1Application.java
/home/rodolfo/opt/spring-pfa-desafio-1/src/main/java/pfa/com/dto/ModuloResponse.java
/home/rodolfo/opt/spring-pfa-desafio-1/src/main/java/pfa/com/Controller/ModuloController.java
