pfa/com/SpringPfaDesafio1Application.class
pfa/com/config/SwaggerConfiguration.class
pfa/com/repository/ModuloRepository.class
pfa/com/entity/ModuloEntity.class
pfa/com/dto/ModuloResponse.class
pfa/com/Controller/ModuloController.class
pfa/com/service/ModuloService.class
