{
  "date": "0704",
  "maxApproval": 0,
  "tenantType": "NORMAL",
  "serviceRequestId": "cbcd6df7-d819-4815-ba42-eec048e795bb",
  "initiator": "transactor",
  "mfsInternalData": {
    "currentStepId": "load.transactionDetails",
    "mfsRequestVersionNumber": "1.0.0",
    "currentStepCount": 3,
    "serviceFlowStepStartTimeInMillis": 1655788376288,
    "serviceFlowStartTimeInMillis": 1655788376260,
    "currentServiceCode": "REVERSAL_TXN"
  },
  "originalBearerCode": "WEB",
  "channel": "WEB",
  "transferAmount": 20,
  "mfsTenantLocale": "en_US",
  "cardToken": "card_c21e8437-a4ec-429c-9f28-04e13eeff03d",
  "transactor": {
    "idType": "systemId",
    "idValue": "system",
    "partyId": "system",
    "userId": "system"
  },
  "originalTxnTransferDate": null,
  "mfsTenantTZ": "GMT",
  "originalTransactionId": "XX220621.1042.A95511",
  "mfs.flowId": "cbcd6df7-d819-4815-ba42-eec048e795bb",
  "transactionDateTime": "2022-06-21T10:42:56+0530",
  "mfsTenantId": "mfsPrimaryTenant",
  "isServiceChargeReversible": "true",
  "tenantDetails": {
    "tenantId": "9a08",
    "name": "Brand1",
    "countryCode": "IN",
    "countryName": "INDIA",
    "preferredLangCode": "en",
    "preferredLang": "English",
    "currencyCode": "101,102",
    "currency": "INDIA Ruppes,US DOALLER",
    "dateTimeFormate": null,
    "timeZone": "india",
    "timeZoneName": "UTC+5:30",
    "amountFormat": "Decimalcomma",
    "status": "Y",
    "createdBy": null,
    "createdOn": 1646200772000,
    "modifiedBy": null,
    "modifiedOn": 1646200772000,
    "brandLogo": "loguri",
    "brandColor": "#HHDDFF",
    "domainName": "mybrand",
    "code": "B1",
    "primaryCurrency": "101",
    "tenantType": "NORMAL",
    "clientId": "5f12b00828b518f88efe4efd8b6bd9",
    "currencyMultificationFactor": 10
  },
  "mfsTrackingData": {
    "addTrackingData": false,
    "trackingId": "cbcd6df7-d819-4815-ba42-eec048e795bb",
    "startTime": 1655788376249
  },
  "originalTxnDate": null,
  "tenantCountry": "IN",
  "serviceCode": "REVERSAL_TXN",
  "serviceFlowId": "REVERSAL_TXN",
  "trannr": "xc2232",
  "originalTrannr": "2d",
  "mfsTenantName": "mobiquity Money",
  "externalReferenceId": "xc2232",
  "originalTransactionDetails": {
    "transferId": "XX220621.1042.A95511",
    "applicationId": "2",
    "tenantId": "9a08",
    "createdBy": "9a08",
    "createdOn": null,
    "idType": null,
    "language": null,
    "modifiedBy": "US.2121642766246583",
    "modifiedOn": null,
    "payeePaymentMethodType": "WALLET",
    "payeePaymentTypeId": "12",
    "payeeProviderId": 101,
    "payeeUserId": "SP",
    "payerPaymentMethodType": "WALLET",
    "payerPaymentTypeId": "12",
    "payerProviderId": 101,
    "payerUserId": "US.2121642766246583",
    "paymentMethodType": "WALLET",
    "referenceNumber": "75406f9a-8bc9-4af2-af7d-b2db5e9b2253",
    "requestGatewayCode": "WEB",
    "requestGatewayType": "WEB",
    "requestSource": "WEB",
    "requestedValue": 20,
    "serviceType": "SALE_TXN",
    "nativeServiceType": null,
    "transactionCategory": "OFFLINE",
    "attemptStatus": null,
    "bankId": null,
    "currentServiceCode": null,
    "closeDate": null,
    "transferDate": null,
    "transferOn": null,
    "transferStatus": "TS",
    "transferSubtype": "SALE_TXN",
    "transferType": "TR_TRF",
    "transferValue": 20,
    "totalServiceCharge": null,
    "totalTaxes": null,
    "totalOptServiceCharge": null,
    "totalCreditedValue": null,
    "totalDebitedValue": null,
    "txnInstanceId": "A",
    "serialNumber": null,
    "attr1Name": null,
    "attr1Value": null,
    "attribute3Name": null,
    "attribute3Value": null,
    "attribute2Name": null,
    "attribute2Value": null,
    "attribute5Name": null,
    "attribute5Value": null,
    "attribute4Name": null,
    "attribute4Value": null,
    "attribute6Name": null,
    "attribute6Value": null,
    "version": 0,
    "reconciliationDate": null,
    "reconciliationDone": null,
    "reconciliationBy": null,
    "loyaltyApplicable": "Y",
    "rewardDataUpdated": "N",
    "ftxnId": "2d0704",
    "remarks": null,
    "pricingPolicyDetails": {
      "serviceCharges": [
        {
          "amount": 100,
          "receiver": {
            "productId": "12",
            "isValid": true,
            "gradeCode": "OPT",
            "partyId": "INC9a0810101",
            "accountNumber": "INC9a0810101",
            "isAccountValid": true
          },
          "sender": {
            "productId": "12",
            "isValid": true,
            "accountNumber": "101120000000168",
            "partyId": "US.2121642766246583",
            "isAccountValid": true
          },
          "isInclusive": false,
          "taxes": [],
          "chargeName": "charges"
        }
      ]
    },
    "transactionDetails": [
      {
        "txnSequenceNumber": 1,
        "accountId": "card_c21e8437-a4ec-429c-9f28-04e13eeff03d",
        "tenantId": "9a08",
        "accountType": "WALLET",
        "approvedValue": 20,
        "entryType": "DR",
        "gradeCode": null,
        "partyAccessId": "7766554433",
        "partyId": "US.2121642766246583",
        "paymentMethodType": "WALLET",
        "secondParty": "SP9a0810101RU",
        "secondPartyAccountId": "SP9a0810101RU",
        "secondPartyAccountType": "WALLET",
        "secondPartyGradeCode": "OPT",
        "serviceType": "SALE_TXN",
        "transactionType": "MP",
        "transferDate": null,
        "transferOn": null,
        "transferProfileDetailsId": null,
        "transferStatus": "TS",
        "transferSubtype": "SALE_TXN",
        "transferValue": 20,
        "unitPrice": null,
        "walletNumber": "101120000000168",
        "providerId": 101,
        "paymentTypeId": 12,
        "secondPartyProviderId": 101,
        "uniqueSequenceNo": "A21175",
        "userType": "PAYER",
        "requestedValue": 20,
        "hierarchyRoleCode": null,
        "secondPartyHierarchyRoleCode": "OPT",
        "firstPartyPaymentMethodDesc": "12",
        "secondPartyPaymentMethodDesc": "12",
        "accessType": "WEB",
        "previousBalance": 899311,
        "postBalance": 899191,
        "pseudoUserId": null,
        "secondPseudoUserId": null,
        "unregisteredUserId": null,
        "secondUnregisteredUserId": null,
        "bankId": null,
        "attr1Name": null,
        "attr1Value": null,
        "attr2Name": null,
        "attr2Value": null,
        "attr3Name": null,
        "attr3Value": null,
        "txnMode": null,
        "businessDate": "2022-06-20",
        "cqrsVersion": 2,
        "remoteEntry": null,
        "walletSequenceNumber": 0,
        "previousFicBalance": 0,
        "postFicBalance": 0,
        "previousFrozenBalance": 27260,
        "postFrozenBalance": 27260,
        "previousState": null,
        "chargeName": null
      },
      {
        "txnSequenceNumber": 2,
        "accountId": "SP9a0810101RU",
        "tenantId": "9a08",
        "accountType": "WALLET",
        "approvedValue": 20,
        "entryType": "CR",
        "gradeCode": "OPT",
        "partyAccessId": "SP",
        "partyId": "SP9a0810101RU",
        "paymentMethodType": "WALLET",
        "secondParty": "US.2121642766246583",
        "secondPartyAccountId": "card_c21e8437-a4ec-429c-9f28-04e13eeff03d",
        "secondPartyAccountType": "WALLET",
        "secondPartyGradeCode": null,
        "serviceType": "SALE_TXN",
        "transactionType": "MR",
        "transferDate": null,
        "transferOn": null,
        "transferProfileDetailsId": null,
        "transferStatus": "TS",
        "transferSubtype": "SALE_TXN",
        "transferValue": 20,
        "unitPrice": null,
        "walletNumber": "SP9a0810101RU",
        "providerId": 101,
        "paymentTypeId": 12,
        "secondPartyProviderId": 101,
        "uniqueSequenceNo": "A14269",
        "userType": "PAYEE",
        "requestedValue": 20,
        "hierarchyRoleCode": "OPT",
        "secondPartyHierarchyRoleCode": null,
        "firstPartyPaymentMethodDesc": "12",
        "secondPartyPaymentMethodDesc": "12",
        "accessType": "WEB",
        "previousBalance": 58935,
        "postBalance": 58955,
        "pseudoUserId": null,
        "secondPseudoUserId": null,
        "unregisteredUserId": null,
        "secondUnregisteredUserId": null,
        "bankId": null,
        "attr1Name": null,
        "attr1Value": null,
        "attr2Name": null,
        "attr2Value": null,
        "attr3Name": null,
        "attr3Value": null,
        "txnMode": null,
        "businessDate": "2022-06-20",
        "cqrsVersion": 2,
        "remoteEntry": null,
        "walletSequenceNumber": 0,
        "previousFicBalance": 0,
        "postFicBalance": 0,
        "previousFrozenBalance": 0,
        "postFrozenBalance": 0,
        "previousState": null,
        "chargeName": null
      },
      {
        "txnSequenceNumber": 3,
        "accountId": "US.2121642766246583",
        "tenantId": "9a08",
        "accountType": "WALLET",
        "approvedValue": 100,
        "entryType": "DR",
        "gradeCode": null,
        "partyAccessId": "US.2121642766246583",
        "partyId": "US.2121642766246583",
        "paymentMethodType": "WALLET",
        "secondParty": "INC9a0810101",
        "secondPartyAccountId": "INC9a0810101",
        "secondPartyAccountType": "WALLET",
        "secondPartyGradeCode": "OPT",
        "serviceType": "SALE_TXN",
        "transactionType": "SCP",
        "transferDate": null,
        "transferOn": null,
        "transferProfileDetailsId": null,
        "transferStatus": "TS",
        "transferSubtype": "SALE_TXN",
        "transferValue": 100,
        "unitPrice": null,
        "walletNumber": "101120000000168",
        "providerId": 101,
        "paymentTypeId": 12,
        "secondPartyProviderId": 101,
        "uniqueSequenceNo": "A18261",
        "userType": "PAYER",
        "requestedValue": 20,
        "hierarchyRoleCode": null,
        "secondPartyHierarchyRoleCode": null,
        "firstPartyPaymentMethodDesc": "12",
        "secondPartyPaymentMethodDesc": "12",
        "accessType": "WEB",
        "previousBalance": 899311,
        "postBalance": 899191,
        "pseudoUserId": null,
        "secondPseudoUserId": null,
        "unregisteredUserId": null,
        "secondUnregisteredUserId": null,
        "bankId": null,
        "attr1Name": null,
        "attr1Value": null,
        "attr2Name": null,
        "attr2Value": null,
        "attr3Name": null,
        "attr3Value": null,
        "txnMode": null,
        "businessDate": "2022-06-20",
        "cqrsVersion": 2,
        "remoteEntry": null,
        "walletSequenceNumber": 0,
        "previousFicBalance": 0,
        "postFicBalance": 0,
        "previousFrozenBalance": 27260,
        "postFrozenBalance": 27260,
        "previousState": null,
        "chargeName": "charges"
      },
      {
        "txnSequenceNumber": 4,
        "accountId": "INC9a0810101",
        "tenantId": "9a08",
        "accountType": "WALLET",
        "approvedValue": 100,
        "entryType": "CR",
        "gradeCode": "OPT",
        "partyAccessId": "INC9a0810101",
        "partyId": "INC9a0810101",
        "paymentMethodType": "WALLET",
        "secondParty": "US.2121642766246583",
        "secondPartyAccountId": "US.2121642766246583",
        "secondPartyAccountType": "WALLET",
        "secondPartyGradeCode": null,
        "serviceType": "SALE_TXN",
        "transactionType": "SCR",
        "transferDate": null,
        "transferOn": null,
        "transferProfileDetailsId": null,
        "transferStatus": "TS",
        "transferSubtype": "SALE_TXN",
        "transferValue": 100,
        "unitPrice": null,
        "walletNumber": "INC9a0810101",
        "providerId": 101,
        "paymentTypeId": 12,
        "secondPartyProviderId": 101,
        "uniqueSequenceNo": "A24117",
        "userType": "PAYEE",
        "requestedValue": 20,
        "hierarchyRoleCode": null,
        "secondPartyHierarchyRoleCode": null,
        "firstPartyPaymentMethodDesc": "12",
        "secondPartyPaymentMethodDesc": "12",
        "accessType": "WEB",
        "previousBalance": 24521,
        "postBalance": 24621,
        "pseudoUserId": null,
        "secondPseudoUserId": null,
        "unregisteredUserId": null,
        "secondUnregisteredUserId": null,
        "bankId": null,
        "attr1Name": null,
        "attr1Value": null,
        "attr2Name": null,
        "attr2Value": null,
        "attr3Name": null,
        "attr3Value": null,
        "txnMode": null,
        "businessDate": "2022-06-20",
        "cqrsVersion": 2,
        "remoteEntry": null,
        "walletSequenceNumber": 0,
        "previousFicBalance": 0,
        "postFicBalance": 0,
        "previousFrozenBalance": 0,
        "postFrozenBalance": 0,
        "previousState": null,
        "chargeName": "charges"
      }
    ],
    "errorCode": null,
    "serviceRequestId": "75406f9a-8bc9-4af2-af7d-b2db5e9b2253",
    "isAmountFreezed": "N",
    "thresholdServiceType": null,
    "requestType": null,
    "partnerData": null,
    "originalTransferId": null,
    "thirdPartyResponse": null,
    "creditBackStatus": null,
    "source": null,
    "referenceId": null,
    "genericField": null,
    "field1": null,
    "cavvVerificationCD": "0",
    "cvvVerificationCD": "0",
    "txnDate": "0704",
    "emvVerificationCD": "0",
    "merchantCategoryCode": "7765",
    "merchantId": "123456789011234",
    "nameorlocation": "GGN",
    "otpVerificationCD": "0",
    "pinVerificationCD": "0",
    "retryCount": 0,
    "pauseReason": null,
    "resumeParty": null,
    "businessDate": "2022-06-20",
    "cqrsVersion": 2,
    "posEntryMode": "90",
    "retrievalReferenceNumber": "612348649012",
    "settlementAmount": "20",
    "settlementDate": "2203",
    "settlementCurrency": "101",
    "terminalId": "1234568",
    "time": "125959",
    "transactor": "system",
    "txnAmount": "200",
    "transactionCurrency": "101",
    "transactionType": "00",
    "tracenumber": "abcdef",
    "payeeHandleType": null,
    "payeeHandleValue": null,
    "payerHandleType": null,
    "payerHandleValue": null,
    "clientId": "9a08",
    "previousState": null,
    "userProfilePayerUserId": "US.2121642766246583",
    "userProfilePayeeUserId": null,
    "orderId": null,
    "initiatorProfileId": "system",
    "isPaymentHandleRequest": "N",
    "cardToken": "card_c21e8437-a4ec-429c-9f28-04e13eeff03d",
    "payerCurrencyCode": "USD",
    "payeeCurrencyCode": "USD",
    "settlementStatus": null,
    "exceptionTxnCode": null,
    "serviceName": "Sale/Purchase",
    "disputeTicket": null
  },
  "serviceFlowStepParams": {},
  "originalRequestType": null,
  "finalResponseRoutingKey": "jigsaw.create.request.applicationserver-srinii.novalocal.finalResponse",
  "transactionAmount": 20,
  "customerId": "cust_14b6c50a-4bf6-4c27-aa0c-1b09e7c4f45d",
  "isOrderManagementEnabled": "false",
  "mfsTenantCurrency": "INR",
  "bearerCode": "WEB",
  "mcipTenantId": "9a08",
  "mfsTenantDesc": "The default tenant when used in single/multi-tenant mode.         Please do not change this.",
  "message": "0420",
  "serviceName": "Reversal void and decline transaction",
  "userId": "US.2121642766246583",
  "originalTransaction": {
    "idType": "transferId",
    "idValue": "XX220621.1042.A95511"
  },
  "originalTxnTransferOnDate": null,
  "isFinancial": true,
  "serviceCodeName": "REVERSAL_TXN",
  "time": "125959",
  "currentServiceCode": "REVERSAL_TXN"
}


