{
  "$schema": "./node_modules/@rocketmakers/orbit-template-http-repository/lib/serviceJsonSchema.json",
  "partials": {
    "header": {
      "path": "partials/html/header.handlebars"
    },
    "footer": {
      "path": "partials/html/footer.handlebars"
    },
    "styles": {
      "path": "partials/html/styles.handlebars"
    }
  },
  "layouts": {
    "forgotPassword": {
      "path": "layouts/forgotPassword",
      "templates": ["html", "txt"]
    },
    "emailVerification": {
      "path": "layouts/emailVerification",
      "templates": ["html", "txt"]
    },
    "smsVerification": {
      "path": "layouts/smsVerification",
      "templates": ["txt"]
    }
  }
}
