{
  "description": "Specify required object",
  "examples": [{ "username": "test@rocketmakers.com" }],
  "type": "object",
  "properties": { "username": { "type": "string" } },
  "required": ["username"],
  "$schema": "http://json-schema.org/draft-07/schema#"
}
