{
  "document" : {
    "configuration" : { },
    "fields" : {
      "items" : {
        "type" : "table",
        "fields" : {
          "product" : {
            "type" : "dict:product"
          },
          "quantity" : {
            "type" : "number"
          }
        }
      }
    }
  }
}