<?xml version="1.0"?>
<sdf version="1.4">
  <world name="default">

    <!-- ground plane -->
    <include>
      <uri>model://ground_plane</uri>
    </include>
    
    <!-- global light source -->
    <include>
      <uri>model://sun</uri>
    </include>

    <physics name="default_physics" default="0" type="ode">
      <max_step_size>0.01</max_step_size>
      <real_time_factor>1</real_time_factor>
      <real_time_update_rate>100</real_time_update_rate>
      <ode>
        <solver>
          <type>quick</type>
          <iters>50</iters>
          <sor>1.0</sor> <!-- important, see issue #2209 -->
          <use_dynamic_moi_rescaling>false</use_dynamic_moi_rescaling>
        </solver>
      </ode>
    </physics>
    
    <!-- focus camera -->
    <gui fullscreen='0'>
      <camera name='user_camera'>
        <pose>4.927360 -4.376610 3.740080 0.000000 0.275643 2.356190</pose>
        <view_controller>orbit</view_controller>
      </camera>
    </gui>
    
  </world>  
</sdf>
