-1.88967052042e-05
-2.71502482542e-05
0.000485441144795

0.000252268541701
0.0233958729699
-0.00126159430784

0.00977824611814
0.292630680885
-0.0308882832284

0.0353799783228
0.672896822586
-0.0830983304675

0.0493222287033
1.01954744951
-0.142005147279

0.0665673296891
1.33355469365
-0.195814476078

0.0820569226863
1.63444581809
-0.241131797174

0.0936317984823
1.92138771544
-0.274630055281

0.106298975751
2.19246027605
-0.30391300443

0.11357544509
2.44822125881
-0.328373667878

0.118699781893
2.68673671785
-0.34898631566

0.121031673393
2.91078045898
-0.369522623356

0.120131271235
3.12160140523
-0.389394600464

0.118790926872
3.31854113746
-0.409271784101

0.115683958279
3.50189524888
-0.429259393166

0.111836253875
3.67316438021
-0.448340620578

0.108020867374
3.8318610801
-0.465852464681

0.104241643478
3.97915701679
-0.480000425571

0.101134633383
4.11564648902
-0.48855347118

0.0991090485933
4.24169953133
-0.489469200636

0.0982717522565
4.35814603256
-0.480782854996

0.098901660464
4.46559949209
-0.46055333031

0.100788172984
4.5652777456
-0.427732159638

0.103828004027
4.65808398915
-0.381516615332

0.107825981453
4.74464112819
-0.322276365093

0.11261237639
4.82617059108
-0.254531166563

0.117933865206
4.90360848424
-0.184290979667

0.123353298679
4.9768441888
-0.115155679361

0.128522239015
5.04571914143
-0.0488840180449

0.133182904523
5.11051630848
0.0143293513101

0.137053960621
5.17147319753
0.0747061007072

0.139820958672
5.22811153554
0.13222046706

0.14140217541
5.28102157955
0.187196549109

0.141908971616
5.3308149438
0.240069650155

0.141149844106
5.37613414653
0.291080464191

0.139093871068
5.41527367238
0.340346450977

0.135810394558
5.44714430145
0.387666600535

0.131514160405
5.47152282702
0.432553069469

0.126332902302
5.48815362823
0.47437510003

0.120395028913
5.49694010119
0.512445552942

0.113789478514
5.4980850514
0.546151059663

0.106633284403
5.49229727166
0.574985029979

0.0990710222166
5.48055542768
0.598566596783

0.0912471630054
5.46398508339
0.616682584069

0.0833178988641
5.4441502981
0.629546640582

0.0754333569937
5.42262404245
0.637682974571

0.0677432587328
5.40077284559
0.641642888158

0.060315820912
5.37983803063
0.642076490356

0.0532795522833
5.36132349442
0.639893278108

0.0467119859283
5.34638061124
0.636210490121

0.0407003488768
5.33600491367
0.632052920157

0.0353944840881
5.33115123968
0.62846812344

0.0307938923831
5.33212514007
0.626531028841

0.0269372831185
5.33928654276
0.627264999605

0.0238687926036
5.35273704674
0.631586339877

