{"epoch": 0, "loss": 0.061361596191471274, "iou_score": 0.9335068464279175, "iou_score_student_hard": 0.9335068464279175, "val_loss": 0.1211344726383686, "val_iou_score": 0.9124951362609863, "val_iou_score_student_hard": 0.9124951362609863, "_runtime": 81.19343209266663, "_timestamp": 1578512274.158312, "_step": 0}
{"epoch": 1, "loss": 0.05824183080006729, "iou_score": 0.9373564720153809, "iou_score_student_hard": 0.9373564720153809, "val_loss": 0.1377046663314104, "val_iou_score": 0.9054867029190063, "val_iou_score_student_hard": 0.9054867029190063, "_runtime": 146.0164532661438, "_timestamp": 1578512338.9813333, "_step": 1}
{"epoch": 2, "loss": 0.056787972203032534, "iou_score": 0.9384004473686218, "iou_score_student_hard": 0.9384004473686218, "val_loss": 0.11857153102755547, "val_iou_score": 0.9082786440849304, "val_iou_score_student_hard": 0.9082786440849304, "_runtime": 210.08544754981995, "_timestamp": 1578512403.0503275, "_step": 2}
{"epoch": 3, "loss": 0.056954826177521185, "iou_score": 0.938737154006958, "iou_score_student_hard": 0.938737154006958, "val_loss": 0.1353542860597372, "val_iou_score": 0.8871827125549316, "val_iou_score_student_hard": 0.8871827125549316, "_runtime": 274.19513869285583, "_timestamp": 1578512467.1600187, "_step": 3}
{"epoch": 4, "loss": 0.05272854183885184, "iou_score": 0.9431167840957642, "iou_score_student_hard": 0.9431167840957642, "val_loss": 0.12703181393444538, "val_iou_score": 0.9076477289199829, "val_iou_score_student_hard": 0.9076477289199829, "_runtime": 338.1900005340576, "_timestamp": 1578512531.1548805, "_step": 4}
{"epoch": 5, "loss": 0.05332246319475499, "iou_score": 0.9422140121459961, "iou_score_student_hard": 0.9422140121459961, "val_loss": 0.1262065052986145, "val_iou_score": 0.9095910787582397, "val_iou_score_student_hard": 0.9095910787582397, "_runtime": 402.6545488834381, "_timestamp": 1578512595.6194289, "_step": 5}
{"epoch": 6, "loss": 0.053189375590194356, "iou_score": 0.9426687359809875, "iou_score_student_hard": 0.9426687359809875, "val_loss": 0.11169702559709549, "val_iou_score": 0.9182060360908508, "val_iou_score_student_hard": 0.9182060360908508, "_runtime": 467.09536123275757, "_timestamp": 1578512660.0602412, "_step": 6}
{"epoch": 7, "loss": 0.05198082531040365, "iou_score": 0.9446265697479248, "iou_score_student_hard": 0.9446265697479248, "val_loss": 0.1350861843675375, "val_iou_score": 0.9025353193283081, "val_iou_score_student_hard": 0.9025353193283081, "_runtime": 531.9664733409882, "_timestamp": 1578512724.9313533, "_step": 7}
{"epoch": 8, "loss": 0.04784526926549998, "iou_score": 0.9476290345191956, "iou_score_student_hard": 0.9476290345191956, "val_loss": 0.14981417097151278, "val_iou_score": 0.8968908190727234, "val_iou_score_student_hard": 0.8968908190727234, "_runtime": 597.865496635437, "_timestamp": 1578512790.8303766, "_step": 8}
{"epoch": 9, "loss": 0.048393817381425334, "iou_score": 0.9475876688957214, "iou_score_student_hard": 0.9475876688957214, "val_loss": 0.240421412140131, "val_iou_score": 0.8388524055480957, "val_iou_score_student_hard": 0.8388524055480957, "_runtime": 663.7826089859009, "_timestamp": 1578512856.747489, "_step": 9}
{"epoch": 10, "loss": 0.04567542811009017, "iou_score": 0.9510515928268433, "iou_score_student_hard": 0.9510515928268433, "val_loss": 0.12208090759813786, "val_iou_score": 0.9111620783805847, "val_iou_score_student_hard": 0.9111620783805847, "_runtime": 727.7545347213745, "_timestamp": 1578512920.7194147, "_step": 10}
{"epoch": 11, "loss": 0.04448433113707737, "iou_score": 0.951736330986023, "iou_score_student_hard": 0.951736330986023, "val_loss": 0.14748617000877856, "val_iou_score": 0.8936659097671509, "val_iou_score_student_hard": 0.8936659097671509, "_runtime": 792.2133021354675, "_timestamp": 1578512985.1781821, "_step": 11}
{"epoch": 12, "loss": 0.043940131273120644, "iou_score": 0.9521417021751404, "iou_score_student_hard": 0.9521417021751404, "val_loss": 0.12751915380358697, "val_iou_score": 0.9044045209884644, "val_iou_score_student_hard": 0.9044045209884644, "_runtime": 856.5551600456238, "_timestamp": 1578513049.52004, "_step": 12}
{"epoch": 13, "loss": 0.04450086477127942, "iou_score": 0.9517483115196228, "iou_score_student_hard": 0.9517483115196228, "val_loss": 0.140542484074831, "val_iou_score": 0.9110239744186401, "val_iou_score_student_hard": 0.9110239744186401, "_runtime": 920.826530456543, "_timestamp": 1578513113.7914104, "_step": 13}
{"epoch": 14, "loss": 0.043720142187719996, "iou_score": 0.9529795050621033, "iou_score_student_hard": 0.9529795050621033, "val_loss": 0.17139883637428283, "val_iou_score": 0.9042736291885376, "val_iou_score_student_hard": 0.9042736291885376, "_runtime": 985.6361331939697, "_timestamp": 1578513178.6010132, "_step": 14}
{"epoch": 15, "loss": 0.039857367824085735, "iou_score": 0.9563688039779663, "iou_score_student_hard": 0.9563688039779663, "val_loss": 0.13483646661043167, "val_iou_score": 0.9074699282646179, "val_iou_score_student_hard": 0.9074699282646179, "_runtime": 1049.9280714988708, "_timestamp": 1578513242.8929515, "_step": 15}
{"epoch": 16, "loss": 0.04014942714605819, "iou_score": 0.9568361043930054, "iou_score_student_hard": 0.9568361043930054, "val_loss": 0.1301890105009079, "val_iou_score": 0.908542275428772, "val_iou_score_student_hard": 0.908542275428772, "_runtime": 1114.0995421409607, "_timestamp": 1578513307.0644221, "_step": 16}
{"epoch": 17, "loss": 0.04109131104566834, "iou_score": 0.9558181762695312, "iou_score_student_hard": 0.9558181762695312, "val_loss": 0.17064890302717686, "val_iou_score": 0.875163197517395, "val_iou_score_student_hard": 0.875163197517395, "_runtime": 1178.8050904273987, "_timestamp": 1578513371.7699704, "_step": 17}
{"epoch": 18, "loss": 0.03718011652712117, "iou_score": 0.9595187306404114, "iou_score_student_hard": 0.9595187306404114, "val_loss": 0.15461350567638873, "val_iou_score": 0.9090837240219116, "val_iou_score_student_hard": 0.9090837240219116, "_runtime": 1243.269764661789, "_timestamp": 1578513436.2346447, "_step": 18}
{"epoch": 19, "loss": 0.03624637704342604, "iou_score": 0.9600397348403931, "iou_score_student_hard": 0.9600397348403931, "val_loss": 0.17754640839993954, "val_iou_score": 0.8876357078552246, "val_iou_score_student_hard": 0.8876357078552246, "_runtime": 1307.550129890442, "_timestamp": 1578513500.5150099, "_step": 19}
{"epoch": 20, "loss": 0.0368789718401703, "iou_score": 0.9595961570739746, "iou_score_student_hard": 0.9595961570739746, "val_loss": 0.17235409058630466, "val_iou_score": 0.8931983113288879, "val_iou_score_student_hard": 0.8931983113288879, "_runtime": 1371.934993505478, "_timestamp": 1578513564.8998735, "_step": 20}
{"epoch": 21, "loss": 0.03641443633559075, "iou_score": 0.960352897644043, "iou_score_student_hard": 0.960352897644043, "val_loss": 0.13914047479629515, "val_iou_score": 0.9130262136459351, "val_iou_score_student_hard": 0.9130262136459351, "_runtime": 1437.8492455482483, "_timestamp": 1578513630.8141255, "_step": 21}
{"epoch": 22, "loss": 0.03457214262505824, "iou_score": 0.9625335931777954, "iou_score_student_hard": 0.9625335931777954, "val_loss": 0.17009446434676648, "val_iou_score": 0.9062546491622925, "val_iou_score_student_hard": 0.9062546491622925, "_runtime": 1503.9316415786743, "_timestamp": 1578513696.8965216, "_step": 22}
{"epoch": 23, "loss": 0.03559561346403577, "iou_score": 0.9616727828979492, "iou_score_student_hard": 0.9616727828979492, "val_loss": 0.1573808640241623, "val_iou_score": 0.9071087837219238, "val_iou_score_student_hard": 0.9071087837219238, "_runtime": 1568.3165247440338, "_timestamp": 1578513761.2814047, "_step": 23}
{"epoch": 24, "loss": 0.03337942452423952, "iou_score": 0.9632644057273865, "iou_score_student_hard": 0.9632644057273865, "val_loss": 0.1393717646598816, "val_iou_score": 0.9052569270133972, "val_iou_score_student_hard": 0.9052569270133972, "_runtime": 1632.3220195770264, "_timestamp": 1578513825.2868996, "_step": 24}
{"epoch": 25, "loss": 0.03255815704099157, "iou_score": 0.9648883938789368, "iou_score_student_hard": 0.9648883938789368, "val_loss": 0.14011188521981238, "val_iou_score": 0.9148553013801575, "val_iou_score_student_hard": 0.9148553013801575, "_runtime": 1696.3459985256195, "_timestamp": 1578513889.3108785, "_step": 25}
{"epoch": 26, "loss": 0.03356232682073658, "iou_score": 0.9633355140686035, "iou_score_student_hard": 0.9633355140686035, "val_loss": 0.16409944519400596, "val_iou_score": 0.9002512097358704, "val_iou_score_student_hard": 0.9002512097358704, "_runtime": 1760.653917312622, "_timestamp": 1578513953.6187973, "_step": 26}
{"epoch": 27, "loss": 0.03179682854732329, "iou_score": 0.9651963114738464, "iou_score_student_hard": 0.9651963114738464, "val_loss": 0.16835134588181971, "val_iou_score": 0.8991877436637878, "val_iou_score_student_hard": 0.8991877436637878, "_runtime": 1825.077140569687, "_timestamp": 1578514018.0420206, "_step": 27}
{"epoch": 28, "loss": 0.030500066695226865, "iou_score": 0.9667840003967285, "iou_score_student_hard": 0.9667840003967285, "val_loss": 0.14231715798377992, "val_iou_score": 0.9154037237167358, "val_iou_score_student_hard": 0.9154037237167358, "_runtime": 1889.1483442783356, "_timestamp": 1578514082.1132243, "_step": 28}
{"epoch": 29, "loss": 0.03062461389398033, "iou_score": 0.966559112071991, "iou_score_student_hard": 0.966559112071991, "val_loss": 0.15788986645638942, "val_iou_score": 0.9076139330863953, "val_iou_score_student_hard": 0.9076139330863953, "_runtime": 1953.8052082061768, "_timestamp": 1578514146.7700882, "_step": 29}
{"epoch": 30, "loss": 0.030482664484192023, "iou_score": 0.9665522575378418, "iou_score_student_hard": 0.9665522575378418, "val_loss": 0.16862986758351325, "val_iou_score": 0.9032853841781616, "val_iou_score_student_hard": 0.9032853841781616, "_runtime": 2018.2826235294342, "_timestamp": 1578514211.2475035, "_step": 30}
{"epoch": 31, "loss": 0.028854983757165345, "iou_score": 0.9686033129692078, "iou_score_student_hard": 0.9686033129692078, "val_loss": 0.17848203964531423, "val_iou_score": 0.9032432436943054, "val_iou_score_student_hard": 0.9032432436943054, "_runtime": 2083.071325302124, "_timestamp": 1578514276.0362053, "_step": 31}
{"epoch": 32, "loss": 0.0336174835535613, "iou_score": 0.9646006226539612, "iou_score_student_hard": 0.9646006226539612, "val_loss": 0.150450324639678, "val_iou_score": 0.9141780138015747, "val_iou_score_student_hard": 0.9141780138015747, "_runtime": 2147.5101544857025, "_timestamp": 1578514340.4750345, "_step": 32}
{"epoch": 33, "loss": 0.029125350222668864, "iou_score": 0.9684479236602783, "iou_score_student_hard": 0.9684479236602783, "val_loss": 0.1585524298250675, "val_iou_score": 0.905508816242218, "val_iou_score_student_hard": 0.905508816242218, "_runtime": 2211.5904383659363, "_timestamp": 1578514404.5553184, "_step": 33}
{"epoch": 34, "loss": 0.026795172979208557, "iou_score": 0.9703164100646973, "iou_score_student_hard": 0.9703164100646973, "val_loss": 0.17377234064042568, "val_iou_score": 0.8974679708480835, "val_iou_score_student_hard": 0.8974679708480835, "_runtime": 2276.4561545848846, "_timestamp": 1578514469.4210346, "_step": 34}
{"epoch": 35, "loss": 0.03010012156922709, "iou_score": 0.9677801132202148, "iou_score_student_hard": 0.9677801132202148, "val_loss": 0.17208805531263352, "val_iou_score": 0.9085472822189331, "val_iou_score_student_hard": 0.9085472822189331, "_runtime": 2342.261837720871, "_timestamp": 1578514535.2267177, "_step": 35}
{"epoch": 36, "loss": 0.026784581123766575, "iou_score": 0.9707256555557251, "iou_score_student_hard": 0.9707256555557251, "val_loss": 0.21856213882565498, "val_iou_score": 0.8830690383911133, "val_iou_score_student_hard": 0.8830690383911133, "_runtime": 2406.7315907478333, "_timestamp": 1578514599.6964707, "_step": 36}
{"epoch": 37, "loss": 0.02777410392564806, "iou_score": 0.9698808789253235, "iou_score_student_hard": 0.9698808789253235, "val_loss": 0.16996375396847724, "val_iou_score": 0.9140070080757141, "val_iou_score_student_hard": 0.9140070080757141, "_runtime": 2470.5680899620056, "_timestamp": 1578514663.53297, "_step": 37}
{"epoch": 38, "loss": 0.027868909295648336, "iou_score": 0.9702302813529968, "iou_score_student_hard": 0.9702302813529968, "val_loss": 0.16051186695694925, "val_iou_score": 0.9114142656326294, "val_iou_score_student_hard": 0.9114142656326294, "_runtime": 2535.4601719379425, "_timestamp": 1578514728.425052, "_step": 38}
{"epoch": 39, "loss": 0.026236777574839918, "iou_score": 0.9715574383735657, "iou_score_student_hard": 0.9715574383735657, "val_loss": 0.1594079475849867, "val_iou_score": 0.9130786657333374, "val_iou_score_student_hard": 0.9130786657333374, "_runtime": 2599.45268201828, "_timestamp": 1578514792.417562, "_step": 39}
{"epoch": 40, "loss": 0.024935987566343763, "iou_score": 0.9726091027259827, "iou_score_student_hard": 0.9726091027259827, "val_loss": 0.20600394457578658, "val_iou_score": 0.8884618878364563, "val_iou_score_student_hard": 0.8884618878364563, "_runtime": 2663.31817483902, "_timestamp": 1578514856.2830548, "_step": 40}
{"epoch": 41, "loss": 0.02560621854764494, "iou_score": 0.9725574254989624, "iou_score_student_hard": 0.9725574254989624, "val_loss": 0.15122457928955554, "val_iou_score": 0.9184144735336304, "val_iou_score_student_hard": 0.9184144735336304, "_runtime": 2727.656858921051, "_timestamp": 1578514920.621739, "_step": 41}
{"epoch": 42, "loss": 0.02515713515776125, "iou_score": 0.9726451635360718, "iou_score_student_hard": 0.9726451635360718, "val_loss": 0.1727920573204756, "val_iou_score": 0.9125468134880066, "val_iou_score_student_hard": 0.9125468134880066, "_runtime": 2791.8996551036835, "_timestamp": 1578514984.864535, "_step": 42}
{"epoch": 43, "loss": 0.024229327292943543, "iou_score": 0.9735907912254333, "iou_score_student_hard": 0.9735907912254333, "val_loss": 0.1780456431210041, "val_iou_score": 0.9053544998168945, "val_iou_score_student_hard": 0.9053544998168945, "_runtime": 2856.022317647934, "_timestamp": 1578515048.9871976, "_step": 43}
{"epoch": 44, "loss": 0.024164108093827963, "iou_score": 0.9741485118865967, "iou_score_student_hard": 0.9741485118865967, "val_loss": 0.19191655069589614, "val_iou_score": 0.915483832359314, "val_iou_score_student_hard": 0.915483832359314, "_runtime": 2920.2211360931396, "_timestamp": 1578515113.186016, "_step": 44}
{"epoch": 45, "loss": 0.022317545750940387, "iou_score": 0.9751083254814148, "iou_score_student_hard": 0.9751083254814148, "val_loss": 0.18948009014129638, "val_iou_score": 0.898408055305481, "val_iou_score_student_hard": 0.898408055305481, "_runtime": 2984.476271390915, "_timestamp": 1578515177.4411514, "_step": 45}
{"epoch": 46, "loss": 0.024586754944175483, "iou_score": 0.9732800126075745, "iou_score_student_hard": 0.9732800126075745, "val_loss": 0.17488034814596176, "val_iou_score": 0.9198209643363953, "val_iou_score_student_hard": 0.9198209643363953, "_runtime": 3048.902318716049, "_timestamp": 1578515241.8671987, "_step": 46}
{"epoch": 47, "loss": 0.023207496881315653, "iou_score": 0.9749161005020142, "iou_score_student_hard": 0.9749161005020142, "val_loss": 0.17263419330120086, "val_iou_score": 0.9125024080276489, "val_iou_score_student_hard": 0.9125024080276489, "_runtime": 3113.5545587539673, "_timestamp": 1578515306.5194387, "_step": 47}
{"epoch": 48, "loss": 0.025740186980163508, "iou_score": 0.9728231430053711, "iou_score_student_hard": 0.9728231430053711, "val_loss": 0.16864468455314635, "val_iou_score": 0.9160733222961426, "val_iou_score_student_hard": 0.9160733222961426, "_runtime": 3180.501161336899, "_timestamp": 1578515373.4660413, "_step": 48}
{"epoch": 49, "loss": 0.0218919893049381, "iou_score": 0.9758293628692627, "iou_score_student_hard": 0.9758293628692627, "val_loss": 0.1742683444172144, "val_iou_score": 0.9128031730651855, "val_iou_score_student_hard": 0.9128031730651855, "_runtime": 3244.77987909317, "_timestamp": 1578515437.744759, "_step": 49}
{"epoch": 50, "loss": 0.02156556552614678, "iou_score": 0.9763069152832031, "iou_score_student_hard": 0.9763069152832031, "val_loss": 0.17345560900866985, "val_iou_score": 0.9177864193916321, "val_iou_score_student_hard": 0.9177864193916321, "_runtime": 3308.906716108322, "_timestamp": 1578515501.871596, "_step": 50}
{"epoch": 51, "loss": 0.022708550095558167, "iou_score": 0.9757457971572876, "iou_score_student_hard": 0.9757457971572876, "val_loss": 0.1935348678380251, "val_iou_score": 0.9016925692558289, "val_iou_score_student_hard": 0.9016925692558289, "_runtime": 3372.8736515045166, "_timestamp": 1578515565.8385315, "_step": 51}
{"epoch": 52, "loss": 0.021392022860659794, "iou_score": 0.9766218066215515, "iou_score_student_hard": 0.9766218066215515, "val_loss": 0.2144116260111332, "val_iou_score": 0.8924751281738281, "val_iou_score_student_hard": 0.8924751281738281, "_runtime": 3436.866033554077, "_timestamp": 1578515629.8309135, "_step": 52}
{"epoch": 53, "loss": 0.021333669049834664, "iou_score": 0.9765952229499817, "iou_score_student_hard": 0.9765952229499817, "val_loss": 0.1817951787263155, "val_iou_score": 0.9084140062332153, "val_iou_score_student_hard": 0.9084140062332153, "_runtime": 3500.7857389450073, "_timestamp": 1578515693.750619, "_step": 53}
{"epoch": 54, "loss": 0.020475695900280366, "iou_score": 0.9776419401168823, "iou_score_student_hard": 0.9776419401168823, "val_loss": 0.19460495188832283, "val_iou_score": 0.9080346822738647, "val_iou_score_student_hard": 0.9080346822738647, "_runtime": 3564.77578663826, "_timestamp": 1578515757.7406666, "_step": 54}
{"epoch": 55, "loss": 0.020899063264104453, "iou_score": 0.9771509766578674, "iou_score_student_hard": 0.9771509766578674, "val_loss": 0.3236451596021652, "val_iou_score": 0.8537378311157227, "val_iou_score_student_hard": 0.8537378311157227, "_runtime": 3628.8523721694946, "_timestamp": 1578515821.8172522, "_step": 55}
{"epoch": 56, "loss": 0.01976096752015027, "iou_score": 0.9782895445823669, "iou_score_student_hard": 0.9782895445823669, "val_loss": 0.24064429625868797, "val_iou_score": 0.9074820280075073, "val_iou_score_student_hard": 0.9074820280075073, "_runtime": 3692.8240077495575, "_timestamp": 1578515885.7888877, "_step": 56}
{"epoch": 57, "loss": 0.021535457475957545, "iou_score": 0.9767155647277832, "iou_score_student_hard": 0.9767155647277832, "val_loss": 0.1773654118180275, "val_iou_score": 0.9164652824401855, "val_iou_score_student_hard": 0.9164652824401855, "_runtime": 3757.056480407715, "_timestamp": 1578515950.0213604, "_step": 57}
{"epoch": 58, "loss": 0.0202084129083563, "iou_score": 0.9785454273223877, "iou_score_student_hard": 0.9785454273223877, "val_loss": 0.17983911745250225, "val_iou_score": 0.9136678576469421, "val_iou_score_student_hard": 0.9136678576469421, "_runtime": 3820.9594583511353, "_timestamp": 1578516013.9243383, "_step": 58}
{"epoch": 59, "loss": 0.01935085953128609, "iou_score": 0.9784418940544128, "iou_score_student_hard": 0.9784418940544128, "val_loss": 0.19806062206625938, "val_iou_score": 0.904173731803894, "val_iou_score_student_hard": 0.904173731803894, "_runtime": 3884.9531400203705, "_timestamp": 1578516077.91802, "_step": 59}
{"epoch": 60, "loss": 0.01876469709995118, "iou_score": 0.9793187975883484, "iou_score_student_hard": 0.9793187975883484, "val_loss": 0.19750255569815636, "val_iou_score": 0.9069234132766724, "val_iou_score_student_hard": 0.9069234132766724, "_runtime": 3949.464111328125, "_timestamp": 1578516142.4289913, "_step": 60}
{"epoch": 61, "loss": 0.018836492600596763, "iou_score": 0.9793621301651001, "iou_score_student_hard": 0.9793621301651001, "val_loss": 0.21865171939134598, "val_iou_score": 0.9093564748764038, "val_iou_score_student_hard": 0.9093564748764038, "_runtime": 4013.837461948395, "_timestamp": 1578516206.802342, "_step": 61}
{"epoch": 62, "loss": 0.018426900754936717, "iou_score": 0.9797738790512085, "iou_score_student_hard": 0.9797738790512085, "val_loss": 0.18330746963620187, "val_iou_score": 0.9146841168403625, "val_iou_score_student_hard": 0.9146841168403625, "_runtime": 4079.5834987163544, "_timestamp": 1578516272.5483787, "_step": 62}
{"epoch": 63, "loss": 0.01836052347313274, "iou_score": 0.9800876975059509, "iou_score_student_hard": 0.9800876975059509, "val_loss": 0.19072340428829193, "val_iou_score": 0.9156851768493652, "val_iou_score_student_hard": 0.9156851768493652, "_runtime": 4145.129594564438, "_timestamp": 1578516338.0944746, "_step": 63}
{"epoch": 64, "loss": 0.018344696463001044, "iou_score": 0.9800301790237427, "iou_score_student_hard": 0.9800301790237427, "val_loss": 0.21397182196378708, "val_iou_score": 0.8956022262573242, "val_iou_score_student_hard": 0.8956022262573242, "_runtime": 4208.973523378372, "_timestamp": 1578516401.9384034, "_step": 64}
{"epoch": 65, "loss": 0.0190036287446591, "iou_score": 0.9792342185974121, "iou_score_student_hard": 0.9792342185974121, "val_loss": 0.18845674246549607, "val_iou_score": 0.9131069183349609, "val_iou_score_student_hard": 0.9131069183349609, "_runtime": 4273.693198680878, "_timestamp": 1578516466.6580787, "_step": 65}
{"epoch": 66, "loss": 0.01692464274608276, "iou_score": 0.981334388256073, "iou_score_student_hard": 0.981334388256073, "val_loss": 0.20158765763044356, "val_iou_score": 0.9099391102790833, "val_iou_score_student_hard": 0.9099391102790833, "_runtime": 4337.568185567856, "_timestamp": 1578516530.5330656, "_step": 66}
{"epoch": 67, "loss": 0.018594198576598005, "iou_score": 0.9797101020812988, "iou_score_student_hard": 0.9797101020812988, "val_loss": 0.22050860971212388, "val_iou_score": 0.8976704478263855, "val_iou_score_student_hard": 0.8976704478263855, "_runtime": 4402.029798269272, "_timestamp": 1578516594.9946783, "_step": 67}
{"epoch": 68, "loss": 0.01790343303741379, "iou_score": 0.980583667755127, "iou_score_student_hard": 0.980583667755127, "val_loss": 0.20264916941523553, "val_iou_score": 0.9123326539993286, "val_iou_score_student_hard": 0.9123326539993286, "_runtime": 4466.334279060364, "_timestamp": 1578516659.299159, "_step": 68}
{"epoch": 69, "loss": 0.017284329354085706, "iou_score": 0.9810659885406494, "iou_score_student_hard": 0.9810659885406494, "val_loss": 0.18240775689482688, "val_iou_score": 0.9192826151847839, "val_iou_score_student_hard": 0.9192826151847839, "_runtime": 4531.233659982681, "_timestamp": 1578516724.19854, "_step": 69}
{"epoch": 70, "loss": 0.018311859578402204, "iou_score": 0.9804646372795105, "iou_score_student_hard": 0.9804646372795105, "val_loss": 0.19182422906160354, "val_iou_score": 0.9127541780471802, "val_iou_score_student_hard": 0.9127541780471802, "_runtime": 4595.996855735779, "_timestamp": 1578516788.9617357, "_step": 70}
{"epoch": 71, "loss": 0.01725182850337164, "iou_score": 0.9811879992485046, "iou_score_student_hard": 0.9811879992485046, "val_loss": 0.1847085203975439, "val_iou_score": 0.921962559223175, "val_iou_score_student_hard": 0.921962559223175, "_runtime": 4660.424338579178, "_timestamp": 1578516853.3892186, "_step": 71}
{"epoch": 72, "loss": 0.01651604684831744, "iou_score": 0.9815070629119873, "iou_score_student_hard": 0.9815070629119873, "val_loss": 0.20323940217494965, "val_iou_score": 0.9151914715766907, "val_iou_score_student_hard": 0.9151914715766907, "_runtime": 4724.724800109863, "_timestamp": 1578516917.68968, "_step": 72}
{"epoch": 73, "loss": 0.017446902944621714, "iou_score": 0.9811975359916687, "iou_score_student_hard": 0.9811975359916687, "val_loss": 0.23558878675103187, "val_iou_score": 0.8931907415390015, "val_iou_score_student_hard": 0.8931907415390015, "_runtime": 4788.950801610947, "_timestamp": 1578516981.9156816, "_step": 73}
{"epoch": 74, "loss": 0.014802662389014254, "iou_score": 0.9833866953849792, "iou_score_student_hard": 0.9833866953849792, "val_loss": 0.22042042315006255, "val_iou_score": 0.9143449068069458, "val_iou_score_student_hard": 0.9143449068069458, "_runtime": 4852.9775602817535, "_timestamp": 1578517045.9424403, "_step": 74}
{"epoch": 75, "loss": 0.01663802129809152, "iou_score": 0.9818090796470642, "iou_score_student_hard": 0.9818090796470642, "val_loss": 0.3997496597468853, "val_iou_score": 0.8559625744819641, "val_iou_score_student_hard": 0.8559625744819641, "_runtime": 4919.231120347977, "_timestamp": 1578517112.1960003, "_step": 75}
{"epoch": 76, "loss": 0.016166291466321456, "iou_score": 0.9823544025421143, "iou_score_student_hard": 0.9823544025421143, "val_loss": 0.20694916024804116, "val_iou_score": 0.9081768989562988, "val_iou_score_student_hard": 0.9081768989562988, "_runtime": 4984.095219373703, "_timestamp": 1578517177.0600994, "_step": 76}
{"epoch": 77, "loss": 0.015362737840041519, "iou_score": 0.9829166531562805, "iou_score_student_hard": 0.9829166531562805, "val_loss": 0.21020614430308343, "val_iou_score": 0.9119367599487305, "val_iou_score_student_hard": 0.9119367599487305, "_runtime": 5048.445347309113, "_timestamp": 1578517241.4102273, "_step": 77}
{"epoch": 78, "loss": 0.01540675378319892, "iou_score": 0.9830203056335449, "iou_score_student_hard": 0.9830203056335449, "val_loss": 0.20483941882848739, "val_iou_score": 0.9127328991889954, "val_iou_score_student_hard": 0.9127328991889954, "_runtime": 5112.909432888031, "_timestamp": 1578517305.8743129, "_step": 78}
{"epoch": 79, "loss": 0.015359151295640252, "iou_score": 0.9830979108810425, "iou_score_student_hard": 0.9830979108810425, "val_loss": 0.23839745298027992, "val_iou_score": 0.9042736887931824, "val_iou_score_student_hard": 0.9042736887931824, "_runtime": 5177.158752441406, "_timestamp": 1578517370.1236324, "_step": 79}
{"epoch": 80, "loss": 0.015553933873095296, "iou_score": 0.9831345081329346, "iou_score_student_hard": 0.9831345081329346, "val_loss": 0.20702937990427017, "val_iou_score": 0.9166499376296997, "val_iou_score_student_hard": 0.9166499376296997, "_runtime": 5241.347423315048, "_timestamp": 1578517434.3123033, "_step": 80}
{"epoch": 81, "loss": 0.016102329455316068, "iou_score": 0.9827042818069458, "iou_score_student_hard": 0.9827042818069458, "val_loss": 0.22659354880452157, "val_iou_score": 0.9051163792610168, "val_iou_score_student_hard": 0.9051163792610168, "_runtime": 5305.551671743393, "_timestamp": 1578517498.5165517, "_step": 81}
{"epoch": 82, "loss": 0.014954607137902216, "iou_score": 0.9836836457252502, "iou_score_student_hard": 0.9836836457252502, "val_loss": 0.23072483502328395, "val_iou_score": 0.9106594324111938, "val_iou_score_student_hard": 0.9106594324111938, "_runtime": 5369.415456533432, "_timestamp": 1578517562.3803365, "_step": 82}
{"epoch": 83, "loss": 0.014304539612071081, "iou_score": 0.9842950701713562, "iou_score_student_hard": 0.9842950701713562, "val_loss": 0.21098392233252525, "val_iou_score": 0.9146645665168762, "val_iou_score_student_hard": 0.9146645665168762, "_runtime": 5433.657810211182, "_timestamp": 1578517626.6226902, "_step": 83}
{"epoch": 84, "loss": 0.01436861141754145, "iou_score": 0.9841758608818054, "iou_score_student_hard": 0.9841758608818054, "val_loss": 0.2040209539234638, "val_iou_score": 0.9178496599197388, "val_iou_score_student_hard": 0.9178496599197388, "_runtime": 5497.468396902084, "_timestamp": 1578517690.433277, "_step": 84}
{"epoch": 85, "loss": 0.014989923402159051, "iou_score": 0.9836650490760803, "iou_score_student_hard": 0.9836650490760803, "val_loss": 0.21955136060714722, "val_iou_score": 0.9072836637496948, "val_iou_score_student_hard": 0.9072836637496948, "_runtime": 5561.810491323471, "_timestamp": 1578517754.7753713, "_step": 85}
{"epoch": 86, "loss": 0.014828777114268053, "iou_score": 0.9839552640914917, "iou_score_student_hard": 0.9839552640914917, "val_loss": 0.22988093495368958, "val_iou_score": 0.9115278124809265, "val_iou_score_student_hard": 0.9115278124809265, "_runtime": 5625.825142860413, "_timestamp": 1578517818.7900229, "_step": 86}
{"epoch": 87, "loss": 0.014627939386462624, "iou_score": 0.9839816093444824, "iou_score_student_hard": 0.9839816093444824, "val_loss": 0.21133778393268585, "val_iou_score": 0.9180102348327637, "val_iou_score_student_hard": 0.9180102348327637, "_runtime": 5689.837065935135, "_timestamp": 1578517882.801946, "_step": 87}
{"epoch": 88, "loss": 0.012758097395470196, "iou_score": 0.985741138458252, "iou_score_student_hard": 0.985741138458252, "val_loss": 0.21868658289313317, "val_iou_score": 0.9093208312988281, "val_iou_score_student_hard": 0.9093208312988281, "_runtime": 5754.799324989319, "_timestamp": 1578517947.764205, "_step": 88}
{"epoch": 89, "loss": 0.0145611974876374, "iou_score": 0.9841449856758118, "iou_score_student_hard": 0.9841449856758118, "val_loss": 0.22969129979610442, "val_iou_score": 0.9096559286117554, "val_iou_score_student_hard": 0.9096559286117554, "_runtime": 5820.48824262619, "_timestamp": 1578518013.4531226, "_step": 89}
{"epoch": 90, "loss": 0.013950180622156371, "iou_score": 0.9848517775535583, "iou_score_student_hard": 0.9848517775535583, "val_loss": 0.22130033671855925, "val_iou_score": 0.9126238822937012, "val_iou_score_student_hard": 0.9126238822937012, "_runtime": 5884.733187198639, "_timestamp": 1578518077.6980672, "_step": 90}
{"epoch": 91, "loss": 0.013998496109111743, "iou_score": 0.9847005009651184, "iou_score_student_hard": 0.9847005009651184, "val_loss": 0.2485072035342455, "val_iou_score": 0.9088712930679321, "val_iou_score_student_hard": 0.9088712930679321, "_runtime": 5948.925852537155, "_timestamp": 1578518141.8907325, "_step": 91}
{"epoch": 92, "loss": 0.013919352447952737, "iou_score": 0.9846802949905396, "iou_score_student_hard": 0.9846802949905396, "val_loss": 0.24359369948506354, "val_iou_score": 0.9076468348503113, "val_iou_score_student_hard": 0.9076468348503113, "_runtime": 6013.125555515289, "_timestamp": 1578518206.0904355, "_step": 92}
{"epoch": 93, "loss": 0.014668868791142648, "iou_score": 0.9846219420433044, "iou_score_student_hard": 0.9846219420433044, "val_loss": 0.2102143719792366, "val_iou_score": 0.9184349179267883, "val_iou_score_student_hard": 0.9184349179267883, "_runtime": 6077.246125221252, "_timestamp": 1578518270.2110052, "_step": 93}
{"epoch": 94, "loss": 0.014822669716721231, "iou_score": 0.9845407009124756, "iou_score_student_hard": 0.9845407009124756, "val_loss": 0.24842575937509537, "val_iou_score": 0.8961045145988464, "val_iou_score_student_hard": 0.8961045145988464, "_runtime": 6141.146502017975, "_timestamp": 1578518334.111382, "_step": 94}
{"epoch": 95, "loss": 0.013101947311819954, "iou_score": 0.9854066967964172, "iou_score_student_hard": 0.9854066967964172, "val_loss": 0.22560081854462624, "val_iou_score": 0.9085041284561157, "val_iou_score_student_hard": 0.9085041284561157, "_runtime": 6204.941325187683, "_timestamp": 1578518397.9062052, "_step": 95}
{"epoch": 96, "loss": 0.012959478287534281, "iou_score": 0.9856436848640442, "iou_score_student_hard": 0.9856436848640442, "val_loss": 0.28182182386517524, "val_iou_score": 0.8923907279968262, "val_iou_score_student_hard": 0.8923907279968262, "_runtime": 6268.843415021896, "_timestamp": 1578518461.808295, "_step": 96}
{"epoch": 97, "loss": 0.013047392945736647, "iou_score": 0.9857346415519714, "iou_score_student_hard": 0.9857346415519714, "val_loss": 0.22307410091161728, "val_iou_score": 0.9161069989204407, "val_iou_score_student_hard": 0.9161069989204407, "_runtime": 6332.75018453598, "_timestamp": 1578518525.7150645, "_step": 97}
{"epoch": 98, "loss": 0.013904532184824347, "iou_score": 0.9850913882255554, "iou_score_student_hard": 0.9850913882255554, "val_loss": 0.22507047206163405, "val_iou_score": 0.9094763994216919, "val_iou_score_student_hard": 0.9094763994216919, "_runtime": 6396.741251945496, "_timestamp": 1578518589.706132, "_step": 98}
{"epoch": 99, "loss": 0.011730066653002393, "iou_score": 0.986842930316925, "iou_score_student_hard": 0.986842930316925, "val_loss": 0.22680865079164506, "val_iou_score": 0.9145909547805786, "val_iou_score_student_hard": 0.9145909547805786, "_runtime": 6460.7252361774445, "_timestamp": 1578518653.6901162, "_step": 99}
{"epoch": 100, "loss": 0.013003150767392732, "iou_score": 0.9858006834983826, "iou_score_student_hard": 0.9858006834983826, "val_loss": 0.22372511252760888, "val_iou_score": 0.9152997136116028, "val_iou_score_student_hard": 0.9152997136116028, "_runtime": 6525.272742986679, "_timestamp": 1578518718.237623, "_step": 100}
{"epoch": 101, "loss": 0.013421529747376388, "iou_score": 0.9854834079742432, "iou_score_student_hard": 0.9854834079742432, "val_loss": 0.2139492265880108, "val_iou_score": 0.9157679677009583, "val_iou_score_student_hard": 0.9157679677009583, "_runtime": 6589.049816608429, "_timestamp": 1578518782.0146966, "_step": 101}
{"epoch": 102, "loss": 0.012006014716726812, "iou_score": 0.9867725968360901, "iou_score_student_hard": 0.9867725968360901, "val_loss": 0.2175558589398861, "val_iou_score": 0.9186215400695801, "val_iou_score_student_hard": 0.9186215400695801, "_runtime": 6653.119191169739, "_timestamp": 1578518846.0840712, "_step": 102}
{"epoch": 103, "loss": 0.013335464513775977, "iou_score": 0.9855868220329285, "iou_score_student_hard": 0.9855868220329285, "val_loss": 0.22733990624547004, "val_iou_score": 0.9117878079414368, "val_iou_score_student_hard": 0.9117878079414368, "_runtime": 6719.033374547958, "_timestamp": 1578518911.9982545, "_step": 103}
{"epoch": 104, "loss": 0.011844670230692083, "iou_score": 0.9867985844612122, "iou_score_student_hard": 0.9867985844612122, "val_loss": 0.23384482339024543, "val_iou_score": 0.9137321710586548, "val_iou_score_student_hard": 0.9137321710586548, "_runtime": 6783.891482830048, "_timestamp": 1578518976.8563628, "_step": 104}
{"epoch": 105, "loss": 0.013715255984359166, "iou_score": 0.9858682155609131, "iou_score_student_hard": 0.9858682155609131, "val_loss": 0.29727878272533415, "val_iou_score": 0.8858798742294312, "val_iou_score_student_hard": 0.8858798742294312, "_runtime": 6848.025724649429, "_timestamp": 1578519040.9906046, "_step": 105}
{"epoch": 106, "loss": 0.012023958148942752, "iou_score": 0.9867812991142273, "iou_score_student_hard": 0.9867812991142273, "val_loss": 0.23667944669723512, "val_iou_score": 0.9109399914741516, "val_iou_score_student_hard": 0.9109399914741516, "_runtime": 6912.463482618332, "_timestamp": 1578519105.4283626, "_step": 106}
{"epoch": 107, "loss": 0.011814393293620511, "iou_score": 0.9874000549316406, "iou_score_student_hard": 0.9874000549316406, "val_loss": 0.23268405646085738, "val_iou_score": 0.9183403253555298, "val_iou_score_student_hard": 0.9183403253555298, "_runtime": 6976.546210765839, "_timestamp": 1578519169.5110908, "_step": 107}
{"epoch": 108, "loss": 0.012738472219048575, "iou_score": 0.9863930940628052, "iou_score_student_hard": 0.9863930940628052, "val_loss": 0.23998618945479394, "val_iou_score": 0.9186902046203613, "val_iou_score_student_hard": 0.9186902046203613, "_runtime": 7040.720060110092, "_timestamp": 1578519233.68494, "_step": 108}
{"epoch": 109, "loss": 0.011867704583247277, "iou_score": 0.986975908279419, "iou_score_student_hard": 0.986975908279419, "val_loss": 0.24906022176146508, "val_iou_score": 0.9057381749153137, "val_iou_score_student_hard": 0.9057381749153137, "_runtime": 7105.411320447922, "_timestamp": 1578519298.3762004, "_step": 109}
{"epoch": 110, "loss": 0.011144510432231155, "iou_score": 0.9877741932868958, "iou_score_student_hard": 0.9877741932868958, "val_loss": 0.23542285412549974, "val_iou_score": 0.9150287508964539, "val_iou_score_student_hard": 0.9150287508964539, "_runtime": 7169.1387350559235, "_timestamp": 1578519362.103615, "_step": 110}
{"epoch": 111, "loss": 0.011457288146696307, "iou_score": 0.9874035716056824, "iou_score_student_hard": 0.9874035716056824, "val_loss": 0.2327037625014782, "val_iou_score": 0.9115884900093079, "val_iou_score_student_hard": 0.9115884900093079, "_runtime": 7233.366157531738, "_timestamp": 1578519426.3310375, "_step": 111}
{"epoch": 112, "loss": 0.011458635406399315, "iou_score": 0.9875927567481995, "iou_score_student_hard": 0.9875927567481995, "val_loss": 0.2519604988396168, "val_iou_score": 0.9107920527458191, "val_iou_score_student_hard": 0.9107920527458191, "_runtime": 7297.5167191028595, "_timestamp": 1578519490.481599, "_step": 112}
{"epoch": 113, "loss": 0.011204435130242597, "iou_score": 0.9876980185508728, "iou_score_student_hard": 0.9876980185508728, "val_loss": 0.2531232565641403, "val_iou_score": 0.9095187187194824, "val_iou_score_student_hard": 0.9095187187194824, "_runtime": 7361.555521965027, "_timestamp": 1578519554.520402, "_step": 113}
{"epoch": 114, "loss": 0.012325533445585858, "iou_score": 0.9869532585144043, "iou_score_student_hard": 0.9869532585144043, "val_loss": 0.24310825690627097, "val_iou_score": 0.9141870737075806, "val_iou_score_student_hard": 0.9141870737075806, "_runtime": 7425.319427728653, "_timestamp": 1578519618.2843077, "_step": 114}
{"epoch": 115, "loss": 0.01221706965006888, "iou_score": 0.9869834184646606, "iou_score_student_hard": 0.9869834184646606, "val_loss": 0.24342017471790314, "val_iou_score": 0.9094728231430054, "val_iou_score_student_hard": 0.9094728231430054, "_runtime": 7489.3239715099335, "_timestamp": 1578519682.2888515, "_step": 115}
{"epoch": 116, "loss": 0.010615106189454144, "iou_score": 0.9882565140724182, "iou_score_student_hard": 0.9882565140724182, "val_loss": 0.24716389700770378, "val_iou_score": 0.9139361381530762, "val_iou_score_student_hard": 0.9139361381530762, "_runtime": 7554.09011888504, "_timestamp": 1578519747.0549989, "_step": 116}
{"epoch": 117, "loss": 0.011869719165207987, "iou_score": 0.9871563911437988, "iou_score_student_hard": 0.9871563911437988, "val_loss": 0.2636576272547245, "val_iou_score": 0.9074338674545288, "val_iou_score_student_hard": 0.9074338674545288, "_runtime": 7620.353494167328, "_timestamp": 1578519813.3183742, "_step": 117}
{"epoch": 118, "loss": 0.010318812126801772, "iou_score": 0.9884900450706482, "iou_score_student_hard": 0.9884900450706482, "val_loss": 0.23564268723130227, "val_iou_score": 0.9137948751449585, "val_iou_score_student_hard": 0.9137948751449585, "_runtime": 7685.15012049675, "_timestamp": 1578519878.1150005, "_step": 118}
{"epoch": 119, "loss": 0.011092017713764852, "iou_score": 0.9879683256149292, "iou_score_student_hard": 0.9879683256149292, "val_loss": 0.23622221127152443, "val_iou_score": 0.9183440208435059, "val_iou_score_student_hard": 0.9183440208435059, "_runtime": 7749.816575288773, "_timestamp": 1578519942.7814553, "_step": 119}
