{
    "root": "/home/ozastrow/image-analysis",
    "program": "train.py",
    "git": {
        "remote": "git@gitlab.com:robotic-startup/Platform/image-analysis.git",
        "commit": "6f80313b83236634a1a072c8fc1b7511cfbb3e15"
    },
    "email": "otto.zastrow@hotmail.de",
    "startedAt": "2020-01-11T19:05:21.863694",
    "host": "octane001.ziti.uni-heidelberg.de",
    "username": "ozastrow",
    "executable": "/opt/anaconda3/bin/python3",
    "os": "Linux-3.10.0-957.12.1.el7.x86_64-x86_64-with-centos-7.4.1708-Core",
    "python": "3.6.7",
    "gpu": "Tesla K20m",
    "gpu_count": 1,
    "cpu_count": 12,
    "args": [
        "--train_steps=110",
        "--epochs=250",
        "--experiment_name=optimizer_comp",
        "--val_steps=20",
        "--optimizer_name=nadam",
        "--augment",
        "--run_name=nadam"
    ],
    "state": "failed",
    "jobType": null,
    "mode": "run",
    "name": "nadam",
    "project": "lawnrobot",
    "heartbeatAt": "2020-01-11T19:05:29.196023",
    "exitcode": 1
}
