{"system.gpu.0.gpu": 0.0, "system.gpu.0.memory": 0.0, "system.gpu.0.memory_allocated": 1.33, "system.gpu.0.temp": 29.47, "system.cpu": 62.89, "system.memory": 8.5, "system.disk": 0.4, "system.proc.memory.availableMB": 58774.83, "system.proc.memory.rssMB": 3554.36, "system.proc.memory.percent": 5.53, "system.proc.cpu.threads": 57.27, "system.network.sent": 5238829, "system.network.recv": 5340279, "_wandb": true, "_timestamp": 1578784773, "_runtime": 30}
{"system.gpu.0.gpu": 0.0, "system.gpu.0.memory": 0.0, "system.gpu.0.memory_allocated": 1.33, "system.gpu.0.temp": 31.13, "system.cpu": 78.2, "system.memory": 8.61, "system.disk": 0.4, "system.proc.memory.availableMB": 58715.26, "system.proc.memory.rssMB": 3600.85, "system.proc.memory.percent": 5.61, "system.proc.cpu.threads": 58.67, "system.network.sent": 9967886, "system.network.recv": 6381174, "_wandb": true, "_timestamp": 1578784803, "_runtime": 60}
{"system.gpu.0.gpu": 0.0, "system.gpu.0.memory": 0.0, "system.gpu.0.memory_allocated": 1.33, "system.gpu.0.temp": 32.67, "system.cpu": 79.95, "system.memory": 9.36, "system.disk": 0.4, "system.proc.memory.availableMB": 58211.2, "system.proc.memory.rssMB": 4117.07, "system.proc.memory.percent": 6.41, "system.proc.cpu.threads": 63.0, "system.network.sent": 12010225, "system.network.recv": 8215801, "_wandb": true, "_timestamp": 1578784833, "_runtime": 90}
{"system.gpu.0.gpu": 0.0, "system.gpu.0.memory": 0.0, "system.gpu.0.memory_allocated": 1.33, "system.gpu.0.temp": 34.07, "system.cpu": 79.55, "system.memory": 9.03, "system.disk": 0.4, "system.proc.memory.availableMB": 58428.89, "system.proc.memory.rssMB": 3899.65, "system.proc.memory.percent": 6.07, "system.proc.cpu.threads": 62.47, "system.network.sent": 16930238, "system.network.recv": 10582209, "_wandb": true, "_timestamp": 1578784863, "_runtime": 121}
{"system.gpu.0.gpu": 0.0, "system.gpu.0.memory": 0.0, "system.gpu.0.memory_allocated": 1.33, "system.gpu.0.temp": 35.33, "system.cpu": 80.13, "system.memory": 9.27, "system.disk": 0.4, "system.proc.memory.availableMB": 58284.73, "system.proc.memory.rssMB": 4038.11, "system.proc.memory.percent": 6.29, "system.proc.cpu.threads": 62.0, "system.network.sent": 17238442, "system.network.recv": 10664444, "_wandb": true, "_timestamp": 1578784894, "_runtime": 151}
{"system.gpu.0.gpu": 0.0, "system.gpu.0.memory": 0.0, "system.gpu.0.memory_allocated": 1.33, "system.gpu.0.temp": 36.4, "system.cpu": 78.18, "system.memory": 9.3, "system.disk": 0.4, "system.proc.memory.availableMB": 58263.2, "system.proc.memory.rssMB": 4060.48, "system.proc.memory.percent": 6.32, "system.proc.cpu.threads": 62.0, "system.network.sent": 22850751, "system.network.recv": 12644856, "_wandb": true, "_timestamp": 1578784924, "_runtime": 181}
{"system.gpu.0.gpu": 0.0, "system.gpu.0.memory": 0.0, "system.gpu.0.memory_allocated": 1.33, "system.gpu.0.temp": 37.33, "system.cpu": 78.34, "system.memory": 9.34, "system.disk": 0.4, "system.proc.memory.availableMB": 58236.0, "system.proc.memory.rssMB": 4090.53, "system.proc.memory.percent": 6.37, "system.proc.cpu.threads": 62.0, "system.network.sent": 26563302, "system.network.recv": 12745911, "_wandb": true, "_timestamp": 1578784954, "_runtime": 211}
{"system.gpu.0.gpu": 0.0, "system.gpu.0.memory": 0.0, "system.gpu.0.memory_allocated": 1.33, "system.gpu.0.temp": 38.0, "system.cpu": 80.49, "system.memory": 9.32, "system.disk": 0.4, "system.proc.memory.availableMB": 58241.08, "system.proc.memory.rssMB": 4087.36, "system.proc.memory.percent": 6.36, "system.proc.cpu.threads": 62.0, "system.network.sent": 26886255, "system.network.recv": 12831165, "_wandb": true, "_timestamp": 1578784984, "_runtime": 241}
{"system.gpu.0.gpu": 0.0, "system.gpu.0.memory": 0.0, "system.gpu.0.memory_allocated": 1.33, "system.gpu.0.temp": 38.6, "system.cpu": 78.65, "system.memory": 9.43, "system.disk": 0.4, "system.proc.memory.availableMB": 58171.98, "system.proc.memory.rssMB": 4155.93, "system.proc.memory.percent": 6.47, "system.proc.cpu.threads": 62.0, "system.network.sent": 32347566, "system.network.recv": 14693352, "_wandb": true, "_timestamp": 1578785014, "_runtime": 271}
{"system.gpu.0.gpu": 0.0, "system.gpu.0.memory": 0.0, "system.gpu.0.memory_allocated": 1.33, "system.gpu.0.temp": 39.0, "system.cpu": 78.56, "system.memory": 9.17, "system.disk": 0.4, "system.proc.memory.availableMB": 58333.7, "system.proc.memory.rssMB": 3983.65, "system.proc.memory.percent": 6.2, "system.proc.cpu.threads": 62.0, "system.network.sent": 36135552, "system.network.recv": 14803249, "_wandb": true, "_timestamp": 1578785044, "_runtime": 301}
{"system.gpu.0.gpu": 0.0, "system.gpu.0.memory": 0.0, "system.gpu.0.memory_allocated": 1.33, "system.gpu.0.temp": 39.33, "system.cpu": 80.44, "system.memory": 9.29, "system.disk": 0.4, "system.proc.memory.availableMB": 58260.33, "system.proc.memory.rssMB": 4067.65, "system.proc.memory.percent": 6.33, "system.proc.cpu.threads": 62.0, "system.network.sent": 36482751, "system.network.recv": 14889540, "_wandb": true, "_timestamp": 1578785074, "_runtime": 331}
{"system.gpu.0.gpu": 0.0, "system.gpu.0.memory": 0.0, "system.gpu.0.memory_allocated": 1.33, "system.gpu.0.temp": 40.0, "system.cpu": 79.69, "system.memory": 9.14, "system.disk": 0.4, "system.proc.memory.availableMB": 58359.02, "system.proc.memory.rssMB": 3951.7, "system.proc.memory.percent": 6.15, "system.proc.cpu.threads": 62.0, "system.network.sent": 36861036, "system.network.recv": 14982318, "_wandb": true, "_timestamp": 1578785104, "_runtime": 362}
{"system.gpu.0.gpu": 0.0, "system.gpu.0.memory": 0.0, "system.gpu.0.memory_allocated": 1.33, "system.gpu.0.temp": 40.0, "system.cpu": 80.0, "system.memory": 9.41, "system.disk": 0.4, "system.proc.memory.availableMB": 58182.01, "system.proc.memory.rssMB": 4145.66, "system.proc.memory.percent": 6.46, "system.proc.cpu.threads": 62.0, "system.network.sent": 37212309, "system.network.recv": 15066567, "_wandb": true, "_timestamp": 1578785134, "_runtime": 392}
{"system.gpu.0.gpu": 0.0, "system.gpu.0.memory": 0.0, "system.gpu.0.memory_allocated": 1.33, "system.gpu.0.temp": 40.0, "system.cpu": 79.73, "system.memory": 9.19, "system.disk": 0.4, "system.proc.memory.availableMB": 58325.91, "system.proc.memory.rssMB": 4002.16, "system.proc.memory.percent": 6.23, "system.proc.cpu.threads": 62.0, "system.network.sent": 37591176, "system.network.recv": 15158913, "_wandb": true, "_timestamp": 1578785165, "_runtime": 422}
{"system.gpu.0.gpu": 0.0, "system.gpu.0.memory": 0.0, "system.gpu.0.memory_allocated": 1.33, "system.gpu.0.temp": 40.0, "system.cpu": 79.75, "system.memory": 9.29, "system.disk": 0.4, "system.proc.memory.availableMB": 58271.18, "system.proc.memory.rssMB": 4055.78, "system.proc.memory.percent": 6.31, "system.proc.cpu.threads": 62.0, "system.network.sent": 37962492, "system.network.recv": 15248201, "_wandb": true, "_timestamp": 1578785195, "_runtime": 452}
{"system.gpu.0.gpu": 0.0, "system.gpu.0.memory": 0.0, "system.gpu.0.memory_allocated": 1.33, "system.gpu.0.temp": 40.6, "system.cpu": 80.31, "system.memory": 9.31, "system.disk": 0.4, "system.proc.memory.availableMB": 58253.25, "system.proc.memory.rssMB": 4075.13, "system.proc.memory.percent": 6.34, "system.proc.cpu.threads": 62.0, "system.network.sent": 38328816, "system.network.recv": 15335422, "_wandb": true, "_timestamp": 1578785225, "_runtime": 482}
{"system.gpu.0.gpu": 0.0, "system.gpu.0.memory": 0.0, "system.gpu.0.memory_allocated": 1.33, "system.gpu.0.temp": 41.0, "system.cpu": 79.29, "system.memory": 9.54, "system.disk": 0.4, "system.proc.memory.availableMB": 58094.31, "system.proc.memory.rssMB": 4234.4, "system.proc.memory.percent": 6.59, "system.proc.cpu.threads": 62.0, "system.network.sent": 40370673, "system.network.recv": 15431666, "_wandb": true, "_timestamp": 1578785255, "_runtime": 512}
{"system.gpu.0.gpu": 0.0, "system.gpu.0.memory": 0.0, "system.gpu.0.memory_allocated": 1.33, "system.gpu.0.temp": 41.0, "system.cpu": 79.79, "system.memory": 9.44, "system.disk": 0.4, "system.proc.memory.availableMB": 58175.05, "system.proc.memory.rssMB": 4153.14, "system.proc.memory.percent": 6.47, "system.proc.cpu.threads": 62.0, "system.network.sent": 40709164, "system.network.recv": 15517467, "_wandb": true, "_timestamp": 1578785285, "_runtime": 542}
{"system.gpu.0.gpu": 0.0, "system.gpu.0.memory": 0.0, "system.gpu.0.memory_allocated": 1.33, "system.gpu.0.temp": 41.0, "system.cpu": 80.49, "system.memory": 9.4, "system.disk": 0.4, "system.proc.memory.availableMB": 58195.69, "system.proc.memory.rssMB": 4131.62, "system.proc.memory.percent": 6.43, "system.proc.cpu.threads": 62.0, "system.network.sent": 41064950, "system.network.recv": 15604522, "_wandb": true, "_timestamp": 1578785315, "_runtime": 572}
{"system.gpu.0.gpu": 0.0, "system.gpu.0.memory": 0.0, "system.gpu.0.memory_allocated": 1.33, "system.gpu.0.temp": 41.0, "system.cpu": 78.94, "system.memory": 9.33, "system.disk": 0.4, "system.proc.memory.availableMB": 58238.83, "system.proc.memory.rssMB": 4088.24, "system.proc.memory.percent": 6.36, "system.proc.cpu.threads": 62.0, "system.network.sent": 43091102, "system.network.recv": 15699732, "_wandb": true, "_timestamp": 1578785345, "_runtime": 603}
{"system.gpu.0.gpu": 0.0, "system.gpu.0.memory": 0.0, "system.gpu.0.memory_allocated": 1.33, "system.gpu.0.temp": 41.0, "system.cpu": 79.58, "system.memory": 9.35, "system.disk": 0.4, "system.proc.memory.availableMB": 58220.47, "system.proc.memory.rssMB": 4107.3, "system.proc.memory.percent": 6.39, "system.proc.cpu.threads": 62.0, "system.network.sent": 43401970, "system.network.recv": 15782277, "_wandb": true, "_timestamp": 1578785375, "_runtime": 633}
{"system.gpu.0.gpu": 0.0, "system.gpu.0.memory": 0.0, "system.gpu.0.memory_allocated": 1.33, "system.gpu.0.temp": 41.0, "system.cpu": 80.08, "system.memory": 9.46, "system.disk": 0.4, "system.proc.memory.availableMB": 58151.64, "system.proc.memory.rssMB": 4176.59, "system.proc.memory.percent": 6.5, "system.proc.cpu.threads": 62.0, "system.network.sent": 43710028, "system.network.recv": 15864006, "_wandb": true, "_timestamp": 1578785406, "_runtime": 663}
{"system.gpu.0.gpu": 0.0, "system.gpu.0.memory": 0.0, "system.gpu.0.memory_allocated": 1.33, "system.gpu.0.temp": 41.13, "system.cpu": 80.02, "system.memory": 9.19, "system.disk": 0.4, "system.proc.memory.availableMB": 58317.63, "system.proc.memory.rssMB": 4010.29, "system.proc.memory.percent": 6.24, "system.proc.cpu.threads": 62.0, "system.network.sent": 44014242, "system.network.recv": 15945291, "_wandb": true, "_timestamp": 1578785436, "_runtime": 693}
{"system.gpu.0.gpu": 0.0, "system.gpu.0.memory": 0.0, "system.gpu.0.memory_allocated": 1.33, "system.gpu.0.temp": 41.0, "system.cpu": 79.8, "system.memory": 9.43, "system.disk": 0.4, "system.proc.memory.availableMB": 58167.0, "system.proc.memory.rssMB": 4159.77, "system.proc.memory.percent": 6.48, "system.proc.cpu.threads": 62.0, "system.network.sent": 44339836, "system.network.recv": 16028920, "_wandb": true, "_timestamp": 1578785466, "_runtime": 723}
{"system.gpu.0.gpu": 0.0, "system.gpu.0.memory": 0.0, "system.gpu.0.memory_allocated": 1.33, "system.gpu.0.temp": 41.0, "system.cpu": 80.43, "system.memory": 9.31, "system.disk": 0.4, "system.proc.memory.availableMB": 58254.52, "system.proc.memory.rssMB": 4068.69, "system.proc.memory.percent": 6.33, "system.proc.cpu.threads": 62.0, "system.network.sent": 44654549, "system.network.recv": 16110683, "_wandb": true, "_timestamp": 1578785496, "_runtime": 753}
{"system.gpu.0.gpu": 0.0, "system.gpu.0.memory": 0.0, "system.gpu.0.memory_allocated": 1.33, "system.gpu.0.temp": 41.0, "system.cpu": 79.67, "system.memory": 9.31, "system.disk": 0.4, "system.proc.memory.availableMB": 58265.08, "system.proc.memory.rssMB": 4049.92, "system.proc.memory.percent": 6.31, "system.proc.cpu.threads": 62.0, "system.network.sent": 44970959, "system.network.recv": 16194678, "_wandb": true, "_timestamp": 1578785526, "_runtime": 783}
{"system.gpu.0.gpu": 0.0, "system.gpu.0.memory": 0.0, "system.gpu.0.memory_allocated": 1.33, "system.gpu.0.temp": 41.0, "system.cpu": 80.62, "system.memory": 9.49, "system.disk": 0.4, "system.proc.memory.availableMB": 58134.03, "system.proc.memory.rssMB": 4191.28, "system.proc.memory.percent": 6.53, "system.proc.cpu.threads": 62.0, "system.network.sent": 45276980, "system.network.recv": 16274323, "_wandb": true, "_timestamp": 1578785556, "_runtime": 813}
{"system.gpu.0.gpu": 0.0, "system.gpu.0.memory": 0.0, "system.gpu.0.memory_allocated": 1.33, "system.gpu.0.temp": 41.0, "system.cpu": 79.33, "system.memory": 9.18, "system.disk": 0.4, "system.proc.memory.availableMB": 58330.71, "system.proc.memory.rssMB": 3997.03, "system.proc.memory.percent": 6.22, "system.proc.cpu.threads": 62.0, "system.network.sent": 47289161, "system.network.recv": 16366238, "_wandb": true, "_timestamp": 1578785586, "_runtime": 843}
{"system.gpu.0.gpu": 0.0, "system.gpu.0.memory": 0.0, "system.gpu.0.memory_allocated": 1.33, "system.gpu.0.temp": 41.0, "system.cpu": 79.66, "system.memory": 9.26, "system.disk": 0.4, "system.proc.memory.availableMB": 58282.2, "system.proc.memory.rssMB": 4045.96, "system.proc.memory.percent": 6.3, "system.proc.cpu.threads": 62.0, "system.network.sent": 47603425, "system.network.recv": 16448695, "_wandb": true, "_timestamp": 1578785616, "_runtime": 874}
{"system.gpu.0.gpu": 0.0, "system.gpu.0.memory": 0.0, "system.gpu.0.memory_allocated": 1.33, "system.gpu.0.temp": 41.0, "system.cpu": 80.34, "system.memory": 9.38, "system.disk": 0.4, "system.proc.memory.availableMB": 58207.56, "system.proc.memory.rssMB": 4119.87, "system.proc.memory.percent": 6.41, "system.proc.cpu.threads": 62.0, "system.network.sent": 47914635, "system.network.recv": 16533856, "_wandb": true, "_timestamp": 1578785646, "_runtime": 904}
{"system.gpu.0.gpu": 0.0, "system.gpu.0.memory": 0.0, "system.gpu.0.memory_allocated": 1.33, "system.gpu.0.temp": 41.0, "system.cpu": 79.8, "system.memory": 9.32, "system.disk": 0.4, "system.proc.memory.availableMB": 58239.71, "system.proc.memory.rssMB": 4089.07, "system.proc.memory.percent": 6.36, "system.proc.cpu.threads": 62.0, "system.network.sent": 48232716, "system.network.recv": 16617411, "_wandb": true, "_timestamp": 1578785677, "_runtime": 934}
{"system.gpu.0.gpu": 0.0, "system.gpu.0.memory": 0.0, "system.gpu.0.memory_allocated": 1.33, "system.gpu.0.temp": 41.0, "system.cpu": 79.74, "system.memory": 9.25, "system.disk": 0.4, "system.proc.memory.availableMB": 58295.75, "system.proc.memory.rssMB": 4032.43, "system.proc.memory.percent": 6.28, "system.proc.cpu.threads": 62.0, "system.network.sent": 48535322, "system.network.recv": 16698584, "_wandb": true, "_timestamp": 1578785707, "_runtime": 964}
{"system.gpu.0.gpu": 0.0, "system.gpu.0.memory": 0.0, "system.gpu.0.memory_allocated": 1.33, "system.gpu.0.temp": 40.87, "system.cpu": 80.6, "system.memory": 9.35, "system.disk": 0.4, "system.proc.memory.availableMB": 58223.01, "system.proc.memory.rssMB": 4105.82, "system.proc.memory.percent": 6.39, "system.proc.cpu.threads": 62.0, "system.network.sent": 48850845, "system.network.recv": 16780055, "_wandb": true, "_timestamp": 1578785737, "_runtime": 994}
{"system.gpu.0.gpu": 0.0, "system.gpu.0.memory": 0.0, "system.gpu.0.memory_allocated": 1.33, "system.gpu.0.temp": 40.73, "system.cpu": 79.52, "system.memory": 9.29, "system.disk": 0.4, "system.proc.memory.availableMB": 58258.17, "system.proc.memory.rssMB": 4070.02, "system.proc.memory.percent": 6.34, "system.proc.cpu.threads": 62.0, "system.network.sent": 49174569, "system.network.recv": 16866140, "_wandb": true, "_timestamp": 1578785767, "_runtime": 1024}
{"system.gpu.0.gpu": 0.0, "system.gpu.0.memory": 0.0, "system.gpu.0.memory_allocated": 1.33, "system.gpu.0.temp": 40.07, "system.cpu": 79.91, "system.memory": 9.15, "system.disk": 0.4, "system.proc.memory.availableMB": 58345.65, "system.proc.memory.rssMB": 3982.98, "system.proc.memory.percent": 6.2, "system.proc.cpu.threads": 62.0, "system.network.sent": 49478533, "system.network.recv": 16947892, "_wandb": true, "_timestamp": 1578785797, "_runtime": 1054}
{"system.gpu.0.gpu": 0.0, "system.gpu.0.memory": 0.0, "system.gpu.0.memory_allocated": 1.33, "system.gpu.0.temp": 40.13, "system.cpu": 80.38, "system.memory": 9.39, "system.disk": 0.4, "system.proc.memory.availableMB": 58196.79, "system.proc.memory.rssMB": 4131.78, "system.proc.memory.percent": 6.43, "system.proc.cpu.threads": 62.0, "system.network.sent": 49798536, "system.network.recv": 17031723, "_wandb": true, "_timestamp": 1578785827, "_runtime": 1084}
{"system.gpu.0.gpu": 0.0, "system.gpu.0.memory": 0.0, "system.gpu.0.memory_allocated": 1.33, "system.gpu.0.temp": 40.13, "system.cpu": 79.65, "system.memory": 9.33, "system.disk": 0.4, "system.proc.memory.availableMB": 58227.17, "system.proc.memory.rssMB": 4093.34, "system.proc.memory.percent": 6.37, "system.proc.cpu.threads": 62.0, "system.network.sent": 50111336, "system.network.recv": 17112654, "_wandb": true, "_timestamp": 1578785857, "_runtime": 1114}
{"system.gpu.0.gpu": 0.0, "system.gpu.0.memory": 0.0, "system.gpu.0.memory_allocated": 1.33, "system.gpu.0.temp": 40.07, "system.cpu": 80.06, "system.memory": 9.37, "system.disk": 0.4, "system.proc.memory.availableMB": 58216.77, "system.proc.memory.rssMB": 4110.9, "system.proc.memory.percent": 6.4, "system.proc.cpu.threads": 62.0, "system.network.sent": 50420335, "system.network.recv": 17192855, "_wandb": true, "_timestamp": 1578785887, "_runtime": 1145}
{"system.gpu.0.gpu": 0.0, "system.gpu.0.memory": 0.0, "system.gpu.0.memory_allocated": 1.33, "system.gpu.0.temp": 40.07, "system.cpu": 79.89, "system.memory": 9.47, "system.disk": 0.4, "system.proc.memory.availableMB": 58145.57, "system.proc.memory.rssMB": 4172.71, "system.proc.memory.percent": 6.5, "system.proc.cpu.threads": 62.0, "system.network.sent": 50741584, "system.network.recv": 17284674, "_wandb": true, "_timestamp": 1578785918, "_runtime": 1175}
{"system.gpu.0.gpu": 0.0, "system.gpu.0.memory": 0.0, "system.gpu.0.memory_allocated": 1.33, "system.gpu.0.temp": 40.0, "system.cpu": 80.06, "system.memory": 9.33, "system.disk": 0.4, "system.proc.memory.availableMB": 58241.61, "system.proc.memory.rssMB": 4082.52, "system.proc.memory.percent": 6.36, "system.proc.cpu.threads": 62.0, "system.network.sent": 51053071, "system.network.recv": 17366185, "_wandb": true, "_timestamp": 1578785948, "_runtime": 1205}
{"system.gpu.0.gpu": 0.0, "system.gpu.0.memory": 0.0, "system.gpu.0.memory_allocated": 1.33, "system.gpu.0.temp": 40.0, "system.cpu": 80.17, "system.memory": 9.52, "system.disk": 0.4, "system.proc.memory.availableMB": 58112.98, "system.proc.memory.rssMB": 4214.28, "system.proc.memory.percent": 6.56, "system.proc.cpu.threads": 62.0, "system.network.sent": 51363200, "system.network.recv": 17446117, "_wandb": true, "_timestamp": 1578785978, "_runtime": 1235}
{"system.gpu.0.gpu": 0.0, "system.gpu.0.memory": 0.0, "system.gpu.0.memory_allocated": 1.33, "system.gpu.0.temp": 40.07, "system.cpu": 79.54, "system.memory": 9.3, "system.disk": 0.4, "system.proc.memory.availableMB": 58252.95, "system.proc.memory.rssMB": 4075.65, "system.proc.memory.percent": 6.35, "system.proc.cpu.threads": 62.0, "system.network.sent": 51687035, "system.network.recv": 17530930, "_wandb": true, "_timestamp": 1578786008, "_runtime": 1265}
{"system.gpu.0.gpu": 0.0, "system.gpu.0.memory": 0.0, "system.gpu.0.memory_allocated": 1.33, "system.gpu.0.temp": 40.27, "system.cpu": 79.73, "system.memory": 9.43, "system.disk": 0.4, "system.proc.memory.availableMB": 58173.81, "system.proc.memory.rssMB": 4150.05, "system.proc.memory.percent": 6.46, "system.proc.cpu.threads": 62.0, "system.network.sent": 51992122, "system.network.recv": 17612655, "_wandb": true, "_timestamp": 1578786038, "_runtime": 1295}
{"system.gpu.0.gpu": 0.0, "system.gpu.0.memory": 0.0, "system.gpu.0.memory_allocated": 1.33, "system.gpu.0.temp": 40.2, "system.cpu": 80.21, "system.memory": 9.6, "system.disk": 0.4, "system.proc.memory.availableMB": 58057.98, "system.proc.memory.rssMB": 4269.42, "system.proc.memory.percent": 6.65, "system.proc.cpu.threads": 62.0, "system.network.sent": 52298513, "system.network.recv": 17695150, "_wandb": true, "_timestamp": 1578786068, "_runtime": 1325}
{"system.gpu.0.gpu": 0.0, "system.gpu.0.memory": 0.0, "system.gpu.0.memory_allocated": 1.33, "system.gpu.0.temp": 40.47, "system.cpu": 80.02, "system.memory": 9.43, "system.disk": 0.4, "system.proc.memory.availableMB": 58180.32, "system.proc.memory.rssMB": 4147.58, "system.proc.memory.percent": 6.46, "system.proc.cpu.threads": 62.0, "system.network.sent": 52615330, "system.network.recv": 17778621, "_wandb": true, "_timestamp": 1578786098, "_runtime": 1355}
{"system.gpu.0.gpu": 0.0, "system.gpu.0.memory": 0.0, "system.gpu.0.memory_allocated": 1.33, "system.gpu.0.temp": 40.87, "system.cpu": 79.86, "system.memory": 9.39, "system.disk": 0.4, "system.proc.memory.availableMB": 58200.55, "system.proc.memory.rssMB": 4127.37, "system.proc.memory.percent": 6.43, "system.proc.cpu.threads": 62.0, "system.network.sent": 52931473, "system.network.recv": 17863496, "_wandb": true, "_timestamp": 1578786128, "_runtime": 1386}
{"system.gpu.0.gpu": 0.0, "system.gpu.0.memory": 0.0, "system.gpu.0.memory_allocated": 1.33, "system.gpu.0.temp": 40.67, "system.cpu": 80.35, "system.memory": 9.49, "system.disk": 0.4, "system.proc.memory.availableMB": 58138.32, "system.proc.memory.rssMB": 4189.13, "system.proc.memory.percent": 6.52, "system.proc.cpu.threads": 62.0, "system.network.sent": 53235855, "system.network.recv": 17941985, "_wandb": true, "_timestamp": 1578786158, "_runtime": 1416}
{"system.gpu.0.gpu": 0.0, "system.gpu.0.memory": 0.0, "system.gpu.0.memory_allocated": 1.33, "system.gpu.0.temp": 40.8, "system.cpu": 76.05, "system.memory": 9.27, "system.disk": 0.4, "system.proc.memory.availableMB": 58275.82, "system.proc.memory.rssMB": 4052.5, "system.proc.memory.percent": 6.31, "system.proc.cpu.threads": 62.0, "system.network.sent": 55262803, "system.network.recv": 18039088, "_wandb": true, "_timestamp": 1578786189, "_runtime": 1446}
{"system.gpu.0.gpu": 0.0, "system.gpu.0.memory": 0.0, "system.gpu.0.memory_allocated": 1.33, "system.gpu.0.temp": 41.0, "system.cpu": 79.55, "system.memory": 9.33, "system.disk": 0.4, "system.proc.memory.availableMB": 58242.19, "system.proc.memory.rssMB": 4084.71, "system.proc.memory.percent": 6.36, "system.proc.cpu.threads": 62.0, "system.network.sent": 55568336, "system.network.recv": 18119527, "_wandb": true, "_timestamp": 1578786219, "_runtime": 1476}
{"system.gpu.0.gpu": 0.0, "system.gpu.0.memory": 0.0, "system.gpu.0.memory_allocated": 1.33, "system.gpu.0.temp": 40.73, "system.cpu": 80.24, "system.memory": 9.45, "system.disk": 0.4, "system.proc.memory.availableMB": 58152.29, "system.proc.memory.rssMB": 4175.73, "system.proc.memory.percent": 6.5, "system.proc.cpu.threads": 62.0, "system.network.sent": 55890107, "system.network.recv": 18206543, "_wandb": true, "_timestamp": 1578786249, "_runtime": 1506}
{"system.gpu.0.gpu": 0.0, "system.gpu.0.memory": 0.0, "system.gpu.0.memory_allocated": 1.33, "system.gpu.0.temp": 41.0, "system.cpu": 79.39, "system.memory": 9.32, "system.disk": 0.4, "system.proc.memory.availableMB": 58248.23, "system.proc.memory.rssMB": 4081.1, "system.proc.memory.percent": 6.35, "system.proc.cpu.threads": 62.0, "system.network.sent": 59627201, "system.network.recv": 20040938, "_wandb": true, "_timestamp": 1578786279, "_runtime": 1536}
{"system.gpu.0.gpu": 0.0, "system.gpu.0.memory": 0.0, "system.gpu.0.memory_allocated": 1.33, "system.gpu.0.temp": 40.87, "system.cpu": 80.24, "system.memory": 9.45, "system.disk": 0.4, "system.proc.memory.availableMB": 58155.68, "system.proc.memory.rssMB": 4172.84, "system.proc.memory.percent": 6.5, "system.proc.cpu.threads": 62.0, "system.network.sent": 59939740, "system.network.recv": 20121123, "_wandb": true, "_timestamp": 1578786309, "_runtime": 1566}
{"system.gpu.0.gpu": 0.0, "system.gpu.0.memory": 0.0, "system.gpu.0.memory_allocated": 1.33, "system.gpu.0.temp": 40.73, "system.cpu": 79.92, "system.memory": 9.47, "system.disk": 0.4, "system.proc.memory.availableMB": 58143.11, "system.proc.memory.rssMB": 4183.48, "system.proc.memory.percent": 6.51, "system.proc.cpu.threads": 62.0, "system.network.sent": 60251060, "system.network.recv": 20205124, "_wandb": true, "_timestamp": 1578786339, "_runtime": 1596}
{"system.gpu.0.gpu": 0.0, "system.gpu.0.memory": 0.0, "system.gpu.0.memory_allocated": 1.33, "system.gpu.0.temp": 40.47, "system.cpu": 79.98, "system.memory": 9.35, "system.disk": 0.4, "system.proc.memory.availableMB": 58224.06, "system.proc.memory.rssMB": 4104.15, "system.proc.memory.percent": 6.39, "system.proc.cpu.threads": 62.0, "system.network.sent": 60564989, "system.network.recv": 20287473, "_wandb": true, "_timestamp": 1578786369, "_runtime": 1626}
{"system.gpu.0.gpu": 0.0, "system.gpu.0.memory": 0.0, "system.gpu.0.memory_allocated": 1.33, "system.gpu.0.temp": 40.27, "system.cpu": 80.51, "system.memory": 9.53, "system.disk": 0.4, "system.proc.memory.availableMB": 58110.79, "system.proc.memory.rssMB": 4216.68, "system.proc.memory.percent": 6.57, "system.proc.cpu.threads": 62.0, "system.network.sent": 60876637, "system.network.recv": 20368889, "_wandb": true, "_timestamp": 1578786399, "_runtime": 1657}
{"system.gpu.0.gpu": 0.0, "system.gpu.0.memory": 0.0, "system.gpu.0.memory_allocated": 1.33, "system.gpu.0.temp": 40.2, "system.cpu": 80.13, "system.memory": 9.63, "system.disk": 0.4, "system.proc.memory.availableMB": 58052.09, "system.proc.memory.rssMB": 4274.83, "system.proc.memory.percent": 6.66, "system.proc.cpu.threads": 62.0, "system.network.sent": 61184021, "system.network.recv": 20450042, "_wandb": true, "_timestamp": 1578786430, "_runtime": 1687}
{"system.gpu.0.gpu": 0.0, "system.gpu.0.memory": 0.0, "system.gpu.0.memory_allocated": 1.33, "system.gpu.0.temp": 40.0, "system.cpu": 80.13, "system.memory": 9.47, "system.disk": 0.4, "system.proc.memory.availableMB": 58141.08, "system.proc.memory.rssMB": 4187.0, "system.proc.memory.percent": 6.52, "system.proc.cpu.threads": 62.0, "system.network.sent": 61495758, "system.network.recv": 20533409, "_wandb": true, "_timestamp": 1578786460, "_runtime": 1717}
{"system.gpu.0.gpu": 0.0, "system.gpu.0.memory": 0.0, "system.gpu.0.memory_allocated": 1.33, "system.gpu.0.temp": 40.07, "system.cpu": 80.36, "system.memory": 9.49, "system.disk": 0.4, "system.proc.memory.availableMB": 58135.58, "system.proc.memory.rssMB": 4192.47, "system.proc.memory.percent": 6.53, "system.proc.cpu.threads": 62.0, "system.network.sent": 61853605, "system.network.recv": 20618278, "_wandb": true, "_timestamp": 1578786490, "_runtime": 1747}
{"system.gpu.0.gpu": 0.0, "system.gpu.0.memory": 0.0, "system.gpu.0.memory_allocated": 1.33, "system.gpu.0.temp": 40.0, "system.cpu": 79.65, "system.memory": 9.37, "system.disk": 0.4, "system.proc.memory.availableMB": 58210.6, "system.proc.memory.rssMB": 4117.7, "system.proc.memory.percent": 6.41, "system.proc.cpu.threads": 62.0, "system.network.sent": 62160928, "system.network.recv": 20703431, "_wandb": true, "_timestamp": 1578786520, "_runtime": 1777}
{"system.gpu.0.gpu": 0.0, "system.gpu.0.memory": 0.0, "system.gpu.0.memory_allocated": 1.33, "system.gpu.0.temp": 40.0, "system.cpu": 79.43, "system.memory": 9.25, "system.disk": 0.4, "system.proc.memory.availableMB": 58289.01, "system.proc.memory.rssMB": 4028.81, "system.proc.memory.percent": 6.27, "system.proc.cpu.threads": 62.0, "system.network.sent": 62470130, "system.network.recv": 20785954, "_wandb": true, "_timestamp": 1578786550, "_runtime": 1807}
{"system.gpu.0.gpu": 0.0, "system.gpu.0.memory": 0.0, "system.gpu.0.memory_allocated": 1.33, "system.gpu.0.temp": 40.0, "system.cpu": 80.69, "system.memory": 9.39, "system.disk": 0.4, "system.proc.memory.availableMB": 58202.44, "system.proc.memory.rssMB": 4125.98, "system.proc.memory.percent": 6.42, "system.proc.cpu.threads": 62.0, "system.network.sent": 62813186, "system.network.recv": 20874162, "_wandb": true, "_timestamp": 1578786580, "_runtime": 1837}
{"system.gpu.0.gpu": 0.0, "system.gpu.0.memory": 0.0, "system.gpu.0.memory_allocated": 1.33, "system.gpu.0.temp": 40.0, "system.cpu": 78.81, "system.memory": 9.18, "system.disk": 0.4, "system.proc.memory.availableMB": 58331.1, "system.proc.memory.rssMB": 3996.13, "system.proc.memory.percent": 6.22, "system.proc.cpu.threads": 62.0, "system.network.sent": 63163523, "system.network.recv": 20962029, "_wandb": true, "_timestamp": 1578786611, "_runtime": 1868}
{"system.gpu.0.gpu": 0.0, "system.gpu.0.memory": 0.0, "system.gpu.0.memory_allocated": 1.33, "system.gpu.0.temp": 40.07, "system.cpu": 80.61, "system.memory": 9.43, "system.disk": 0.4, "system.proc.memory.availableMB": 58177.87, "system.proc.memory.rssMB": 4143.75, "system.proc.memory.percent": 6.45, "system.proc.cpu.threads": 62.0, "system.network.sent": 63487936, "system.network.recv": 21043654, "_wandb": true, "_timestamp": 1578786641, "_runtime": 1898}
{"system.gpu.0.gpu": 0.0, "system.gpu.0.memory": 0.0, "system.gpu.0.memory_allocated": 1.33, "system.gpu.0.temp": 40.0, "system.cpu": 80.03, "system.memory": 9.38, "system.disk": 0.4, "system.proc.memory.availableMB": 58205.58, "system.proc.memory.rssMB": 4109.81, "system.proc.memory.percent": 6.4, "system.proc.cpu.threads": 62.0, "system.network.sent": 63800994, "system.network.recv": 21129325, "_wandb": true, "_timestamp": 1578786671, "_runtime": 1928}
{"system.gpu.0.gpu": 0.0, "system.gpu.0.memory": 0.0, "system.gpu.0.memory_allocated": 1.33, "system.gpu.0.temp": 40.07, "system.cpu": 79.82, "system.memory": 9.33, "system.disk": 0.4, "system.proc.memory.availableMB": 58230.79, "system.proc.memory.rssMB": 4093.91, "system.proc.memory.percent": 6.37, "system.proc.cpu.threads": 62.0, "system.network.sent": 64155007, "system.network.recv": 21213400, "_wandb": true, "_timestamp": 1578786701, "_runtime": 1958}
{"system.gpu.0.gpu": 0.0, "system.gpu.0.memory": 0.0, "system.gpu.0.memory_allocated": 1.33, "system.gpu.0.temp": 40.0, "system.cpu": 80.31, "system.memory": 9.3, "system.disk": 0.4, "system.proc.memory.availableMB": 58250.66, "system.proc.memory.rssMB": 4076.99, "system.proc.memory.percent": 6.35, "system.proc.cpu.threads": 62.0, "system.network.sent": 64467003, "system.network.recv": 21293475, "_wandb": true, "_timestamp": 1578786731, "_runtime": 1988}
{"system.gpu.0.gpu": 0.0, "system.gpu.0.memory": 0.0, "system.gpu.0.memory_allocated": 1.33, "system.gpu.0.temp": 40.0, "system.cpu": 80.07, "system.memory": 9.33, "system.disk": 0.4, "system.proc.memory.availableMB": 58236.26, "system.proc.memory.rssMB": 4088.05, "system.proc.memory.percent": 6.36, "system.proc.cpu.threads": 62.0, "system.network.sent": 64781450, "system.network.recv": 21378596, "_wandb": true, "_timestamp": 1578786761, "_runtime": 2018}
{"system.gpu.0.gpu": 0.0, "system.gpu.0.memory": 0.0, "system.gpu.0.memory_allocated": 1.33, "system.gpu.0.temp": 40.0, "system.cpu": 79.59, "system.memory": 9.32, "system.disk": 0.4, "system.proc.memory.availableMB": 58246.8, "system.proc.memory.rssMB": 4080.94, "system.proc.memory.percent": 6.35, "system.proc.cpu.threads": 62.0, "system.network.sent": 65098533, "system.network.recv": 21461734, "_wandb": true, "_timestamp": 1578786791, "_runtime": 2049}
{"system.gpu.0.gpu": 0.0, "system.gpu.0.memory": 0.0, "system.gpu.0.memory_allocated": 1.33, "system.gpu.0.temp": 40.2, "system.cpu": 80.57, "system.memory": 9.52, "system.disk": 0.4, "system.proc.memory.availableMB": 58106.34, "system.proc.memory.rssMB": 4221.85, "system.proc.memory.percent": 6.57, "system.proc.cpu.threads": 62.0, "system.network.sent": 65422989, "system.network.recv": 21551371, "_wandb": true, "_timestamp": 1578786822, "_runtime": 2079}
{"system.gpu.0.gpu": 0.0, "system.gpu.0.memory": 0.0, "system.gpu.0.memory_allocated": 1.33, "system.gpu.0.temp": 40.33, "system.cpu": 80.11, "system.memory": 9.15, "system.disk": 0.4, "system.proc.memory.availableMB": 58353.51, "system.proc.memory.rssMB": 3974.25, "system.proc.memory.percent": 6.18, "system.proc.cpu.threads": 62.0, "system.network.sent": 65726133, "system.network.recv": 21632786, "_wandb": true, "_timestamp": 1578786852, "_runtime": 2109}
{"system.gpu.0.gpu": 0.0, "system.gpu.0.memory": 0.0, "system.gpu.0.memory_allocated": 1.33, "system.gpu.0.temp": 40.6, "system.cpu": 79.85, "system.memory": 9.32, "system.disk": 0.4, "system.proc.memory.availableMB": 58247.03, "system.proc.memory.rssMB": 4080.56, "system.proc.memory.percent": 6.35, "system.proc.cpu.threads": 62.0, "system.network.sent": 66026026, "system.network.recv": 21712707, "_wandb": true, "_timestamp": 1578786882, "_runtime": 2139}
