{"system.gpu.0.gpu": 4.07, "system.gpu.0.memory": 0.6, "system.gpu.0.memory_allocated": 89.83, "system.gpu.0.temp": 53.87, "system.gpu.1.gpu": 5.47, "system.gpu.1.memory": 0.93, "system.gpu.1.memory_allocated": 83.5, "system.gpu.1.temp": 57.2, "system.gpu.2.gpu": 4.73, "system.gpu.2.memory": 0.8, "system.gpu.2.memory_allocated": 96.34, "system.gpu.2.temp": 54.33, "system.gpu.3.gpu": 4.4, "system.gpu.3.memory": 0.93, "system.gpu.3.memory_allocated": 89.96, "system.gpu.3.temp": 59.13, "system.cpu": 16.91, "system.memory": 11.01, "system.disk": 1.2, "system.proc.memory.availableMB": 57160.43, "system.proc.memory.rssMB": 5214.74, "system.proc.memory.percent": 8.12, "system.proc.cpu.threads": 88.33, "system.network.sent": 2725916, "system.network.recv": 2212318, "_wandb": true, "_timestamp": 1578856738, "_runtime": 32}
{"system.gpu.0.gpu": 32.0, "system.gpu.0.memory": 5.2, "system.gpu.0.memory_allocated": 97.42, "system.gpu.0.temp": 56.4, "system.gpu.1.gpu": 30.2, "system.gpu.1.memory": 5.0, "system.gpu.1.memory_allocated": 97.47, "system.gpu.1.temp": 59.8, "system.gpu.2.gpu": 30.93, "system.gpu.2.memory": 4.4, "system.gpu.2.memory_allocated": 97.42, "system.gpu.2.temp": 61.4, "system.gpu.3.gpu": 32.73, "system.gpu.3.memory": 4.6, "system.gpu.3.memory_allocated": 97.47, "system.gpu.3.temp": 63.07, "system.cpu": 73.27, "system.memory": 16.12, "system.disk": 1.2, "system.proc.memory.availableMB": 53872.91, "system.proc.memory.rssMB": 8539.31, "system.proc.memory.percent": 13.29, "system.proc.cpu.threads": 132.27, "system.network.sent": 10060656, "system.network.recv": 4152618, "_wandb": true, "_timestamp": 1578856768, "_runtime": 62}
{"system.gpu.0.gpu": 39.13, "system.gpu.0.memory": 6.13, "system.gpu.0.memory_allocated": 97.42, "system.gpu.0.temp": 59.73, "system.gpu.1.gpu": 39.8, "system.gpu.1.memory": 6.47, "system.gpu.1.memory_allocated": 97.47, "system.gpu.1.temp": 62.87, "system.gpu.2.gpu": 40.8, "system.gpu.2.memory": 5.73, "system.gpu.2.memory_allocated": 97.42, "system.gpu.2.temp": 64.33, "system.gpu.3.gpu": 40.6, "system.gpu.3.memory": 5.4, "system.gpu.3.memory_allocated": 97.47, "system.gpu.3.temp": 66.8, "system.cpu": 76.64, "system.memory": 16.46, "system.disk": 1.2, "system.proc.memory.availableMB": 53662.3, "system.proc.memory.rssMB": 8750.46, "system.proc.memory.percent": 13.62, "system.proc.cpu.threads": 157.33, "system.network.sent": 13170215, "system.network.recv": 5002213, "_wandb": true, "_timestamp": 1578856798, "_runtime": 92}
{"system.gpu.0.gpu": 42.87, "system.gpu.0.memory": 7.13, "system.gpu.0.memory_allocated": 97.42, "system.gpu.0.temp": 61.47, "system.gpu.1.gpu": 38.47, "system.gpu.1.memory": 6.47, "system.gpu.1.memory_allocated": 97.47, "system.gpu.1.temp": 64.87, "system.gpu.2.gpu": 40.4, "system.gpu.2.memory": 5.53, "system.gpu.2.memory_allocated": 97.42, "system.gpu.2.temp": 66.27, "system.gpu.3.gpu": 40.33, "system.gpu.3.memory": 6.0, "system.gpu.3.memory_allocated": 97.47, "system.gpu.3.temp": 68.53, "system.cpu": 79.45, "system.memory": 16.4, "system.disk": 1.2, "system.proc.memory.availableMB": 53687.83, "system.proc.memory.rssMB": 8723.97, "system.proc.memory.percent": 13.58, "system.proc.cpu.threads": 180.13, "system.network.sent": 13775661, "system.network.recv": 5176677, "_wandb": true, "_timestamp": 1578856828, "_runtime": 122}
{"system.gpu.0.gpu": 38.73, "system.gpu.0.memory": 6.13, "system.gpu.0.memory_allocated": 97.42, "system.gpu.0.temp": 63.0, "system.gpu.1.gpu": 35.53, "system.gpu.1.memory": 6.27, "system.gpu.1.memory_allocated": 97.47, "system.gpu.1.temp": 66.27, "system.gpu.2.gpu": 34.13, "system.gpu.2.memory": 5.2, "system.gpu.2.memory_allocated": 97.42, "system.gpu.2.temp": 66.87, "system.gpu.3.gpu": 35.53, "system.gpu.3.memory": 4.87, "system.gpu.3.memory_allocated": 97.47, "system.gpu.3.temp": 69.47, "system.cpu": 79.67, "system.memory": 16.45, "system.disk": 1.2, "system.proc.memory.availableMB": 53670.43, "system.proc.memory.rssMB": 8741.07, "system.proc.memory.percent": 13.61, "system.proc.cpu.threads": 203.8, "system.network.sent": 14296880, "system.network.recv": 5338387, "_wandb": true, "_timestamp": 1578856858, "_runtime": 152}
{"system.gpu.0.gpu": 33.67, "system.gpu.0.memory": 5.87, "system.gpu.0.memory_allocated": 97.42, "system.gpu.0.temp": 64.0, "system.gpu.1.gpu": 37.53, "system.gpu.1.memory": 5.67, "system.gpu.1.memory_allocated": 97.47, "system.gpu.1.temp": 67.13, "system.gpu.2.gpu": 32.8, "system.gpu.2.memory": 4.93, "system.gpu.2.memory_allocated": 97.42, "system.gpu.2.temp": 67.4, "system.gpu.3.gpu": 34.27, "system.gpu.3.memory": 4.47, "system.gpu.3.memory_allocated": 97.47, "system.gpu.3.temp": 69.93, "system.cpu": 79.62, "system.memory": 16.69, "system.disk": 1.2, "system.proc.memory.availableMB": 53516.53, "system.proc.memory.rssMB": 8893.2, "system.proc.memory.percent": 13.85, "system.proc.cpu.threads": 227.8, "system.network.sent": 14855434, "system.network.recv": 5506141, "_wandb": true, "_timestamp": 1578856888, "_runtime": 182}
{"system.gpu.0.gpu": 34.2, "system.gpu.0.memory": 5.2, "system.gpu.0.memory_allocated": 97.42, "system.gpu.0.temp": 64.47, "system.gpu.1.gpu": 33.87, "system.gpu.1.memory": 5.13, "system.gpu.1.memory_allocated": 97.47, "system.gpu.1.temp": 67.4, "system.gpu.2.gpu": 33.67, "system.gpu.2.memory": 4.2, "system.gpu.2.memory_allocated": 97.42, "system.gpu.2.temp": 67.6, "system.gpu.3.gpu": 35.33, "system.gpu.3.memory": 4.4, "system.gpu.3.memory_allocated": 97.47, "system.gpu.3.temp": 70.4, "system.cpu": 79.02, "system.memory": 16.67, "system.disk": 1.2, "system.proc.memory.availableMB": 53516.92, "system.proc.memory.rssMB": 8891.99, "system.proc.memory.percent": 13.84, "system.proc.cpu.threads": 250.8, "system.network.sent": 15407838, "system.network.recv": 5673037, "_wandb": true, "_timestamp": 1578856918, "_runtime": 213}
{"system.gpu.0.gpu": 36.07, "system.gpu.0.memory": 5.33, "system.gpu.0.memory_allocated": 97.42, "system.gpu.0.temp": 64.93, "system.gpu.1.gpu": 32.67, "system.gpu.1.memory": 4.93, "system.gpu.1.memory_allocated": 97.47, "system.gpu.1.temp": 67.87, "system.gpu.2.gpu": 31.27, "system.gpu.2.memory": 4.0, "system.gpu.2.memory_allocated": 97.42, "system.gpu.2.temp": 67.73, "system.gpu.3.gpu": 34.73, "system.gpu.3.memory": 4.47, "system.gpu.3.memory_allocated": 97.47, "system.gpu.3.temp": 70.73, "system.cpu": 77.83, "system.memory": 16.76, "system.disk": 1.2, "system.proc.memory.availableMB": 53463.08, "system.proc.memory.rssMB": 8946.02, "system.proc.memory.percent": 13.93, "system.proc.cpu.threads": 274.13, "system.network.sent": 19343202, "system.network.recv": 5858449, "_wandb": true, "_timestamp": 1578856949, "_runtime": 243}
{"system.gpu.0.gpu": 36.4, "system.gpu.0.memory": 6.33, "system.gpu.0.memory_allocated": 97.42, "system.gpu.0.temp": 65.0, "system.gpu.1.gpu": 33.2, "system.gpu.1.memory": 5.93, "system.gpu.1.memory_allocated": 97.47, "system.gpu.1.temp": 68.27, "system.gpu.2.gpu": 34.73, "system.gpu.2.memory": 4.93, "system.gpu.2.memory_allocated": 97.42, "system.gpu.2.temp": 68.13, "system.gpu.3.gpu": 36.13, "system.gpu.3.memory": 5.07, "system.gpu.3.memory_allocated": 97.47, "system.gpu.3.temp": 70.8, "system.cpu": 78.96, "system.memory": 16.8, "system.disk": 1.2, "system.proc.memory.availableMB": 53446.28, "system.proc.memory.rssMB": 8961.3, "system.proc.memory.percent": 13.95, "system.proc.cpu.threads": 297.0, "system.network.sent": 21694668, "system.network.recv": 6054874, "_wandb": true, "_timestamp": 1578856979, "_runtime": 273}
{"system.gpu.0.gpu": 39.33, "system.gpu.0.memory": 6.27, "system.gpu.0.memory_allocated": 97.42, "system.gpu.0.temp": 65.2, "system.gpu.1.gpu": 38.0, "system.gpu.1.memory": 6.53, "system.gpu.1.memory_allocated": 97.47, "system.gpu.1.temp": 68.27, "system.gpu.2.gpu": 37.67, "system.gpu.2.memory": 5.47, "system.gpu.2.memory_allocated": 97.42, "system.gpu.2.temp": 68.13, "system.gpu.3.gpu": 40.93, "system.gpu.3.memory": 5.87, "system.gpu.3.memory_allocated": 97.47, "system.gpu.3.temp": 70.93, "system.cpu": 79.61, "system.memory": 16.87, "system.disk": 1.2, "system.proc.memory.availableMB": 53407.22, "system.proc.memory.rssMB": 8998.25, "system.proc.memory.percent": 14.01, "system.proc.cpu.threads": 319.53, "system.network.sent": 22257979, "system.network.recv": 6223149, "_wandb": true, "_timestamp": 1578857009, "_runtime": 303}
{"system.gpu.0.gpu": 34.67, "system.gpu.0.memory": 5.53, "system.gpu.0.memory_allocated": 97.42, "system.gpu.0.temp": 65.33, "system.gpu.1.gpu": 35.2, "system.gpu.1.memory": 5.93, "system.gpu.1.memory_allocated": 97.47, "system.gpu.1.temp": 68.67, "system.gpu.2.gpu": 36.07, "system.gpu.2.memory": 5.27, "system.gpu.2.memory_allocated": 97.42, "system.gpu.2.temp": 68.33, "system.gpu.3.gpu": 34.07, "system.gpu.3.memory": 4.93, "system.gpu.3.memory_allocated": 97.47, "system.gpu.3.temp": 70.93, "system.cpu": 79.04, "system.memory": 16.85, "system.disk": 1.2, "system.proc.memory.availableMB": 53411.28, "system.proc.memory.rssMB": 8993.87, "system.proc.memory.percent": 14.0, "system.proc.cpu.threads": 342.2, "system.network.sent": 22827679, "system.network.recv": 6403968, "_wandb": true, "_timestamp": 1578857039, "_runtime": 333}
{"system.gpu.0.gpu": 35.33, "system.gpu.0.memory": 5.2, "system.gpu.0.memory_allocated": 97.42, "system.gpu.0.temp": 65.2, "system.gpu.1.gpu": 34.13, "system.gpu.1.memory": 5.4, "system.gpu.1.memory_allocated": 97.47, "system.gpu.1.temp": 68.47, "system.gpu.2.gpu": 34.53, "system.gpu.2.memory": 4.73, "system.gpu.2.memory_allocated": 97.42, "system.gpu.2.temp": 68.4, "system.gpu.3.gpu": 34.33, "system.gpu.3.memory": 4.6, "system.gpu.3.memory_allocated": 97.47, "system.gpu.3.temp": 70.93, "system.cpu": 78.87, "system.memory": 17.06, "system.disk": 1.2, "system.proc.memory.availableMB": 53279.68, "system.proc.memory.rssMB": 9124.14, "system.proc.memory.percent": 14.21, "system.proc.cpu.threads": 364.53, "system.network.sent": 23348398, "system.network.recv": 6568251, "_wandb": true, "_timestamp": 1578857069, "_runtime": 363}
{"system.gpu.0.gpu": 33.13, "system.gpu.0.memory": 5.13, "system.gpu.0.memory_allocated": 97.42, "system.gpu.0.temp": 65.33, "system.gpu.1.gpu": 32.47, "system.gpu.1.memory": 5.27, "system.gpu.1.memory_allocated": 97.47, "system.gpu.1.temp": 68.6, "system.gpu.2.gpu": 31.73, "system.gpu.2.memory": 4.33, "system.gpu.2.memory_allocated": 97.42, "system.gpu.2.temp": 68.33, "system.gpu.3.gpu": 33.67, "system.gpu.3.memory": 4.53, "system.gpu.3.memory_allocated": 97.47, "system.gpu.3.temp": 71.2, "system.cpu": 78.69, "system.memory": 17.04, "system.disk": 1.2, "system.proc.memory.availableMB": 53282.13, "system.proc.memory.rssMB": 9120.21, "system.proc.memory.percent": 14.2, "system.proc.cpu.threads": 386.87, "system.network.sent": 23856886, "system.network.recv": 6730568, "_wandb": true, "_timestamp": 1578857099, "_runtime": 393}
{"system.gpu.0.gpu": 44.13, "system.gpu.0.memory": 7.53, "system.gpu.0.memory_allocated": 97.42, "system.gpu.0.temp": 65.6, "system.gpu.1.gpu": 44.87, "system.gpu.1.memory": 7.47, "system.gpu.1.memory_allocated": 97.47, "system.gpu.1.temp": 68.73, "system.gpu.2.gpu": 43.27, "system.gpu.2.memory": 6.2, "system.gpu.2.memory_allocated": 97.42, "system.gpu.2.temp": 68.53, "system.gpu.3.gpu": 38.4, "system.gpu.3.memory": 5.73, "system.gpu.3.memory_allocated": 97.47, "system.gpu.3.temp": 71.2, "system.cpu": 78.39, "system.memory": 17.02, "system.disk": 1.2, "system.proc.memory.availableMB": 53293.9, "system.proc.memory.rssMB": 9107.61, "system.proc.memory.percent": 14.18, "system.proc.cpu.threads": 408.27, "system.network.sent": 26105949, "system.network.recv": 6909064, "_wandb": true, "_timestamp": 1578857129, "_runtime": 424}
{"system.gpu.0.gpu": 36.0, "system.gpu.0.memory": 5.4, "system.gpu.0.memory_allocated": 97.42, "system.gpu.0.temp": 65.4, "system.gpu.1.gpu": 34.87, "system.gpu.1.memory": 5.6, "system.gpu.1.memory_allocated": 97.47, "system.gpu.1.temp": 68.73, "system.gpu.2.gpu": 32.93, "system.gpu.2.memory": 4.67, "system.gpu.2.memory_allocated": 97.42, "system.gpu.2.temp": 68.33, "system.gpu.3.gpu": 35.2, "system.gpu.3.memory": 4.73, "system.gpu.3.memory_allocated": 97.47, "system.gpu.3.temp": 71.27, "system.cpu": 79.13, "system.memory": 17.02, "system.disk": 1.2, "system.proc.memory.availableMB": 53296.04, "system.proc.memory.rssMB": 9104.4, "system.proc.memory.percent": 14.17, "system.proc.cpu.threads": 429.2, "system.network.sent": 26646952, "system.network.recv": 7076917, "_wandb": true, "_timestamp": 1578857160, "_runtime": 454}
{"system.gpu.0.gpu": 35.0, "system.gpu.0.memory": 5.13, "system.gpu.0.memory_allocated": 97.42, "system.gpu.0.temp": 65.47, "system.gpu.1.gpu": 34.6, "system.gpu.1.memory": 5.2, "system.gpu.1.memory_allocated": 97.47, "system.gpu.1.temp": 68.6, "system.gpu.2.gpu": 32.93, "system.gpu.2.memory": 4.33, "system.gpu.2.memory_allocated": 97.42, "system.gpu.2.temp": 68.4, "system.gpu.3.gpu": 32.33, "system.gpu.3.memory": 4.27, "system.gpu.3.memory_allocated": 97.47, "system.gpu.3.temp": 71.2, "system.cpu": 79.22, "system.memory": 16.98, "system.disk": 1.2, "system.proc.memory.availableMB": 53324.19, "system.proc.memory.rssMB": 9076.52, "system.proc.memory.percent": 14.13, "system.proc.cpu.threads": 452.6, "system.network.sent": 27205700, "system.network.recv": 7243827, "_wandb": true, "_timestamp": 1578857190, "_runtime": 484}
{"system.gpu.0.gpu": 35.6, "system.gpu.0.memory": 5.87, "system.gpu.0.memory_allocated": 97.42, "system.gpu.0.temp": 65.4, "system.gpu.1.gpu": 36.0, "system.gpu.1.memory": 6.07, "system.gpu.1.memory_allocated": 97.47, "system.gpu.1.temp": 68.8, "system.gpu.2.gpu": 37.4, "system.gpu.2.memory": 5.13, "system.gpu.2.memory_allocated": 97.42, "system.gpu.2.temp": 68.4, "system.gpu.3.gpu": 37.0, "system.gpu.3.memory": 5.0, "system.gpu.3.memory_allocated": 97.47, "system.gpu.3.temp": 71.07, "system.cpu": 78.44, "system.memory": 17.15, "system.disk": 1.2, "system.proc.memory.availableMB": 53214.41, "system.proc.memory.rssMB": 9185.05, "system.proc.memory.percent": 14.3, "system.proc.cpu.threads": 474.4, "system.network.sent": 27710711, "system.network.recv": 7402497, "_wandb": true, "_timestamp": 1578857220, "_runtime": 514}
{"system.gpu.0.gpu": 33.47, "system.gpu.0.memory": 5.13, "system.gpu.0.memory_allocated": 97.42, "system.gpu.0.temp": 65.53, "system.gpu.1.gpu": 31.0, "system.gpu.1.memory": 5.27, "system.gpu.1.memory_allocated": 97.47, "system.gpu.1.temp": 68.67, "system.gpu.2.gpu": 33.73, "system.gpu.2.memory": 4.8, "system.gpu.2.memory_allocated": 97.42, "system.gpu.2.temp": 68.2, "system.gpu.3.gpu": 35.47, "system.gpu.3.memory": 4.73, "system.gpu.3.memory_allocated": 97.47, "system.gpu.3.temp": 71.07, "system.cpu": 78.6, "system.memory": 17.29, "system.disk": 1.2, "system.proc.memory.availableMB": 53127.15, "system.proc.memory.rssMB": 9270.97, "system.proc.memory.percent": 14.43, "system.proc.cpu.threads": 496.87, "system.network.sent": 28242216, "system.network.recv": 7566025, "_wandb": true, "_timestamp": 1578857250, "_runtime": 544}
{"system.gpu.0.gpu": 33.87, "system.gpu.0.memory": 5.2, "system.gpu.0.memory_allocated": 97.42, "system.gpu.0.temp": 65.2, "system.gpu.1.gpu": 33.67, "system.gpu.1.memory": 5.47, "system.gpu.1.memory_allocated": 97.47, "system.gpu.1.temp": 68.47, "system.gpu.2.gpu": 31.93, "system.gpu.2.memory": 4.33, "system.gpu.2.memory_allocated": 97.42, "system.gpu.2.temp": 68.27, "system.gpu.3.gpu": 32.53, "system.gpu.3.memory": 4.4, "system.gpu.3.memory_allocated": 97.47, "system.gpu.3.temp": 71.0, "system.cpu": 78.47, "system.memory": 17.39, "system.disk": 1.2, "system.proc.memory.availableMB": 53055.36, "system.proc.memory.rssMB": 9341.59, "system.proc.memory.percent": 14.54, "system.proc.cpu.threads": 518.33, "system.network.sent": 28809661, "system.network.recv": 7731952, "_wandb": true, "_timestamp": 1578857280, "_runtime": 574}
{"system.gpu.0.gpu": 38.67, "system.gpu.0.memory": 6.07, "system.gpu.0.memory_allocated": 97.42, "system.gpu.0.temp": 65.4, "system.gpu.1.gpu": 39.67, "system.gpu.1.memory": 6.0, "system.gpu.1.memory_allocated": 97.47, "system.gpu.1.temp": 68.4, "system.gpu.2.gpu": 36.73, "system.gpu.2.memory": 5.27, "system.gpu.2.memory_allocated": 97.42, "system.gpu.2.temp": 67.87, "system.gpu.3.gpu": 36.73, "system.gpu.3.memory": 5.07, "system.gpu.3.memory_allocated": 97.47, "system.gpu.3.temp": 70.93, "system.cpu": 78.67, "system.memory": 17.28, "system.disk": 1.2, "system.proc.memory.availableMB": 53139.82, "system.proc.memory.rssMB": 9256.06, "system.proc.memory.percent": 14.41, "system.proc.cpu.threads": 537.27, "system.network.sent": 29282721, "system.network.recv": 7891528, "_wandb": true, "_timestamp": 1578857310, "_runtime": 604}
{"system.gpu.0.gpu": 36.93, "system.gpu.0.memory": 5.4, "system.gpu.0.memory_allocated": 97.42, "system.gpu.0.temp": 65.33, "system.gpu.1.gpu": 34.8, "system.gpu.1.memory": 5.2, "system.gpu.1.memory_allocated": 97.47, "system.gpu.1.temp": 68.07, "system.gpu.2.gpu": 31.87, "system.gpu.2.memory": 4.2, "system.gpu.2.memory_allocated": 97.42, "system.gpu.2.temp": 68.0, "system.gpu.3.gpu": 33.47, "system.gpu.3.memory": 4.53, "system.gpu.3.memory_allocated": 97.47, "system.gpu.3.temp": 70.67, "system.cpu": 78.27, "system.memory": 17.27, "system.disk": 1.2, "system.proc.memory.availableMB": 53135.43, "system.proc.memory.rssMB": 9260.04, "system.proc.memory.percent": 14.42, "system.proc.cpu.threads": 558.0, "system.network.sent": 29813723, "system.network.recv": 8057269, "_wandb": true, "_timestamp": 1578857340, "_runtime": 635}
{"system.gpu.0.gpu": 37.53, "system.gpu.0.memory": 6.07, "system.gpu.0.memory_allocated": 97.42, "system.gpu.0.temp": 65.13, "system.gpu.1.gpu": 36.27, "system.gpu.1.memory": 5.73, "system.gpu.1.memory_allocated": 97.47, "system.gpu.1.temp": 67.8, "system.gpu.2.gpu": 35.2, "system.gpu.2.memory": 5.13, "system.gpu.2.memory_allocated": 97.42, "system.gpu.2.temp": 67.73, "system.gpu.3.gpu": 39.07, "system.gpu.3.memory": 4.87, "system.gpu.3.memory_allocated": 97.47, "system.gpu.3.temp": 70.73, "system.cpu": 77.92, "system.memory": 17.21, "system.disk": 1.2, "system.proc.memory.availableMB": 53178.38, "system.proc.memory.rssMB": 9216.86, "system.proc.memory.percent": 14.35, "system.proc.cpu.threads": 578.53, "system.network.sent": 30312363, "system.network.recv": 8212303, "_wandb": true, "_timestamp": 1578857371, "_runtime": 665}
{"system.gpu.0.gpu": 36.47, "system.gpu.0.memory": 5.93, "system.gpu.0.memory_allocated": 97.42, "system.gpu.0.temp": 65.0, "system.gpu.1.gpu": 36.33, "system.gpu.1.memory": 5.8, "system.gpu.1.memory_allocated": 97.47, "system.gpu.1.temp": 67.93, "system.gpu.2.gpu": 36.4, "system.gpu.2.memory": 5.4, "system.gpu.2.memory_allocated": 97.42, "system.gpu.2.temp": 67.67, "system.gpu.3.gpu": 38.07, "system.gpu.3.memory": 5.27, "system.gpu.3.memory_allocated": 97.47, "system.gpu.3.temp": 70.6, "system.cpu": 77.99, "system.memory": 17.38, "system.disk": 1.2, "system.proc.memory.availableMB": 53072.54, "system.proc.memory.rssMB": 9321.97, "system.proc.memory.percent": 14.51, "system.proc.cpu.threads": 599.6, "system.network.sent": 30859226, "system.network.recv": 8389078, "_wandb": true, "_timestamp": 1578857401, "_runtime": 695}
{"system.gpu.0.gpu": 36.2, "system.gpu.0.memory": 5.6, "system.gpu.0.memory_allocated": 97.42, "system.gpu.0.temp": 64.67, "system.gpu.1.gpu": 38.4, "system.gpu.1.memory": 5.33, "system.gpu.1.memory_allocated": 97.47, "system.gpu.1.temp": 67.73, "system.gpu.2.gpu": 32.53, "system.gpu.2.memory": 4.67, "system.gpu.2.memory_allocated": 97.42, "system.gpu.2.temp": 67.6, "system.gpu.3.gpu": 36.4, "system.gpu.3.memory": 5.07, "system.gpu.3.memory_allocated": 97.47, "system.gpu.3.temp": 70.53, "system.cpu": 77.58, "system.memory": 17.4, "system.disk": 1.2, "system.proc.memory.availableMB": 53063.4, "system.proc.memory.rssMB": 9330.62, "system.proc.memory.percent": 14.53, "system.proc.cpu.threads": 618.87, "system.network.sent": 31364818, "system.network.recv": 8552723, "_wandb": true, "_timestamp": 1578857431, "_runtime": 725}
{"system.gpu.0.gpu": 35.4, "system.gpu.0.memory": 5.8, "system.gpu.0.memory_allocated": 97.42, "system.gpu.0.temp": 64.67, "system.gpu.1.gpu": 34.53, "system.gpu.1.memory": 5.8, "system.gpu.1.memory_allocated": 97.47, "system.gpu.1.temp": 67.87, "system.gpu.2.gpu": 33.67, "system.gpu.2.memory": 4.73, "system.gpu.2.memory_allocated": 97.42, "system.gpu.2.temp": 67.47, "system.gpu.3.gpu": 33.73, "system.gpu.3.memory": 4.8, "system.gpu.3.memory_allocated": 97.47, "system.gpu.3.temp": 70.47, "system.cpu": 77.57, "system.memory": 17.32, "system.disk": 1.2, "system.proc.memory.availableMB": 53105.93, "system.proc.memory.rssMB": 9286.25, "system.proc.memory.percent": 14.46, "system.proc.cpu.threads": 638.93, "system.network.sent": 31871094, "system.network.recv": 8713910, "_wandb": true, "_timestamp": 1578857461, "_runtime": 755}
{"system.gpu.0.gpu": 38.87, "system.gpu.0.memory": 5.93, "system.gpu.0.memory_allocated": 97.42, "system.gpu.0.temp": 64.73, "system.gpu.1.gpu": 37.8, "system.gpu.1.memory": 6.13, "system.gpu.1.memory_allocated": 97.47, "system.gpu.1.temp": 67.73, "system.gpu.2.gpu": 37.0, "system.gpu.2.memory": 5.0, "system.gpu.2.memory_allocated": 97.42, "system.gpu.2.temp": 67.53, "system.gpu.3.gpu": 36.73, "system.gpu.3.memory": 5.13, "system.gpu.3.memory_allocated": 97.47, "system.gpu.3.temp": 70.2, "system.cpu": 77.59, "system.memory": 17.35, "system.disk": 1.2, "system.proc.memory.availableMB": 53089.4, "system.proc.memory.rssMB": 9301.41, "system.proc.memory.percent": 14.48, "system.proc.cpu.threads": 657.87, "system.network.sent": 32357666, "system.network.recv": 8877686, "_wandb": true, "_timestamp": 1578857491, "_runtime": 785}
{"system.gpu.0.gpu": 33.6, "system.gpu.0.memory": 5.33, "system.gpu.0.memory_allocated": 97.42, "system.gpu.0.temp": 64.67, "system.gpu.1.gpu": 33.47, "system.gpu.1.memory": 5.13, "system.gpu.1.memory_allocated": 97.47, "system.gpu.1.temp": 67.8, "system.gpu.2.gpu": 32.47, "system.gpu.2.memory": 4.47, "system.gpu.2.memory_allocated": 97.42, "system.gpu.2.temp": 67.33, "system.gpu.3.gpu": 32.73, "system.gpu.3.memory": 4.67, "system.gpu.3.memory_allocated": 97.47, "system.gpu.3.temp": 70.33, "system.cpu": 78.3, "system.memory": 17.39, "system.disk": 1.2, "system.proc.memory.availableMB": 53063.87, "system.proc.memory.rssMB": 9326.93, "system.proc.memory.percent": 14.52, "system.proc.cpu.threads": 675.13, "system.network.sent": 32901355, "system.network.recv": 9037743, "_wandb": true, "_timestamp": 1578857521, "_runtime": 815}
{"system.gpu.0.gpu": 37.33, "system.gpu.0.memory": 6.27, "system.gpu.0.memory_allocated": 97.42, "system.gpu.0.temp": 64.87, "system.gpu.1.gpu": 37.33, "system.gpu.1.memory": 5.93, "system.gpu.1.memory_allocated": 97.47, "system.gpu.1.temp": 67.73, "system.gpu.2.gpu": 32.2, "system.gpu.2.memory": 4.67, "system.gpu.2.memory_allocated": 97.42, "system.gpu.2.temp": 67.47, "system.gpu.3.gpu": 34.8, "system.gpu.3.memory": 4.8, "system.gpu.3.memory_allocated": 97.47, "system.gpu.3.temp": 70.33, "system.cpu": 77.75, "system.memory": 17.47, "system.disk": 1.2, "system.proc.memory.availableMB": 53009.11, "system.proc.memory.rssMB": 9379.74, "system.proc.memory.percent": 14.6, "system.proc.cpu.threads": 694.6, "system.network.sent": 33424060, "system.network.recv": 9191921, "_wandb": true, "_timestamp": 1578857551, "_runtime": 845}
{"system.gpu.0.gpu": 31.47, "system.gpu.0.memory": 4.87, "system.gpu.0.memory_allocated": 97.42, "system.gpu.0.temp": 64.87, "system.gpu.1.gpu": 33.33, "system.gpu.1.memory": 4.93, "system.gpu.1.memory_allocated": 97.47, "system.gpu.1.temp": 67.73, "system.gpu.2.gpu": 32.27, "system.gpu.2.memory": 4.4, "system.gpu.2.memory_allocated": 97.42, "system.gpu.2.temp": 67.53, "system.gpu.3.gpu": 31.93, "system.gpu.3.memory": 4.0, "system.gpu.3.memory_allocated": 97.47, "system.gpu.3.temp": 70.33, "system.cpu": 78.75, "system.memory": 17.73, "system.disk": 1.2, "system.proc.memory.availableMB": 52840.18, "system.proc.memory.rssMB": 9547.96, "system.proc.memory.percent": 14.86, "system.proc.cpu.threads": 713.93, "system.network.sent": 33947610, "system.network.recv": 9352827, "_wandb": true, "_timestamp": 1578857581, "_runtime": 876}
{"system.gpu.0.gpu": 34.33, "system.gpu.0.memory": 5.47, "system.gpu.0.memory_allocated": 97.42, "system.gpu.0.temp": 65.13, "system.gpu.1.gpu": 35.0, "system.gpu.1.memory": 6.2, "system.gpu.1.memory_allocated": 97.47, "system.gpu.1.temp": 67.93, "system.gpu.2.gpu": 35.87, "system.gpu.2.memory": 5.2, "system.gpu.2.memory_allocated": 97.42, "system.gpu.2.temp": 67.47, "system.gpu.3.gpu": 37.6, "system.gpu.3.memory": 5.2, "system.gpu.3.memory_allocated": 97.47, "system.gpu.3.temp": 70.53, "system.cpu": 77.71, "system.memory": 17.54, "system.disk": 1.2, "system.proc.memory.availableMB": 52964.31, "system.proc.memory.rssMB": 9424.48, "system.proc.memory.percent": 14.67, "system.proc.cpu.threads": 735.87, "system.network.sent": 34478245, "system.network.recv": 9517926, "_wandb": true, "_timestamp": 1578857612, "_runtime": 906}
{"system.gpu.0.gpu": 33.93, "system.gpu.0.memory": 4.87, "system.gpu.0.memory_allocated": 97.42, "system.gpu.0.temp": 64.93, "system.gpu.1.gpu": 31.8, "system.gpu.1.memory": 4.8, "system.gpu.1.memory_allocated": 97.47, "system.gpu.1.temp": 67.73, "system.gpu.2.gpu": 32.6, "system.gpu.2.memory": 4.6, "system.gpu.2.memory_allocated": 97.42, "system.gpu.2.temp": 67.73, "system.gpu.3.gpu": 30.4, "system.gpu.3.memory": 4.0, "system.gpu.3.memory_allocated": 97.47, "system.gpu.3.temp": 70.4, "system.cpu": 77.53, "system.memory": 17.43, "system.disk": 1.2, "system.proc.memory.availableMB": 53035.89, "system.proc.memory.rssMB": 9352.05, "system.proc.memory.percent": 14.56, "system.proc.cpu.threads": 757.87, "system.network.sent": 35022985, "system.network.recv": 9681324, "_wandb": true, "_timestamp": 1578857642, "_runtime": 936}
{"system.gpu.0.gpu": 37.53, "system.gpu.0.memory": 6.33, "system.gpu.0.memory_allocated": 97.42, "system.gpu.0.temp": 65.4, "system.gpu.1.gpu": 40.13, "system.gpu.1.memory": 6.53, "system.gpu.1.memory_allocated": 97.47, "system.gpu.1.temp": 68.0, "system.gpu.2.gpu": 37.47, "system.gpu.2.memory": 5.13, "system.gpu.2.memory_allocated": 97.42, "system.gpu.2.temp": 67.53, "system.gpu.3.gpu": 41.27, "system.gpu.3.memory": 5.6, "system.gpu.3.memory_allocated": 97.47, "system.gpu.3.temp": 70.6, "system.cpu": 77.14, "system.memory": 17.56, "system.disk": 1.2, "system.proc.memory.availableMB": 52949.27, "system.proc.memory.rssMB": 9437.48, "system.proc.memory.percent": 14.69, "system.proc.cpu.threads": 775.27, "system.network.sent": 35505817, "system.network.recv": 9833864, "_wandb": true, "_timestamp": 1578857672, "_runtime": 966}
{"system.gpu.0.gpu": 34.33, "system.gpu.0.memory": 5.13, "system.gpu.0.memory_allocated": 97.42, "system.gpu.0.temp": 65.13, "system.gpu.1.gpu": 35.67, "system.gpu.1.memory": 5.53, "system.gpu.1.memory_allocated": 97.47, "system.gpu.1.temp": 67.93, "system.gpu.2.gpu": 30.8, "system.gpu.2.memory": 4.07, "system.gpu.2.memory_allocated": 97.42, "system.gpu.2.temp": 67.8, "system.gpu.3.gpu": 34.4, "system.gpu.3.memory": 4.53, "system.gpu.3.memory_allocated": 97.47, "system.gpu.3.temp": 70.47, "system.cpu": 77.78, "system.memory": 17.51, "system.disk": 1.2, "system.proc.memory.availableMB": 52983.27, "system.proc.memory.rssMB": 9402.3, "system.proc.memory.percent": 14.64, "system.proc.cpu.threads": 794.33, "system.network.sent": 35999864, "system.network.recv": 9997468, "_wandb": true, "_timestamp": 1578857702, "_runtime": 996}
{"system.gpu.0.gpu": 38.47, "system.gpu.0.memory": 6.0, "system.gpu.0.memory_allocated": 97.42, "system.gpu.0.temp": 65.33, "system.gpu.1.gpu": 35.87, "system.gpu.1.memory": 5.93, "system.gpu.1.memory_allocated": 97.47, "system.gpu.1.temp": 67.87, "system.gpu.2.gpu": 33.6, "system.gpu.2.memory": 4.93, "system.gpu.2.memory_allocated": 97.42, "system.gpu.2.temp": 67.73, "system.gpu.3.gpu": 35.33, "system.gpu.3.memory": 5.0, "system.gpu.3.memory_allocated": 97.47, "system.gpu.3.temp": 70.53, "system.cpu": 77.61, "system.memory": 17.78, "system.disk": 1.2, "system.proc.memory.availableMB": 52814.84, "system.proc.memory.rssMB": 9569.48, "system.proc.memory.percent": 14.9, "system.proc.cpu.threads": 813.6, "system.network.sent": 36483969, "system.network.recv": 10154585, "_wandb": true, "_timestamp": 1578857732, "_runtime": 1026}
{"system.gpu.0.gpu": 37.87, "system.gpu.0.memory": 5.8, "system.gpu.0.memory_allocated": 97.42, "system.gpu.0.temp": 65.4, "system.gpu.1.gpu": 35.2, "system.gpu.1.memory": 5.93, "system.gpu.1.memory_allocated": 97.47, "system.gpu.1.temp": 68.0, "system.gpu.2.gpu": 36.93, "system.gpu.2.memory": 5.27, "system.gpu.2.memory_allocated": 97.42, "system.gpu.2.temp": 67.93, "system.gpu.3.gpu": 36.0, "system.gpu.3.memory": 5.07, "system.gpu.3.memory_allocated": 97.47, "system.gpu.3.temp": 70.8, "system.cpu": 77.89, "system.memory": 17.61, "system.disk": 1.2, "system.proc.memory.availableMB": 52915.2, "system.proc.memory.rssMB": 9468.6, "system.proc.memory.percent": 14.74, "system.proc.cpu.threads": 833.07, "system.network.sent": 37040221, "system.network.recv": 10315338, "_wandb": true, "_timestamp": 1578857762, "_runtime": 1056}
{"system.gpu.0.gpu": 35.33, "system.gpu.0.memory": 5.33, "system.gpu.0.memory_allocated": 97.42, "system.gpu.0.temp": 65.4, "system.gpu.1.gpu": 35.93, "system.gpu.1.memory": 5.87, "system.gpu.1.memory_allocated": 97.47, "system.gpu.1.temp": 67.93, "system.gpu.2.gpu": 32.73, "system.gpu.2.memory": 4.67, "system.gpu.2.memory_allocated": 97.42, "system.gpu.2.temp": 67.8, "system.gpu.3.gpu": 34.27, "system.gpu.3.memory": 4.8, "system.gpu.3.memory_allocated": 97.47, "system.gpu.3.temp": 70.6, "system.cpu": 77.95, "system.memory": 17.57, "system.disk": 1.2, "system.proc.memory.availableMB": 52949.48, "system.proc.memory.rssMB": 9433.78, "system.proc.memory.percent": 14.69, "system.proc.cpu.threads": 852.07, "system.network.sent": 37537380, "system.network.recv": 10474573, "_wandb": true, "_timestamp": 1578857792, "_runtime": 1087}
{"system.gpu.0.gpu": 31.6, "system.gpu.0.memory": 5.4, "system.gpu.0.memory_allocated": 97.42, "system.gpu.0.temp": 65.6, "system.gpu.1.gpu": 33.6, "system.gpu.1.memory": 5.47, "system.gpu.1.memory_allocated": 97.47, "system.gpu.1.temp": 68.0, "system.gpu.2.gpu": 33.27, "system.gpu.2.memory": 4.4, "system.gpu.2.memory_allocated": 97.42, "system.gpu.2.temp": 68.0, "system.gpu.3.gpu": 32.33, "system.gpu.3.memory": 4.53, "system.gpu.3.memory_allocated": 97.47, "system.gpu.3.temp": 70.73, "system.cpu": 78.38, "system.memory": 17.62, "system.disk": 1.2, "system.proc.memory.availableMB": 52910.32, "system.proc.memory.rssMB": 9472.79, "system.proc.memory.percent": 14.75, "system.proc.cpu.threads": 871.67, "system.network.sent": 38044949, "system.network.recv": 10631740, "_wandb": true, "_timestamp": 1578857823, "_runtime": 1117}
{"system.gpu.0.gpu": 33.87, "system.gpu.0.memory": 5.4, "system.gpu.0.memory_allocated": 97.42, "system.gpu.0.temp": 65.47, "system.gpu.1.gpu": 34.33, "system.gpu.1.memory": 5.4, "system.gpu.1.memory_allocated": 97.47, "system.gpu.1.temp": 68.0, "system.gpu.2.gpu": 30.93, "system.gpu.2.memory": 4.27, "system.gpu.2.memory_allocated": 97.42, "system.gpu.2.temp": 68.07, "system.gpu.3.gpu": 32.13, "system.gpu.3.memory": 4.47, "system.gpu.3.memory_allocated": 97.47, "system.gpu.3.temp": 70.53, "system.cpu": 78.53, "system.memory": 17.75, "system.disk": 1.2, "system.proc.memory.availableMB": 52823.56, "system.proc.memory.rssMB": 9559.01, "system.proc.memory.percent": 14.88, "system.proc.cpu.threads": 890.13, "system.network.sent": 38561715, "system.network.recv": 10786974, "_wandb": true, "_timestamp": 1578857853, "_runtime": 1147}
{"system.gpu.0.gpu": 32.4, "system.gpu.0.memory": 5.0, "system.gpu.0.memory_allocated": 97.42, "system.gpu.0.temp": 65.27, "system.gpu.1.gpu": 30.67, "system.gpu.1.memory": 5.0, "system.gpu.1.memory_allocated": 97.47, "system.gpu.1.temp": 67.93, "system.gpu.2.gpu": 29.4, "system.gpu.2.memory": 4.07, "system.gpu.2.memory_allocated": 97.42, "system.gpu.2.temp": 67.8, "system.gpu.3.gpu": 30.2, "system.gpu.3.memory": 4.07, "system.gpu.3.memory_allocated": 97.47, "system.gpu.3.temp": 70.53, "system.cpu": 75.79, "system.memory": 17.77, "system.disk": 1.2, "system.proc.memory.availableMB": 52821.87, "system.proc.memory.rssMB": 9559.21, "system.proc.memory.percent": 14.88, "system.proc.cpu.threads": 905.4, "system.network.sent": 44212729, "system.network.recv": 12703351, "_wandb": true, "_timestamp": 1578857883, "_runtime": 1177}
{"system.gpu.0.gpu": 40.53, "system.gpu.0.memory": 6.6, "system.gpu.0.memory_allocated": 97.42, "system.gpu.0.temp": 65.27, "system.gpu.1.gpu": 40.07, "system.gpu.1.memory": 6.53, "system.gpu.1.memory_allocated": 97.47, "system.gpu.1.temp": 68.0, "system.gpu.2.gpu": 40.2, "system.gpu.2.memory": 5.6, "system.gpu.2.memory_allocated": 97.42, "system.gpu.2.temp": 67.73, "system.gpu.3.gpu": 37.6, "system.gpu.3.memory": 5.2, "system.gpu.3.memory_allocated": 97.47, "system.gpu.3.temp": 70.6, "system.cpu": 76.29, "system.memory": 17.89, "system.disk": 1.2, "system.proc.memory.availableMB": 52737.0, "system.proc.memory.rssMB": 9642.77, "system.proc.memory.percent": 15.01, "system.proc.cpu.threads": 921.67, "system.network.sent": 46445364, "system.network.recv": 12882585, "_wandb": true, "_timestamp": 1578857913, "_runtime": 1207}
{"system.gpu.0.gpu": 33.87, "system.gpu.0.memory": 5.27, "system.gpu.0.memory_allocated": 97.42, "system.gpu.0.temp": 65.07, "system.gpu.1.gpu": 34.2, "system.gpu.1.memory": 5.13, "system.gpu.1.memory_allocated": 97.47, "system.gpu.1.temp": 67.93, "system.gpu.2.gpu": 35.27, "system.gpu.2.memory": 4.8, "system.gpu.2.memory_allocated": 97.42, "system.gpu.2.temp": 67.53, "system.gpu.3.gpu": 33.8, "system.gpu.3.memory": 4.6, "system.gpu.3.memory_allocated": 97.47, "system.gpu.3.temp": 70.47, "system.cpu": 76.72, "system.memory": 17.87, "system.disk": 1.2, "system.proc.memory.availableMB": 52753.93, "system.proc.memory.rssMB": 9624.56, "system.proc.memory.percent": 14.98, "system.proc.cpu.threads": 941.2, "system.network.sent": 48657165, "system.network.recv": 13061132, "_wandb": true, "_timestamp": 1578857943, "_runtime": 1237}
{"system.gpu.0.gpu": 38.4, "system.gpu.0.memory": 6.13, "system.gpu.0.memory_allocated": 97.42, "system.gpu.0.temp": 65.0, "system.gpu.1.gpu": 36.6, "system.gpu.1.memory": 5.87, "system.gpu.1.memory_allocated": 97.47, "system.gpu.1.temp": 67.87, "system.gpu.2.gpu": 35.13, "system.gpu.2.memory": 4.93, "system.gpu.2.memory_allocated": 97.42, "system.gpu.2.temp": 67.47, "system.gpu.3.gpu": 35.8, "system.gpu.3.memory": 5.13, "system.gpu.3.memory_allocated": 97.47, "system.gpu.3.temp": 70.53, "system.cpu": 77.97, "system.memory": 17.94, "system.disk": 1.2, "system.proc.memory.availableMB": 52701.97, "system.proc.memory.rssMB": 9674.77, "system.proc.memory.percent": 15.06, "system.proc.cpu.threads": 957.73, "system.network.sent": 49148917, "system.network.recv": 13218748, "_wandb": true, "_timestamp": 1578857973, "_runtime": 1267}
{"system.gpu.0.gpu": 33.53, "system.gpu.0.memory": 5.33, "system.gpu.0.memory_allocated": 97.42, "system.gpu.0.temp": 64.93, "system.gpu.1.gpu": 35.67, "system.gpu.1.memory": 5.2, "system.gpu.1.memory_allocated": 97.47, "system.gpu.1.temp": 67.8, "system.gpu.2.gpu": 31.07, "system.gpu.2.memory": 4.27, "system.gpu.2.memory_allocated": 97.42, "system.gpu.2.temp": 67.53, "system.gpu.3.gpu": 30.73, "system.gpu.3.memory": 4.2, "system.gpu.3.memory_allocated": 97.47, "system.gpu.3.temp": 70.27, "system.cpu": 77.21, "system.memory": 17.85, "system.disk": 1.2, "system.proc.memory.availableMB": 52771.96, "system.proc.memory.rssMB": 9604.61, "system.proc.memory.percent": 14.95, "system.proc.cpu.threads": 976.33, "system.network.sent": 49684072, "system.network.recv": 13372341, "_wandb": true, "_timestamp": 1578858003, "_runtime": 1297}
{"system.gpu.0.gpu": 33.8, "system.gpu.0.memory": 4.93, "system.gpu.0.memory_allocated": 97.42, "system.gpu.0.temp": 64.93, "system.gpu.1.gpu": 31.87, "system.gpu.1.memory": 5.07, "system.gpu.1.memory_allocated": 97.47, "system.gpu.1.temp": 67.67, "system.gpu.2.gpu": 30.93, "system.gpu.2.memory": 4.13, "system.gpu.2.memory_allocated": 97.42, "system.gpu.2.temp": 67.27, "system.gpu.3.gpu": 32.87, "system.gpu.3.memory": 4.47, "system.gpu.3.memory_allocated": 97.47, "system.gpu.3.temp": 70.33, "system.cpu": 77.18, "system.memory": 17.82, "system.disk": 1.2, "system.proc.memory.availableMB": 52782.51, "system.proc.memory.rssMB": 9593.14, "system.proc.memory.percent": 14.94, "system.proc.cpu.threads": 993.33, "system.network.sent": 50202787, "system.network.recv": 13534117, "_wandb": true, "_timestamp": 1578858034, "_runtime": 1328}
{"system.gpu.0.gpu": 36.6, "system.gpu.0.memory": 5.87, "system.gpu.0.memory_allocated": 97.42, "system.gpu.0.temp": 64.93, "system.gpu.1.gpu": 36.73, "system.gpu.1.memory": 6.07, "system.gpu.1.memory_allocated": 97.47, "system.gpu.1.temp": 67.73, "system.gpu.2.gpu": 37.6, "system.gpu.2.memory": 5.47, "system.gpu.2.memory_allocated": 97.42, "system.gpu.2.temp": 67.53, "system.gpu.3.gpu": 36.8, "system.gpu.3.memory": 5.13, "system.gpu.3.memory_allocated": 97.47, "system.gpu.3.temp": 70.27, "system.cpu": 78.16, "system.memory": 17.91, "system.disk": 1.2, "system.proc.memory.availableMB": 52733.63, "system.proc.memory.rssMB": 9643.07, "system.proc.memory.percent": 15.01, "system.proc.cpu.threads": 1010.0, "system.network.sent": 50671627, "system.network.recv": 13685042, "_wandb": true, "_timestamp": 1578858064, "_runtime": 1358}
{"system.gpu.0.gpu": 28.93, "system.gpu.0.memory": 4.67, "system.gpu.0.memory_allocated": 97.42, "system.gpu.0.temp": 64.8, "system.gpu.1.gpu": 29.4, "system.gpu.1.memory": 4.67, "system.gpu.1.memory_allocated": 97.47, "system.gpu.1.temp": 67.8, "system.gpu.2.gpu": 29.93, "system.gpu.2.memory": 4.27, "system.gpu.2.memory_allocated": 97.42, "system.gpu.2.temp": 67.27, "system.gpu.3.gpu": 28.8, "system.gpu.3.memory": 4.2, "system.gpu.3.memory_allocated": 97.47, "system.gpu.3.temp": 70.2, "system.cpu": 75.46, "system.memory": 17.76, "system.disk": 1.2, "system.proc.memory.availableMB": 52823.78, "system.proc.memory.rssMB": 9552.27, "system.proc.memory.percent": 14.87, "system.proc.cpu.threads": 1029.93, "system.network.sent": 56329370, "system.network.recv": 15608653, "_wandb": true, "_timestamp": 1578858094, "_runtime": 1388}
{"system.gpu.0.gpu": 33.93, "system.gpu.0.memory": 5.27, "system.gpu.0.memory_allocated": 97.42, "system.gpu.0.temp": 64.87, "system.gpu.1.gpu": 31.33, "system.gpu.1.memory": 5.2, "system.gpu.1.memory_allocated": 97.47, "system.gpu.1.temp": 67.6, "system.gpu.2.gpu": 35.6, "system.gpu.2.memory": 4.8, "system.gpu.2.memory_allocated": 97.42, "system.gpu.2.temp": 67.53, "system.gpu.3.gpu": 34.4, "system.gpu.3.memory": 4.27, "system.gpu.3.memory_allocated": 97.47, "system.gpu.3.temp": 70.13, "system.cpu": 77.94, "system.memory": 17.81, "system.disk": 1.2, "system.proc.memory.availableMB": 52792.87, "system.proc.memory.rssMB": 9580.74, "system.proc.memory.percent": 14.92, "system.proc.cpu.threads": 1048.07, "system.network.sent": 56807152, "system.network.recv": 15762258, "_wandb": true, "_timestamp": 1578858124, "_runtime": 1418}
{"system.gpu.0.gpu": 35.4, "system.gpu.0.memory": 5.33, "system.gpu.0.memory_allocated": 97.42, "system.gpu.0.temp": 65.0, "system.gpu.1.gpu": 35.13, "system.gpu.1.memory": 5.4, "system.gpu.1.memory_allocated": 97.47, "system.gpu.1.temp": 67.8, "system.gpu.2.gpu": 34.33, "system.gpu.2.memory": 4.53, "system.gpu.2.memory_allocated": 97.42, "system.gpu.2.temp": 67.33, "system.gpu.3.gpu": 34.8, "system.gpu.3.memory": 4.6, "system.gpu.3.memory_allocated": 97.47, "system.gpu.3.temp": 70.2, "system.cpu": 77.09, "system.memory": 17.87, "system.disk": 1.2, "system.proc.memory.availableMB": 52760.88, "system.proc.memory.rssMB": 9612.19, "system.proc.memory.percent": 14.96, "system.proc.cpu.threads": 1065.33, "system.network.sent": 57301887, "system.network.recv": 15931247, "_wandb": true, "_timestamp": 1578858154, "_runtime": 1448}
{"system.gpu.0.gpu": 37.47, "system.gpu.0.memory": 6.0, "system.gpu.0.memory_allocated": 97.42, "system.gpu.0.temp": 65.0, "system.gpu.1.gpu": 38.87, "system.gpu.1.memory": 6.13, "system.gpu.1.memory_allocated": 97.47, "system.gpu.1.temp": 67.8, "system.gpu.2.gpu": 39.27, "system.gpu.2.memory": 5.33, "system.gpu.2.memory_allocated": 97.42, "system.gpu.2.temp": 67.53, "system.gpu.3.gpu": 37.07, "system.gpu.3.memory": 5.13, "system.gpu.3.memory_allocated": 97.47, "system.gpu.3.temp": 70.27, "system.cpu": 76.65, "system.memory": 17.77, "system.disk": 1.2, "system.proc.memory.availableMB": 52817.35, "system.proc.memory.rssMB": 9555.32, "system.proc.memory.percent": 14.88, "system.proc.cpu.threads": 1082.73, "system.network.sent": 59596661, "system.network.recv": 16113748, "_wandb": true, "_timestamp": 1578858184, "_runtime": 1478}
{"system.gpu.0.gpu": 31.67, "system.gpu.0.memory": 4.8, "system.gpu.0.memory_allocated": 97.42, "system.gpu.0.temp": 64.93, "system.gpu.1.gpu": 33.67, "system.gpu.1.memory": 4.8, "system.gpu.1.memory_allocated": 97.47, "system.gpu.1.temp": 67.8, "system.gpu.2.gpu": 30.4, "system.gpu.2.memory": 3.93, "system.gpu.2.memory_allocated": 97.42, "system.gpu.2.temp": 67.47, "system.gpu.3.gpu": 33.53, "system.gpu.3.memory": 4.67, "system.gpu.3.memory_allocated": 97.47, "system.gpu.3.temp": 70.27, "system.cpu": 77.62, "system.memory": 17.89, "system.disk": 1.2, "system.proc.memory.availableMB": 52745.86, "system.proc.memory.rssMB": 9625.88, "system.proc.memory.percent": 14.99, "system.proc.cpu.threads": 1101.47, "system.network.sent": 60123691, "system.network.recv": 16271702, "_wandb": true, "_timestamp": 1578858214, "_runtime": 1508}
{"system.gpu.0.gpu": 34.0, "system.gpu.0.memory": 5.6, "system.gpu.0.memory_allocated": 97.42, "system.gpu.0.temp": 65.0, "system.gpu.1.gpu": 32.67, "system.gpu.1.memory": 5.73, "system.gpu.1.memory_allocated": 97.47, "system.gpu.1.temp": 67.73, "system.gpu.2.gpu": 31.6, "system.gpu.2.memory": 4.47, "system.gpu.2.memory_allocated": 97.42, "system.gpu.2.temp": 67.4, "system.gpu.3.gpu": 33.07, "system.gpu.3.memory": 4.73, "system.gpu.3.memory_allocated": 97.47, "system.gpu.3.temp": 70.53, "system.cpu": 77.2, "system.memory": 17.91, "system.disk": 1.2, "system.proc.memory.availableMB": 52726.2, "system.proc.memory.rssMB": 9644.78, "system.proc.memory.percent": 15.02, "system.proc.cpu.threads": 1122.13, "system.network.sent": 60605819, "system.network.recv": 16421443, "_wandb": true, "_timestamp": 1578858244, "_runtime": 1539}
{"system.gpu.0.gpu": 35.6, "system.gpu.0.memory": 5.6, "system.gpu.0.memory_allocated": 97.42, "system.gpu.0.temp": 64.87, "system.gpu.1.gpu": 35.53, "system.gpu.1.memory": 5.53, "system.gpu.1.memory_allocated": 97.47, "system.gpu.1.temp": 67.8, "system.gpu.2.gpu": 33.73, "system.gpu.2.memory": 4.8, "system.gpu.2.memory_allocated": 97.42, "system.gpu.2.temp": 67.6, "system.gpu.3.gpu": 33.0, "system.gpu.3.memory": 4.67, "system.gpu.3.memory_allocated": 97.47, "system.gpu.3.temp": 70.27, "system.cpu": 77.27, "system.memory": 17.9, "system.disk": 1.2, "system.proc.memory.availableMB": 52732.43, "system.proc.memory.rssMB": 9638.65, "system.proc.memory.percent": 15.01, "system.proc.cpu.threads": 1140.67, "system.network.sent": 61122426, "system.network.recv": 16581164, "_wandb": true, "_timestamp": 1578858275, "_runtime": 1569}
{"system.gpu.0.gpu": 34.6, "system.gpu.0.memory": 5.47, "system.gpu.0.memory_allocated": 97.42, "system.gpu.0.temp": 64.93, "system.gpu.1.gpu": 35.13, "system.gpu.1.memory": 5.93, "system.gpu.1.memory_allocated": 97.47, "system.gpu.1.temp": 67.87, "system.gpu.2.gpu": 35.4, "system.gpu.2.memory": 4.93, "system.gpu.2.memory_allocated": 97.42, "system.gpu.2.temp": 67.53, "system.gpu.3.gpu": 35.53, "system.gpu.3.memory": 4.87, "system.gpu.3.memory_allocated": 97.47, "system.gpu.3.temp": 70.53, "system.cpu": 77.39, "system.memory": 17.93, "system.disk": 1.2, "system.proc.memory.availableMB": 52715.17, "system.proc.memory.rssMB": 9654.47, "system.proc.memory.percent": 15.03, "system.proc.cpu.threads": 1159.0, "system.network.sent": 61634495, "system.network.recv": 16740771, "_wandb": true, "_timestamp": 1578858305, "_runtime": 1599}
{"system.gpu.0.gpu": 34.07, "system.gpu.0.memory": 5.53, "system.gpu.0.memory_allocated": 97.42, "system.gpu.0.temp": 64.8, "system.gpu.1.gpu": 34.4, "system.gpu.1.memory": 5.53, "system.gpu.1.memory_allocated": 97.47, "system.gpu.1.temp": 67.87, "system.gpu.2.gpu": 33.6, "system.gpu.2.memory": 4.47, "system.gpu.2.memory_allocated": 97.42, "system.gpu.2.temp": 67.73, "system.gpu.3.gpu": 34.87, "system.gpu.3.memory": 4.73, "system.gpu.3.memory_allocated": 97.47, "system.gpu.3.temp": 70.53, "system.cpu": 76.68, "system.memory": 18.02, "system.disk": 1.2, "system.proc.memory.availableMB": 52658.6, "system.proc.memory.rssMB": 9711.04, "system.proc.memory.percent": 15.12, "system.proc.cpu.threads": 1173.93, "system.network.sent": 62192680, "system.network.recv": 16903460, "_wandb": true, "_timestamp": 1578858335, "_runtime": 1629}
{"system.gpu.0.gpu": 38.07, "system.gpu.0.memory": 6.0, "system.gpu.0.memory_allocated": 97.42, "system.gpu.0.temp": 65.2, "system.gpu.1.gpu": 37.4, "system.gpu.1.memory": 6.33, "system.gpu.1.memory_allocated": 97.47, "system.gpu.1.temp": 67.93, "system.gpu.2.gpu": 37.73, "system.gpu.2.memory": 5.4, "system.gpu.2.memory_allocated": 97.42, "system.gpu.2.temp": 67.87, "system.gpu.3.gpu": 35.53, "system.gpu.3.memory": 5.4, "system.gpu.3.memory_allocated": 97.47, "system.gpu.3.temp": 70.6, "system.cpu": 77.72, "system.memory": 17.97, "system.disk": 1.2, "system.proc.memory.availableMB": 52695.44, "system.proc.memory.rssMB": 9673.81, "system.proc.memory.percent": 15.06, "system.proc.cpu.threads": 1188.6, "system.network.sent": 62712053, "system.network.recv": 17071146, "_wandb": true, "_timestamp": 1578858365, "_runtime": 1659}
{"system.gpu.0.gpu": 35.73, "system.gpu.0.memory": 5.53, "system.gpu.0.memory_allocated": 97.42, "system.gpu.0.temp": 65.4, "system.gpu.1.gpu": 36.53, "system.gpu.1.memory": 5.93, "system.gpu.1.memory_allocated": 97.47, "system.gpu.1.temp": 68.0, "system.gpu.2.gpu": 35.53, "system.gpu.2.memory": 4.87, "system.gpu.2.memory_allocated": 97.42, "system.gpu.2.temp": 67.73, "system.gpu.3.gpu": 37.6, "system.gpu.3.memory": 5.07, "system.gpu.3.memory_allocated": 97.47, "system.gpu.3.temp": 70.6, "system.cpu": 76.7, "system.memory": 17.99, "system.disk": 1.2, "system.proc.memory.availableMB": 52682.45, "system.proc.memory.rssMB": 9685.09, "system.proc.memory.percent": 15.08, "system.proc.cpu.threads": 1202.0, "system.network.sent": 63216402, "system.network.recv": 17229246, "_wandb": true, "_timestamp": 1578858395, "_runtime": 1689}
{"system.gpu.0.gpu": 39.27, "system.gpu.0.memory": 6.2, "system.gpu.0.memory_allocated": 97.42, "system.gpu.0.temp": 65.4, "system.gpu.1.gpu": 39.2, "system.gpu.1.memory": 6.53, "system.gpu.1.memory_allocated": 97.47, "system.gpu.1.temp": 68.0, "system.gpu.2.gpu": 37.73, "system.gpu.2.memory": 5.2, "system.gpu.2.memory_allocated": 97.42, "system.gpu.2.temp": 67.8, "system.gpu.3.gpu": 39.13, "system.gpu.3.memory": 5.53, "system.gpu.3.memory_allocated": 97.47, "system.gpu.3.temp": 70.4, "system.cpu": 78.15, "system.memory": 18.07, "system.disk": 1.2, "system.proc.memory.availableMB": 52633.57, "system.proc.memory.rssMB": 9733.6, "system.proc.memory.percent": 15.15, "system.proc.cpu.threads": 1217.33, "system.network.sent": 63726403, "system.network.recv": 17387946, "_wandb": true, "_timestamp": 1578858425, "_runtime": 1719}
{"system.gpu.0.gpu": 30.8, "system.gpu.0.memory": 4.93, "system.gpu.0.memory_allocated": 97.42, "system.gpu.0.temp": 65.33, "system.gpu.1.gpu": 33.33, "system.gpu.1.memory": 5.2, "system.gpu.1.memory_allocated": 97.47, "system.gpu.1.temp": 67.93, "system.gpu.2.gpu": 33.27, "system.gpu.2.memory": 4.2, "system.gpu.2.memory_allocated": 97.42, "system.gpu.2.temp": 67.8, "system.gpu.3.gpu": 33.33, "system.gpu.3.memory": 4.4, "system.gpu.3.memory_allocated": 97.47, "system.gpu.3.temp": 70.4, "system.cpu": 77.83, "system.memory": 18.06, "system.disk": 1.2, "system.proc.memory.availableMB": 52631.14, "system.proc.memory.rssMB": 9734.4, "system.proc.memory.percent": 15.16, "system.proc.cpu.threads": 1235.07, "system.network.sent": 64190017, "system.network.recv": 17543221, "_wandb": true, "_timestamp": 1578858455, "_runtime": 1750}
{"system.gpu.0.gpu": 33.07, "system.gpu.0.memory": 5.13, "system.gpu.0.memory_allocated": 97.42, "system.gpu.0.temp": 65.07, "system.gpu.1.gpu": 33.27, "system.gpu.1.memory": 5.4, "system.gpu.1.memory_allocated": 97.47, "system.gpu.1.temp": 68.0, "system.gpu.2.gpu": 35.6, "system.gpu.2.memory": 4.53, "system.gpu.2.memory_allocated": 97.42, "system.gpu.2.temp": 67.8, "system.gpu.3.gpu": 35.53, "system.gpu.3.memory": 4.47, "system.gpu.3.memory_allocated": 97.47, "system.gpu.3.temp": 70.27, "system.cpu": 77.07, "system.memory": 18.07, "system.disk": 1.2, "system.proc.memory.availableMB": 52631.61, "system.proc.memory.rssMB": 9734.51, "system.proc.memory.percent": 15.16, "system.proc.cpu.threads": 1252.33, "system.network.sent": 64727902, "system.network.recv": 17696689, "_wandb": true, "_timestamp": 1578858486, "_runtime": 1780}
{"system.gpu.0.gpu": 35.67, "system.gpu.0.memory": 5.73, "system.gpu.0.memory_allocated": 97.42, "system.gpu.0.temp": 65.33, "system.gpu.1.gpu": 36.13, "system.gpu.1.memory": 6.13, "system.gpu.1.memory_allocated": 97.47, "system.gpu.1.temp": 67.8, "system.gpu.2.gpu": 36.47, "system.gpu.2.memory": 5.07, "system.gpu.2.memory_allocated": 97.42, "system.gpu.2.temp": 67.53, "system.gpu.3.gpu": 36.07, "system.gpu.3.memory": 5.0, "system.gpu.3.memory_allocated": 97.47, "system.gpu.3.temp": 70.33, "system.cpu": 77.49, "system.memory": 18.13, "system.disk": 1.2, "system.proc.memory.availableMB": 52572.97, "system.proc.memory.rssMB": 9792.06, "system.proc.memory.percent": 15.25, "system.proc.cpu.threads": 1269.2, "system.network.sent": 65234731, "system.network.recv": 17853159, "_wandb": true, "_timestamp": 1578858516, "_runtime": 1810}
{"system.gpu.0.gpu": 34.53, "system.gpu.0.memory": 5.4, "system.gpu.0.memory_allocated": 97.42, "system.gpu.0.temp": 65.13, "system.gpu.1.gpu": 35.67, "system.gpu.1.memory": 5.53, "system.gpu.1.memory_allocated": 97.47, "system.gpu.1.temp": 68.0, "system.gpu.2.gpu": 32.93, "system.gpu.2.memory": 4.33, "system.gpu.2.memory_allocated": 97.42, "system.gpu.2.temp": 67.53, "system.gpu.3.gpu": 31.67, "system.gpu.3.memory": 4.47, "system.gpu.3.memory_allocated": 97.47, "system.gpu.3.temp": 70.33, "system.cpu": 77.35, "system.memory": 18.16, "system.disk": 1.2, "system.proc.memory.availableMB": 52569.52, "system.proc.memory.rssMB": 9794.97, "system.proc.memory.percent": 15.25, "system.proc.cpu.threads": 1282.67, "system.network.sent": 65734545, "system.network.recv": 18012377, "_wandb": true, "_timestamp": 1578858546, "_runtime": 1840}
{"system.gpu.0.gpu": 32.47, "system.gpu.0.memory": 5.33, "system.gpu.0.memory_allocated": 97.42, "system.gpu.0.temp": 65.0, "system.gpu.1.gpu": 33.8, "system.gpu.1.memory": 5.4, "system.gpu.1.memory_allocated": 97.47, "system.gpu.1.temp": 67.87, "system.gpu.2.gpu": 33.13, "system.gpu.2.memory": 4.73, "system.gpu.2.memory_allocated": 97.42, "system.gpu.2.temp": 67.53, "system.gpu.3.gpu": 34.47, "system.gpu.3.memory": 4.6, "system.gpu.3.memory_allocated": 97.47, "system.gpu.3.temp": 70.33, "system.cpu": 76.67, "system.memory": 18.24, "system.disk": 1.2, "system.proc.memory.availableMB": 52520.51, "system.proc.memory.rssMB": 9842.29, "system.proc.memory.percent": 15.32, "system.proc.cpu.threads": 1295.73, "system.network.sent": 66296086, "system.network.recv": 18175327, "_wandb": true, "_timestamp": 1578858576, "_runtime": 1870}
{"system.gpu.0.gpu": 42.27, "system.gpu.0.memory": 7.13, "system.gpu.0.memory_allocated": 97.42, "system.gpu.0.temp": 65.0, "system.gpu.1.gpu": 38.93, "system.gpu.1.memory": 7.0, "system.gpu.1.memory_allocated": 97.47, "system.gpu.1.temp": 68.0, "system.gpu.2.gpu": 38.53, "system.gpu.2.memory": 5.73, "system.gpu.2.memory_allocated": 97.42, "system.gpu.2.temp": 67.53, "system.gpu.3.gpu": 41.6, "system.gpu.3.memory": 5.8, "system.gpu.3.memory_allocated": 97.47, "system.gpu.3.temp": 70.2, "system.cpu": 77.77, "system.memory": 18.17, "system.disk": 1.2, "system.proc.memory.availableMB": 52562.5, "system.proc.memory.rssMB": 9799.79, "system.proc.memory.percent": 15.26, "system.proc.cpu.threads": 1310.73, "system.network.sent": 66833521, "system.network.recv": 18336921, "_wandb": true, "_timestamp": 1578858606, "_runtime": 1900}
{"system.gpu.0.gpu": 33.67, "system.gpu.0.memory": 5.33, "system.gpu.0.memory_allocated": 97.42, "system.gpu.0.temp": 64.87, "system.gpu.1.gpu": 34.93, "system.gpu.1.memory": 5.0, "system.gpu.1.memory_allocated": 97.47, "system.gpu.1.temp": 67.73, "system.gpu.2.gpu": 32.8, "system.gpu.2.memory": 4.07, "system.gpu.2.memory_allocated": 97.42, "system.gpu.2.temp": 67.6, "system.gpu.3.gpu": 33.4, "system.gpu.3.memory": 4.47, "system.gpu.3.memory_allocated": 97.47, "system.gpu.3.temp": 70.13, "system.cpu": 76.68, "system.memory": 18.14, "system.disk": 1.2, "system.proc.memory.availableMB": 52581.75, "system.proc.memory.rssMB": 9779.95, "system.proc.memory.percent": 15.23, "system.proc.cpu.threads": 1323.8, "system.network.sent": 67338121, "system.network.recv": 18498610, "_wandb": true, "_timestamp": 1578858636, "_runtime": 1930}
{"system.gpu.0.gpu": 36.13, "system.gpu.0.memory": 6.0, "system.gpu.0.memory_allocated": 97.42, "system.gpu.0.temp": 65.07, "system.gpu.1.gpu": 37.6, "system.gpu.1.memory": 6.0, "system.gpu.1.memory_allocated": 97.47, "system.gpu.1.temp": 67.87, "system.gpu.2.gpu": 36.8, "system.gpu.2.memory": 5.13, "system.gpu.2.memory_allocated": 97.42, "system.gpu.2.temp": 67.4, "system.gpu.3.gpu": 37.93, "system.gpu.3.memory": 5.2, "system.gpu.3.memory_allocated": 97.47, "system.gpu.3.temp": 70.33, "system.cpu": 77.22, "system.memory": 18.27, "system.disk": 1.2, "system.proc.memory.availableMB": 52492.88, "system.proc.memory.rssMB": 9868.03, "system.proc.memory.percent": 15.36, "system.proc.cpu.threads": 1338.33, "system.network.sent": 67820005, "system.network.recv": 18658436, "_wandb": true, "_timestamp": 1578858666, "_runtime": 1961}
{"system.gpu.0.gpu": 33.4, "system.gpu.0.memory": 5.4, "system.gpu.0.memory_allocated": 97.42, "system.gpu.0.temp": 64.8, "system.gpu.1.gpu": 31.47, "system.gpu.1.memory": 4.73, "system.gpu.1.memory_allocated": 97.47, "system.gpu.1.temp": 67.67, "system.gpu.2.gpu": 32.6, "system.gpu.2.memory": 4.4, "system.gpu.2.memory_allocated": 97.42, "system.gpu.2.temp": 67.53, "system.gpu.3.gpu": 31.33, "system.gpu.3.memory": 4.33, "system.gpu.3.memory_allocated": 97.47, "system.gpu.3.temp": 70.13, "system.cpu": 76.84, "system.memory": 18.23, "system.disk": 1.2, "system.proc.memory.availableMB": 52516.49, "system.proc.memory.rssMB": 9845.25, "system.proc.memory.percent": 15.33, "system.proc.cpu.threads": 1354.0, "system.network.sent": 68344963, "system.network.recv": 18814635, "_wandb": true, "_timestamp": 1578858697, "_runtime": 1991}
{"system.gpu.0.gpu": 33.53, "system.gpu.0.memory": 4.8, "system.gpu.0.memory_allocated": 97.42, "system.gpu.0.temp": 64.93, "system.gpu.1.gpu": 30.27, "system.gpu.1.memory": 4.87, "system.gpu.1.memory_allocated": 97.47, "system.gpu.1.temp": 67.67, "system.gpu.2.gpu": 32.2, "system.gpu.2.memory": 4.33, "system.gpu.2.memory_allocated": 97.42, "system.gpu.2.temp": 67.4, "system.gpu.3.gpu": 31.47, "system.gpu.3.memory": 4.2, "system.gpu.3.memory_allocated": 97.47, "system.gpu.3.temp": 70.13, "system.cpu": 77.06, "system.memory": 18.2, "system.disk": 1.2, "system.proc.memory.availableMB": 52541.65, "system.proc.memory.rssMB": 9818.91, "system.proc.memory.percent": 15.29, "system.proc.cpu.threads": 1370.87, "system.network.sent": 68847707, "system.network.recv": 18972200, "_wandb": true, "_timestamp": 1578858727, "_runtime": 2021}
{"system.gpu.0.gpu": 36.13, "system.gpu.0.memory": 5.47, "system.gpu.0.memory_allocated": 97.42, "system.gpu.0.temp": 64.87, "system.gpu.1.gpu": 30.73, "system.gpu.1.memory": 5.2, "system.gpu.1.memory_allocated": 97.47, "system.gpu.1.temp": 67.67, "system.gpu.2.gpu": 31.47, "system.gpu.2.memory": 4.27, "system.gpu.2.memory_allocated": 97.42, "system.gpu.2.temp": 67.53, "system.gpu.3.gpu": 32.53, "system.gpu.3.memory": 4.2, "system.gpu.3.memory_allocated": 97.47, "system.gpu.3.temp": 70.2, "system.cpu": 77.14, "system.memory": 18.43, "system.disk": 1.2, "system.proc.memory.availableMB": 52398.7, "system.proc.memory.rssMB": 9960.87, "system.proc.memory.percent": 15.51, "system.proc.cpu.threads": 1385.07, "system.network.sent": 69380473, "system.network.recv": 19127843, "_wandb": true, "_timestamp": 1578858757, "_runtime": 2051}
{"system.gpu.0.gpu": 36.8, "system.gpu.0.memory": 5.6, "system.gpu.0.memory_allocated": 97.42, "system.gpu.0.temp": 64.93, "system.gpu.1.gpu": 33.67, "system.gpu.1.memory": 5.53, "system.gpu.1.memory_allocated": 97.47, "system.gpu.1.temp": 67.8, "system.gpu.2.gpu": 33.4, "system.gpu.2.memory": 4.8, "system.gpu.2.memory_allocated": 97.42, "system.gpu.2.temp": 67.6, "system.gpu.3.gpu": 34.0, "system.gpu.3.memory": 4.73, "system.gpu.3.memory_allocated": 97.47, "system.gpu.3.temp": 70.13, "system.cpu": 77.62, "system.memory": 18.29, "system.disk": 1.2, "system.proc.memory.availableMB": 52485.04, "system.proc.memory.rssMB": 9874.65, "system.proc.memory.percent": 15.37, "system.proc.cpu.threads": 1397.8, "system.network.sent": 69945511, "system.network.recv": 19294905, "_wandb": true, "_timestamp": 1578858787, "_runtime": 2081}
{"system.gpu.0.gpu": 35.0, "system.gpu.0.memory": 5.47, "system.gpu.0.memory_allocated": 97.42, "system.gpu.0.temp": 65.07, "system.gpu.1.gpu": 33.93, "system.gpu.1.memory": 5.67, "system.gpu.1.memory_allocated": 97.47, "system.gpu.1.temp": 67.93, "system.gpu.2.gpu": 34.93, "system.gpu.2.memory": 5.0, "system.gpu.2.memory_allocated": 97.42, "system.gpu.2.temp": 67.53, "system.gpu.3.gpu": 32.8, "system.gpu.3.memory": 4.47, "system.gpu.3.memory_allocated": 97.47, "system.gpu.3.temp": 70.27, "system.cpu": 77.28, "system.memory": 18.3, "system.disk": 1.2, "system.proc.memory.availableMB": 52477.14, "system.proc.memory.rssMB": 9881.55, "system.proc.memory.percent": 15.38, "system.proc.cpu.threads": 1411.8, "system.network.sent": 70410658, "system.network.recv": 19458196, "_wandb": true, "_timestamp": 1578858817, "_runtime": 2111}
{"system.gpu.0.gpu": 38.0, "system.gpu.0.memory": 6.13, "system.gpu.0.memory_allocated": 97.42, "system.gpu.0.temp": 64.93, "system.gpu.1.gpu": 36.4, "system.gpu.1.memory": 5.93, "system.gpu.1.memory_allocated": 97.47, "system.gpu.1.temp": 67.87, "system.gpu.2.gpu": 35.27, "system.gpu.2.memory": 5.0, "system.gpu.2.memory_allocated": 97.42, "system.gpu.2.temp": 67.67, "system.gpu.3.gpu": 37.47, "system.gpu.3.memory": 5.07, "system.gpu.3.memory_allocated": 97.47, "system.gpu.3.temp": 70.27, "system.cpu": 76.58, "system.memory": 18.59, "system.disk": 1.2, "system.proc.memory.availableMB": 52289.81, "system.proc.memory.rssMB": 10067.05, "system.proc.memory.percent": 15.67, "system.proc.cpu.threads": 1427.2, "system.network.sent": 70922604, "system.network.recv": 19624137, "_wandb": true, "_timestamp": 1578858847, "_runtime": 2141}
{"system.gpu.0.gpu": 41.6, "system.gpu.0.memory": 6.33, "system.gpu.0.memory_allocated": 97.42, "system.gpu.0.temp": 65.13, "system.gpu.1.gpu": 36.47, "system.gpu.1.memory": 6.0, "system.gpu.1.memory_allocated": 97.47, "system.gpu.1.temp": 67.93, "system.gpu.2.gpu": 38.2, "system.gpu.2.memory": 5.27, "system.gpu.2.memory_allocated": 97.42, "system.gpu.2.temp": 67.67, "system.gpu.3.gpu": 40.27, "system.gpu.3.memory": 5.4, "system.gpu.3.memory_allocated": 97.47, "system.gpu.3.temp": 70.47, "system.cpu": 77.48, "system.memory": 18.46, "system.disk": 1.2, "system.proc.memory.availableMB": 52369.16, "system.proc.memory.rssMB": 9987.49, "system.proc.memory.percent": 15.55, "system.proc.cpu.threads": 1438.47, "system.network.sent": 71415990, "system.network.recv": 19779516, "_wandb": true, "_timestamp": 1578858877, "_runtime": 2172}
{"system.gpu.0.gpu": 33.93, "system.gpu.0.memory": 5.33, "system.gpu.0.memory_allocated": 97.42, "system.gpu.0.temp": 65.0, "system.gpu.1.gpu": 32.87, "system.gpu.1.memory": 5.27, "system.gpu.1.memory_allocated": 97.47, "system.gpu.1.temp": 67.87, "system.gpu.2.gpu": 32.53, "system.gpu.2.memory": 4.33, "system.gpu.2.memory_allocated": 97.42, "system.gpu.2.temp": 67.53, "system.gpu.3.gpu": 32.67, "system.gpu.3.memory": 4.33, "system.gpu.3.memory_allocated": 97.47, "system.gpu.3.temp": 70.2, "system.cpu": 76.37, "system.memory": 18.45, "system.disk": 1.2, "system.proc.memory.availableMB": 52378.29, "system.proc.memory.rssMB": 9978.91, "system.proc.memory.percent": 15.54, "system.proc.cpu.threads": 1452.4, "system.network.sent": 71962215, "system.network.recv": 19941608, "_wandb": true, "_timestamp": 1578858908, "_runtime": 2202}
{"system.gpu.0.gpu": 31.13, "system.gpu.0.memory": 5.13, "system.gpu.0.memory_allocated": 97.42, "system.gpu.0.temp": 65.07, "system.gpu.1.gpu": 30.13, "system.gpu.1.memory": 4.8, "system.gpu.1.memory_allocated": 97.47, "system.gpu.1.temp": 68.0, "system.gpu.2.gpu": 29.13, "system.gpu.2.memory": 4.0, "system.gpu.2.memory_allocated": 97.42, "system.gpu.2.temp": 67.53, "system.gpu.3.gpu": 31.8, "system.gpu.3.memory": 4.27, "system.gpu.3.memory_allocated": 97.47, "system.gpu.3.temp": 70.4, "system.cpu": 77.39, "system.memory": 18.37, "system.disk": 1.2, "system.proc.memory.availableMB": 52432.51, "system.proc.memory.rssMB": 9923.89, "system.proc.memory.percent": 15.45, "system.proc.cpu.threads": 1465.4, "system.network.sent": 72458758, "system.network.recv": 20099112, "_wandb": true, "_timestamp": 1578858938, "_runtime": 2232}
{"system.gpu.0.gpu": 30.73, "system.gpu.0.memory": 5.0, "system.gpu.0.memory_allocated": 97.42, "system.gpu.0.temp": 65.2, "system.gpu.1.gpu": 31.53, "system.gpu.1.memory": 4.8, "system.gpu.1.memory_allocated": 97.47, "system.gpu.1.temp": 68.0, "system.gpu.2.gpu": 31.67, "system.gpu.2.memory": 4.27, "system.gpu.2.memory_allocated": 97.42, "system.gpu.2.temp": 67.67, "system.gpu.3.gpu": 31.6, "system.gpu.3.memory": 4.07, "system.gpu.3.memory_allocated": 97.47, "system.gpu.3.temp": 70.47, "system.cpu": 76.85, "system.memory": 18.32, "system.disk": 1.2, "system.proc.memory.availableMB": 52461.37, "system.proc.memory.rssMB": 9894.31, "system.proc.memory.percent": 15.4, "system.proc.cpu.threads": 1480.53, "system.network.sent": 73000513, "system.network.recv": 20260137, "_wandb": true, "_timestamp": 1578858968, "_runtime": 2262}
{"system.gpu.0.gpu": 35.33, "system.gpu.0.memory": 5.6, "system.gpu.0.memory_allocated": 97.42, "system.gpu.0.temp": 65.13, "system.gpu.1.gpu": 33.8, "system.gpu.1.memory": 5.4, "system.gpu.1.memory_allocated": 97.47, "system.gpu.1.temp": 67.93, "system.gpu.2.gpu": 34.0, "system.gpu.2.memory": 4.67, "system.gpu.2.memory_allocated": 97.42, "system.gpu.2.temp": 67.6, "system.gpu.3.gpu": 33.53, "system.gpu.3.memory": 4.67, "system.gpu.3.memory_allocated": 97.47, "system.gpu.3.temp": 70.4, "system.cpu": 76.54, "system.memory": 18.33, "system.disk": 1.2, "system.proc.memory.availableMB": 52455.2, "system.proc.memory.rssMB": 9900.44, "system.proc.memory.percent": 15.41, "system.proc.cpu.threads": 1494.27, "system.network.sent": 73548128, "system.network.recv": 20421056, "_wandb": true, "_timestamp": 1578858998, "_runtime": 2292}
{"system.gpu.0.gpu": 38.33, "system.gpu.0.memory": 5.93, "system.gpu.0.memory_allocated": 97.42, "system.gpu.0.temp": 65.2, "system.gpu.1.gpu": 38.33, "system.gpu.1.memory": 6.27, "system.gpu.1.memory_allocated": 97.47, "system.gpu.1.temp": 68.0, "system.gpu.2.gpu": 41.8, "system.gpu.2.memory": 5.4, "system.gpu.2.memory_allocated": 97.42, "system.gpu.2.temp": 67.73, "system.gpu.3.gpu": 36.67, "system.gpu.3.memory": 5.07, "system.gpu.3.memory_allocated": 97.47, "system.gpu.3.temp": 70.47, "system.cpu": 76.39, "system.memory": 18.32, "system.disk": 1.2, "system.proc.memory.availableMB": 52465.84, "system.proc.memory.rssMB": 9888.31, "system.proc.memory.percent": 15.39, "system.proc.cpu.threads": 1511.53, "system.network.sent": 74052700, "system.network.recv": 20585677, "_wandb": true, "_timestamp": 1578859028, "_runtime": 2322}
{"system.gpu.0.gpu": 35.67, "system.gpu.0.memory": 5.67, "system.gpu.0.memory_allocated": 97.42, "system.gpu.0.temp": 65.07, "system.gpu.1.gpu": 34.27, "system.gpu.1.memory": 5.53, "system.gpu.1.memory_allocated": 97.47, "system.gpu.1.temp": 67.93, "system.gpu.2.gpu": 36.4, "system.gpu.2.memory": 4.4, "system.gpu.2.memory_allocated": 97.42, "system.gpu.2.temp": 67.67, "system.gpu.3.gpu": 35.33, "system.gpu.3.memory": 4.53, "system.gpu.3.memory_allocated": 97.47, "system.gpu.3.temp": 70.2, "system.cpu": 76.77, "system.memory": 18.41, "system.disk": 1.2, "system.proc.memory.availableMB": 52405.12, "system.proc.memory.rssMB": 9947.96, "system.proc.memory.percent": 15.49, "system.proc.cpu.threads": 1528.2, "system.network.sent": 74566338, "system.network.recv": 20741884, "_wandb": true, "_timestamp": 1578859058, "_runtime": 2352}
{"system.gpu.0.gpu": 39.4, "system.gpu.0.memory": 6.2, "system.gpu.0.memory_allocated": 97.42, "system.gpu.0.temp": 65.33, "system.gpu.1.gpu": 34.6, "system.gpu.1.memory": 5.6, "system.gpu.1.memory_allocated": 97.47, "system.gpu.1.temp": 68.0, "system.gpu.2.gpu": 35.13, "system.gpu.2.memory": 4.6, "system.gpu.2.memory_allocated": 97.42, "system.gpu.2.temp": 67.47, "system.gpu.3.gpu": 38.4, "system.gpu.3.memory": 5.47, "system.gpu.3.memory_allocated": 97.47, "system.gpu.3.temp": 70.47, "system.cpu": 77.66, "system.memory": 18.37, "system.disk": 1.2, "system.proc.memory.availableMB": 52429.26, "system.proc.memory.rssMB": 9923.34, "system.proc.memory.percent": 15.45, "system.proc.cpu.threads": 1545.33, "system.network.sent": 75080527, "system.network.recv": 20898397, "_wandb": true, "_timestamp": 1578859088, "_runtime": 2383}
{"system.gpu.0.gpu": 32.93, "system.gpu.0.memory": 5.67, "system.gpu.0.memory_allocated": 97.42, "system.gpu.0.temp": 64.93, "system.gpu.1.gpu": 37.93, "system.gpu.1.memory": 5.87, "system.gpu.1.memory_allocated": 97.47, "system.gpu.1.temp": 67.8, "system.gpu.2.gpu": 29.67, "system.gpu.2.memory": 4.2, "system.gpu.2.memory_allocated": 97.42, "system.gpu.2.temp": 67.6, "system.gpu.3.gpu": 35.93, "system.gpu.3.memory": 4.73, "system.gpu.3.memory_allocated": 97.47, "system.gpu.3.temp": 70.2, "system.cpu": 76.62, "system.memory": 18.43, "system.disk": 1.2, "system.proc.memory.availableMB": 52399.13, "system.proc.memory.rssMB": 9951.48, "system.proc.memory.percent": 15.49, "system.proc.cpu.threads": 1562.07, "system.network.sent": 75577586, "system.network.recv": 21049760, "_wandb": true, "_timestamp": 1578859119, "_runtime": 2413}
{"system.gpu.0.gpu": 34.33, "system.gpu.0.memory": 5.47, "system.gpu.0.memory_allocated": 97.42, "system.gpu.0.temp": 64.93, "system.gpu.1.gpu": 31.87, "system.gpu.1.memory": 5.27, "system.gpu.1.memory_allocated": 97.47, "system.gpu.1.temp": 67.87, "system.gpu.2.gpu": 28.4, "system.gpu.2.memory": 4.13, "system.gpu.2.memory_allocated": 97.42, "system.gpu.2.temp": 67.4, "system.gpu.3.gpu": 32.67, "system.gpu.3.memory": 4.2, "system.gpu.3.memory_allocated": 97.47, "system.gpu.3.temp": 70.2, "system.cpu": 77.35, "system.memory": 18.43, "system.disk": 1.2, "system.proc.memory.availableMB": 52386.96, "system.proc.memory.rssMB": 9964.86, "system.proc.memory.percent": 15.51, "system.proc.cpu.threads": 1577.6, "system.network.sent": 76100781, "system.network.recv": 21204755, "_wandb": true, "_timestamp": 1578859149, "_runtime": 2443}
{"system.gpu.0.gpu": 32.0, "system.gpu.0.memory": 5.67, "system.gpu.0.memory_allocated": 97.42, "system.gpu.0.temp": 64.93, "system.gpu.1.gpu": 32.87, "system.gpu.1.memory": 5.4, "system.gpu.1.memory_allocated": 97.47, "system.gpu.1.temp": 67.67, "system.gpu.2.gpu": 34.87, "system.gpu.2.memory": 4.73, "system.gpu.2.memory_allocated": 97.42, "system.gpu.2.temp": 67.47, "system.gpu.3.gpu": 31.47, "system.gpu.3.memory": 4.53, "system.gpu.3.memory_allocated": 97.47, "system.gpu.3.temp": 70.0, "system.cpu": 76.97, "system.memory": 18.48, "system.disk": 1.2, "system.proc.memory.availableMB": 52357.26, "system.proc.memory.rssMB": 9994.22, "system.proc.memory.percent": 15.56, "system.proc.cpu.threads": 1589.67, "system.network.sent": 76611146, "system.network.recv": 21358289, "_wandb": true, "_timestamp": 1578859179, "_runtime": 2473}
{"system.gpu.0.gpu": 36.87, "system.gpu.0.memory": 6.4, "system.gpu.0.memory_allocated": 97.42, "system.gpu.0.temp": 64.87, "system.gpu.1.gpu": 37.27, "system.gpu.1.memory": 6.33, "system.gpu.1.memory_allocated": 97.47, "system.gpu.1.temp": 67.67, "system.gpu.2.gpu": 35.47, "system.gpu.2.memory": 5.13, "system.gpu.2.memory_allocated": 97.42, "system.gpu.2.temp": 67.53, "system.gpu.3.gpu": 36.6, "system.gpu.3.memory": 5.27, "system.gpu.3.memory_allocated": 97.47, "system.gpu.3.temp": 70.07, "system.cpu": 76.82, "system.memory": 18.57, "system.disk": 1.2, "system.proc.memory.availableMB": 52303.84, "system.proc.memory.rssMB": 10000.52, "system.proc.memory.percent": 15.57, "system.proc.cpu.threads": 1604.93, "system.network.sent": 77129164, "system.network.recv": 21565921, "_wandb": true, "_timestamp": 1578859209, "_runtime": 2503}
{"system.gpu.0.gpu": 37.33, "system.gpu.0.memory": 5.6, "system.gpu.0.memory_allocated": 97.42, "system.gpu.0.temp": 64.87, "system.gpu.1.gpu": 38.27, "system.gpu.1.memory": 6.0, "system.gpu.1.memory_allocated": 97.47, "system.gpu.1.temp": 67.67, "system.gpu.2.gpu": 36.53, "system.gpu.2.memory": 5.13, "system.gpu.2.memory_allocated": 97.42, "system.gpu.2.temp": 67.4, "system.gpu.3.gpu": 36.6, "system.gpu.3.memory": 4.73, "system.gpu.3.memory_allocated": 97.47, "system.gpu.3.temp": 70.13, "system.cpu": 76.57, "system.memory": 18.54, "system.disk": 1.2, "system.proc.memory.availableMB": 52324.0, "system.proc.memory.rssMB": 10020.65, "system.proc.memory.percent": 15.6, "system.proc.cpu.threads": 1618.2, "system.network.sent": 77622651, "system.network.recv": 21728548, "_wandb": true, "_timestamp": 1578859239, "_runtime": 2533}
{"system.gpu.0.gpu": 36.13, "system.gpu.0.memory": 6.0, "system.gpu.0.memory_allocated": 97.42, "system.gpu.0.temp": 64.87, "system.gpu.1.gpu": 37.13, "system.gpu.1.memory": 6.0, "system.gpu.1.memory_allocated": 97.47, "system.gpu.1.temp": 67.47, "system.gpu.2.gpu": 36.93, "system.gpu.2.memory": 5.0, "system.gpu.2.memory_allocated": 97.42, "system.gpu.2.temp": 67.53, "system.gpu.3.gpu": 35.4, "system.gpu.3.memory": 5.0, "system.gpu.3.memory_allocated": 97.47, "system.gpu.3.temp": 70.07, "system.cpu": 77.2, "system.memory": 18.74, "system.disk": 1.2, "system.proc.memory.availableMB": 52195.97, "system.proc.memory.rssMB": 10147.62, "system.proc.memory.percent": 15.8, "system.proc.cpu.threads": 1631.87, "system.network.sent": 78231619, "system.network.recv": 21889822, "_wandb": true, "_timestamp": 1578859269, "_runtime": 2563}
{"system.gpu.0.gpu": 33.53, "system.gpu.0.memory": 5.2, "system.gpu.0.memory_allocated": 97.42, "system.gpu.0.temp": 65.0, "system.gpu.1.gpu": 35.27, "system.gpu.1.memory": 5.27, "system.gpu.1.memory_allocated": 97.47, "system.gpu.1.temp": 67.8, "system.gpu.2.gpu": 36.93, "system.gpu.2.memory": 4.53, "system.gpu.2.memory_allocated": 97.42, "system.gpu.2.temp": 67.27, "system.gpu.3.gpu": 32.27, "system.gpu.3.memory": 4.47, "system.gpu.3.memory_allocated": 97.47, "system.gpu.3.temp": 70.07, "system.cpu": 76.45, "system.memory": 18.6, "system.disk": 1.2, "system.proc.memory.availableMB": 52283.26, "system.proc.memory.rssMB": 10060.81, "system.proc.memory.percent": 15.66, "system.proc.cpu.threads": 1645.6, "system.network.sent": 78736612, "system.network.recv": 22042942, "_wandb": true, "_timestamp": 1578859299, "_runtime": 2594}
{"system.gpu.0.gpu": 32.93, "system.gpu.0.memory": 5.53, "system.gpu.0.memory_allocated": 97.42, "system.gpu.0.temp": 64.73, "system.gpu.1.gpu": 32.07, "system.gpu.1.memory": 5.47, "system.gpu.1.memory_allocated": 97.47, "system.gpu.1.temp": 67.53, "system.gpu.2.gpu": 32.93, "system.gpu.2.memory": 4.47, "system.gpu.2.memory_allocated": 97.42, "system.gpu.2.temp": 67.4, "system.gpu.3.gpu": 34.07, "system.gpu.3.memory": 4.73, "system.gpu.3.memory_allocated": 97.47, "system.gpu.3.temp": 70.0, "system.cpu": 76.59, "system.memory": 18.49, "system.disk": 1.2, "system.proc.memory.availableMB": 52361.03, "system.proc.memory.rssMB": 9986.59, "system.proc.memory.percent": 15.55, "system.proc.cpu.threads": 1657.0, "system.network.sent": 79227072, "system.network.recv": 22192759, "_wandb": true, "_timestamp": 1578859330, "_runtime": 2624}
{"system.gpu.0.gpu": 33.07, "system.gpu.0.memory": 5.47, "system.gpu.0.memory_allocated": 97.42, "system.gpu.0.temp": 64.8, "system.gpu.1.gpu": 33.53, "system.gpu.1.memory": 5.53, "system.gpu.1.memory_allocated": 97.47, "system.gpu.1.temp": 67.67, "system.gpu.2.gpu": 33.67, "system.gpu.2.memory": 4.6, "system.gpu.2.memory_allocated": 97.42, "system.gpu.2.temp": 67.2, "system.gpu.3.gpu": 34.53, "system.gpu.3.memory": 4.67, "system.gpu.3.memory_allocated": 97.47, "system.gpu.3.temp": 70.07, "system.cpu": 77.63, "system.memory": 18.54, "system.disk": 1.2, "system.proc.memory.availableMB": 52329.46, "system.proc.memory.rssMB": 10017.9, "system.proc.memory.percent": 15.6, "system.proc.cpu.threads": 1669.53, "system.network.sent": 79732205, "system.network.recv": 22347732, "_wandb": true, "_timestamp": 1578859360, "_runtime": 2654}
{"system.gpu.0.gpu": 30.8, "system.gpu.0.memory": 5.53, "system.gpu.0.memory_allocated": 97.42, "system.gpu.0.temp": 64.87, "system.gpu.1.gpu": 34.67, "system.gpu.1.memory": 5.4, "system.gpu.1.memory_allocated": 97.47, "system.gpu.1.temp": 67.6, "system.gpu.2.gpu": 33.33, "system.gpu.2.memory": 4.87, "system.gpu.2.memory_allocated": 97.42, "system.gpu.2.temp": 67.53, "system.gpu.3.gpu": 31.93, "system.gpu.3.memory": 4.73, "system.gpu.3.memory_allocated": 97.47, "system.gpu.3.temp": 70.13, "system.cpu": 76.27, "system.memory": 18.65, "system.disk": 1.2, "system.proc.memory.availableMB": 52248.74, "system.proc.memory.rssMB": 10098.03, "system.proc.memory.percent": 15.72, "system.proc.cpu.threads": 1683.0, "system.network.sent": 80202123, "system.network.recv": 22498862, "_wandb": true, "_timestamp": 1578859390, "_runtime": 2684}
{"system.gpu.0.gpu": 38.87, "system.gpu.0.memory": 6.0, "system.gpu.0.memory_allocated": 97.42, "system.gpu.0.temp": 64.93, "system.gpu.1.gpu": 36.13, "system.gpu.1.memory": 5.8, "system.gpu.1.memory_allocated": 97.47, "system.gpu.1.temp": 67.8, "system.gpu.2.gpu": 34.07, "system.gpu.2.memory": 5.0, "system.gpu.2.memory_allocated": 97.42, "system.gpu.2.temp": 67.53, "system.gpu.3.gpu": 36.27, "system.gpu.3.memory": 4.47, "system.gpu.3.memory_allocated": 97.47, "system.gpu.3.temp": 70.07, "system.cpu": 76.69, "system.memory": 18.66, "system.disk": 1.2, "system.proc.memory.availableMB": 52244.32, "system.proc.memory.rssMB": 10101.51, "system.proc.memory.percent": 15.73, "system.proc.cpu.threads": 1697.6, "system.network.sent": 80727613, "system.network.recv": 22661241, "_wandb": true, "_timestamp": 1578859420, "_runtime": 2714}
{"system.gpu.0.gpu": 34.47, "system.gpu.0.memory": 5.6, "system.gpu.0.memory_allocated": 97.42, "system.gpu.0.temp": 65.07, "system.gpu.1.gpu": 36.13, "system.gpu.1.memory": 5.2, "system.gpu.1.memory_allocated": 97.47, "system.gpu.1.temp": 67.73, "system.gpu.2.gpu": 33.6, "system.gpu.2.memory": 4.33, "system.gpu.2.memory_allocated": 97.42, "system.gpu.2.temp": 67.53, "system.gpu.3.gpu": 36.8, "system.gpu.3.memory": 5.0, "system.gpu.3.memory_allocated": 97.47, "system.gpu.3.temp": 70.4, "system.cpu": 76.47, "system.memory": 18.64, "system.disk": 1.2, "system.proc.memory.availableMB": 52257.07, "system.proc.memory.rssMB": 10087.92, "system.proc.memory.percent": 15.71, "system.proc.cpu.threads": 1711.07, "system.network.sent": 81267901, "system.network.recv": 22819092, "_wandb": true, "_timestamp": 1578859450, "_runtime": 2744}
{"system.gpu.0.gpu": 32.8, "system.gpu.0.memory": 5.47, "system.gpu.0.memory_allocated": 97.42, "system.gpu.0.temp": 65.0, "system.gpu.1.gpu": 32.73, "system.gpu.1.memory": 5.13, "system.gpu.1.memory_allocated": 97.47, "system.gpu.1.temp": 67.8, "system.gpu.2.gpu": 32.8, "system.gpu.2.memory": 4.4, "system.gpu.2.memory_allocated": 97.42, "system.gpu.2.temp": 67.6, "system.gpu.3.gpu": 34.87, "system.gpu.3.memory": 4.6, "system.gpu.3.memory_allocated": 97.47, "system.gpu.3.temp": 70.2, "system.cpu": 76.14, "system.memory": 18.67, "system.disk": 1.2, "system.proc.memory.availableMB": 52233.14, "system.proc.memory.rssMB": 10111.92, "system.proc.memory.percent": 15.74, "system.proc.cpu.threads": 1725.73, "system.network.sent": 81755886, "system.network.recv": 22975957, "_wandb": true, "_timestamp": 1578859480, "_runtime": 2774}
{"system.gpu.0.gpu": 32.27, "system.gpu.0.memory": 5.53, "system.gpu.0.memory_allocated": 97.42, "system.gpu.0.temp": 65.2, "system.gpu.1.gpu": 33.53, "system.gpu.1.memory": 5.33, "system.gpu.1.memory_allocated": 97.47, "system.gpu.1.temp": 67.93, "system.gpu.2.gpu": 33.0, "system.gpu.2.memory": 4.33, "system.gpu.2.memory_allocated": 97.42, "system.gpu.2.temp": 67.47, "system.gpu.3.gpu": 33.87, "system.gpu.3.memory": 4.53, "system.gpu.3.memory_allocated": 97.47, "system.gpu.3.temp": 70.4, "system.cpu": 76.35, "system.memory": 18.59, "system.disk": 1.2, "system.proc.memory.availableMB": 52284.41, "system.proc.memory.rssMB": 10058.43, "system.proc.memory.percent": 15.66, "system.proc.cpu.threads": 1736.27, "system.network.sent": 82296688, "system.network.recv": 23134323, "_wandb": true, "_timestamp": 1578859510, "_runtime": 2805}
{"system.gpu.0.gpu": 30.47, "system.gpu.0.memory": 5.07, "system.gpu.0.memory_allocated": 97.42, "system.gpu.0.temp": 65.07, "system.gpu.1.gpu": 33.4, "system.gpu.1.memory": 5.13, "system.gpu.1.memory_allocated": 97.47, "system.gpu.1.temp": 67.93, "system.gpu.2.gpu": 31.4, "system.gpu.2.memory": 4.0, "system.gpu.2.memory_allocated": 97.42, "system.gpu.2.temp": 67.73, "system.gpu.3.gpu": 32.73, "system.gpu.3.memory": 4.47, "system.gpu.3.memory_allocated": 97.47, "system.gpu.3.temp": 70.27, "system.cpu": 76.41, "system.memory": 18.58, "system.disk": 1.2, "system.proc.memory.availableMB": 52293.32, "system.proc.memory.rssMB": 10051.36, "system.proc.memory.percent": 15.65, "system.proc.cpu.threads": 1746.27, "system.network.sent": 82842893, "system.network.recv": 23295510, "_wandb": true, "_timestamp": 1578859541, "_runtime": 2835}
{"system.gpu.0.gpu": 38.8, "system.gpu.0.memory": 6.0, "system.gpu.0.memory_allocated": 97.42, "system.gpu.0.temp": 65.53, "system.gpu.1.gpu": 37.13, "system.gpu.1.memory": 6.07, "system.gpu.1.memory_allocated": 97.47, "system.gpu.1.temp": 67.93, "system.gpu.2.gpu": 38.0, "system.gpu.2.memory": 5.4, "system.gpu.2.memory_allocated": 97.42, "system.gpu.2.temp": 67.67, "system.gpu.3.gpu": 38.67, "system.gpu.3.memory": 5.27, "system.gpu.3.memory_allocated": 97.47, "system.gpu.3.temp": 70.6, "system.cpu": 76.55, "system.memory": 18.71, "system.disk": 1.2, "system.proc.memory.availableMB": 52213.78, "system.proc.memory.rssMB": 10129.51, "system.proc.memory.percent": 15.77, "system.proc.cpu.threads": 1759.87, "system.network.sent": 83354992, "system.network.recv": 23459835, "_wandb": true, "_timestamp": 1578859571, "_runtime": 2865}
{"system.gpu.0.gpu": 36.4, "system.gpu.0.memory": 5.87, "system.gpu.0.memory_allocated": 97.42, "system.gpu.0.temp": 65.4, "system.gpu.1.gpu": 36.4, "system.gpu.1.memory": 5.87, "system.gpu.1.memory_allocated": 97.47, "system.gpu.1.temp": 67.93, "system.gpu.2.gpu": 36.07, "system.gpu.2.memory": 4.67, "system.gpu.2.memory_allocated": 97.42, "system.gpu.2.temp": 67.87, "system.gpu.3.gpu": 37.4, "system.gpu.3.memory": 4.8, "system.gpu.3.memory_allocated": 97.47, "system.gpu.3.temp": 70.53, "system.cpu": 76.63, "system.memory": 18.73, "system.disk": 1.2, "system.proc.memory.availableMB": 52206.51, "system.proc.memory.rssMB": 10136.04, "system.proc.memory.percent": 15.78, "system.proc.cpu.threads": 1770.53, "system.network.sent": 83880100, "system.network.recv": 23625042, "_wandb": true, "_timestamp": 1578859601, "_runtime": 2895}
{"system.gpu.0.gpu": 37.07, "system.gpu.0.memory": 5.6, "system.gpu.0.memory_allocated": 97.42, "system.gpu.0.temp": 65.27, "system.gpu.1.gpu": 34.73, "system.gpu.1.memory": 5.33, "system.gpu.1.memory_allocated": 97.47, "system.gpu.1.temp": 67.8, "system.gpu.2.gpu": 35.87, "system.gpu.2.memory": 4.67, "system.gpu.2.memory_allocated": 97.42, "system.gpu.2.temp": 67.6, "system.gpu.3.gpu": 34.87, "system.gpu.3.memory": 4.6, "system.gpu.3.memory_allocated": 97.47, "system.gpu.3.temp": 70.47, "system.cpu": 76.96, "system.memory": 18.96, "system.disk": 1.2, "system.proc.memory.availableMB": 52053.49, "system.proc.memory.rssMB": 10288.16, "system.proc.memory.percent": 16.02, "system.proc.cpu.threads": 1779.67, "system.network.sent": 84414209, "system.network.recv": 23786146, "_wandb": true, "_timestamp": 1578859631, "_runtime": 2925}
{"system.gpu.0.gpu": 34.2, "system.gpu.0.memory": 5.07, "system.gpu.0.memory_allocated": 97.42, "system.gpu.0.temp": 65.47, "system.gpu.1.gpu": 32.33, "system.gpu.1.memory": 5.27, "system.gpu.1.memory_allocated": 97.47, "system.gpu.1.temp": 67.87, "system.gpu.2.gpu": 32.93, "system.gpu.2.memory": 4.53, "system.gpu.2.memory_allocated": 97.42, "system.gpu.2.temp": 67.87, "system.gpu.3.gpu": 35.87, "system.gpu.3.memory": 4.67, "system.gpu.3.memory_allocated": 97.47, "system.gpu.3.temp": 70.53, "system.cpu": 76.47, "system.memory": 18.64, "system.disk": 1.2, "system.proc.memory.availableMB": 52258.79, "system.proc.memory.rssMB": 10083.18, "system.proc.memory.percent": 15.7, "system.proc.cpu.threads": 1792.93, "system.network.sent": 84905872, "system.network.recv": 23940137, "_wandb": true, "_timestamp": 1578859661, "_runtime": 2955}
{"system.gpu.0.gpu": 35.27, "system.gpu.0.memory": 5.67, "system.gpu.0.memory_allocated": 97.42, "system.gpu.0.temp": 65.2, "system.gpu.1.gpu": 37.13, "system.gpu.1.memory": 5.93, "system.gpu.1.memory_allocated": 97.47, "system.gpu.1.temp": 67.8, "system.gpu.2.gpu": 36.53, "system.gpu.2.memory": 4.87, "system.gpu.2.memory_allocated": 97.42, "system.gpu.2.temp": 67.67, "system.gpu.3.gpu": 31.0, "system.gpu.3.memory": 4.53, "system.gpu.3.memory_allocated": 97.47, "system.gpu.3.temp": 70.4, "system.cpu": 76.78, "system.memory": 18.63, "system.disk": 1.2, "system.proc.memory.availableMB": 52266.87, "system.proc.memory.rssMB": 10073.87, "system.proc.memory.percent": 15.68, "system.proc.cpu.threads": 1803.67, "system.network.sent": 85439892, "system.network.recv": 24094904, "_wandb": true, "_timestamp": 1578859691, "_runtime": 2985}
{"system.gpu.0.gpu": 33.4, "system.gpu.0.memory": 5.47, "system.gpu.0.memory_allocated": 97.42, "system.gpu.0.temp": 65.07, "system.gpu.1.gpu": 34.93, "system.gpu.1.memory": 5.6, "system.gpu.1.memory_allocated": 97.47, "system.gpu.1.temp": 67.93, "system.gpu.2.gpu": 30.87, "system.gpu.2.memory": 4.73, "system.gpu.2.memory_allocated": 97.42, "system.gpu.2.temp": 67.67, "system.gpu.3.gpu": 35.0, "system.gpu.3.memory": 4.67, "system.gpu.3.memory_allocated": 97.47, "system.gpu.3.temp": 70.47, "system.cpu": 77.03, "system.memory": 18.78, "system.disk": 1.2, "system.proc.memory.availableMB": 52174.33, "system.proc.memory.rssMB": 10165.96, "system.proc.memory.percent": 15.83, "system.proc.cpu.threads": 1815.8, "system.network.sent": 85930104, "system.network.recv": 24258191, "_wandb": true, "_timestamp": 1578859722, "_runtime": 3016}
{"system.gpu.0.gpu": 33.8, "system.gpu.0.memory": 5.4, "system.gpu.0.memory_allocated": 97.42, "system.gpu.0.temp": 65.2, "system.gpu.1.gpu": 31.73, "system.gpu.1.memory": 5.4, "system.gpu.1.memory_allocated": 97.47, "system.gpu.1.temp": 67.87, "system.gpu.2.gpu": 34.6, "system.gpu.2.memory": 4.67, "system.gpu.2.memory_allocated": 97.42, "system.gpu.2.temp": 67.6, "system.gpu.3.gpu": 33.87, "system.gpu.3.memory": 4.67, "system.gpu.3.memory_allocated": 97.47, "system.gpu.3.temp": 70.33, "system.cpu": 76.35, "system.memory": 18.79, "system.disk": 1.2, "system.proc.memory.availableMB": 52164.57, "system.proc.memory.rssMB": 10175.78, "system.proc.memory.percent": 15.84, "system.proc.cpu.threads": 1827.93, "system.network.sent": 86442165, "system.network.recv": 24416884, "_wandb": true, "_timestamp": 1578859752, "_runtime": 3046}
{"system.gpu.0.gpu": 37.2, "system.gpu.0.memory": 6.2, "system.gpu.0.memory_allocated": 97.42, "system.gpu.0.temp": 65.2, "system.gpu.1.gpu": 35.4, "system.gpu.1.memory": 6.0, "system.gpu.1.memory_allocated": 97.47, "system.gpu.1.temp": 67.93, "system.gpu.2.gpu": 36.4, "system.gpu.2.memory": 5.07, "system.gpu.2.memory_allocated": 97.42, "system.gpu.2.temp": 67.6, "system.gpu.3.gpu": 37.4, "system.gpu.3.memory": 5.2, "system.gpu.3.memory_allocated": 97.47, "system.gpu.3.temp": 70.53, "system.cpu": 75.89, "system.memory": 18.75, "system.disk": 1.2, "system.proc.memory.availableMB": 52191.66, "system.proc.memory.rssMB": 10148.65, "system.proc.memory.percent": 15.8, "system.proc.cpu.threads": 1841.73, "system.network.sent": 86956205, "system.network.recv": 24580839, "_wandb": true, "_timestamp": 1578859782, "_runtime": 3076}
{"system.gpu.0.gpu": 36.47, "system.gpu.0.memory": 5.93, "system.gpu.0.memory_allocated": 97.42, "system.gpu.0.temp": 64.93, "system.gpu.1.gpu": 35.53, "system.gpu.1.memory": 6.0, "system.gpu.1.memory_allocated": 97.47, "system.gpu.1.temp": 67.6, "system.gpu.2.gpu": 34.13, "system.gpu.2.memory": 4.6, "system.gpu.2.memory_allocated": 97.42, "system.gpu.2.temp": 67.6, "system.gpu.3.gpu": 37.47, "system.gpu.3.memory": 4.93, "system.gpu.3.memory_allocated": 97.47, "system.gpu.3.temp": 70.13, "system.cpu": 76.41, "system.memory": 18.82, "system.disk": 1.2, "system.proc.memory.availableMB": 52141.04, "system.proc.memory.rssMB": 10199.01, "system.proc.memory.percent": 15.88, "system.proc.cpu.threads": 1853.13, "system.network.sent": 87501963, "system.network.recv": 24746729, "_wandb": true, "_timestamp": 1578859812, "_runtime": 3106}
{"system.gpu.0.gpu": 34.73, "system.gpu.0.memory": 5.47, "system.gpu.0.memory_allocated": 97.42, "system.gpu.0.temp": 64.93, "system.gpu.1.gpu": 33.2, "system.gpu.1.memory": 5.4, "system.gpu.1.memory_allocated": 97.47, "system.gpu.1.temp": 67.53, "system.gpu.2.gpu": 34.07, "system.gpu.2.memory": 4.6, "system.gpu.2.memory_allocated": 97.42, "system.gpu.2.temp": 67.13, "system.gpu.3.gpu": 33.2, "system.gpu.3.memory": 4.4, "system.gpu.3.memory_allocated": 97.47, "system.gpu.3.temp": 70.27, "system.cpu": 76.77, "system.memory": 18.84, "system.disk": 1.2, "system.proc.memory.availableMB": 52132.13, "system.proc.memory.rssMB": 10206.94, "system.proc.memory.percent": 15.89, "system.proc.cpu.threads": 1863.33, "system.network.sent": 87995071, "system.network.recv": 24896098, "_wandb": true, "_timestamp": 1578859842, "_runtime": 3136}
{"system.gpu.0.gpu": 31.47, "system.gpu.0.memory": 5.2, "system.gpu.0.memory_allocated": 97.42, "system.gpu.0.temp": 65.0, "system.gpu.1.gpu": 32.13, "system.gpu.1.memory": 5.47, "system.gpu.1.memory_allocated": 97.47, "system.gpu.1.temp": 67.47, "system.gpu.2.gpu": 32.67, "system.gpu.2.memory": 4.47, "system.gpu.2.memory_allocated": 97.42, "system.gpu.2.temp": 67.33, "system.gpu.3.gpu": 32.73, "system.gpu.3.memory": 4.47, "system.gpu.3.memory_allocated": 97.47, "system.gpu.3.temp": 70.07, "system.cpu": 75.74, "system.memory": 18.85, "system.disk": 1.2, "system.proc.memory.availableMB": 52122.94, "system.proc.memory.rssMB": 10215.18, "system.proc.memory.percent": 15.9, "system.proc.cpu.threads": 1872.8, "system.network.sent": 88516582, "system.network.recv": 25054310, "_wandb": true, "_timestamp": 1578859872, "_runtime": 3166}
{"system.gpu.0.gpu": 34.5, "system.gpu.0.memory": 6.0, "system.gpu.0.memory_allocated": 97.42, "system.gpu.0.temp": 65.0, "system.gpu.1.gpu": 27.0, "system.gpu.1.memory": 5.25, "system.gpu.1.memory_allocated": 97.47, "system.gpu.1.temp": 67.5, "system.gpu.2.gpu": 31.25, "system.gpu.2.memory": 5.0, "system.gpu.2.memory_allocated": 97.42, "system.gpu.2.temp": 67.5, "system.gpu.3.gpu": 29.0, "system.gpu.3.memory": 5.0, "system.gpu.3.memory_allocated": 97.47, "system.gpu.3.temp": 70.25, "system.cpu": 61.62, "system.memory": 18.32, "system.disk": 1.2, "system.proc.memory.availableMB": 52451.1, "system.proc.memory.rssMB": 9903.43, "system.proc.memory.percent": 15.42, "system.proc.cpu.threads": 1435.75, "system.network.sent": 88604882, "system.network.recv": 25100313, "_wandb": true, "_timestamp": 1578859880, "_runtime": 3174}
