{"epoch": 0, "loss": 0.5064419028433886, "iou_score": 0.502307116985321, "iou_score_student_hard": 0.502307116985321, "val_loss": 0.6436659157276153, "val_iou_score": 0.3571850061416626, "val_iou_score_student_hard": 0.3571850061416626, "_runtime": 60.3772451877594, "_timestamp": 1578862782.6955152, "_step": 0}
{"epoch": 1, "loss": 0.44988971298391167, "iou_score": 0.5555753111839294, "iou_score_student_hard": 0.5555753111839294, "val_loss": 0.9981042265892028, "val_iou_score": 0.7071295380592346, "val_iou_score_student_hard": 0.7071295380592346, "_runtime": 101.25319290161133, "_timestamp": 1578862823.5714629, "_step": 1}
{"epoch": 2, "loss": 0.38123389834707433, "iou_score": 0.6114382743835449, "iou_score_student_hard": 0.6114382743835449, "val_loss": 2.8625060319900513, "val_iou_score": 0.10799441486597061, "val_iou_score_student_hard": 0.10799441486597061, "_runtime": 141.22227358818054, "_timestamp": 1578862863.5405436, "_step": 2}
{"epoch": 3, "loss": 0.3515004485845566, "iou_score": 0.6420233845710754, "iou_score_student_hard": 0.6420233845710754, "val_loss": 13.334152126312256, "val_iou_score": 0.09296450018882751, "val_iou_score_student_hard": 0.09296450018882751, "_runtime": 181.34673762321472, "_timestamp": 1578862903.6650076, "_step": 3}
{"epoch": 4, "loss": 0.35233220877972515, "iou_score": 0.6433861255645752, "iou_score_student_hard": 0.6433861255645752, "val_loss": 13.265510368347169, "val_iou_score": 0.09310291707515717, "val_iou_score_student_hard": 0.09310291707515717, "_runtime": 221.44801473617554, "_timestamp": 1578862943.7662847, "_step": 4}
{"epoch": 5, "loss": 0.34313734837553717, "iou_score": 0.6497859358787537, "iou_score_student_hard": 0.6497859358787537, "val_loss": 2.6310941755771635, "val_iou_score": 0.7082651257514954, "val_iou_score_student_hard": 0.7082651257514954, "_runtime": 261.69554018974304, "_timestamp": 1578862984.0138102, "_step": 5}
{"epoch": 6, "loss": 0.39065619503909893, "iou_score": 0.6085558533668518, "iou_score_student_hard": 0.6085558533668518, "val_loss": 13.422242736816406, "val_iou_score": 0.09154453873634338, "val_iou_score_student_hard": 0.09154453873634338, "_runtime": 301.9325370788574, "_timestamp": 1578863024.250807, "_step": 6}
{"epoch": 7, "loss": 0.3868011083115231, "iou_score": 0.616218626499176, "iou_score_student_hard": 0.616218626499176, "val_loss": 13.274664163589478, "val_iou_score": 0.09530844539403915, "val_iou_score_student_hard": 0.09530844539403915, "_runtime": 341.8544399738312, "_timestamp": 1578863064.17271, "_step": 7}
{"epoch": 8, "loss": 0.33445701355283913, "iou_score": 0.6632947325706482, "iou_score_student_hard": 0.6632947325706482, "val_loss": 2.7371332824230192, "val_iou_score": 0.7114089131355286, "val_iou_score_student_hard": 0.7114089131355286, "_runtime": 382.05478858947754, "_timestamp": 1578863104.3730586, "_step": 8}
{"epoch": 9, "loss": 0.3325345463373444, "iou_score": 0.6616681218147278, "iou_score_student_hard": 0.6616681218147278, "val_loss": 13.322152996063233, "val_iou_score": 0.09535729885101318, "val_iou_score_student_hard": 0.09535729885101318, "_runtime": 422.5460374355316, "_timestamp": 1578863144.8643074, "_step": 9}
{"epoch": 10, "loss": 0.32921225171197543, "iou_score": 0.6684290170669556, "iou_score_student_hard": 0.6684290170669556, "val_loss": 2.7929982900619508, "val_iou_score": 0.7060732841491699, "val_iou_score_student_hard": 0.7060732841491699, "_runtime": 462.48357629776, "_timestamp": 1578863184.8018463, "_step": 10}
{"epoch": 11, "loss": 0.3528151349587874, "iou_score": 0.6484324336051941, "iou_score_student_hard": 0.6484324336051941, "val_loss": 13.366488218307495, "val_iou_score": 0.0936332643032074, "val_iou_score_student_hard": 0.0936332643032074, "_runtime": 502.3998498916626, "_timestamp": 1578863224.7181199, "_step": 11}
{"epoch": 12, "loss": 0.3282792236317288, "iou_score": 0.6654068827629089, "iou_score_student_hard": 0.6654068827629089, "val_loss": 2.7890384435653686, "val_iou_score": 0.7064403891563416, "val_iou_score_student_hard": 0.7064403891563416, "_runtime": 542.7571032047272, "_timestamp": 1578863265.0753732, "_step": 12}
{"epoch": 13, "loss": 0.3238074714487249, "iou_score": 0.6712095737457275, "iou_score_student_hard": 0.6712095737457275, "val_loss": 13.412101030349731, "val_iou_score": 0.09224379807710648, "val_iou_score_student_hard": 0.09224379807710648, "_runtime": 582.7028949260712, "_timestamp": 1578863305.021165, "_step": 13}
{"epoch": 14, "loss": 0.3503239783373746, "iou_score": 0.6522232890129089, "iou_score_student_hard": 0.6522232890129089, "val_loss": 13.354234838485718, "val_iou_score": 0.09425417333841324, "val_iou_score_student_hard": 0.09425417333841324, "_runtime": 622.9517447948456, "_timestamp": 1578863345.2700148, "_step": 14}
{"epoch": 15, "loss": 0.34995102828199215, "iou_score": 0.647071123123169, "iou_score_student_hard": 0.647071123123169, "val_loss": 2.7252185463905336, "val_iou_score": 0.711916446685791, "val_iou_score_student_hard": 0.711916446685791, "_runtime": 663.6212508678436, "_timestamp": 1578863385.9395208, "_step": 15}
{"epoch": 16, "loss": 0.3086326027458364, "iou_score": 0.6853271722793579, "iou_score_student_hard": 0.6853271722793579, "val_loss": 13.37734260559082, "val_iou_score": 0.09341169148683548, "val_iou_score_student_hard": 0.09341169148683548, "_runtime": 704.040712594986, "_timestamp": 1578863426.3589826, "_step": 16}
{"epoch": 17, "loss": 0.3277718724174933, "iou_score": 0.6700232625007629, "iou_score_student_hard": 0.6700232625007629, "val_loss": 13.350646352767944, "val_iou_score": 0.09453180432319641, "val_iou_score_student_hard": 0.09453180432319641, "_runtime": 744.0783183574677, "_timestamp": 1578863466.3965883, "_step": 17}
{"epoch": 18, "loss": 0.3667791909792206, "iou_score": 0.6336169242858887, "iou_score_student_hard": 0.6336169242858887, "val_loss": 13.399881649017335, "val_iou_score": 0.09254112094640732, "val_iou_score_student_hard": 0.09254112094640732, "_runtime": 783.9103593826294, "_timestamp": 1578863506.2286294, "_step": 18}
{"epoch": 19, "loss": 0.3581115252592347, "iou_score": 0.6399120688438416, "iou_score_student_hard": 0.6399120688438416, "val_loss": 2.775940787792206, "val_iou_score": 0.7069878578186035, "val_iou_score_student_hard": 0.7069878578186035, "_runtime": 823.9588208198547, "_timestamp": 1578863546.2770908, "_step": 19}
{"epoch": 20, "loss": 0.3169808795506304, "iou_score": 0.677942156791687, "iou_score_student_hard": 0.677942156791687, "val_loss": 13.39343581199646, "val_iou_score": 0.09254700690507889, "val_iou_score_student_hard": 0.09254700690507889, "_runtime": 863.8934540748596, "_timestamp": 1578863586.211724, "_step": 20}
{"epoch": 21, "loss": 0.3145600411024961, "iou_score": 0.6814572215080261, "iou_score_student_hard": 0.6814572215080261, "val_loss": 13.198047351837157, "val_iou_score": 0.09524111449718475, "val_iou_score_student_hard": 0.09524111449718475, "_runtime": 903.724933385849, "_timestamp": 1578863626.0432034, "_step": 21}
{"epoch": 22, "loss": 0.31577111238783057, "iou_score": 0.6788763999938965, "iou_score_student_hard": 0.6788763999938965, "val_loss": 13.35301332473755, "val_iou_score": 0.09430474042892456, "val_iou_score_student_hard": 0.09430474042892456, "_runtime": 943.9041359424591, "_timestamp": 1578863666.222406, "_step": 22}
{"epoch": 23, "loss": 0.3113646679303863, "iou_score": 0.6826270818710327, "iou_score_student_hard": 0.6826270818710327, "val_loss": 13.380401420593262, "val_iou_score": 0.0925944596529007, "val_iou_score_student_hard": 0.0925944596529007, "_runtime": 984.0358901023865, "_timestamp": 1578863706.35416, "_step": 23}
{"epoch": 24, "loss": 0.3050216635519808, "iou_score": 0.6879251599311829, "iou_score_student_hard": 0.6879251599311829, "val_loss": 13.419326496124267, "val_iou_score": 0.09170836210250854, "val_iou_score_student_hard": 0.09170836210250854, "_runtime": 1024.447350025177, "_timestamp": 1578863746.76562, "_step": 24}
{"epoch": 25, "loss": 0.31181329136545005, "iou_score": 0.6842159032821655, "iou_score_student_hard": 0.6842159032821655, "val_loss": 2.753471666574478, "val_iou_score": 0.7082235217094421, "val_iou_score_student_hard": 0.7082235217094421, "_runtime": 1064.55956697464, "_timestamp": 1578863786.877837, "_step": 25}
{"epoch": 26, "loss": 0.3332391127943993, "iou_score": 0.6680785417556763, "iou_score_student_hard": 0.6680785417556763, "val_loss": 13.365745401382446, "val_iou_score": 0.09336056560277939, "val_iou_score_student_hard": 0.09336056560277939, "_runtime": 1105.0354838371277, "_timestamp": 1578863827.3537538, "_step": 26}
{"epoch": 27, "loss": 0.31953332735733553, "iou_score": 0.6788618564605713, "iou_score_student_hard": 0.6788618564605713, "val_loss": 13.434611606597901, "val_iou_score": 0.09127309918403625, "val_iou_score_student_hard": 0.09127309918403625, "_runtime": 1145.0688288211823, "_timestamp": 1578863867.3870988, "_step": 27}
{"epoch": 28, "loss": 0.30994136943058537, "iou_score": 0.6820085644721985, "iou_score_student_hard": 0.6820085644721985, "val_loss": 13.406344938278199, "val_iou_score": 0.09220817685127258, "val_iou_score_student_hard": 0.09220817685127258, "_runtime": 1185.0443007946014, "_timestamp": 1578863907.3625708, "_step": 28}
{"epoch": 29, "loss": 0.30335270640524953, "iou_score": 0.6922236084938049, "iou_score_student_hard": 0.6922236084938049, "val_loss": 2.5569653868675233, "val_iou_score": 0.712216317653656, "val_iou_score_student_hard": 0.712216317653656, "_runtime": 1225.7463471889496, "_timestamp": 1578863948.0646172, "_step": 29}
{"epoch": 30, "loss": 0.30733826052058827, "iou_score": 0.6883388161659241, "iou_score_student_hard": 0.6883388161659241, "val_loss": 2.770862191915512, "val_iou_score": 0.7073773145675659, "val_iou_score_student_hard": 0.7073773145675659, "_runtime": 1265.6551468372345, "_timestamp": 1578863987.9734168, "_step": 30}
{"epoch": 31, "loss": 0.3242943819273602, "iou_score": 0.6749330163002014, "iou_score_student_hard": 0.6749330163002014, "val_loss": 13.431583595275878, "val_iou_score": 0.09119473397731781, "val_iou_score_student_hard": 0.09119473397731781, "_runtime": 1305.4778337478638, "_timestamp": 1578864027.7961037, "_step": 31}
{"epoch": 32, "loss": 0.3707922182299874, "iou_score": 0.6208459734916687, "iou_score_student_hard": 0.6208459734916687, "val_loss": 13.366723442077637, "val_iou_score": 0.09384894371032715, "val_iou_score_student_hard": 0.09384894371032715, "_runtime": 1345.3357141017914, "_timestamp": 1578864067.653984, "_step": 32}
{"epoch": 33, "loss": 0.3442031063816764, "iou_score": 0.6498244404792786, "iou_score_student_hard": 0.6498244404792786, "val_loss": 13.3902587890625, "val_iou_score": 0.09282614290714264, "val_iou_score_student_hard": 0.09282614290714264, "_runtime": 1385.3602690696716, "_timestamp": 1578864107.678539, "_step": 33}
{"epoch": 34, "loss": 0.36094084531068804, "iou_score": 0.6393593549728394, "iou_score_student_hard": 0.6393593549728394, "val_loss": 13.357504940032959, "val_iou_score": 0.09389850497245789, "val_iou_score_student_hard": 0.09389850497245789, "_runtime": 1425.3205468654633, "_timestamp": 1578864147.6388168, "_step": 34}
{"epoch": 35, "loss": 0.3033623393286358, "iou_score": 0.6881007552146912, "iou_score_student_hard": 0.6881007552146912, "val_loss": 2.724173331260681, "val_iou_score": 0.712673544883728, "val_iou_score_student_hard": 0.712673544883728, "_runtime": 1465.3541605472565, "_timestamp": 1578864187.6724305, "_step": 35}
{"epoch": 36, "loss": 0.30547290024432266, "iou_score": 0.6892969012260437, "iou_score_student_hard": 0.6892969012260437, "val_loss": 13.360041332244872, "val_iou_score": 0.09384046494960785, "val_iou_score_student_hard": 0.09384046494960785, "_runtime": 1505.5865054130554, "_timestamp": 1578864227.9047754, "_step": 36}
{"epoch": 37, "loss": 0.3601263701915741, "iou_score": 0.6415734887123108, "iou_score_student_hard": 0.6415734887123108, "val_loss": 2.7753923892974854, "val_iou_score": 0.7069817781448364, "val_iou_score_student_hard": 0.7069817781448364, "_runtime": 1545.6794819831848, "_timestamp": 1578864267.997752, "_step": 37}
{"epoch": 38, "loss": 0.3037354226816784, "iou_score": 0.6921527981758118, "iou_score_student_hard": 0.6921527981758118, "val_loss": 2.823137950897217, "val_iou_score": 0.7029908299446106, "val_iou_score_student_hard": 0.7029908299446106, "_runtime": 1585.4655802249908, "_timestamp": 1578864307.7838502, "_step": 38}
{"epoch": 39, "loss": 0.29867976036938754, "iou_score": 0.6934466361999512, "iou_score_student_hard": 0.6934466361999512, "val_loss": 13.357009744644165, "val_iou_score": 0.0939302071928978, "val_iou_score_student_hard": 0.0939302071928978, "_runtime": 1625.1621351242065, "_timestamp": 1578864347.480405, "_step": 39}
{"epoch": 40, "loss": 0.30170307592912154, "iou_score": 0.6974895000457764, "iou_score_student_hard": 0.6974895000457764, "val_loss": 2.7886627554893493, "val_iou_score": 0.7068163156509399, "val_iou_score_student_hard": 0.7068163156509399, "_runtime": 1665.02516579628, "_timestamp": 1578864387.3434358, "_step": 40}
{"epoch": 41, "loss": 0.308281158181754, "iou_score": 0.688974142074585, "iou_score_student_hard": 0.688974142074585, "val_loss": 13.381635427474976, "val_iou_score": 0.09328220784664154, "val_iou_score_student_hard": 0.09328220784664154, "_runtime": 1704.8895494937897, "_timestamp": 1578864427.2078195, "_step": 41}
{"epoch": 42, "loss": 0.3133839519186453, "iou_score": 0.6836680769920349, "iou_score_student_hard": 0.6836680769920349, "val_loss": 13.389996242523193, "val_iou_score": 0.09273029863834381, "val_iou_score_student_hard": 0.09273029863834381, "_runtime": 1745.1145882606506, "_timestamp": 1578864467.4328582, "_step": 42}
{"epoch": 43, "loss": 0.2975426503203132, "iou_score": 0.6961910724639893, "iou_score_student_hard": 0.6961910724639893, "val_loss": 11.820138359069825, "val_iou_score": 0.09492066502571106, "val_iou_score_student_hard": 0.09492066502571106, "_runtime": 1785.1198148727417, "_timestamp": 1578864507.4380848, "_step": 43}
{"epoch": 44, "loss": 0.2955298751592636, "iou_score": 0.7013261914253235, "iou_score_student_hard": 0.7013261914253235, "val_loss": 0.49227829128503797, "val_iou_score": 0.7257031798362732, "val_iou_score_student_hard": 0.7257031798362732, "_runtime": 1825.1079778671265, "_timestamp": 1578864547.4262478, "_step": 44}
{"epoch": 45, "loss": 0.29617797366597437, "iou_score": 0.6995168328285217, "iou_score_student_hard": 0.6995168328285217, "val_loss": 2.729982727766037, "val_iou_score": 0.711354672908783, "val_iou_score_student_hard": 0.711354672908783, "_runtime": 1865.776064157486, "_timestamp": 1578864588.0943341, "_step": 45}
{"epoch": 46, "loss": 0.30768656730651855, "iou_score": 0.690419614315033, "iou_score_student_hard": 0.690419614315033, "val_loss": 2.7348228693008423, "val_iou_score": 0.7110615968704224, "val_iou_score_student_hard": 0.7110615968704224, "_runtime": 1905.547456741333, "_timestamp": 1578864627.8657267, "_step": 46}
{"epoch": 47, "loss": 0.30089109783822837, "iou_score": 0.6949887871742249, "iou_score_student_hard": 0.6949887871742249, "val_loss": 2.7221297681331635, "val_iou_score": 0.7117555141448975, "val_iou_score_student_hard": 0.7117555141448975, "_runtime": 1945.4532635211945, "_timestamp": 1578864667.7715335, "_step": 47}
{"epoch": 48, "loss": 0.30519571724263106, "iou_score": 0.6921688318252563, "iou_score_student_hard": 0.6921688318252563, "val_loss": 13.409286165237427, "val_iou_score": 0.09215890616178513, "val_iou_score_student_hard": 0.09215890616178513, "_runtime": 1985.2018978595734, "_timestamp": 1578864707.5201678, "_step": 48}
{"epoch": 49, "loss": 0.29623610133474526, "iou_score": 0.6993144154548645, "iou_score_student_hard": 0.6993144154548645, "val_loss": 13.396409702301025, "val_iou_score": 0.09266828745603561, "val_iou_score_student_hard": 0.09266828745603561, "_runtime": 2025.3449969291687, "_timestamp": 1578864747.663267, "_step": 49}
{"epoch": 50, "loss": 0.3573449264873158, "iou_score": 0.6492308378219604, "iou_score_student_hard": 0.6492308378219604, "val_loss": 13.341240167617798, "val_iou_score": 0.0944729894399643, "val_iou_score_student_hard": 0.0944729894399643, "_runtime": 2065.4424633979797, "_timestamp": 1578864787.7607334, "_step": 50}
{"epoch": 51, "loss": 0.33899638585068964, "iou_score": 0.6582887172698975, "iou_score_student_hard": 0.6582887172698975, "val_loss": 2.756557470560074, "val_iou_score": 0.709689199924469, "val_iou_score_student_hard": 0.709689199924469, "_runtime": 2105.334835767746, "_timestamp": 1578864827.6531057, "_step": 51}
{"epoch": 52, "loss": 0.29642732346599754, "iou_score": 0.6996192336082458, "iou_score_student_hard": 0.6996192336082458, "val_loss": 2.7698576867580416, "val_iou_score": 0.7084325551986694, "val_iou_score_student_hard": 0.7084325551986694, "_runtime": 2145.564544916153, "_timestamp": 1578864867.882815, "_step": 52}
{"epoch": 53, "loss": 0.29754427386955784, "iou_score": 0.6982179284095764, "iou_score_student_hard": 0.6982179284095764, "val_loss": 2.7674774825572968, "val_iou_score": 0.7077422738075256, "val_iou_score_student_hard": 0.7077422738075256, "_runtime": 2185.420654773712, "_timestamp": 1578864907.7389247, "_step": 53}
{"epoch": 54, "loss": 0.29453449777581475, "iou_score": 0.702236533164978, "iou_score_student_hard": 0.702236533164978, "val_loss": 2.7555988252162935, "val_iou_score": 0.7102676630020142, "val_iou_score_student_hard": 0.7102676630020142, "_runtime": 2225.4592196941376, "_timestamp": 1578864947.7774897, "_step": 54}
{"epoch": 55, "loss": 0.29510656039823185, "iou_score": 0.7008904814720154, "iou_score_student_hard": 0.7008904814720154, "val_loss": 13.404130458831787, "val_iou_score": 0.09243255853652954, "val_iou_score_student_hard": 0.09243255853652954, "_runtime": 2265.34440946579, "_timestamp": 1578864987.6626794, "_step": 55}
{"epoch": 56, "loss": 0.2995824930342761, "iou_score": 0.698211669921875, "iou_score_student_hard": 0.698211669921875, "val_loss": 2.718618929386139, "val_iou_score": 0.7123976945877075, "val_iou_score_student_hard": 0.7123976945877075, "_runtime": 2305.2075366973877, "_timestamp": 1578865027.5258067, "_step": 56}
{"epoch": 57, "loss": 0.29786686653440647, "iou_score": 0.6961648464202881, "iou_score_student_hard": 0.6961648464202881, "val_loss": 13.366054391860962, "val_iou_score": 0.09370461106300354, "val_iou_score_student_hard": 0.09370461106300354, "_runtime": 2345.01447725296, "_timestamp": 1578865067.3327472, "_step": 57}
{"epoch": 58, "loss": 0.30104098509658467, "iou_score": 0.6961182355880737, "iou_score_student_hard": 0.6961182355880737, "val_loss": 2.765612703561783, "val_iou_score": 0.7081238031387329, "val_iou_score_student_hard": 0.7081238031387329, "_runtime": 2384.7084069252014, "_timestamp": 1578865107.026677, "_step": 58}
{"epoch": 59, "loss": 0.3051533662460067, "iou_score": 0.6901850700378418, "iou_score_student_hard": 0.6901850700378418, "val_loss": 13.41264328956604, "val_iou_score": 0.09191104769706726, "val_iou_score_student_hard": 0.09191104769706726, "_runtime": 2424.5388317108154, "_timestamp": 1578865146.8571017, "_step": 59}
{"epoch": 60, "loss": 0.29362175505269655, "iou_score": 0.7018700838088989, "iou_score_student_hard": 0.7018700838088989, "val_loss": 0.956283912062645, "val_iou_score": 0.7103153467178345, "val_iou_score_student_hard": 0.7103153467178345, "_runtime": 2464.9232647418976, "_timestamp": 1578865187.2415347, "_step": 60}
{"epoch": 61, "loss": 0.29432232732122593, "iou_score": 0.7001714110374451, "iou_score_student_hard": 0.7001714110374451, "val_loss": 2.787827801704407, "val_iou_score": 0.7066289782524109, "val_iou_score_student_hard": 0.7066289782524109, "_runtime": 2504.785398721695, "_timestamp": 1578865227.1036687, "_step": 61}
{"epoch": 62, "loss": 0.29192715842615474, "iou_score": 0.7031288146972656, "iou_score_student_hard": 0.7031288146972656, "val_loss": 2.766932499408722, "val_iou_score": 0.7078575491905212, "val_iou_score_student_hard": 0.7078575491905212, "_runtime": 2544.562049627304, "_timestamp": 1578865266.8803196, "_step": 62}
{"epoch": 63, "loss": 0.3066106304526329, "iou_score": 0.6914876699447632, "iou_score_student_hard": 0.6914876699447632, "val_loss": 13.395142602920533, "val_iou_score": 0.09264574944972992, "val_iou_score_student_hard": 0.09264574944972992, "_runtime": 2584.4589536190033, "_timestamp": 1578865306.7772236, "_step": 63}
{"epoch": 64, "loss": 0.29613094411113045, "iou_score": 0.6981344223022461, "iou_score_student_hard": 0.6981344223022461, "val_loss": 13.397696733474731, "val_iou_score": 0.09260135143995285, "val_iou_score_student_hard": 0.09260135143995285, "_runtime": 2624.5957181453705, "_timestamp": 1578865346.913988, "_step": 64}
{"epoch": 65, "loss": 0.29314739243550736, "iou_score": 0.7028017044067383, "iou_score_student_hard": 0.7028017044067383, "val_loss": 13.37323899269104, "val_iou_score": 0.09358672797679901, "val_iou_score_student_hard": 0.09358672797679901, "_runtime": 2664.6640112400055, "_timestamp": 1578865386.9822812, "_step": 65}
{"epoch": 66, "loss": 0.29459195841442454, "iou_score": 0.7023646235466003, "iou_score_student_hard": 0.7023646235466003, "val_loss": 2.8115869402885436, "val_iou_score": 0.704584002494812, "val_iou_score_student_hard": 0.704584002494812, "_runtime": 2704.8807158470154, "_timestamp": 1578865427.1989858, "_step": 66}
{"epoch": 67, "loss": 0.285276022688909, "iou_score": 0.7073651552200317, "iou_score_student_hard": 0.7073651552200317, "val_loss": 13.404461860656738, "val_iou_score": 0.09213888645172119, "val_iou_score_student_hard": 0.09213888645172119, "_runtime": 2744.6892743110657, "_timestamp": 1578865467.0075443, "_step": 67}
{"epoch": 68, "loss": 0.3433694057843902, "iou_score": 0.6601231098175049, "iou_score_student_hard": 0.6601231098175049, "val_loss": 2.755861979722977, "val_iou_score": 0.7091756463050842, "val_iou_score_student_hard": 0.7091756463050842, "_runtime": 2784.7173919677734, "_timestamp": 1578865507.035662, "_step": 68}
{"epoch": 69, "loss": 0.2905025474049828, "iou_score": 0.7017210721969604, "iou_score_student_hard": 0.7017210721969604, "val_loss": 4.065641701221466, "val_iou_score": 0.10535724461078644, "val_iou_score_student_hard": 0.10535724461078644, "_runtime": 2824.9195189476013, "_timestamp": 1578865547.237789, "_step": 69}
{"epoch": 70, "loss": 0.3191698454997756, "iou_score": 0.6829707026481628, "iou_score_student_hard": 0.6829707026481628, "val_loss": 13.371786308288574, "val_iou_score": 0.09350116550922394, "val_iou_score_student_hard": 0.09350116550922394, "_runtime": 2864.975715637207, "_timestamp": 1578865587.2939856, "_step": 70}
{"epoch": 71, "loss": 0.34752231646667825, "iou_score": 0.6482404470443726, "iou_score_student_hard": 0.6482404470443726, "val_loss": 13.41620225906372, "val_iou_score": 0.09179076552391052, "val_iou_score_student_hard": 0.09179076552391052, "_runtime": 2904.843154668808, "_timestamp": 1578865627.1614246, "_step": 71}
{"epoch": 72, "loss": 0.3581626839258454, "iou_score": 0.6384490728378296, "iou_score_student_hard": 0.6384490728378296, "val_loss": 13.402387714385986, "val_iou_score": 0.09238927811384201, "val_iou_score_student_hard": 0.09238927811384201, "_runtime": 2944.8262243270874, "_timestamp": 1578865667.1444943, "_step": 72}
{"epoch": 73, "loss": 0.29417764544487, "iou_score": 0.6996337175369263, "iou_score_student_hard": 0.6996337175369263, "val_loss": 2.7103998839855192, "val_iou_score": 0.713339626789093, "val_iou_score_student_hard": 0.713339626789093, "_runtime": 2984.804869413376, "_timestamp": 1578865707.1231394, "_step": 73}
{"epoch": 74, "loss": 0.2912689863280816, "iou_score": 0.7024396061897278, "iou_score_student_hard": 0.7024396061897278, "val_loss": 2.7402278423309325, "val_iou_score": 0.7109676599502563, "val_iou_score_student_hard": 0.7109676599502563, "_runtime": 3024.650439977646, "_timestamp": 1578865746.96871, "_step": 74}
{"epoch": 75, "loss": 0.3319281469691883, "iou_score": 0.6712108254432678, "iou_score_student_hard": 0.6712108254432678, "val_loss": 13.384738111495972, "val_iou_score": 0.09294536709785461, "val_iou_score_student_hard": 0.09294536709785461, "_runtime": 3064.6162695884705, "_timestamp": 1578865786.9345396, "_step": 75}
{"epoch": 76, "loss": 0.3547697194597938, "iou_score": 0.6360957026481628, "iou_score_student_hard": 0.6360957026481628, "val_loss": 13.376600503921509, "val_iou_score": 0.09339650720357895, "val_iou_score_student_hard": 0.09339650720357895, "_runtime": 3104.7124903202057, "_timestamp": 1578865827.0307603, "_step": 76}
{"epoch": 77, "loss": 0.32698120745745574, "iou_score": 0.6680096983909607, "iou_score_student_hard": 0.6680096983909607, "val_loss": 13.385813426971435, "val_iou_score": 0.09283603727817535, "val_iou_score_student_hard": 0.09283603727817535, "_runtime": 3144.959938287735, "_timestamp": 1578865867.2782083, "_step": 77}
{"epoch": 78, "loss": 0.3281614646315575, "iou_score": 0.6674028038978577, "iou_score_student_hard": 0.6674028038978577, "val_loss": 13.308586168289185, "val_iou_score": 0.09583058208227158, "val_iou_score_student_hard": 0.09583058208227158, "_runtime": 3184.8324007987976, "_timestamp": 1578865907.1506708, "_step": 78}
{"epoch": 79, "loss": 0.3410806092348966, "iou_score": 0.6616689562797546, "iou_score_student_hard": 0.6616689562797546, "val_loss": 13.377636623382568, "val_iou_score": 0.09315519779920578, "val_iou_score_student_hard": 0.09315519779920578, "_runtime": 3224.819262742996, "_timestamp": 1578865947.1375327, "_step": 79}
{"epoch": 80, "loss": 0.34485332667827606, "iou_score": 0.652804970741272, "iou_score_student_hard": 0.652804970741272, "val_loss": 6.913726449012756, "val_iou_score": 0.09442511200904846, "val_iou_score_student_hard": 0.09442511200904846, "_runtime": 3265.0861043930054, "_timestamp": 1578865987.4043744, "_step": 80}
{"epoch": 81, "loss": 0.31294087293473155, "iou_score": 0.6806883811950684, "iou_score_student_hard": 0.6806883811950684, "val_loss": 2.68759229183197, "val_iou_score": 0.7153533101081848, "val_iou_score_student_hard": 0.7153533101081848, "_runtime": 3305.0419516563416, "_timestamp": 1578866027.3602216, "_step": 81}
{"epoch": 82, "loss": 0.321418942917477, "iou_score": 0.6764258146286011, "iou_score_student_hard": 0.6764258146286011, "val_loss": 13.3755793094635, "val_iou_score": 0.09327242523431778, "val_iou_score_student_hard": 0.09327242523431778, "_runtime": 3345.43474316597, "_timestamp": 1578866067.7530131, "_step": 82}
{"epoch": 83, "loss": 0.3286107155409726, "iou_score": 0.6686294078826904, "iou_score_student_hard": 0.6686294078826904, "val_loss": 2.6996488511562347, "val_iou_score": 0.7143105864524841, "val_iou_score_student_hard": 0.7143105864524841, "_runtime": 3385.304171562195, "_timestamp": 1578866107.6224415, "_step": 83}
{"epoch": 84, "loss": 0.31780755953355266, "iou_score": 0.678293764591217, "iou_score_student_hard": 0.678293764591217, "val_loss": 12.944762659072875, "val_iou_score": 0.09435591846704483, "val_iou_score_student_hard": 0.09435591846704483, "_runtime": 3425.2104518413544, "_timestamp": 1578866147.5287218, "_step": 84}
{"epoch": 85, "loss": 0.3033501280979677, "iou_score": 0.690549910068512, "iou_score_student_hard": 0.690549910068512, "val_loss": 13.41097092628479, "val_iou_score": 0.09108476340770721, "val_iou_score_student_hard": 0.09108476340770721, "_runtime": 3465.043289899826, "_timestamp": 1578866187.3615599, "_step": 85}
{"epoch": 86, "loss": 0.32832028323953805, "iou_score": 0.6733385324478149, "iou_score_student_hard": 0.6733385324478149, "val_loss": 13.369224882125854, "val_iou_score": 0.09334758669137955, "val_iou_score_student_hard": 0.09334758669137955, "_runtime": 3504.98464679718, "_timestamp": 1578866227.3029168, "_step": 86}
{"epoch": 87, "loss": 0.30297296114943245, "iou_score": 0.6907175779342651, "iou_score_student_hard": 0.6907175779342651, "val_loss": 2.7676974654197695, "val_iou_score": 0.7076883912086487, "val_iou_score_student_hard": 0.7076883912086487, "_runtime": 3545.223351955414, "_timestamp": 1578866267.541622, "_step": 87}
{"epoch": 88, "loss": 0.30031513341448524, "iou_score": 0.6956531405448914, "iou_score_student_hard": 0.6956531405448914, "val_loss": 2.7322294116020203, "val_iou_score": 0.7111859917640686, "val_iou_score_student_hard": 0.7111859917640686, "_runtime": 3585.141364812851, "_timestamp": 1578866307.4596348, "_step": 88}
{"epoch": 89, "loss": 0.29784531200473957, "iou_score": 0.6979767084121704, "iou_score_student_hard": 0.6979767084121704, "val_loss": 5.7840763330459595, "val_iou_score": 0.09493126720190048, "val_iou_score_student_hard": 0.09493126720190048, "_runtime": 3625.031515598297, "_timestamp": 1578866347.3497856, "_step": 89}
{"epoch": 90, "loss": 0.29920310337435113, "iou_score": 0.6937060356140137, "iou_score_student_hard": 0.6937060356140137, "val_loss": 13.349467754364014, "val_iou_score": 0.09419454634189606, "val_iou_score_student_hard": 0.09419454634189606, "_runtime": 3664.740211725235, "_timestamp": 1578866387.0584817, "_step": 90}
{"epoch": 91, "loss": 0.30286298150366003, "iou_score": 0.6918326616287231, "iou_score_student_hard": 0.6918326616287231, "val_loss": 2.7440069735050203, "val_iou_score": 0.7098504900932312, "val_iou_score_student_hard": 0.7098504900932312, "_runtime": 3704.5298743247986, "_timestamp": 1578866426.8481443, "_step": 91}
{"epoch": 92, "loss": 0.29164028723131524, "iou_score": 0.701863169670105, "iou_score_student_hard": 0.701863169670105, "val_loss": 13.393406915664674, "val_iou_score": 0.09286903589963913, "val_iou_score_student_hard": 0.09286903589963913, "_runtime": 3744.4292075634003, "_timestamp": 1578866466.7474775, "_step": 92}
{"epoch": 93, "loss": 0.296292176165364, "iou_score": 0.6990287899971008, "iou_score_student_hard": 0.6990287899971008, "val_loss": 13.401504278182983, "val_iou_score": 0.09230931848287582, "val_iou_score_student_hard": 0.09230931848287582, "_runtime": 3784.2338585853577, "_timestamp": 1578866506.5521286, "_step": 93}
{"epoch": 94, "loss": 0.2952540816231207, "iou_score": 0.6989829540252686, "iou_score_student_hard": 0.6989829540252686, "val_loss": 13.333128452301025, "val_iou_score": 0.09497594088315964, "val_iou_score_student_hard": 0.09497594088315964, "_runtime": 3824.393316268921, "_timestamp": 1578866546.7115862, "_step": 94}
{"epoch": 95, "loss": 0.29228494302792984, "iou_score": 0.6989427208900452, "iou_score_student_hard": 0.6989427208900452, "val_loss": 13.317067098617553, "val_iou_score": 0.09549660235643387, "val_iou_score_student_hard": 0.09549660235643387, "_runtime": 3864.5579557418823, "_timestamp": 1578866586.8762257, "_step": 95}
{"epoch": 96, "loss": 0.30209575999866833, "iou_score": 0.6948763132095337, "iou_score_student_hard": 0.6948763132095337, "val_loss": 13.40382523536682, "val_iou_score": 0.09248771518468857, "val_iou_score_student_hard": 0.09248771518468857, "_runtime": 3904.3642902374268, "_timestamp": 1578866626.6825602, "_step": 96}
{"epoch": 97, "loss": 0.29012344872409646, "iou_score": 0.7012532949447632, "iou_score_student_hard": 0.7012532949447632, "val_loss": 13.387566995620727, "val_iou_score": 0.09292811155319214, "val_iou_score_student_hard": 0.09292811155319214, "_runtime": 3944.1856088638306, "_timestamp": 1578866666.5038788, "_step": 97}
{"epoch": 98, "loss": 0.2944170442494479, "iou_score": 0.7021796703338623, "iou_score_student_hard": 0.7021796703338623, "val_loss": 2.7443044245243073, "val_iou_score": 0.709973156452179, "val_iou_score_student_hard": 0.709973156452179, "_runtime": 3984.159901857376, "_timestamp": 1578866706.4781718, "_step": 98}
{"epoch": 99, "loss": 0.29843108518557115, "iou_score": 0.6970638632774353, "iou_score_student_hard": 0.6970638632774353, "val_loss": 13.38233060836792, "val_iou_score": 0.09310410916805267, "val_iou_score_student_hard": 0.09310410916805267, "_runtime": 4024.0626027584076, "_timestamp": 1578866746.3808727, "_step": 99}
{"epoch": 100, "loss": 0.2875441685318947, "iou_score": 0.7058765292167664, "iou_score_student_hard": 0.7058765292167664, "val_loss": 2.7570614218711853, "val_iou_score": 0.7096380591392517, "val_iou_score_student_hard": 0.7096380591392517, "_runtime": 4064.003443956375, "_timestamp": 1578866786.321714, "_step": 100}
{"epoch": 101, "loss": 0.2992080901156772, "iou_score": 0.6958577036857605, "iou_score_student_hard": 0.6958577036857605, "val_loss": 2.766575825214386, "val_iou_score": 0.708728015422821, "val_iou_score_student_hard": 0.708728015422821, "_runtime": 4103.797781705856, "_timestamp": 1578866826.1160517, "_step": 101}
{"epoch": 102, "loss": 0.29459686333482915, "iou_score": 0.6987965703010559, "iou_score_student_hard": 0.6987965703010559, "val_loss": 13.400718832015992, "val_iou_score": 0.09238378703594208, "val_iou_score_student_hard": 0.09238378703594208, "_runtime": 4143.691113233566, "_timestamp": 1578866866.0093832, "_step": 102}
{"epoch": 103, "loss": 0.29354283443906093, "iou_score": 0.6999447345733643, "iou_score_student_hard": 0.6999447345733643, "val_loss": 13.365724325180054, "val_iou_score": 0.09376620501279831, "val_iou_score_student_hard": 0.09376620501279831, "_runtime": 4183.652307748795, "_timestamp": 1578866905.9705777, "_step": 103}
{"epoch": 104, "loss": 0.2960384146733718, "iou_score": 0.6975222229957581, "iou_score_student_hard": 0.6975222229957581, "val_loss": 13.370431089401245, "val_iou_score": 0.09369194507598877, "val_iou_score_student_hard": 0.09369194507598877, "_runtime": 4223.541543960571, "_timestamp": 1578866945.859814, "_step": 104}
{"epoch": 105, "loss": 0.2883626261895353, "iou_score": 0.7035169005393982, "iou_score_student_hard": 0.7035169005393982, "val_loss": 2.72681645154953, "val_iou_score": 0.7116016745567322, "val_iou_score_student_hard": 0.7116016745567322, "_runtime": 4263.215137958527, "_timestamp": 1578866985.533408, "_step": 105}
{"epoch": 106, "loss": 0.2980119449171153, "iou_score": 0.6965993046760559, "iou_score_student_hard": 0.6965993046760559, "val_loss": 13.399100065231323, "val_iou_score": 0.09251918643712997, "val_iou_score_student_hard": 0.09251918643712997, "_runtime": 4303.140106678009, "_timestamp": 1578867025.4583766, "_step": 106}
{"epoch": 107, "loss": 0.2931319677016952, "iou_score": 0.7012760639190674, "iou_score_student_hard": 0.7012760639190674, "val_loss": 2.754469043016434, "val_iou_score": 0.7091715931892395, "val_iou_score_student_hard": 0.7091715931892395, "_runtime": 4343.017233133316, "_timestamp": 1578867065.335503, "_step": 107}
{"epoch": 108, "loss": 0.29287962019443514, "iou_score": 0.7012445330619812, "iou_score_student_hard": 0.7012445330619812, "val_loss": 2.7000068187713624, "val_iou_score": 0.7145129442214966, "val_iou_score_student_hard": 0.7145129442214966, "_runtime": 4382.684762954712, "_timestamp": 1578867105.003033, "_step": 108}
{"epoch": 109, "loss": 0.29078005213629116, "iou_score": 0.7044782638549805, "iou_score_student_hard": 0.7044782638549805, "val_loss": 2.711949896812439, "val_iou_score": 0.7124320268630981, "val_iou_score_student_hard": 0.7124320268630981, "_runtime": 4422.747679233551, "_timestamp": 1578867145.0659492, "_step": 109}
{"epoch": 110, "loss": 0.2903921162540262, "iou_score": 0.7027347087860107, "iou_score_student_hard": 0.7027347087860107, "val_loss": 13.378602647781372, "val_iou_score": 0.09334544837474823, "val_iou_score_student_hard": 0.09334544837474823, "_runtime": 4462.751024723053, "_timestamp": 1578867185.0692947, "_step": 110}
{"epoch": 111, "loss": 0.28393260687589644, "iou_score": 0.7089730501174927, "iou_score_student_hard": 0.7089730501174927, "val_loss": 2.7560914516448975, "val_iou_score": 0.7093609571456909, "val_iou_score_student_hard": 0.7093609571456909, "_runtime": 4502.633645772934, "_timestamp": 1578867224.9519157, "_step": 111}
{"epoch": 112, "loss": 0.28870760080489244, "iou_score": 0.7051137089729309, "iou_score_student_hard": 0.7051137089729309, "val_loss": 13.274515008926391, "val_iou_score": 0.09743895381689072, "val_iou_score_student_hard": 0.09743895381689072, "_runtime": 4542.869779348373, "_timestamp": 1578867265.1880493, "_step": 112}
{"epoch": 113, "loss": 0.3008077999407595, "iou_score": 0.6970338821411133, "iou_score_student_hard": 0.6970338821411133, "val_loss": 13.414803409576416, "val_iou_score": 0.09184979647397995, "val_iou_score_student_hard": 0.09184979647397995, "_runtime": 4583.0556762218475, "_timestamp": 1578867305.3739462, "_step": 113}
{"epoch": 114, "loss": 0.372338875179941, "iou_score": 0.6294419169425964, "iou_score_student_hard": 0.6294419169425964, "val_loss": 13.33438000679016, "val_iou_score": 0.09474356472492218, "val_iou_score_student_hard": 0.09474356472492218, "_runtime": 4623.2366807460785, "_timestamp": 1578867345.5549507, "_step": 114}
{"epoch": 115, "loss": 0.34143574156544426, "iou_score": 0.6535809636116028, "iou_score_student_hard": 0.6535809636116028, "val_loss": 13.401177740097046, "val_iou_score": 0.0922795757651329, "val_iou_score_student_hard": 0.0922795757651329, "_runtime": 4662.921583414078, "_timestamp": 1578867385.2398534, "_step": 115}
{"epoch": 116, "loss": 0.28688415546308865, "iou_score": 0.7035059928894043, "iou_score_student_hard": 0.7035059928894043, "val_loss": 2.8111271619796754, "val_iou_score": 0.7051032781600952, "val_iou_score_student_hard": 0.7051032781600952, "_runtime": 4702.971208572388, "_timestamp": 1578867425.2894785, "_step": 116}
{"epoch": 117, "loss": 0.2935444937510924, "iou_score": 0.7025051712989807, "iou_score_student_hard": 0.7025051712989807, "val_loss": 2.783113235235214, "val_iou_score": 0.7069017887115479, "val_iou_score_student_hard": 0.7069017887115479, "_runtime": 4743.060140609741, "_timestamp": 1578867465.3784106, "_step": 117}
{"epoch": 118, "loss": 0.2950184066187252, "iou_score": 0.6983041167259216, "iou_score_student_hard": 0.6983041167259216, "val_loss": 2.6903739631175996, "val_iou_score": 0.715603232383728, "val_iou_score_student_hard": 0.715603232383728, "_runtime": 4783.1420545578, "_timestamp": 1578867505.4603245, "_step": 118}
{"epoch": 119, "loss": 0.2875219239429994, "iou_score": 0.7043328881263733, "iou_score_student_hard": 0.7043328881263733, "val_loss": 13.416572666168213, "val_iou_score": 0.09183694422245026, "val_iou_score_student_hard": 0.09183694422245026, "_runtime": 4823.233666181564, "_timestamp": 1578867545.5519361, "_step": 119}
{"epoch": 120, "loss": 0.29089974733916196, "iou_score": 0.701339602470398, "iou_score_student_hard": 0.701339602470398, "val_loss": 13.364061117172241, "val_iou_score": 0.0937623605132103, "val_iou_score_student_hard": 0.0937623605132103, "_runtime": 4863.075469017029, "_timestamp": 1578867585.393739, "_step": 120}
{"epoch": 121, "loss": 0.38866564374078405, "iou_score": 0.6172588467597961, "iou_score_student_hard": 0.6172588467597961, "val_loss": 13.331640386581421, "val_iou_score": 0.09507289528846741, "val_iou_score_student_hard": 0.09507289528846741, "_runtime": 4903.1449954509735, "_timestamp": 1578867625.4632654, "_step": 121}
{"epoch": 122, "loss": 0.3525500760837035, "iou_score": 0.6423510313034058, "iou_score_student_hard": 0.6423510313034058, "val_loss": 13.360916328430175, "val_iou_score": 0.09401153028011322, "val_iou_score_student_hard": 0.09401153028011322, "_runtime": 4943.219291210175, "_timestamp": 1578867665.5375612, "_step": 122}
{"epoch": 123, "loss": 0.31989819570021194, "iou_score": 0.6670075058937073, "iou_score_student_hard": 0.6670075058937073, "val_loss": 13.41897406578064, "val_iou_score": 0.09167735278606415, "val_iou_score_student_hard": 0.09167735278606415, "_runtime": 4983.2353274822235, "_timestamp": 1578867705.5535975, "_step": 123}
{"epoch": 124, "loss": 0.3216304283250462, "iou_score": 0.6759382486343384, "iou_score_student_hard": 0.6759382486343384, "val_loss": 2.7645272612571716, "val_iou_score": 0.7082403898239136, "val_iou_score_student_hard": 0.7082403898239136, "_runtime": 5023.09432220459, "_timestamp": 1578867745.4125922, "_step": 124}
{"epoch": 125, "loss": 0.30429001409899104, "iou_score": 0.6866003274917603, "iou_score_student_hard": 0.6866003274917603, "val_loss": 2.7337978422641753, "val_iou_score": 0.7080928683280945, "val_iou_score_student_hard": 0.7080928683280945, "_runtime": 5062.85173201561, "_timestamp": 1578867785.170002, "_step": 125}
{"epoch": 126, "loss": 0.29721302959052, "iou_score": 0.695059597492218, "iou_score_student_hard": 0.695059597492218, "val_loss": 9.012730884552003, "val_iou_score": 0.09207888692617416, "val_iou_score_student_hard": 0.09207888692617416, "_runtime": 5102.898408412933, "_timestamp": 1578867825.2166784, "_step": 126}
{"epoch": 127, "loss": 0.3040869947184216, "iou_score": 0.689164936542511, "iou_score_student_hard": 0.689164936542511, "val_loss": 2.7235454857349395, "val_iou_score": 0.712509036064148, "val_iou_score_student_hard": 0.712509036064148, "_runtime": 5142.96160697937, "_timestamp": 1578867865.279877, "_step": 127}
{"epoch": 128, "loss": 0.295687359706922, "iou_score": 0.6967283487319946, "iou_score_student_hard": 0.6967283487319946, "val_loss": 2.780955159664154, "val_iou_score": 0.7069628238677979, "val_iou_score_student_hard": 0.7069628238677979, "_runtime": 5182.990747451782, "_timestamp": 1578867905.3090174, "_step": 128}
{"epoch": 129, "loss": 0.2981222924861041, "iou_score": 0.6970083713531494, "iou_score_student_hard": 0.6970083713531494, "val_loss": 13.337972450256348, "val_iou_score": 0.09480953216552734, "val_iou_score_student_hard": 0.09480953216552734, "_runtime": 5223.165108919144, "_timestamp": 1578867945.483379, "_step": 129}
{"epoch": 130, "loss": 0.29957328113642606, "iou_score": 0.6963911056518555, "iou_score_student_hard": 0.6963911056518555, "val_loss": 13.344495630264282, "val_iou_score": 0.09466680884361267, "val_iou_score_student_hard": 0.09466680884361267, "_runtime": 5263.395776748657, "_timestamp": 1578867985.7140467, "_step": 130}
{"epoch": 131, "loss": 0.2940083674409173, "iou_score": 0.6989313960075378, "iou_score_student_hard": 0.6989313960075378, "val_loss": 2.771474301815033, "val_iou_score": 0.707344651222229, "val_iou_score_student_hard": 0.707344651222229, "_runtime": 5303.474910736084, "_timestamp": 1578868025.7931807, "_step": 131}
{"epoch": 132, "loss": 0.2886263722723181, "iou_score": 0.7042969465255737, "iou_score_student_hard": 0.7042969465255737, "val_loss": 13.380154609680176, "val_iou_score": 0.09302231669425964, "val_iou_score_student_hard": 0.09302231669425964, "_runtime": 5343.282985925674, "_timestamp": 1578868065.601256, "_step": 132}
{"epoch": 133, "loss": 0.2906030465256084, "iou_score": 0.7018786072731018, "iou_score_student_hard": 0.7018786072731018, "val_loss": 13.410843849182129, "val_iou_score": 0.09208723157644272, "val_iou_score_student_hard": 0.09208723157644272, "_runtime": 5383.150175571442, "_timestamp": 1578868105.4684455, "_step": 133}
{"epoch": 134, "loss": 0.2930624642155387, "iou_score": 0.6983095407485962, "iou_score_student_hard": 0.6983095407485962, "val_loss": 13.396328115463257, "val_iou_score": 0.09254033118486404, "val_iou_score_student_hard": 0.09254033118486404, "_runtime": 5423.042551755905, "_timestamp": 1578868145.3608217, "_step": 134}
{"epoch": 135, "loss": 0.2923533866351301, "iou_score": 0.7002949714660645, "iou_score_student_hard": 0.7002949714660645, "val_loss": 13.372882080078124, "val_iou_score": 0.09348990768194199, "val_iou_score_student_hard": 0.09348990768194199, "_runtime": 5463.221043348312, "_timestamp": 1578868185.5393133, "_step": 135}
{"epoch": 136, "loss": 0.28488888009028, "iou_score": 0.7060074806213379, "iou_score_student_hard": 0.7060074806213379, "val_loss": 13.356715154647826, "val_iou_score": 0.09405247122049332, "val_iou_score_student_hard": 0.09405247122049332, "_runtime": 5503.184292554855, "_timestamp": 1578868225.5025625, "_step": 136}
{"epoch": 137, "loss": 0.2857882178642533, "iou_score": 0.7072072625160217, "iou_score_student_hard": 0.7072072625160217, "val_loss": 2.7395922362804415, "val_iou_score": 0.710069477558136, "val_iou_score_student_hard": 0.710069477558136, "_runtime": 5543.002300262451, "_timestamp": 1578868265.3205702, "_step": 137}
{"epoch": 138, "loss": 0.3232337312264876, "iou_score": 0.6733143329620361, "iou_score_student_hard": 0.6733143329620361, "val_loss": 13.349459743499756, "val_iou_score": 0.09427154064178467, "val_iou_score_student_hard": 0.09427154064178467, "_runtime": 5582.557318210602, "_timestamp": 1578868304.8755882, "_step": 138}
{"epoch": 139, "loss": 0.2867563872174783, "iou_score": 0.7077686786651611, "iou_score_student_hard": 0.7077686786651611, "val_loss": 2.8003976702690125, "val_iou_score": 0.7049742341041565, "val_iou_score_student_hard": 0.7049742341041565, "_runtime": 5622.356912136078, "_timestamp": 1578868344.675182, "_step": 139}
{"epoch": 140, "loss": 0.29082265862009743, "iou_score": 0.705420970916748, "iou_score_student_hard": 0.705420970916748, "val_loss": 13.34771933555603, "val_iou_score": 0.09436841309070587, "val_iou_score_student_hard": 0.09436841309070587, "_runtime": 5662.226822137833, "_timestamp": 1578868384.545092, "_step": 140}
{"epoch": 141, "loss": 0.2856263361193917, "iou_score": 0.7081878185272217, "iou_score_student_hard": 0.7081878185272217, "val_loss": 13.402801084518433, "val_iou_score": 0.0922069251537323, "val_iou_score_student_hard": 0.0922069251537323, "_runtime": 5702.237718582153, "_timestamp": 1578868424.5559886, "_step": 141}
{"epoch": 142, "loss": 0.285320793363181, "iou_score": 0.7086705565452576, "iou_score_student_hard": 0.7086705565452576, "val_loss": 13.38725471496582, "val_iou_score": 0.09279599040746689, "val_iou_score_student_hard": 0.09279599040746689, "_runtime": 5742.018803596497, "_timestamp": 1578868464.3370736, "_step": 142}
{"epoch": 143, "loss": 0.28728713555769486, "iou_score": 0.7048259377479553, "iou_score_student_hard": 0.7048259377479553, "val_loss": 13.377526140213012, "val_iou_score": 0.09331642091274261, "val_iou_score_student_hard": 0.09331642091274261, "_runtime": 5781.881084442139, "_timestamp": 1578868504.1993544, "_step": 143}
{"epoch": 144, "loss": 0.31831792118874463, "iou_score": 0.6774054169654846, "iou_score_student_hard": 0.6774054169654846, "val_loss": 13.38562731742859, "val_iou_score": 0.09296174347400665, "val_iou_score_student_hard": 0.09296174347400665, "_runtime": 5822.006331443787, "_timestamp": 1578868544.3246014, "_step": 144}
{"epoch": 145, "loss": 0.3635057452050122, "iou_score": 0.6320261359214783, "iou_score_student_hard": 0.6320261359214783, "val_loss": 13.421796131134034, "val_iou_score": 0.09160236269235611, "val_iou_score_student_hard": 0.09160236269235611, "_runtime": 5861.996872186661, "_timestamp": 1578868584.3151422, "_step": 145}
{"epoch": 146, "loss": 0.40411237383430654, "iou_score": 0.5995886921882629, "iou_score_student_hard": 0.5995886921882629, "val_loss": 13.343607091903687, "val_iou_score": 0.09459337592124939, "val_iou_score_student_hard": 0.09459337592124939, "_runtime": 5901.818682909012, "_timestamp": 1578868624.1369529, "_step": 146}
{"epoch": 147, "loss": 0.2853448288007216, "iou_score": 0.7036831378936768, "iou_score_student_hard": 0.7036831378936768, "val_loss": 2.7716660678386686, "val_iou_score": 0.7079429626464844, "val_iou_score_student_hard": 0.7079429626464844, "_runtime": 5941.674568414688, "_timestamp": 1578868663.9928384, "_step": 147}
{"epoch": 148, "loss": 0.3664806528524919, "iou_score": 0.6317647099494934, "iou_score_student_hard": 0.6317647099494934, "val_loss": 13.374937868118286, "val_iou_score": 0.09338931739330292, "val_iou_score_student_hard": 0.09338931739330292, "_runtime": 5981.448043346405, "_timestamp": 1578868703.7663133, "_step": 148}
{"epoch": 149, "loss": 0.3249490794810382, "iou_score": 0.6710626482963562, "iou_score_student_hard": 0.6710626482963562, "val_loss": 2.710805881023407, "val_iou_score": 0.7135604619979858, "val_iou_score_student_hard": 0.7135604619979858, "_runtime": 6021.4178030490875, "_timestamp": 1578868743.736073, "_step": 149}
{"epoch": 150, "loss": 0.29178374274210495, "iou_score": 0.7040095329284668, "iou_score_student_hard": 0.7040095329284668, "val_loss": 2.713248944282532, "val_iou_score": 0.7123920917510986, "val_iou_score_student_hard": 0.7123920917510986, "_runtime": 6061.588560581207, "_timestamp": 1578868783.9068305, "_step": 150}
{"epoch": 151, "loss": 0.29716908633708955, "iou_score": 0.6969743371009827, "iou_score_student_hard": 0.6969743371009827, "val_loss": 13.41075119972229, "val_iou_score": 0.09208790957927704, "val_iou_score_student_hard": 0.09208790957927704, "_runtime": 6101.894387960434, "_timestamp": 1578868824.212658, "_step": 151}
{"epoch": 152, "loss": 0.2945950611071153, "iou_score": 0.6982493996620178, "iou_score_student_hard": 0.6982493996620178, "val_loss": 2.7186449348926542, "val_iou_score": 0.7124863266944885, "val_iou_score_student_hard": 0.7124863266944885, "_runtime": 6141.659742355347, "_timestamp": 1578868863.9780123, "_step": 152}
{"epoch": 153, "loss": 0.2859874551946467, "iou_score": 0.7080777883529663, "iou_score_student_hard": 0.7080777883529663, "val_loss": 2.718357986211777, "val_iou_score": 0.7124651670455933, "val_iou_score_student_hard": 0.7124651670455933, "_runtime": 6181.61452293396, "_timestamp": 1578868903.932793, "_step": 153}
{"epoch": 154, "loss": 0.2850521727041765, "iou_score": 0.7067286968231201, "iou_score_student_hard": 0.7067286968231201, "val_loss": 13.321981430053711, "val_iou_score": 0.09531961381435394, "val_iou_score_student_hard": 0.09531961381435394, "_runtime": 6221.597747325897, "_timestamp": 1578868943.9160173, "_step": 154}
{"epoch": 155, "loss": 0.362208391726017, "iou_score": 0.6348583698272705, "iou_score_student_hard": 0.6348583698272705, "val_loss": 13.378952550888062, "val_iou_score": 0.09326814860105515, "val_iou_score_student_hard": 0.09326814860105515, "_runtime": 6261.868807315826, "_timestamp": 1578868984.1870773, "_step": 155}
{"epoch": 156, "loss": 0.30390907620841806, "iou_score": 0.6892961859703064, "iou_score_student_hard": 0.6892961859703064, "val_loss": 2.760774332284927, "val_iou_score": 0.709078848361969, "val_iou_score_student_hard": 0.709078848361969, "_runtime": 6302.047006607056, "_timestamp": 1578869024.3652766, "_step": 156}
{"epoch": 157, "loss": 0.29146772961724887, "iou_score": 0.7033666372299194, "iou_score_student_hard": 0.7033666372299194, "val_loss": 13.352465677261353, "val_iou_score": 0.09406238794326782, "val_iou_score_student_hard": 0.09406238794326782, "_runtime": 6341.914242744446, "_timestamp": 1578869064.2325127, "_step": 157}
{"epoch": 158, "loss": 0.30725097249854694, "iou_score": 0.688016951084137, "iou_score_student_hard": 0.688016951084137, "val_loss": 2.7463351428508758, "val_iou_score": 0.7100057601928711, "val_iou_score_student_hard": 0.7100057601928711, "_runtime": 6381.558965921402, "_timestamp": 1578869103.877236, "_step": 158}
{"epoch": 159, "loss": 0.31040219176899303, "iou_score": 0.6801800727844238, "iou_score_student_hard": 0.6801800727844238, "val_loss": 13.312718200683594, "val_iou_score": 0.09581153094768524, "val_iou_score_student_hard": 0.09581153094768524, "_runtime": 6421.67102265358, "_timestamp": 1578869143.9892926, "_step": 159}
{"epoch": 160, "loss": 0.34444128329103646, "iou_score": 0.6465606093406677, "iou_score_student_hard": 0.6465606093406677, "val_loss": 13.373409509658813, "val_iou_score": 0.0934649407863617, "val_iou_score_student_hard": 0.0934649407863617, "_runtime": 6461.382697820663, "_timestamp": 1578869183.7009678, "_step": 160}
{"epoch": 161, "loss": 0.3063899747349999, "iou_score": 0.6815131902694702, "iou_score_student_hard": 0.6815131902694702, "val_loss": 13.398169326782227, "val_iou_score": 0.09246022999286652, "val_iou_score_student_hard": 0.09246022999286652, "_runtime": 6501.191087245941, "_timestamp": 1578869223.5093572, "_step": 161}
{"epoch": 162, "loss": 0.3054230524735017, "iou_score": 0.6930021047592163, "iou_score_student_hard": 0.6930021047592163, "val_loss": 13.390161323547364, "val_iou_score": 0.09281854331493378, "val_iou_score_student_hard": 0.09281854331493378, "_runtime": 6541.427976846695, "_timestamp": 1578869263.7462468, "_step": 162}
{"epoch": 163, "loss": 0.3028827552090992, "iou_score": 0.6905509233474731, "iou_score_student_hard": 0.6905509233474731, "val_loss": 2.726476049423218, "val_iou_score": 0.7112773060798645, "val_iou_score_student_hard": 0.7112773060798645, "_runtime": 6581.52930021286, "_timestamp": 1578869303.8475702, "_step": 163}
{"epoch": 164, "loss": 0.3050746421922337, "iou_score": 0.6907470226287842, "iou_score_student_hard": 0.6907470226287842, "val_loss": 0.40935010015964507, "val_iou_score": 0.7525841593742371, "val_iou_score_student_hard": 0.7525841593742371, "_runtime": 6621.488961219788, "_timestamp": 1578869343.8072312, "_step": 164}
{"epoch": 165, "loss": 0.2849732342091474, "iou_score": 0.7072330713272095, "iou_score_student_hard": 0.7072330713272095, "val_loss": 2.7018209874629973, "val_iou_score": 0.7135165333747864, "val_iou_score_student_hard": 0.7135165333747864, "_runtime": 6662.47158408165, "_timestamp": 1578869384.789854, "_step": 165}
{"epoch": 166, "loss": 0.2876919131387364, "iou_score": 0.7061335444450378, "iou_score_student_hard": 0.7061335444450378, "val_loss": 2.7721124589443207, "val_iou_score": 0.7074042558670044, "val_iou_score_student_hard": 0.7074042558670044, "_runtime": 6702.410424232483, "_timestamp": 1578869424.7286942, "_step": 166}
{"epoch": 167, "loss": 0.29284341660412877, "iou_score": 0.7023599743843079, "iou_score_student_hard": 0.7023599743843079, "val_loss": 2.7241826713085175, "val_iou_score": 0.7119906544685364, "val_iou_score_student_hard": 0.7119906544685364, "_runtime": 6742.346004486084, "_timestamp": 1578869464.6642745, "_step": 167}
{"epoch": 168, "loss": 0.28689940720796586, "iou_score": 0.7067360877990723, "iou_score_student_hard": 0.7067360877990723, "val_loss": 13.347151279449463, "val_iou_score": 0.09446340054273605, "val_iou_score_student_hard": 0.09446340054273605, "_runtime": 6782.099629640579, "_timestamp": 1578869504.4178996, "_step": 168}
{"epoch": 169, "loss": 0.28314954150806776, "iou_score": 0.709213376045227, "iou_score_student_hard": 0.709213376045227, "val_loss": 4.676511883735657, "val_iou_score": 0.09689631313085556, "val_iou_score_student_hard": 0.09689631313085556, "_runtime": 6822.078252792358, "_timestamp": 1578869544.3965228, "_step": 169}
{"epoch": 170, "loss": 0.3064292732964862, "iou_score": 0.6862900257110596, "iou_score_student_hard": 0.6862900257110596, "val_loss": 13.358076095581055, "val_iou_score": 0.09389163553714752, "val_iou_score_student_hard": 0.09389163553714752, "_runtime": 6862.434973239899, "_timestamp": 1578869584.7532432, "_step": 170}
{"epoch": 171, "loss": 0.30506950427185403, "iou_score": 0.6913307905197144, "iou_score_student_hard": 0.6913307905197144, "val_loss": 2.740095055103302, "val_iou_score": 0.7103720903396606, "val_iou_score_student_hard": 0.7103720903396606, "_runtime": 6902.3684985637665, "_timestamp": 1578869624.6867685, "_step": 171}
{"epoch": 172, "loss": 0.28612390715967523, "iou_score": 0.7079156637191772, "iou_score_student_hard": 0.7079156637191772, "val_loss": 13.377702474594116, "val_iou_score": 0.09312953799962997, "val_iou_score_student_hard": 0.09312953799962997, "_runtime": 6942.416353464127, "_timestamp": 1578869664.7346234, "_step": 172}
{"epoch": 173, "loss": 0.32820347967472946, "iou_score": 0.6685027480125427, "iou_score_student_hard": 0.6685027480125427, "val_loss": 13.368444633483886, "val_iou_score": 0.09350550174713135, "val_iou_score_student_hard": 0.09350550174713135, "_runtime": 6982.298198461533, "_timestamp": 1578869704.6164684, "_step": 173}
{"epoch": 174, "loss": 0.4794612858783115, "iou_score": 0.5454208254814148, "iou_score_student_hard": 0.5454208254814148, "val_loss": 13.36972599029541, "val_iou_score": 0.09332659095525742, "val_iou_score_student_hard": 0.09332659095525742, "_runtime": 7022.242850780487, "_timestamp": 1578869744.5611207, "_step": 174}
{"epoch": 175, "loss": 0.4074061556295915, "iou_score": 0.5884791016578674, "iou_score_student_hard": 0.5884791016578674, "val_loss": 13.314597606658936, "val_iou_score": 0.0932685062289238, "val_iou_score_student_hard": 0.0932685062289238, "_runtime": 7062.005246162415, "_timestamp": 1578869784.3235161, "_step": 175}
{"epoch": 176, "loss": 0.3750163971023126, "iou_score": 0.6236796379089355, "iou_score_student_hard": 0.6236796379089355, "val_loss": 2.693787270784378, "val_iou_score": 0.7149447798728943, "val_iou_score_student_hard": 0.7149447798728943, "_runtime": 7102.253655433655, "_timestamp": 1578869824.5719254, "_step": 176}
{"epoch": 177, "loss": 0.37809459932825784, "iou_score": 0.6257117986679077, "iou_score_student_hard": 0.6257117986679077, "val_loss": 13.376918315887451, "val_iou_score": 0.09326605498790741, "val_iou_score_student_hard": 0.09326605498790741, "_runtime": 7142.291354179382, "_timestamp": 1578869864.6096241, "_step": 177}
{"epoch": 178, "loss": 0.3323458464308219, "iou_score": 0.6658443212509155, "iou_score_student_hard": 0.6658443212509155, "val_loss": 2.721050947904587, "val_iou_score": 0.7123883962631226, "val_iou_score_student_hard": 0.7123883962631226, "_runtime": 7182.322855949402, "_timestamp": 1578869904.641126, "_step": 178}
{"epoch": 179, "loss": 0.3438121293078769, "iou_score": 0.661511242389679, "iou_score_student_hard": 0.661511242389679, "val_loss": 12.872442817687988, "val_iou_score": 0.09229172766208649, "val_iou_score_student_hard": 0.09229172766208649, "_runtime": 7222.116182088852, "_timestamp": 1578869944.434452, "_step": 179}
{"epoch": 180, "loss": 0.28836483427069404, "iou_score": 0.7039775252342224, "iou_score_student_hard": 0.7039775252342224, "val_loss": 13.40567684173584, "val_iou_score": 0.09229590743780136, "val_iou_score_student_hard": 0.09229590743780136, "_runtime": 7262.10865688324, "_timestamp": 1578869984.4269269, "_step": 180}
{"epoch": 181, "loss": 0.3004294197667729, "iou_score": 0.695098876953125, "iou_score_student_hard": 0.695098876953125, "val_loss": 13.372773742675781, "val_iou_score": 0.09334661066532135, "val_iou_score_student_hard": 0.09334661066532135, "_runtime": 7302.260748624802, "_timestamp": 1578870024.5790186, "_step": 181}
{"epoch": 182, "loss": 0.3035584550012242, "iou_score": 0.6889360547065735, "iou_score_student_hard": 0.6889360547065735, "val_loss": 13.391320705413818, "val_iou_score": 0.0927925631403923, "val_iou_score_student_hard": 0.0927925631403923, "_runtime": 7342.3946878910065, "_timestamp": 1578870064.7129579, "_step": 182}
{"epoch": 183, "loss": 0.2859087270769206, "iou_score": 0.7081157565116882, "iou_score_student_hard": 0.7081157565116882, "val_loss": 13.371341323852539, "val_iou_score": 0.09344565868377686, "val_iou_score_student_hard": 0.09344565868377686, "_runtime": 7382.410307884216, "_timestamp": 1578870104.7285779, "_step": 183}
{"epoch": 184, "loss": 0.28843068426305596, "iou_score": 0.7069828510284424, "iou_score_student_hard": 0.7069828510284424, "val_loss": 13.358722496032716, "val_iou_score": 0.09400549530982971, "val_iou_score_student_hard": 0.09400549530982971, "_runtime": 7422.1079070568085, "_timestamp": 1578870144.426177, "_step": 184}
{"epoch": 185, "loss": 0.2858705914833329, "iou_score": 0.7048336267471313, "iou_score_student_hard": 0.7048336267471313, "val_loss": 13.37111029624939, "val_iou_score": 0.09353570640087128, "val_iou_score_student_hard": 0.09353570640087128, "_runtime": 7462.232107400894, "_timestamp": 1578870184.5503774, "_step": 185}
{"epoch": 186, "loss": 0.28124187846075405, "iou_score": 0.711094319820404, "iou_score_student_hard": 0.711094319820404, "val_loss": 13.353903341293336, "val_iou_score": 0.09437121450901031, "val_iou_score_student_hard": 0.09437121450901031, "_runtime": 7502.122990846634, "_timestamp": 1578870224.4412608, "_step": 186}
{"epoch": 187, "loss": 0.2785711115056818, "iou_score": 0.7137616276741028, "iou_score_student_hard": 0.7137616276741028, "val_loss": 2.747241550683975, "val_iou_score": 0.7095655202865601, "val_iou_score_student_hard": 0.7095655202865601, "_runtime": 7541.962026834488, "_timestamp": 1578870264.2802968, "_step": 187}
{"epoch": 188, "loss": 0.28213180588050324, "iou_score": 0.7143983840942383, "iou_score_student_hard": 0.7143983840942383, "val_loss": 0.9201785027980804, "val_iou_score": 0.32781782746315, "val_iou_score_student_hard": 0.32781782746315, "_runtime": 7581.675884962082, "_timestamp": 1578870303.994155, "_step": 188}
{"epoch": 189, "loss": 0.288829900866205, "iou_score": 0.7034663558006287, "iou_score_student_hard": 0.7034663558006287, "val_loss": 13.42140097618103, "val_iou_score": 0.09157831966876984, "val_iou_score_student_hard": 0.09157831966876984, "_runtime": 7621.673753499985, "_timestamp": 1578870343.9920235, "_step": 189}
{"epoch": 190, "loss": 0.32468540384010836, "iou_score": 0.6762902736663818, "iou_score_student_hard": 0.6762902736663818, "val_loss": 13.385393190383912, "val_iou_score": 0.09289846569299698, "val_iou_score_student_hard": 0.09289846569299698, "_runtime": 7661.541259765625, "_timestamp": 1578870383.8595297, "_step": 190}
{"epoch": 191, "loss": 0.29483519169417294, "iou_score": 0.6973698735237122, "iou_score_student_hard": 0.6973698735237122, "val_loss": 13.365458965301514, "val_iou_score": 0.09380580484867096, "val_iou_score_student_hard": 0.09380580484867096, "_runtime": 7701.686396598816, "_timestamp": 1578870424.0046666, "_step": 191}
{"epoch": 192, "loss": 0.28423378535292365, "iou_score": 0.7117394804954529, "iou_score_student_hard": 0.7117394804954529, "val_loss": 13.362496376037598, "val_iou_score": 0.093117356300354, "val_iou_score_student_hard": 0.093117356300354, "_runtime": 7741.502213001251, "_timestamp": 1578870463.820483, "_step": 192}
{"epoch": 193, "loss": 0.2909062847495079, "iou_score": 0.704964280128479, "iou_score_student_hard": 0.704964280128479, "val_loss": 13.424844551086426, "val_iou_score": 0.09155820310115814, "val_iou_score_student_hard": 0.09155820310115814, "_runtime": 7781.204337358475, "_timestamp": 1578870503.5226073, "_step": 193}
{"epoch": 194, "loss": 0.28386957333846524, "iou_score": 0.7083160281181335, "iou_score_student_hard": 0.7083160281181335, "val_loss": 13.385741758346558, "val_iou_score": 0.09260183572769165, "val_iou_score_student_hard": 0.09260183572769165, "_runtime": 7821.1487028598785, "_timestamp": 1578870543.4669728, "_step": 194}
{"epoch": 195, "loss": 0.282842157645659, "iou_score": 0.7130696177482605, "iou_score_student_hard": 0.7130696177482605, "val_loss": 2.7199084758758545, "val_iou_score": 0.7123720645904541, "val_iou_score_student_hard": 0.7123720645904541, "_runtime": 7861.063739538193, "_timestamp": 1578870583.3820095, "_step": 195}
{"epoch": 196, "loss": 0.28462836024436083, "iou_score": 0.7075169086456299, "iou_score_student_hard": 0.7075169086456299, "val_loss": 13.352608013153077, "val_iou_score": 0.09416168928146362, "val_iou_score_student_hard": 0.09416168928146362, "_runtime": 7901.314800739288, "_timestamp": 1578870623.6330707, "_step": 196}
{"epoch": 197, "loss": 0.3819678448817947, "iou_score": 0.6245488524436951, "iou_score_student_hard": 0.6245488524436951, "val_loss": 13.338615036010742, "val_iou_score": 0.09470062702894211, "val_iou_score_student_hard": 0.09470062702894211, "_runtime": 7941.47774720192, "_timestamp": 1578870663.7960172, "_step": 197}
{"epoch": 198, "loss": 0.30516479597850277, "iou_score": 0.6851946711540222, "iou_score_student_hard": 0.6851946711540222, "val_loss": 13.375099897384644, "val_iou_score": 0.09338326752185822, "val_iou_score_student_hard": 0.09338326752185822, "_runtime": 7981.6168756484985, "_timestamp": 1578870703.9351456, "_step": 198}
{"epoch": 199, "loss": 0.31451271000233566, "iou_score": 0.6827813982963562, "iou_score_student_hard": 0.6827813982963562, "val_loss": 13.41650037765503, "val_iou_score": 0.09170221537351608, "val_iou_score_student_hard": 0.09170221537351608, "_runtime": 8021.696592092514, "_timestamp": 1578870744.014862, "_step": 199}
{"epoch": 200, "loss": 0.30204094661907716, "iou_score": 0.6887481212615967, "iou_score_student_hard": 0.6887481212615967, "val_loss": 13.362860536575317, "val_iou_score": 0.09372269362211227, "val_iou_score_student_hard": 0.09372269362211227, "_runtime": 8061.583343029022, "_timestamp": 1578870783.901613, "_step": 200}
{"epoch": 201, "loss": 0.3210033164782958, "iou_score": 0.6694713234901428, "iou_score_student_hard": 0.6694713234901428, "val_loss": 13.386340141296387, "val_iou_score": 0.0928417444229126, "val_iou_score_student_hard": 0.0928417444229126, "_runtime": 8101.646403551102, "_timestamp": 1578870823.9646735, "_step": 201}
{"epoch": 202, "loss": 0.3741217462853952, "iou_score": 0.6213032007217407, "iou_score_student_hard": 0.6213032007217407, "val_loss": 2.533824634552002, "val_iou_score": 0.7121423482894897, "val_iou_score_student_hard": 0.7121423482894897, "_runtime": 8141.663949012756, "_timestamp": 1578870863.982219, "_step": 202}
{"epoch": 203, "loss": 0.3179554810578173, "iou_score": 0.6735109090805054, "iou_score_student_hard": 0.6735109090805054, "val_loss": 2.720825344324112, "val_iou_score": 0.7121071815490723, "val_iou_score_student_hard": 0.7121071815490723, "_runtime": 8181.7399163246155, "_timestamp": 1578870904.0581863, "_step": 203}
{"epoch": 204, "loss": 0.37648763087662784, "iou_score": 0.6166764497756958, "iou_score_student_hard": 0.6166764497756958, "val_loss": 13.331584072113037, "val_iou_score": 0.09480436146259308, "val_iou_score_student_hard": 0.09480436146259308, "_runtime": 8221.335722446442, "_timestamp": 1578870943.6539924, "_step": 204}
{"epoch": 205, "loss": 0.3092136113481088, "iou_score": 0.6837621331214905, "iou_score_student_hard": 0.6837621331214905, "val_loss": 2.7040143609046936, "val_iou_score": 0.7142166495323181, "val_iou_score_student_hard": 0.7142166495323181, "_runtime": 8261.347073316574, "_timestamp": 1578870983.6653433, "_step": 205}
{"epoch": 206, "loss": 0.3060067258097909, "iou_score": 0.6877314448356628, "iou_score_student_hard": 0.6877314448356628, "val_loss": 2.6955446720123293, "val_iou_score": 0.7146793603897095, "val_iou_score_student_hard": 0.7146793603897095, "_runtime": 8301.307327270508, "_timestamp": 1578871023.6255972, "_step": 206}
{"epoch": 207, "loss": 0.2925583445213058, "iou_score": 0.7020153999328613, "iou_score_student_hard": 0.7020153999328613, "val_loss": 2.673345458507538, "val_iou_score": 0.707868218421936, "val_iou_score_student_hard": 0.707868218421936, "_runtime": 8341.104862213135, "_timestamp": 1578871063.4231322, "_step": 207}
{"epoch": 208, "loss": 0.2884774854237383, "iou_score": 0.7056604623794556, "iou_score_student_hard": 0.7056604623794556, "val_loss": 2.7370183646678923, "val_iou_score": 0.7104393243789673, "val_iou_score_student_hard": 0.7104393243789673, "_runtime": 8380.691399097443, "_timestamp": 1578871103.009669, "_step": 208}
{"epoch": 209, "loss": 0.2885563690554012, "iou_score": 0.704231321811676, "iou_score_student_hard": 0.704231321811676, "val_loss": 13.238499546051026, "val_iou_score": 0.09386502206325531, "val_iou_score_student_hard": 0.09386502206325531, "_runtime": 8420.724071741104, "_timestamp": 1578871143.0423417, "_step": 209}
{"epoch": 210, "loss": 0.28633401664820585, "iou_score": 0.7063499689102173, "iou_score_student_hard": 0.7063499689102173, "val_loss": 2.747796541452408, "val_iou_score": 0.7097257375717163, "val_iou_score_student_hard": 0.7097257375717163, "_runtime": 8460.956338882446, "_timestamp": 1578871183.2746089, "_step": 210}
{"epoch": 211, "loss": 0.29100161059336227, "iou_score": 0.7064489126205444, "iou_score_student_hard": 0.7064489126205444, "val_loss": 13.404879426956176, "val_iou_score": 0.09218450635671616, "val_iou_score_student_hard": 0.09218450635671616, "_runtime": 8500.95779967308, "_timestamp": 1578871223.2760696, "_step": 211}
{"epoch": 212, "loss": 0.28218036199157887, "iou_score": 0.7101300358772278, "iou_score_student_hard": 0.7101300358772278, "val_loss": 2.7203430473804473, "val_iou_score": 0.712490439414978, "val_iou_score_student_hard": 0.712490439414978, "_runtime": 8541.024610757828, "_timestamp": 1578871263.3428807, "_step": 212}
{"epoch": 213, "loss": 0.284357116710056, "iou_score": 0.7132190465927124, "iou_score_student_hard": 0.7132190465927124, "val_loss": 13.402771377563477, "val_iou_score": 0.09225274622440338, "val_iou_score_student_hard": 0.09225274622440338, "_runtime": 8580.84457707405, "_timestamp": 1578871303.162847, "_step": 213}
{"epoch": 214, "loss": 0.28502323952588166, "iou_score": 0.7093532085418701, "iou_score_student_hard": 0.7093532085418701, "val_loss": 13.370528173446655, "val_iou_score": 0.09344365447759628, "val_iou_score_student_hard": 0.09344365447759628, "_runtime": 8620.823071956635, "_timestamp": 1578871343.141342, "_step": 214}
{"epoch": 215, "loss": 0.29419236982410607, "iou_score": 0.7001796364784241, "iou_score_student_hard": 0.7001796364784241, "val_loss": 13.365212869644164, "val_iou_score": 0.0940769612789154, "val_iou_score_student_hard": 0.0940769612789154, "_runtime": 8660.763026237488, "_timestamp": 1578871383.0812962, "_step": 215}
{"epoch": 216, "loss": 0.2844740848649632, "iou_score": 0.7078964710235596, "iou_score_student_hard": 0.7078964710235596, "val_loss": 13.381698703765869, "val_iou_score": 0.09323814511299133, "val_iou_score_student_hard": 0.09323814511299133, "_runtime": 8700.808747768402, "_timestamp": 1578871423.1270177, "_step": 216}
{"epoch": 217, "loss": 0.2836035831408067, "iou_score": 0.70997154712677, "iou_score_student_hard": 0.70997154712677, "val_loss": 13.359349822998047, "val_iou_score": 0.09387670457363129, "val_iou_score_student_hard": 0.09387670457363129, "_runtime": 8740.697319507599, "_timestamp": 1578871463.0155895, "_step": 217}
{"epoch": 218, "loss": 0.28889054696668276, "iou_score": 0.7059581279754639, "iou_score_student_hard": 0.7059581279754639, "val_loss": 0.5098550707101822, "val_iou_score": 0.7350889444351196, "val_iou_score_student_hard": 0.7350889444351196, "_runtime": 8780.62066602707, "_timestamp": 1578871502.938936, "_step": 218}
{"epoch": 219, "loss": 0.287138056890531, "iou_score": 0.7042004466056824, "iou_score_student_hard": 0.7042004466056824, "val_loss": 2.018487977981567, "val_iou_score": 0.7134242057800293, "val_iou_score_student_hard": 0.7134242057800293, "_runtime": 8820.42962050438, "_timestamp": 1578871542.7478905, "_step": 219}
{"epoch": 220, "loss": 0.2906626575372436, "iou_score": 0.7077016234397888, "iou_score_student_hard": 0.7077016234397888, "val_loss": 13.36050591468811, "val_iou_score": 0.09385310113430023, "val_iou_score_student_hard": 0.09385310113430023, "_runtime": 8860.495533704758, "_timestamp": 1578871582.8138037, "_step": 220}
{"epoch": 221, "loss": 0.2867241818796505, "iou_score": 0.7069689631462097, "iou_score_student_hard": 0.7069689631462097, "val_loss": 1.334927073121071, "val_iou_score": 0.7122547626495361, "val_iou_score_student_hard": 0.7122547626495361, "_runtime": 8900.447170734406, "_timestamp": 1578871622.7654407, "_step": 221}
{"epoch": 222, "loss": 0.2876286773519082, "iou_score": 0.7084754109382629, "iou_score_student_hard": 0.7084754109382629, "val_loss": 2.7464005172252657, "val_iou_score": 0.7094986438751221, "val_iou_score_student_hard": 0.7094986438751221, "_runtime": 8940.193881034851, "_timestamp": 1578871662.512151, "_step": 222}
{"epoch": 223, "loss": 0.2908915147185326, "iou_score": 0.7041806578636169, "iou_score_student_hard": 0.7041806578636169, "val_loss": 13.373423385620118, "val_iou_score": 0.09345380961894989, "val_iou_score_student_hard": 0.09345380961894989, "_runtime": 8980.17642068863, "_timestamp": 1578871702.4946907, "_step": 223}
{"epoch": 224, "loss": 0.2904817396944219, "iou_score": 0.7013891935348511, "iou_score_student_hard": 0.7013891935348511, "val_loss": 13.412472772598267, "val_iou_score": 0.09220833331346512, "val_iou_score_student_hard": 0.09220833331346512, "_runtime": 9020.328757286072, "_timestamp": 1578871742.6470273, "_step": 224}
{"epoch": 225, "loss": 0.2915371520952745, "iou_score": 0.6975513100624084, "iou_score_student_hard": 0.6975513100624084, "val_loss": 13.417276048660279, "val_iou_score": 0.09172366559505463, "val_iou_score_student_hard": 0.09172366559505463, "_runtime": 9060.16528558731, "_timestamp": 1578871782.4835556, "_step": 225}
{"epoch": 226, "loss": 0.32949856275861916, "iou_score": 0.6658048629760742, "iou_score_student_hard": 0.6658048629760742, "val_loss": 13.38982253074646, "val_iou_score": 0.09281660616397858, "val_iou_score_student_hard": 0.09281660616397858, "_runtime": 9100.162942647934, "_timestamp": 1578871822.4812126, "_step": 226}
{"epoch": 227, "loss": 0.3444767140529372, "iou_score": 0.6497843861579895, "iou_score_student_hard": 0.6497843861579895, "val_loss": 13.336441612243652, "val_iou_score": 0.09469609707593918, "val_iou_score_student_hard": 0.09469609707593918, "_runtime": 9139.939377307892, "_timestamp": 1578871862.2576473, "_step": 227}
{"epoch": 228, "loss": 0.2983395898883993, "iou_score": 0.695643961429596, "iou_score_student_hard": 0.695643961429596, "val_loss": 2.7594101667404174, "val_iou_score": 0.7095639109611511, "val_iou_score_student_hard": 0.7095639109611511, "_runtime": 9179.809720039368, "_timestamp": 1578871902.12799, "_step": 228}
{"epoch": 229, "loss": 0.28306384547190233, "iou_score": 0.7101024389266968, "iou_score_student_hard": 0.7101024389266968, "val_loss": 2.715131628513336, "val_iou_score": 0.713252604007721, "val_iou_score_student_hard": 0.713252604007721, "_runtime": 9219.933322668076, "_timestamp": 1578871942.2515926, "_step": 229}
{"epoch": 230, "loss": 0.2885218609463085, "iou_score": 0.705182671546936, "iou_score_student_hard": 0.705182671546936, "val_loss": 0.8814284712076187, "val_iou_score": 0.7170090675354004, "val_iou_score_student_hard": 0.7170090675354004, "_runtime": 9259.797173261642, "_timestamp": 1578871982.1154432, "_step": 230}
{"epoch": 231, "loss": 0.2897395888512785, "iou_score": 0.7034978866577148, "iou_score_student_hard": 0.7034978866577148, "val_loss": 2.7367069482803346, "val_iou_score": 0.7109793424606323, "val_iou_score_student_hard": 0.7109793424606323, "_runtime": 9299.674401760101, "_timestamp": 1578872021.9926717, "_step": 231}
{"epoch": 232, "loss": 0.28750932501121, "iou_score": 0.7087336182594299, "iou_score_student_hard": 0.7087336182594299, "val_loss": 2.6791761219501495, "val_iou_score": 0.715989351272583, "val_iou_score_student_hard": 0.715989351272583, "_runtime": 9339.561803102493, "_timestamp": 1578872061.880073, "_step": 232}
{"epoch": 233, "loss": 0.2828913205049255, "iou_score": 0.7106585502624512, "iou_score_student_hard": 0.7106585502624512, "val_loss": 13.384026908874512, "val_iou_score": 0.09285051375627518, "val_iou_score_student_hard": 0.09285051375627518, "_runtime": 9379.382157564163, "_timestamp": 1578872101.7004275, "_step": 233}
{"epoch": 234, "loss": 0.28352287736806003, "iou_score": 0.712805986404419, "iou_score_student_hard": 0.712805986404419, "val_loss": 3.479693257808685, "val_iou_score": 0.11044397205114365, "val_iou_score_student_hard": 0.11044397205114365, "_runtime": 9419.356741428375, "_timestamp": 1578872141.6750114, "_step": 234}
{"epoch": 235, "loss": 0.28617940450256524, "iou_score": 0.709994375705719, "iou_score_student_hard": 0.709994375705719, "val_loss": 13.409584379196167, "val_iou_score": 0.0920611098408699, "val_iou_score_student_hard": 0.0920611098408699, "_runtime": 9459.165671110153, "_timestamp": 1578872181.483941, "_step": 235}
{"epoch": 236, "loss": 0.2849696297537197, "iou_score": 0.7112169861793518, "iou_score_student_hard": 0.7112169861793518, "val_loss": 13.354159545898437, "val_iou_score": 0.09405194967985153, "val_iou_score_student_hard": 0.09405194967985153, "_runtime": 9499.096766471863, "_timestamp": 1578872221.4150364, "_step": 236}
{"epoch": 237, "loss": 0.28310430117628793, "iou_score": 0.7102164030075073, "iou_score_student_hard": 0.7102164030075073, "val_loss": 13.370233201980591, "val_iou_score": 0.09363681823015213, "val_iou_score_student_hard": 0.09363681823015213, "_runtime": 9539.191541194916, "_timestamp": 1578872261.5098112, "_step": 237}
{"epoch": 238, "loss": 0.2849312936717814, "iou_score": 0.7108443379402161, "iou_score_student_hard": 0.7108443379402161, "val_loss": 13.393427610397339, "val_iou_score": 0.09253624081611633, "val_iou_score_student_hard": 0.09253624081611633, "_runtime": 9579.339510440826, "_timestamp": 1578872301.6577804, "_step": 238}
{"epoch": 239, "loss": 0.2835755665193905, "iou_score": 0.7104526162147522, "iou_score_student_hard": 0.7104526162147522, "val_loss": 2.025947618484497, "val_iou_score": 0.7080100178718567, "val_iou_score_student_hard": 0.7080100178718567, "_runtime": 9619.247339248657, "_timestamp": 1578872341.5656092, "_step": 239}
{"epoch": 240, "loss": 0.28277142603288996, "iou_score": 0.7119224667549133, "iou_score_student_hard": 0.7119224667549133, "val_loss": 1.5583601146936417, "val_iou_score": 0.7087239027023315, "val_iou_score_student_hard": 0.7087239027023315, "_runtime": 9659.106026172638, "_timestamp": 1578872381.4242961, "_step": 240}
{"epoch": 241, "loss": 0.2847874084656889, "iou_score": 0.7084053754806519, "iou_score_student_hard": 0.7084053754806519, "val_loss": 13.368038654327393, "val_iou_score": 0.0936875194311142, "val_iou_score_student_hard": 0.0936875194311142, "_runtime": 9698.826565504074, "_timestamp": 1578872421.1448355, "_step": 241}
{"epoch": 242, "loss": 0.2863385559483008, "iou_score": 0.7083967924118042, "iou_score_student_hard": 0.7083967924118042, "val_loss": 13.383018064498902, "val_iou_score": 0.09306993335485458, "val_iou_score_student_hard": 0.09306993335485458, "_runtime": 9738.673421144485, "_timestamp": 1578872460.991691, "_step": 242}
{"epoch": 243, "loss": 0.2836970273743976, "iou_score": 0.7081316709518433, "iou_score_student_hard": 0.7081316709518433, "val_loss": 13.374860286712646, "val_iou_score": 0.09322343021631241, "val_iou_score_student_hard": 0.09322343021631241, "_runtime": 9778.73008275032, "_timestamp": 1578872501.0483527, "_step": 243}
{"epoch": 244, "loss": 0.2812447012825446, "iou_score": 0.7127213478088379, "iou_score_student_hard": 0.7127213478088379, "val_loss": 2.7585162997245787, "val_iou_score": 0.7094789743423462, "val_iou_score_student_hard": 0.7094789743423462, "_runtime": 9818.498944282532, "_timestamp": 1578872540.8172143, "_step": 244}
{"epoch": 245, "loss": 0.2841560030525381, "iou_score": 0.714885413646698, "iou_score_student_hard": 0.714885413646698, "val_loss": 13.38132472038269, "val_iou_score": 0.09325144439935684, "val_iou_score_student_hard": 0.09325144439935684, "_runtime": 9858.36117362976, "_timestamp": 1578872580.6794436, "_step": 245}
{"epoch": 246, "loss": 0.28197634463960475, "iou_score": 0.7092429995536804, "iou_score_student_hard": 0.7092429995536804, "val_loss": 13.376952934265137, "val_iou_score": 0.09332059323787689, "val_iou_score_student_hard": 0.09332059323787689, "_runtime": 9898.4409096241, "_timestamp": 1578872620.7591796, "_step": 246}
{"epoch": 247, "loss": 0.28365225236524233, "iou_score": 0.712166428565979, "iou_score_student_hard": 0.712166428565979, "val_loss": 13.397583293914796, "val_iou_score": 0.09245391190052032, "val_iou_score_student_hard": 0.09245391190052032, "_runtime": 9938.280432224274, "_timestamp": 1578872660.5987022, "_step": 247}
{"epoch": 248, "loss": 0.2883055478334427, "iou_score": 0.7039320468902588, "iou_score_student_hard": 0.7039320468902588, "val_loss": 13.428760814666749, "val_iou_score": 0.09139935672283173, "val_iou_score_student_hard": 0.09139935672283173, "_runtime": 9978.173373222351, "_timestamp": 1578872700.4916432, "_step": 248}
{"epoch": 249, "loss": 0.2817261587489735, "iou_score": 0.7095583081245422, "iou_score_student_hard": 0.7095583081245422, "val_loss": 13.387429332733154, "val_iou_score": 0.09282667934894562, "val_iou_score_student_hard": 0.09282667934894562, "_runtime": 10018.157544851303, "_timestamp": 1578872740.4758148, "_step": 249}
{"epoch": 250, "loss": 0.28099327764727855, "iou_score": 0.7120670676231384, "iou_score_student_hard": 0.7120670676231384, "val_loss": 13.370110940933227, "val_iou_score": 0.09348037093877792, "val_iou_score_student_hard": 0.09348037093877792, "_runtime": 10058.371197223663, "_timestamp": 1578872780.6894672, "_step": 250}
{"epoch": 251, "loss": 0.2917141549966552, "iou_score": 0.7019070982933044, "iou_score_student_hard": 0.7019070982933044, "val_loss": 13.259594440460205, "val_iou_score": 0.09376485645771027, "val_iou_score_student_hard": 0.09376485645771027, "_runtime": 10098.144909381866, "_timestamp": 1578872820.4631793, "_step": 251}
{"epoch": 252, "loss": 0.29283910488540477, "iou_score": 0.6997460722923279, "iou_score_student_hard": 0.6997460722923279, "val_loss": 2.687228488922119, "val_iou_score": 0.7159407138824463, "val_iou_score_student_hard": 0.7159407138824463, "_runtime": 10137.890200853348, "_timestamp": 1578872860.2084708, "_step": 252}
{"epoch": 253, "loss": 0.289343987269835, "iou_score": 0.7049179673194885, "iou_score_student_hard": 0.7049179673194885, "val_loss": 2.705553114414215, "val_iou_score": 0.7132357954978943, "val_iou_score_student_hard": 0.7132357954978943, "_runtime": 10177.67283654213, "_timestamp": 1578872899.9911065, "_step": 253}
{"epoch": 254, "loss": 0.2907740301706574, "iou_score": 0.7040124535560608, "iou_score_student_hard": 0.7040124535560608, "val_loss": 2.8004071533679964, "val_iou_score": 0.7050326466560364, "val_iou_score_student_hard": 0.7050326466560364, "_runtime": 10217.627643823624, "_timestamp": 1578872939.9459138, "_step": 254}
{"epoch": 255, "loss": 0.2861491990360347, "iou_score": 0.7059984803199768, "iou_score_student_hard": 0.7059984803199768, "val_loss": 2.691350466012955, "val_iou_score": 0.7146720290184021, "val_iou_score_student_hard": 0.7146720290184021, "_runtime": 10257.732715129852, "_timestamp": 1578872980.050985, "_step": 255}
{"epoch": 256, "loss": 0.2864336624741554, "iou_score": 0.7078232765197754, "iou_score_student_hard": 0.7078232765197754, "val_loss": 13.37604479789734, "val_iou_score": 0.0932369977235794, "val_iou_score_student_hard": 0.0932369977235794, "_runtime": 10297.759437084198, "_timestamp": 1578873020.077707, "_step": 256}
{"epoch": 257, "loss": 0.28405879465016454, "iou_score": 0.7098031044006348, "iou_score_student_hard": 0.7098031044006348, "val_loss": 2.74446017742157, "val_iou_score": 0.7101949453353882, "val_iou_score_student_hard": 0.7101949453353882, "_runtime": 10337.8614153862, "_timestamp": 1578873060.1796854, "_step": 257}
{"epoch": 258, "loss": 0.28711209364912726, "iou_score": 0.7080370187759399, "iou_score_student_hard": 0.7080370187759399, "val_loss": 13.365817451477051, "val_iou_score": 0.09369273483753204, "val_iou_score_student_hard": 0.09369273483753204, "_runtime": 10377.683566570282, "_timestamp": 1578873100.0018365, "_step": 258}
{"epoch": 259, "loss": 0.2945267453789711, "iou_score": 0.6995707154273987, "iou_score_student_hard": 0.6995707154273987, "val_loss": 13.412016582489013, "val_iou_score": 0.09180040657520294, "val_iou_score_student_hard": 0.09180040657520294, "_runtime": 10417.81663441658, "_timestamp": 1578873140.1349044, "_step": 259}
{"epoch": 260, "loss": 0.2877208789641207, "iou_score": 0.7048609852790833, "iou_score_student_hard": 0.7048609852790833, "val_loss": 13.367495965957641, "val_iou_score": 0.09356360137462616, "val_iou_score_student_hard": 0.09356360137462616, "_runtime": 10457.713807582855, "_timestamp": 1578873180.0320776, "_step": 260}
{"epoch": 261, "loss": 0.2861732069741596, "iou_score": 0.7048456072807312, "iou_score_student_hard": 0.7048456072807312, "val_loss": 13.398475885391235, "val_iou_score": 0.09249763935804367, "val_iou_score_student_hard": 0.09249763935804367, "_runtime": 10497.851039648056, "_timestamp": 1578873220.1693096, "_step": 261}
{"epoch": 262, "loss": 0.2894318000836806, "iou_score": 0.7069014310836792, "iou_score_student_hard": 0.7069014310836792, "val_loss": 2.71874116063118, "val_iou_score": 0.7127519249916077, "val_iou_score_student_hard": 0.7127519249916077, "_runtime": 10537.837346076965, "_timestamp": 1578873260.155616, "_step": 262}
{"epoch": 263, "loss": 0.2840222124348987, "iou_score": 0.7087791562080383, "iou_score_student_hard": 0.7087791562080383, "val_loss": 2.730021119117737, "val_iou_score": 0.711164116859436, "val_iou_score_student_hard": 0.711164116859436, "_runtime": 10577.80555152893, "_timestamp": 1578873300.1238215, "_step": 263}
{"epoch": 264, "loss": 0.2846819644624537, "iou_score": 0.7123607397079468, "iou_score_student_hard": 0.7123607397079468, "val_loss": 2.752929079532623, "val_iou_score": 0.7094048261642456, "val_iou_score_student_hard": 0.7094048261642456, "_runtime": 10617.995393037796, "_timestamp": 1578873340.313663, "_step": 264}
{"epoch": 265, "loss": 0.2869255559010939, "iou_score": 0.7081335186958313, "iou_score_student_hard": 0.7081335186958313, "val_loss": 2.7305582642555235, "val_iou_score": 0.7115261554718018, "val_iou_score_student_hard": 0.7115261554718018, "_runtime": 10657.95638680458, "_timestamp": 1578873380.2746568, "_step": 265}
{"epoch": 266, "loss": 0.2826207158240405, "iou_score": 0.7115508317947388, "iou_score_student_hard": 0.7115508317947388, "val_loss": 13.400118923187256, "val_iou_score": 0.09250225126743317, "val_iou_score_student_hard": 0.09250225126743317, "_runtime": 10698.091536521912, "_timestamp": 1578873420.4098065, "_step": 266}
{"epoch": 267, "loss": 0.28973552042787726, "iou_score": 0.7038976550102234, "iou_score_student_hard": 0.7038976550102234, "val_loss": 13.402593517303467, "val_iou_score": 0.09223366528749466, "val_iou_score_student_hard": 0.09223366528749466, "_runtime": 10738.222988128662, "_timestamp": 1578873460.541258, "_step": 267}
{"epoch": 268, "loss": 0.2928280012174086, "iou_score": 0.6997976303100586, "iou_score_student_hard": 0.6997976303100586, "val_loss": 13.379470729827881, "val_iou_score": 0.09318544715642929, "val_iou_score_student_hard": 0.09318544715642929, "_runtime": 10777.909904003143, "_timestamp": 1578873500.228174, "_step": 268}
{"epoch": 269, "loss": 0.284827413613146, "iou_score": 0.7076253890991211, "iou_score_student_hard": 0.7076253890991211, "val_loss": 13.319020318984986, "val_iou_score": 0.09558746218681335, "val_iou_score_student_hard": 0.09558746218681335, "_runtime": 10818.003412723541, "_timestamp": 1578873540.3216827, "_step": 269}
{"epoch": 270, "loss": 0.30151265927336435, "iou_score": 0.6952733397483826, "iou_score_student_hard": 0.6952733397483826, "val_loss": 12.949439573287965, "val_iou_score": 0.0942116528749466, "val_iou_score_student_hard": 0.0942116528749466, "_runtime": 10858.064280509949, "_timestamp": 1578873580.3825505, "_step": 270}
{"epoch": 271, "loss": 0.2836935955015096, "iou_score": 0.7077344655990601, "iou_score_student_hard": 0.7077344655990601, "val_loss": 13.383600282669068, "val_iou_score": 0.09318090975284576, "val_iou_score_student_hard": 0.09318090975284576, "_runtime": 10897.702813863754, "_timestamp": 1578873620.0210838, "_step": 271}
{"epoch": 272, "loss": 0.28897790908813475, "iou_score": 0.7065081596374512, "iou_score_student_hard": 0.7065081596374512, "val_loss": 1.454965388774872, "val_iou_score": 0.7126205563545227, "val_iou_score_student_hard": 0.7126205563545227, "_runtime": 10937.692821979523, "_timestamp": 1578873660.011092, "_step": 272}
{"epoch": 273, "loss": 0.2817290544509888, "iou_score": 0.712090015411377, "iou_score_student_hard": 0.712090015411377, "val_loss": 2.4573848068714144, "val_iou_score": 0.7131454348564148, "val_iou_score_student_hard": 0.7131454348564148, "_runtime": 10977.682403326035, "_timestamp": 1578873700.0006733, "_step": 273}
{"epoch": 274, "loss": 0.3039765093814243, "iou_score": 0.6869282722473145, "iou_score_student_hard": 0.6869282722473145, "val_loss": 13.336829280853271, "val_iou_score": 0.09474335610866547, "val_iou_score_student_hard": 0.09474335610866547, "_runtime": 11018.047106742859, "_timestamp": 1578873740.3653767, "_step": 274}
{"epoch": 275, "loss": 0.2881427641619336, "iou_score": 0.7062950134277344, "iou_score_student_hard": 0.7062950134277344, "val_loss": 13.372803020477296, "val_iou_score": 0.09351752698421478, "val_iou_score_student_hard": 0.09351752698421478, "_runtime": 11058.283680200577, "_timestamp": 1578873780.6019502, "_step": 275}
{"epoch": 276, "loss": 0.28889574882659047, "iou_score": 0.7058826684951782, "iou_score_student_hard": 0.7058826684951782, "val_loss": 13.407397794723511, "val_iou_score": 0.0920620933175087, "val_iou_score_student_hard": 0.0920620933175087, "_runtime": 11098.184074401855, "_timestamp": 1578873820.5023444, "_step": 276}
{"epoch": 277, "loss": 0.2838535260070454, "iou_score": 0.7082257270812988, "iou_score_student_hard": 0.7082257270812988, "val_loss": 13.355826234817505, "val_iou_score": 0.09418362379074097, "val_iou_score_student_hard": 0.09418362379074097, "_runtime": 11138.014027357101, "_timestamp": 1578873860.3322973, "_step": 277}
{"epoch": 278, "loss": 0.3209213981574232, "iou_score": 0.679745614528656, "iou_score_student_hard": 0.679745614528656, "val_loss": 13.34771957397461, "val_iou_score": 0.09437581896781921, "val_iou_score_student_hard": 0.09437581896781921, "_runtime": 11177.929450273514, "_timestamp": 1578873900.2477202, "_step": 278}
{"epoch": 279, "loss": 0.4063277293335308, "iou_score": 0.5936362743377686, "iou_score_student_hard": 0.5936362743377686, "val_loss": 13.426398324966431, "val_iou_score": 0.09145040065050125, "val_iou_score_student_hard": 0.09145040065050125, "_runtime": 11218.07104253769, "_timestamp": 1578873940.3893125, "_step": 279}
{"epoch": 280, "loss": 0.3531075943600048, "iou_score": 0.6385517716407776, "iou_score_student_hard": 0.6385517716407776, "val_loss": 13.376010465621949, "val_iou_score": 0.0932803526520729, "val_iou_score_student_hard": 0.0932803526520729, "_runtime": 11258.007467269897, "_timestamp": 1578873980.3257372, "_step": 280}
{"epoch": 281, "loss": 0.37662471410903064, "iou_score": 0.6189432740211487, "iou_score_student_hard": 0.6189432740211487, "val_loss": 2.698220932483673, "val_iou_score": 0.7143478989601135, "val_iou_score_student_hard": 0.7143478989601135, "_runtime": 11298.055146932602, "_timestamp": 1578874020.373417, "_step": 281}
{"epoch": 282, "loss": 0.3049711948091334, "iou_score": 0.688647449016571, "iou_score_student_hard": 0.688647449016571, "val_loss": 2.7582178473472596, "val_iou_score": 0.70930415391922, "val_iou_score_student_hard": 0.70930415391922, "_runtime": 11337.904600143433, "_timestamp": 1578874060.22287, "_step": 282}
{"epoch": 283, "loss": 0.2851521848277612, "iou_score": 0.708804190158844, "iou_score_student_hard": 0.708804190158844, "val_loss": 7.553996467590332, "val_iou_score": 0.09384545683860779, "val_iou_score_student_hard": 0.09384545683860779, "_runtime": 11377.96946310997, "_timestamp": 1578874100.287733, "_step": 283}
{"epoch": 284, "loss": 0.2826964303851128, "iou_score": 0.7126228213310242, "iou_score_student_hard": 0.7126228213310242, "val_loss": 2.72264763712883, "val_iou_score": 0.7123602032661438, "val_iou_score_student_hard": 0.7123602032661438, "_runtime": 11418.163870811462, "_timestamp": 1578874140.4821408, "_step": 284}
{"epoch": 285, "loss": 0.28065255203030326, "iou_score": 0.7121649384498596, "iou_score_student_hard": 0.7121649384498596, "val_loss": 0.274869529157877, "val_iou_score": 0.6998213529586792, "val_iou_score_student_hard": 0.6998213529586792, "_runtime": 11457.859147310257, "_timestamp": 1578874180.1774173, "_step": 285}
{"epoch": 286, "loss": 0.28875615366480567, "iou_score": 0.7091283202171326, "iou_score_student_hard": 0.7091283202171326, "val_loss": 13.34463095664978, "val_iou_score": 0.09447912871837616, "val_iou_score_student_hard": 0.09447912871837616, "_runtime": 11497.929582118988, "_timestamp": 1578874220.247852, "_step": 286}
{"epoch": 287, "loss": 0.28574209159070796, "iou_score": 0.708889365196228, "iou_score_student_hard": 0.708889365196228, "val_loss": 8.040457367897034, "val_iou_score": 0.0928814485669136, "val_iou_score_student_hard": 0.0928814485669136, "_runtime": 11537.72952580452, "_timestamp": 1578874260.0477958, "_step": 287}
{"epoch": 288, "loss": 0.28630016229369426, "iou_score": 0.707516074180603, "iou_score_student_hard": 0.707516074180603, "val_loss": 2.7246166288852693, "val_iou_score": 0.7117117047309875, "val_iou_score_student_hard": 0.7117117047309875, "_runtime": 11577.651895523071, "_timestamp": 1578874299.9701655, "_step": 288}
{"epoch": 289, "loss": 0.29468182149258526, "iou_score": 0.696259081363678, "iou_score_student_hard": 0.696259081363678, "val_loss": 13.425238561630248, "val_iou_score": 0.09144110977649689, "val_iou_score_student_hard": 0.09144110977649689, "_runtime": 11617.702977657318, "_timestamp": 1578874340.0212476, "_step": 289}
{"epoch": 290, "loss": 0.2905527185310017, "iou_score": 0.7032190561294556, "iou_score_student_hard": 0.7032190561294556, "val_loss": 13.343722009658814, "val_iou_score": 0.09442074596881866, "val_iou_score_student_hard": 0.09442074596881866, "_runtime": 11657.866104125977, "_timestamp": 1578874380.184374, "_step": 290}
{"epoch": 291, "loss": 0.28952500969171524, "iou_score": 0.703097403049469, "iou_score_student_hard": 0.703097403049469, "val_loss": 13.312084770202636, "val_iou_score": 0.0939117893576622, "val_iou_score_student_hard": 0.0939117893576622, "_runtime": 11697.847497701645, "_timestamp": 1578874420.1657677, "_step": 291}
{"epoch": 292, "loss": 0.28460440134460274, "iou_score": 0.7074522972106934, "iou_score_student_hard": 0.7074522972106934, "val_loss": 13.381557607650757, "val_iou_score": 0.09303446114063263, "val_iou_score_student_hard": 0.09303446114063263, "_runtime": 11738.030566453934, "_timestamp": 1578874460.3488364, "_step": 292}
{"epoch": 293, "loss": 0.2966883587566289, "iou_score": 0.6992241144180298, "iou_score_student_hard": 0.6992241144180298, "val_loss": 13.353379011154175, "val_iou_score": 0.0940173789858818, "val_iou_score_student_hard": 0.0940173789858818, "_runtime": 11777.912875413895, "_timestamp": 1578874500.2311454, "_step": 293}
{"epoch": 294, "loss": 0.2906654599038037, "iou_score": 0.70371413230896, "iou_score_student_hard": 0.70371413230896, "val_loss": 13.355219411849976, "val_iou_score": 0.09411638975143433, "val_iou_score_student_hard": 0.09411638975143433, "_runtime": 11817.976024627686, "_timestamp": 1578874540.2942946, "_step": 294}
{"epoch": 295, "loss": 0.28761246692050585, "iou_score": 0.705546498298645, "iou_score_student_hard": 0.705546498298645, "val_loss": 1.8908853650093078, "val_iou_score": 0.18256594240665436, "val_iou_score_student_hard": 0.18256594240665436, "_runtime": 11857.964596509933, "_timestamp": 1578874580.2828665, "_step": 295}
{"epoch": 296, "loss": 0.30770516449754887, "iou_score": 0.683349609375, "iou_score_student_hard": 0.683349609375, "val_loss": 13.34147605895996, "val_iou_score": 0.09463167935609818, "val_iou_score_student_hard": 0.09463167935609818, "_runtime": 11897.822927951813, "_timestamp": 1578874620.141198, "_step": 296}
{"epoch": 297, "loss": 0.2883892591704022, "iou_score": 0.7049866318702698, "iou_score_student_hard": 0.7049866318702698, "val_loss": 2.754573571681976, "val_iou_score": 0.7090990543365479, "val_iou_score_student_hard": 0.7090990543365479, "_runtime": 11937.76688170433, "_timestamp": 1578874660.0851517, "_step": 297}
{"epoch": 298, "loss": 0.28929819315671923, "iou_score": 0.7048516869544983, "iou_score_student_hard": 0.7048516869544983, "val_loss": 13.349183130264283, "val_iou_score": 0.09440348297357559, "val_iou_score_student_hard": 0.09440348297357559, "_runtime": 11977.814544916153, "_timestamp": 1578874700.132815, "_step": 298}
{"epoch": 299, "loss": 0.3467923520640893, "iou_score": 0.6523114442825317, "iou_score_student_hard": 0.6523114442825317, "val_loss": 13.408059358596802, "val_iou_score": 0.09198275208473206, "val_iou_score_student_hard": 0.09198275208473206, "_runtime": 12017.838396549225, "_timestamp": 1578874740.1566665, "_step": 299}
