{"system.gpu.0.gpu": 9.53, "system.gpu.0.memory": 1.67, "system.gpu.0.memory_allocated": 90.0, "system.gpu.0.temp": 29.33, "system.gpu.1.gpu": 10.73, "system.gpu.1.memory": 2.47, "system.gpu.1.memory_allocated": 83.83, "system.gpu.1.temp": 32.53, "system.gpu.2.gpu": 10.4, "system.gpu.2.memory": 2.0, "system.gpu.2.memory_allocated": 96.19, "system.gpu.2.temp": 35.0, "system.gpu.3.gpu": 11.4, "system.gpu.3.memory": 2.27, "system.gpu.3.memory_allocated": 89.97, "system.gpu.3.temp": 38.13, "system.cpu": 9.34, "system.memory": 10.66, "system.disk": 1.2, "system.proc.memory.availableMB": 57374.23, "system.proc.memory.rssMB": 5011.43, "system.proc.memory.percent": 7.8, "system.proc.cpu.threads": 88.27, "system.network.sent": 4326512, "system.network.recv": 8541152, "_wandb": true, "_timestamp": 1578849708, "_runtime": 31}
{"system.gpu.0.gpu": 59.07, "system.gpu.0.memory": 10.6, "system.gpu.0.memory_allocated": 97.42, "system.gpu.0.temp": 39.93, "system.gpu.1.gpu": 63.4, "system.gpu.1.memory": 11.2, "system.gpu.1.memory_allocated": 97.47, "system.gpu.1.temp": 43.27, "system.gpu.2.gpu": 56.73, "system.gpu.2.memory": 8.47, "system.gpu.2.memory_allocated": 97.42, "system.gpu.2.temp": 49.27, "system.gpu.3.gpu": 59.93, "system.gpu.3.memory": 9.07, "system.gpu.3.memory_allocated": 97.47, "system.gpu.3.temp": 49.4, "system.cpu": 19.25, "system.memory": 15.19, "system.disk": 1.2, "system.proc.memory.availableMB": 54464.48, "system.proc.memory.rssMB": 7951.85, "system.proc.memory.percent": 12.38, "system.proc.cpu.threads": 143.8, "system.network.sent": 15152838, "system.network.recv": 10519685, "_wandb": true, "_timestamp": 1578849738, "_runtime": 61}
{"system.gpu.0.gpu": 63.8, "system.gpu.0.memory": 11.87, "system.gpu.0.memory_allocated": 97.42, "system.gpu.0.temp": 48.73, "system.gpu.1.gpu": 63.2, "system.gpu.1.memory": 11.53, "system.gpu.1.memory_allocated": 97.47, "system.gpu.1.temp": 51.8, "system.gpu.2.gpu": 63.47, "system.gpu.2.memory": 9.8, "system.gpu.2.memory_allocated": 97.42, "system.gpu.2.temp": 57.73, "system.gpu.3.gpu": 63.8, "system.gpu.3.memory": 9.87, "system.gpu.3.memory_allocated": 97.47, "system.gpu.3.temp": 57.33, "system.cpu": 19.57, "system.memory": 15.25, "system.disk": 1.2, "system.proc.memory.availableMB": 54441.0, "system.proc.memory.rssMB": 7972.73, "system.proc.memory.percent": 12.41, "system.proc.cpu.threads": 190.8, "system.network.sent": 26726162, "system.network.recv": 11349117, "_wandb": true, "_timestamp": 1578849768, "_runtime": 91}
{"system.gpu.0.gpu": 54.2, "system.gpu.0.memory": 10.33, "system.gpu.0.memory_allocated": 97.42, "system.gpu.0.temp": 54.87, "system.gpu.1.gpu": 56.4, "system.gpu.1.memory": 10.33, "system.gpu.1.memory_allocated": 97.47, "system.gpu.1.temp": 57.53, "system.gpu.2.gpu": 55.93, "system.gpu.2.memory": 8.4, "system.gpu.2.memory_allocated": 97.42, "system.gpu.2.temp": 62.13, "system.gpu.3.gpu": 53.8, "system.gpu.3.memory": 8.93, "system.gpu.3.memory_allocated": 97.47, "system.gpu.3.temp": 61.87, "system.cpu": 19.54, "system.memory": 15.14, "system.disk": 1.2, "system.proc.memory.availableMB": 54500.72, "system.proc.memory.rssMB": 7910.51, "system.proc.memory.percent": 12.32, "system.proc.cpu.threads": 234.53, "system.network.sent": 35939848, "system.network.recv": 13321622, "_wandb": true, "_timestamp": 1578849798, "_runtime": 121}
{"system.gpu.0.gpu": 66.53, "system.gpu.0.memory": 12.2, "system.gpu.0.memory_allocated": 97.42, "system.gpu.0.temp": 59.53, "system.gpu.1.gpu": 65.47, "system.gpu.1.memory": 11.93, "system.gpu.1.memory_allocated": 97.47, "system.gpu.1.temp": 61.33, "system.gpu.2.gpu": 64.8, "system.gpu.2.memory": 9.87, "system.gpu.2.memory_allocated": 97.42, "system.gpu.2.temp": 65.13, "system.gpu.3.gpu": 66.27, "system.gpu.3.memory": 10.2, "system.gpu.3.memory_allocated": 97.47, "system.gpu.3.temp": 65.27, "system.cpu": 19.84, "system.memory": 15.24, "system.disk": 1.2, "system.proc.memory.availableMB": 54443.35, "system.proc.memory.rssMB": 7963.76, "system.proc.memory.percent": 12.4, "system.proc.cpu.threads": 279.4, "system.network.sent": 41697816, "system.network.recv": 15275606, "_wandb": true, "_timestamp": 1578849828, "_runtime": 151}
{"system.gpu.0.gpu": 57.2, "system.gpu.0.memory": 11.07, "system.gpu.0.memory_allocated": 97.42, "system.gpu.0.temp": 62.33, "system.gpu.1.gpu": 57.6, "system.gpu.1.memory": 11.4, "system.gpu.1.memory_allocated": 97.47, "system.gpu.1.temp": 64.07, "system.gpu.2.gpu": 57.67, "system.gpu.2.memory": 9.4, "system.gpu.2.memory_allocated": 97.42, "system.gpu.2.temp": 66.87, "system.gpu.3.gpu": 56.47, "system.gpu.3.memory": 9.27, "system.gpu.3.memory_allocated": 97.47, "system.gpu.3.temp": 67.8, "system.cpu": 19.71, "system.memory": 15.26, "system.disk": 1.2, "system.proc.memory.availableMB": 54432.74, "system.proc.memory.rssMB": 7973.6, "system.proc.memory.percent": 12.41, "system.proc.cpu.threads": 323.2, "system.network.sent": 45714549, "system.network.recv": 15473919, "_wandb": true, "_timestamp": 1578849859, "_runtime": 181}
{"system.gpu.0.gpu": 63.13, "system.gpu.0.memory": 12.0, "system.gpu.0.memory_allocated": 97.42, "system.gpu.0.temp": 64.4, "system.gpu.1.gpu": 62.87, "system.gpu.1.memory": 11.67, "system.gpu.1.memory_allocated": 97.47, "system.gpu.1.temp": 65.93, "system.gpu.2.gpu": 61.73, "system.gpu.2.memory": 9.4, "system.gpu.2.memory_allocated": 97.42, "system.gpu.2.temp": 68.07, "system.gpu.3.gpu": 62.47, "system.gpu.3.memory": 10.07, "system.gpu.3.memory_allocated": 97.47, "system.gpu.3.temp": 69.13, "system.cpu": 19.97, "system.memory": 15.36, "system.disk": 1.2, "system.proc.memory.availableMB": 54361.27, "system.proc.memory.rssMB": 8042.83, "system.proc.memory.percent": 12.52, "system.proc.cpu.threads": 366.93, "system.network.sent": 49725648, "system.network.recv": 15674847, "_wandb": true, "_timestamp": 1578849889, "_runtime": 211}
{"system.gpu.0.gpu": 57.87, "system.gpu.0.memory": 10.67, "system.gpu.0.memory_allocated": 97.42, "system.gpu.0.temp": 65.73, "system.gpu.1.gpu": 56.8, "system.gpu.1.memory": 10.8, "system.gpu.1.memory_allocated": 97.47, "system.gpu.1.temp": 67.2, "system.gpu.2.gpu": 57.4, "system.gpu.2.memory": 9.0, "system.gpu.2.memory_allocated": 97.42, "system.gpu.2.temp": 68.93, "system.gpu.3.gpu": 56.67, "system.gpu.3.memory": 8.67, "system.gpu.3.memory_allocated": 97.47, "system.gpu.3.temp": 70.07, "system.cpu": 19.57, "system.memory": 15.33, "system.disk": 1.2, "system.proc.memory.availableMB": 54383.16, "system.proc.memory.rssMB": 8019.64, "system.proc.memory.percent": 12.49, "system.proc.cpu.threads": 410.47, "system.network.sent": 58937860, "system.network.recv": 17645086, "_wandb": true, "_timestamp": 1578849919, "_runtime": 241}
{"system.gpu.0.gpu": 53.67, "system.gpu.0.memory": 10.2, "system.gpu.0.memory_allocated": 97.42, "system.gpu.0.temp": 66.67, "system.gpu.1.gpu": 54.33, "system.gpu.1.memory": 10.2, "system.gpu.1.memory_allocated": 97.47, "system.gpu.1.temp": 68.2, "system.gpu.2.gpu": 53.87, "system.gpu.2.memory": 8.13, "system.gpu.2.memory_allocated": 97.42, "system.gpu.2.temp": 69.47, "system.gpu.3.gpu": 54.0, "system.gpu.3.memory": 8.53, "system.gpu.3.memory_allocated": 97.47, "system.gpu.3.temp": 70.93, "system.cpu": 19.43, "system.memory": 15.66, "system.disk": 1.2, "system.proc.memory.availableMB": 54173.67, "system.proc.memory.rssMB": 8227.32, "system.proc.memory.percent": 12.81, "system.proc.cpu.threads": 453.73, "system.network.sent": 66445959, "system.network.recv": 17873254, "_wandb": true, "_timestamp": 1578849949, "_runtime": 272}
{"system.gpu.0.gpu": 59.53, "system.gpu.0.memory": 11.6, "system.gpu.0.memory_allocated": 97.42, "system.gpu.0.temp": 67.2, "system.gpu.1.gpu": 61.0, "system.gpu.1.memory": 12.13, "system.gpu.1.memory_allocated": 97.47, "system.gpu.1.temp": 69.2, "system.gpu.2.gpu": 60.07, "system.gpu.2.memory": 9.93, "system.gpu.2.memory_allocated": 97.42, "system.gpu.2.temp": 69.93, "system.gpu.3.gpu": 59.67, "system.gpu.3.memory": 9.93, "system.gpu.3.memory_allocated": 97.47, "system.gpu.3.temp": 71.73, "system.cpu": 20.0, "system.memory": 15.52, "system.disk": 1.2, "system.proc.memory.availableMB": 54261.7, "system.proc.memory.rssMB": 8133.67, "system.proc.memory.percent": 12.66, "system.proc.cpu.threads": 494.67, "system.network.sent": 67040659, "system.network.recv": 18051596, "_wandb": true, "_timestamp": 1578849979, "_runtime": 302}
{"system.gpu.0.gpu": 67.2, "system.gpu.0.memory": 11.87, "system.gpu.0.memory_allocated": 97.42, "system.gpu.0.temp": 67.87, "system.gpu.1.gpu": 65.8, "system.gpu.1.memory": 11.67, "system.gpu.1.memory_allocated": 97.47, "system.gpu.1.temp": 69.87, "system.gpu.2.gpu": 65.6, "system.gpu.2.memory": 9.8, "system.gpu.2.memory_allocated": 97.42, "system.gpu.2.temp": 70.07, "system.gpu.3.gpu": 65.4, "system.gpu.3.memory": 9.6, "system.gpu.3.memory_allocated": 97.47, "system.gpu.3.temp": 72.53, "system.cpu": 19.99, "system.memory": 15.49, "system.disk": 1.2, "system.proc.memory.availableMB": 54277.76, "system.proc.memory.rssMB": 8120.13, "system.proc.memory.percent": 12.64, "system.proc.cpu.threads": 537.67, "system.network.sent": 67623791, "system.network.recv": 18229321, "_wandb": true, "_timestamp": 1578850009, "_runtime": 332}
{"system.gpu.0.gpu": 66.07, "system.gpu.0.memory": 11.4, "system.gpu.0.memory_allocated": 97.42, "system.gpu.0.temp": 68.0, "system.gpu.1.gpu": 69.47, "system.gpu.1.memory": 12.07, "system.gpu.1.memory_allocated": 97.47, "system.gpu.1.temp": 70.8, "system.gpu.2.gpu": 68.73, "system.gpu.2.memory": 9.87, "system.gpu.2.memory_allocated": 97.42, "system.gpu.2.temp": 70.53, "system.gpu.3.gpu": 67.33, "system.gpu.3.memory": 9.73, "system.gpu.3.memory_allocated": 97.47, "system.gpu.3.temp": 73.0, "system.cpu": 20.06, "system.memory": 15.57, "system.disk": 1.2, "system.proc.memory.availableMB": 54229.05, "system.proc.memory.rssMB": 8165.86, "system.proc.memory.percent": 12.71, "system.proc.cpu.threads": 579.8, "system.network.sent": 68206555, "system.network.recv": 18409194, "_wandb": true, "_timestamp": 1578850039, "_runtime": 362}
{"system.gpu.0.gpu": 59.07, "system.gpu.0.memory": 11.27, "system.gpu.0.memory_allocated": 97.42, "system.gpu.0.temp": 68.2, "system.gpu.1.gpu": 60.8, "system.gpu.1.memory": 11.4, "system.gpu.1.memory_allocated": 97.47, "system.gpu.1.temp": 71.07, "system.gpu.2.gpu": 60.33, "system.gpu.2.memory": 9.47, "system.gpu.2.memory_allocated": 97.42, "system.gpu.2.temp": 70.87, "system.gpu.3.gpu": 59.93, "system.gpu.3.memory": 9.53, "system.gpu.3.memory_allocated": 97.47, "system.gpu.3.temp": 73.53, "system.cpu": 20.11, "system.memory": 15.57, "system.disk": 1.2, "system.proc.memory.availableMB": 54230.65, "system.proc.memory.rssMB": 8162.7, "system.proc.memory.percent": 12.71, "system.proc.cpu.threads": 623.6, "system.network.sent": 68803343, "system.network.recv": 18588669, "_wandb": true, "_timestamp": 1578850069, "_runtime": 392}
{"system.gpu.0.gpu": 66.13, "system.gpu.0.memory": 11.8, "system.gpu.0.memory_allocated": 97.42, "system.gpu.0.temp": 68.87, "system.gpu.1.gpu": 65.47, "system.gpu.1.memory": 11.87, "system.gpu.1.memory_allocated": 97.47, "system.gpu.1.temp": 71.6, "system.gpu.2.gpu": 65.07, "system.gpu.2.memory": 9.8, "system.gpu.2.memory_allocated": 97.42, "system.gpu.2.temp": 71.0, "system.gpu.3.gpu": 65.27, "system.gpu.3.memory": 9.93, "system.gpu.3.memory_allocated": 97.47, "system.gpu.3.temp": 74.0, "system.cpu": 19.99, "system.memory": 15.54, "system.disk": 1.2, "system.proc.memory.availableMB": 54251.61, "system.proc.memory.rssMB": 8140.28, "system.proc.memory.percent": 12.67, "system.proc.cpu.threads": 664.67, "system.network.sent": 69390132, "system.network.recv": 18769753, "_wandb": true, "_timestamp": 1578850100, "_runtime": 422}
{"system.gpu.0.gpu": 67.6, "system.gpu.0.memory": 11.8, "system.gpu.0.memory_allocated": 97.42, "system.gpu.0.temp": 69.0, "system.gpu.1.gpu": 70.0, "system.gpu.1.memory": 12.0, "system.gpu.1.memory_allocated": 97.47, "system.gpu.1.temp": 72.0, "system.gpu.2.gpu": 68.2, "system.gpu.2.memory": 9.8, "system.gpu.2.memory_allocated": 97.42, "system.gpu.2.temp": 71.0, "system.gpu.3.gpu": 67.73, "system.gpu.3.memory": 10.07, "system.gpu.3.memory_allocated": 97.47, "system.gpu.3.temp": 74.0, "system.cpu": 19.84, "system.memory": 15.73, "system.disk": 1.2, "system.proc.memory.availableMB": 54131.91, "system.proc.memory.rssMB": 8257.49, "system.proc.memory.percent": 12.86, "system.proc.cpu.threads": 702.33, "system.network.sent": 70004482, "system.network.recv": 18952664, "_wandb": true, "_timestamp": 1578850130, "_runtime": 452}
{"system.gpu.0.gpu": 63.2, "system.gpu.0.memory": 11.47, "system.gpu.0.memory_allocated": 97.42, "system.gpu.0.temp": 69.0, "system.gpu.1.gpu": 60.07, "system.gpu.1.memory": 11.07, "system.gpu.1.memory_allocated": 97.47, "system.gpu.1.temp": 72.07, "system.gpu.2.gpu": 59.47, "system.gpu.2.memory": 9.13, "system.gpu.2.memory_allocated": 97.42, "system.gpu.2.temp": 71.0, "system.gpu.3.gpu": 59.87, "system.gpu.3.memory": 9.33, "system.gpu.3.memory_allocated": 97.47, "system.gpu.3.temp": 74.0, "system.cpu": 20.17, "system.memory": 15.71, "system.disk": 1.2, "system.proc.memory.availableMB": 54140.5, "system.proc.memory.rssMB": 8246.73, "system.proc.memory.percent": 12.84, "system.proc.cpu.threads": 739.6, "system.network.sent": 70597960, "system.network.recv": 19132971, "_wandb": true, "_timestamp": 1578850160, "_runtime": 482}
{"system.gpu.0.gpu": 65.8, "system.gpu.0.memory": 11.27, "system.gpu.0.memory_allocated": 97.42, "system.gpu.0.temp": 69.0, "system.gpu.1.gpu": 66.0, "system.gpu.1.memory": 11.53, "system.gpu.1.memory_allocated": 97.47, "system.gpu.1.temp": 72.73, "system.gpu.2.gpu": 65.2, "system.gpu.2.memory": 9.53, "system.gpu.2.memory_allocated": 97.42, "system.gpu.2.temp": 71.53, "system.gpu.3.gpu": 66.27, "system.gpu.3.memory": 9.67, "system.gpu.3.memory_allocated": 97.47, "system.gpu.3.temp": 74.33, "system.cpu": 20.22, "system.memory": 15.76, "system.disk": 1.2, "system.proc.memory.availableMB": 54107.85, "system.proc.memory.rssMB": 8277.58, "system.proc.memory.percent": 12.89, "system.proc.cpu.threads": 776.4, "system.network.sent": 71203030, "system.network.recv": 19313618, "_wandb": true, "_timestamp": 1578850190, "_runtime": 513}
{"system.gpu.0.gpu": 61.0, "system.gpu.0.memory": 11.73, "system.gpu.0.memory_allocated": 97.42, "system.gpu.0.temp": 69.0, "system.gpu.1.gpu": 63.33, "system.gpu.1.memory": 11.53, "system.gpu.1.memory_allocated": 97.47, "system.gpu.1.temp": 72.93, "system.gpu.2.gpu": 63.07, "system.gpu.2.memory": 9.8, "system.gpu.2.memory_allocated": 97.42, "system.gpu.2.temp": 71.73, "system.gpu.3.gpu": 59.73, "system.gpu.3.memory": 9.8, "system.gpu.3.memory_allocated": 97.47, "system.gpu.3.temp": 74.87, "system.cpu": 20.12, "system.memory": 15.71, "system.disk": 1.2, "system.proc.memory.availableMB": 54138.35, "system.proc.memory.rssMB": 8245.07, "system.proc.memory.percent": 12.84, "system.proc.cpu.threads": 811.07, "system.network.sent": 71797543, "system.network.recv": 19493675, "_wandb": true, "_timestamp": 1578850220, "_runtime": 543}
{"system.gpu.0.gpu": 65.0, "system.gpu.0.memory": 11.87, "system.gpu.0.memory_allocated": 97.42, "system.gpu.0.temp": 69.33, "system.gpu.1.gpu": 66.53, "system.gpu.1.memory": 11.93, "system.gpu.1.memory_allocated": 97.47, "system.gpu.1.temp": 72.93, "system.gpu.2.gpu": 66.0, "system.gpu.2.memory": 9.8, "system.gpu.2.memory_allocated": 97.42, "system.gpu.2.temp": 71.73, "system.gpu.3.gpu": 65.33, "system.gpu.3.memory": 9.87, "system.gpu.3.memory_allocated": 97.47, "system.gpu.3.temp": 75.0, "system.cpu": 20.27, "system.memory": 15.75, "system.disk": 1.2, "system.proc.memory.availableMB": 54108.3, "system.proc.memory.rssMB": 8275.31, "system.proc.memory.percent": 12.88, "system.proc.cpu.threads": 847.33, "system.network.sent": 72382921, "system.network.recv": 19673446, "_wandb": true, "_timestamp": 1578850250, "_runtime": 573}
{"system.gpu.0.gpu": 66.73, "system.gpu.0.memory": 11.73, "system.gpu.0.memory_allocated": 97.42, "system.gpu.0.temp": 69.8, "system.gpu.1.gpu": 67.07, "system.gpu.1.memory": 12.07, "system.gpu.1.memory_allocated": 97.47, "system.gpu.1.temp": 73.07, "system.gpu.2.gpu": 66.27, "system.gpu.2.memory": 9.87, "system.gpu.2.memory_allocated": 97.42, "system.gpu.2.temp": 71.93, "system.gpu.3.gpu": 66.13, "system.gpu.3.memory": 9.87, "system.gpu.3.memory_allocated": 97.47, "system.gpu.3.temp": 75.0, "system.cpu": 19.97, "system.memory": 15.89, "system.disk": 1.2, "system.proc.memory.availableMB": 54026.82, "system.proc.memory.rssMB": 8347.76, "system.proc.memory.percent": 12.99, "system.proc.cpu.threads": 882.67, "system.network.sent": 72984548, "system.network.recv": 19855772, "_wandb": true, "_timestamp": 1578850280, "_runtime": 603}
{"system.gpu.0.gpu": 63.07, "system.gpu.0.memory": 11.67, "system.gpu.0.memory_allocated": 97.42, "system.gpu.0.temp": 69.93, "system.gpu.1.gpu": 62.87, "system.gpu.1.memory": 11.47, "system.gpu.1.memory_allocated": 97.47, "system.gpu.1.temp": 73.0, "system.gpu.2.gpu": 62.13, "system.gpu.2.memory": 9.27, "system.gpu.2.memory_allocated": 97.42, "system.gpu.2.temp": 71.93, "system.gpu.3.gpu": 62.13, "system.gpu.3.memory": 9.47, "system.gpu.3.memory_allocated": 97.47, "system.gpu.3.temp": 75.0, "system.cpu": 19.73, "system.memory": 15.79, "system.disk": 1.2, "system.proc.memory.availableMB": 54080.57, "system.proc.memory.rssMB": 8299.73, "system.proc.memory.percent": 12.92, "system.proc.cpu.threads": 914.27, "system.network.sent": 73585688, "system.network.recv": 20036820, "_wandb": true, "_timestamp": 1578850311, "_runtime": 633}
{"system.gpu.0.gpu": 65.07, "system.gpu.0.memory": 11.33, "system.gpu.0.memory_allocated": 97.42, "system.gpu.0.temp": 69.87, "system.gpu.1.gpu": 65.87, "system.gpu.1.memory": 11.67, "system.gpu.1.memory_allocated": 97.47, "system.gpu.1.temp": 72.87, "system.gpu.2.gpu": 65.2, "system.gpu.2.memory": 9.8, "system.gpu.2.memory_allocated": 97.42, "system.gpu.2.temp": 71.93, "system.gpu.3.gpu": 66.27, "system.gpu.3.memory": 9.93, "system.gpu.3.memory_allocated": 97.47, "system.gpu.3.temp": 75.0, "system.cpu": 20.34, "system.memory": 15.87, "system.disk": 1.2, "system.proc.memory.availableMB": 54044.75, "system.proc.memory.rssMB": 8333.45, "system.proc.memory.percent": 12.97, "system.proc.cpu.threads": 947.87, "system.network.sent": 74151568, "system.network.recv": 20212095, "_wandb": true, "_timestamp": 1578850341, "_runtime": 663}
{"system.gpu.0.gpu": 65.53, "system.gpu.0.memory": 11.67, "system.gpu.0.memory_allocated": 97.42, "system.gpu.0.temp": 69.93, "system.gpu.1.gpu": 63.2, "system.gpu.1.memory": 11.33, "system.gpu.1.memory_allocated": 97.47, "system.gpu.1.temp": 73.0, "system.gpu.2.gpu": 62.73, "system.gpu.2.memory": 9.47, "system.gpu.2.memory_allocated": 97.42, "system.gpu.2.temp": 72.0, "system.gpu.3.gpu": 62.53, "system.gpu.3.memory": 9.53, "system.gpu.3.memory_allocated": 97.47, "system.gpu.3.temp": 75.0, "system.cpu": 19.91, "system.memory": 16.07, "system.disk": 1.2, "system.proc.memory.availableMB": 53915.66, "system.proc.memory.rssMB": 8460.69, "system.proc.memory.percent": 13.17, "system.proc.cpu.threads": 987.67, "system.network.sent": 74763182, "system.network.recv": 20391250, "_wandb": true, "_timestamp": 1578850371, "_runtime": 693}
{"system.gpu.0.gpu": 64.07, "system.gpu.0.memory": 11.67, "system.gpu.0.memory_allocated": 97.42, "system.gpu.0.temp": 70.0, "system.gpu.1.gpu": 63.13, "system.gpu.1.memory": 11.33, "system.gpu.1.memory_allocated": 97.47, "system.gpu.1.temp": 73.0, "system.gpu.2.gpu": 60.2, "system.gpu.2.memory": 9.07, "system.gpu.2.memory_allocated": 97.42, "system.gpu.2.temp": 72.0, "system.gpu.3.gpu": 63.2, "system.gpu.3.memory": 9.73, "system.gpu.3.memory_allocated": 97.47, "system.gpu.3.temp": 75.0, "system.cpu": 19.96, "system.memory": 15.9, "system.disk": 1.2, "system.proc.memory.availableMB": 54023.97, "system.proc.memory.rssMB": 8351.01, "system.proc.memory.percent": 13.0, "system.proc.cpu.threads": 1023.07, "system.network.sent": 75354478, "system.network.recv": 20569609, "_wandb": true, "_timestamp": 1578850401, "_runtime": 723}
{"system.gpu.0.gpu": 63.13, "system.gpu.0.memory": 11.4, "system.gpu.0.memory_allocated": 97.42, "system.gpu.0.temp": 69.87, "system.gpu.1.gpu": 62.13, "system.gpu.1.memory": 11.2, "system.gpu.1.memory_allocated": 97.47, "system.gpu.1.temp": 73.07, "system.gpu.2.gpu": 60.93, "system.gpu.2.memory": 9.27, "system.gpu.2.memory_allocated": 97.42, "system.gpu.2.temp": 72.0, "system.gpu.3.gpu": 62.2, "system.gpu.3.memory": 9.47, "system.gpu.3.memory_allocated": 97.47, "system.gpu.3.temp": 75.0, "system.cpu": 19.84, "system.memory": 15.93, "system.disk": 1.2, "system.proc.memory.availableMB": 54004.49, "system.proc.memory.rssMB": 8369.06, "system.proc.memory.percent": 13.03, "system.proc.cpu.threads": 1058.33, "system.network.sent": 75933516, "system.network.recv": 20750276, "_wandb": true, "_timestamp": 1578850431, "_runtime": 754}
{"system.gpu.0.gpu": 69.53, "system.gpu.0.memory": 11.93, "system.gpu.0.memory_allocated": 97.42, "system.gpu.0.temp": 70.0, "system.gpu.1.gpu": 70.87, "system.gpu.1.memory": 12.33, "system.gpu.1.memory_allocated": 97.47, "system.gpu.1.temp": 73.6, "system.gpu.2.gpu": 71.0, "system.gpu.2.memory": 10.0, "system.gpu.2.memory_allocated": 97.42, "system.gpu.2.temp": 72.0, "system.gpu.3.gpu": 69.27, "system.gpu.3.memory": 10.0, "system.gpu.3.memory_allocated": 97.47, "system.gpu.3.temp": 75.0, "system.cpu": 19.96, "system.memory": 15.97, "system.disk": 1.2, "system.proc.memory.availableMB": 53963.69, "system.proc.memory.rssMB": 8407.48, "system.proc.memory.percent": 13.09, "system.proc.cpu.threads": 1093.2, "system.network.sent": 76537136, "system.network.recv": 20930715, "_wandb": true, "_timestamp": 1578850461, "_runtime": 784}
{"system.gpu.0.gpu": 60.0, "system.gpu.0.memory": 11.2, "system.gpu.0.memory_allocated": 97.42, "system.gpu.0.temp": 70.0, "system.gpu.1.gpu": 59.13, "system.gpu.1.memory": 10.93, "system.gpu.1.memory_allocated": 97.47, "system.gpu.1.temp": 73.73, "system.gpu.2.gpu": 58.6, "system.gpu.2.memory": 9.13, "system.gpu.2.memory_allocated": 97.42, "system.gpu.2.temp": 72.0, "system.gpu.3.gpu": 59.73, "system.gpu.3.memory": 9.47, "system.gpu.3.memory_allocated": 97.47, "system.gpu.3.temp": 75.4, "system.cpu": 19.85, "system.memory": 15.96, "system.disk": 1.2, "system.proc.memory.availableMB": 53984.49, "system.proc.memory.rssMB": 8388.09, "system.proc.memory.percent": 13.06, "system.proc.cpu.threads": 1124.53, "system.network.sent": 77122647, "system.network.recv": 21109653, "_wandb": true, "_timestamp": 1578850491, "_runtime": 814}
{"system.gpu.0.gpu": 64.0, "system.gpu.0.memory": 11.2, "system.gpu.0.memory_allocated": 97.42, "system.gpu.0.temp": 70.0, "system.gpu.1.gpu": 64.87, "system.gpu.1.memory": 11.27, "system.gpu.1.memory_allocated": 97.47, "system.gpu.1.temp": 73.53, "system.gpu.2.gpu": 65.0, "system.gpu.2.memory": 9.33, "system.gpu.2.memory_allocated": 97.42, "system.gpu.2.temp": 72.0, "system.gpu.3.gpu": 63.33, "system.gpu.3.memory": 9.27, "system.gpu.3.memory_allocated": 97.47, "system.gpu.3.temp": 75.6, "system.cpu": 19.84, "system.memory": 16.09, "system.disk": 1.2, "system.proc.memory.availableMB": 53895.02, "system.proc.memory.rssMB": 8474.13, "system.proc.memory.percent": 13.19, "system.proc.cpu.threads": 1161.13, "system.network.sent": 77719763, "system.network.recv": 21294569, "_wandb": true, "_timestamp": 1578850521, "_runtime": 844}
{"system.gpu.0.gpu": 64.93, "system.gpu.0.memory": 11.8, "system.gpu.0.memory_allocated": 97.42, "system.gpu.0.temp": 70.07, "system.gpu.1.gpu": 64.27, "system.gpu.1.memory": 11.93, "system.gpu.1.memory_allocated": 97.47, "system.gpu.1.temp": 73.93, "system.gpu.2.gpu": 63.6, "system.gpu.2.memory": 9.67, "system.gpu.2.memory_allocated": 97.42, "system.gpu.2.temp": 72.0, "system.gpu.3.gpu": 64.53, "system.gpu.3.memory": 9.6, "system.gpu.3.memory_allocated": 97.47, "system.gpu.3.temp": 75.8, "system.cpu": 19.88, "system.memory": 16.01, "system.disk": 1.2, "system.proc.memory.availableMB": 53950.56, "system.proc.memory.rssMB": 8417.05, "system.proc.memory.percent": 13.1, "system.proc.cpu.threads": 1195.8, "system.network.sent": 78309958, "system.network.recv": 21475179, "_wandb": true, "_timestamp": 1578850552, "_runtime": 874}
{"system.gpu.0.gpu": 68.33, "system.gpu.0.memory": 11.87, "system.gpu.0.memory_allocated": 97.42, "system.gpu.0.temp": 70.07, "system.gpu.1.gpu": 65.93, "system.gpu.1.memory": 11.4, "system.gpu.1.memory_allocated": 97.47, "system.gpu.1.temp": 73.93, "system.gpu.2.gpu": 65.87, "system.gpu.2.memory": 9.53, "system.gpu.2.memory_allocated": 97.42, "system.gpu.2.temp": 72.0, "system.gpu.3.gpu": 67.87, "system.gpu.3.memory": 9.8, "system.gpu.3.memory_allocated": 97.47, "system.gpu.3.temp": 75.73, "system.cpu": 20.15, "system.memory": 16.02, "system.disk": 1.2, "system.proc.memory.availableMB": 53936.85, "system.proc.memory.rssMB": 8429.98, "system.proc.memory.percent": 13.12, "system.proc.cpu.threads": 1225.33, "system.network.sent": 78883609, "system.network.recv": 21653816, "_wandb": true, "_timestamp": 1578850582, "_runtime": 904}
{"system.gpu.0.gpu": 59.8, "system.gpu.0.memory": 11.87, "system.gpu.0.memory_allocated": 97.42, "system.gpu.0.temp": 70.0, "system.gpu.1.gpu": 61.87, "system.gpu.1.memory": 11.8, "system.gpu.1.memory_allocated": 97.47, "system.gpu.1.temp": 73.93, "system.gpu.2.gpu": 60.4, "system.gpu.2.memory": 9.53, "system.gpu.2.memory_allocated": 97.42, "system.gpu.2.temp": 72.0, "system.gpu.3.gpu": 59.67, "system.gpu.3.memory": 9.8, "system.gpu.3.memory_allocated": 97.47, "system.gpu.3.temp": 75.73, "system.cpu": 19.94, "system.memory": 16.04, "system.disk": 1.2, "system.proc.memory.availableMB": 53929.74, "system.proc.memory.rssMB": 8435.68, "system.proc.memory.percent": 13.13, "system.proc.cpu.threads": 1255.33, "system.network.sent": 79475264, "system.network.recv": 21832027, "_wandb": true, "_timestamp": 1578850612, "_runtime": 934}
{"system.gpu.0.gpu": 70.6, "system.gpu.0.memory": 12.2, "system.gpu.0.memory_allocated": 97.42, "system.gpu.0.temp": 70.0, "system.gpu.1.gpu": 70.2, "system.gpu.1.memory": 12.0, "system.gpu.1.memory_allocated": 97.47, "system.gpu.1.temp": 73.53, "system.gpu.2.gpu": 69.4, "system.gpu.2.memory": 9.93, "system.gpu.2.memory_allocated": 97.42, "system.gpu.2.temp": 72.0, "system.gpu.3.gpu": 70.47, "system.gpu.3.memory": 10.27, "system.gpu.3.memory_allocated": 97.47, "system.gpu.3.temp": 75.73, "system.cpu": 19.79, "system.memory": 16.15, "system.disk": 1.2, "system.proc.memory.availableMB": 53860.96, "system.proc.memory.rssMB": 8504.63, "system.proc.memory.percent": 13.24, "system.proc.cpu.threads": 1290.2, "system.network.sent": 80053467, "system.network.recv": 22010716, "_wandb": true, "_timestamp": 1578850642, "_runtime": 964}
{"system.gpu.0.gpu": 61.33, "system.gpu.0.memory": 11.13, "system.gpu.0.memory_allocated": 97.42, "system.gpu.0.temp": 69.87, "system.gpu.1.gpu": 61.73, "system.gpu.1.memory": 11.27, "system.gpu.1.memory_allocated": 97.47, "system.gpu.1.temp": 73.33, "system.gpu.2.gpu": 60.47, "system.gpu.2.memory": 9.33, "system.gpu.2.memory_allocated": 97.42, "system.gpu.2.temp": 72.0, "system.gpu.3.gpu": 61.33, "system.gpu.3.memory": 9.4, "system.gpu.3.memory_allocated": 97.47, "system.gpu.3.temp": 75.27, "system.cpu": 19.8, "system.memory": 16.19, "system.disk": 1.2, "system.proc.memory.availableMB": 53834.35, "system.proc.memory.rssMB": 8527.56, "system.proc.memory.percent": 13.28, "system.proc.cpu.threads": 1322.27, "system.network.sent": 80640363, "system.network.recv": 22190721, "_wandb": true, "_timestamp": 1578850672, "_runtime": 995}
{"system.gpu.0.gpu": 64.8, "system.gpu.0.memory": 11.47, "system.gpu.0.memory_allocated": 97.42, "system.gpu.0.temp": 70.0, "system.gpu.1.gpu": 66.13, "system.gpu.1.memory": 11.53, "system.gpu.1.memory_allocated": 97.47, "system.gpu.1.temp": 73.07, "system.gpu.2.gpu": 65.8, "system.gpu.2.memory": 9.53, "system.gpu.2.memory_allocated": 97.42, "system.gpu.2.temp": 72.0, "system.gpu.3.gpu": 65.47, "system.gpu.3.memory": 9.47, "system.gpu.3.memory_allocated": 97.47, "system.gpu.3.temp": 75.07, "system.cpu": 19.9, "system.memory": 16.12, "system.disk": 1.2, "system.proc.memory.availableMB": 53871.65, "system.proc.memory.rssMB": 8489.56, "system.proc.memory.percent": 13.22, "system.proc.cpu.threads": 1347.13, "system.network.sent": 81222393, "system.network.recv": 22370469, "_wandb": true, "_timestamp": 1578850702, "_runtime": 1025}
{"system.gpu.0.gpu": 65.73, "system.gpu.0.memory": 11.8, "system.gpu.0.memory_allocated": 97.42, "system.gpu.0.temp": 70.0, "system.gpu.1.gpu": 64.67, "system.gpu.1.memory": 11.8, "system.gpu.1.memory_allocated": 97.47, "system.gpu.1.temp": 72.87, "system.gpu.2.gpu": 64.13, "system.gpu.2.memory": 9.8, "system.gpu.2.memory_allocated": 97.42, "system.gpu.2.temp": 72.0, "system.gpu.3.gpu": 65.07, "system.gpu.3.memory": 9.87, "system.gpu.3.memory_allocated": 97.47, "system.gpu.3.temp": 75.0, "system.cpu": 19.99, "system.memory": 16.11, "system.disk": 1.2, "system.proc.memory.availableMB": 53883.34, "system.proc.memory.rssMB": 8476.88, "system.proc.memory.percent": 13.2, "system.proc.cpu.threads": 1371.53, "system.network.sent": 81830321, "system.network.recv": 22564213, "_wandb": true, "_timestamp": 1578850732, "_runtime": 1055}
{"system.gpu.0.gpu": 64.47, "system.gpu.0.memory": 11.0, "system.gpu.0.memory_allocated": 97.42, "system.gpu.0.temp": 70.0, "system.gpu.1.gpu": 67.0, "system.gpu.1.memory": 11.4, "system.gpu.1.memory_allocated": 97.47, "system.gpu.1.temp": 73.0, "system.gpu.2.gpu": 66.33, "system.gpu.2.memory": 9.4, "system.gpu.2.memory_allocated": 97.42, "system.gpu.2.temp": 71.93, "system.gpu.3.gpu": 65.6, "system.gpu.3.memory": 9.6, "system.gpu.3.memory_allocated": 97.47, "system.gpu.3.temp": 75.0, "system.cpu": 19.91, "system.memory": 16.15, "system.disk": 1.2, "system.proc.memory.availableMB": 53845.69, "system.proc.memory.rssMB": 8514.14, "system.proc.memory.percent": 13.26, "system.proc.cpu.threads": 1394.53, "system.network.sent": 82438278, "system.network.recv": 22746168, "_wandb": true, "_timestamp": 1578850762, "_runtime": 1085}
{"system.gpu.0.gpu": 60.67, "system.gpu.0.memory": 11.33, "system.gpu.0.memory_allocated": 97.42, "system.gpu.0.temp": 69.93, "system.gpu.1.gpu": 63.8, "system.gpu.1.memory": 11.87, "system.gpu.1.memory_allocated": 97.47, "system.gpu.1.temp": 73.0, "system.gpu.2.gpu": 63.13, "system.gpu.2.memory": 9.93, "system.gpu.2.memory_allocated": 97.42, "system.gpu.2.temp": 71.6, "system.gpu.3.gpu": 60.67, "system.gpu.3.memory": 9.67, "system.gpu.3.memory_allocated": 97.47, "system.gpu.3.temp": 75.0, "system.cpu": 19.85, "system.memory": 16.13, "system.disk": 1.2, "system.proc.memory.availableMB": 53869.36, "system.proc.memory.rssMB": 8487.69, "system.proc.memory.percent": 13.21, "system.proc.cpu.threads": 1425.33, "system.network.sent": 83009210, "system.network.recv": 22923709, "_wandb": true, "_timestamp": 1578850793, "_runtime": 1115}
{"system.gpu.0.gpu": 63.4, "system.gpu.0.memory": 11.4, "system.gpu.0.memory_allocated": 97.42, "system.gpu.0.temp": 69.93, "system.gpu.1.gpu": 62.67, "system.gpu.1.memory": 11.47, "system.gpu.1.memory_allocated": 97.47, "system.gpu.1.temp": 73.07, "system.gpu.2.gpu": 64.07, "system.gpu.2.memory": 9.47, "system.gpu.2.memory_allocated": 97.42, "system.gpu.2.temp": 71.4, "system.gpu.3.gpu": 64.27, "system.gpu.3.memory": 9.53, "system.gpu.3.memory_allocated": 97.47, "system.gpu.3.temp": 75.0, "system.cpu": 20.09, "system.memory": 16.15, "system.disk": 1.2, "system.proc.memory.availableMB": 53865.75, "system.proc.memory.rssMB": 8489.71, "system.proc.memory.percent": 13.22, "system.proc.cpu.threads": 1452.47, "system.network.sent": 83594636, "system.network.recv": 23104825, "_wandb": true, "_timestamp": 1578850823, "_runtime": 1145}
{"system.gpu.0.gpu": 61.2, "system.gpu.0.memory": 11.67, "system.gpu.0.memory_allocated": 97.42, "system.gpu.0.temp": 70.0, "system.gpu.1.gpu": 60.6, "system.gpu.1.memory": 12.07, "system.gpu.1.memory_allocated": 97.47, "system.gpu.1.temp": 73.0, "system.gpu.2.gpu": 60.13, "system.gpu.2.memory": 9.87, "system.gpu.2.memory_allocated": 97.42, "system.gpu.2.temp": 71.4, "system.gpu.3.gpu": 60.0, "system.gpu.3.memory": 9.93, "system.gpu.3.memory_allocated": 97.47, "system.gpu.3.temp": 75.0, "system.cpu": 19.99, "system.memory": 16.32, "system.disk": 1.2, "system.proc.memory.availableMB": 53744.72, "system.proc.memory.rssMB": 8610.01, "system.proc.memory.percent": 13.4, "system.proc.cpu.threads": 1477.0, "system.network.sent": 84220012, "system.network.recv": 23286867, "_wandb": true, "_timestamp": 1578850853, "_runtime": 1175}
{"system.gpu.0.gpu": 66.8, "system.gpu.0.memory": 11.73, "system.gpu.0.memory_allocated": 97.42, "system.gpu.0.temp": 69.93, "system.gpu.1.gpu": 62.87, "system.gpu.1.memory": 11.27, "system.gpu.1.memory_allocated": 97.47, "system.gpu.1.temp": 73.0, "system.gpu.2.gpu": 63.87, "system.gpu.2.memory": 9.6, "system.gpu.2.memory_allocated": 97.42, "system.gpu.2.temp": 71.47, "system.gpu.3.gpu": 66.47, "system.gpu.3.memory": 9.53, "system.gpu.3.memory_allocated": 97.47, "system.gpu.3.temp": 75.0, "system.cpu": 19.82, "system.memory": 16.16, "system.disk": 1.2, "system.proc.memory.availableMB": 53853.0, "system.proc.memory.rssMB": 8501.05, "system.proc.memory.percent": 13.24, "system.proc.cpu.threads": 1502.33, "system.network.sent": 84806354, "system.network.recv": 23469097, "_wandb": true, "_timestamp": 1578850883, "_runtime": 1205}
{"system.gpu.0.gpu": 71.2, "system.gpu.0.memory": 12.33, "system.gpu.0.memory_allocated": 97.42, "system.gpu.0.temp": 70.0, "system.gpu.1.gpu": 71.2, "system.gpu.1.memory": 12.4, "system.gpu.1.memory_allocated": 97.47, "system.gpu.1.temp": 73.0, "system.gpu.2.gpu": 70.8, "system.gpu.2.memory": 10.0, "system.gpu.2.memory_allocated": 97.42, "system.gpu.2.temp": 71.67, "system.gpu.3.gpu": 70.53, "system.gpu.3.memory": 10.13, "system.gpu.3.memory_allocated": 97.47, "system.gpu.3.temp": 75.0, "system.cpu": 19.9, "system.memory": 16.34, "system.disk": 1.2, "system.proc.memory.availableMB": 53732.04, "system.proc.memory.rssMB": 8621.51, "system.proc.memory.percent": 13.42, "system.proc.cpu.threads": 1522.33, "system.network.sent": 85392878, "system.network.recv": 23647828, "_wandb": true, "_timestamp": 1578850913, "_runtime": 1236}
{"system.gpu.0.gpu": 63.2, "system.gpu.0.memory": 11.27, "system.gpu.0.memory_allocated": 97.42, "system.gpu.0.temp": 69.93, "system.gpu.1.gpu": 65.53, "system.gpu.1.memory": 11.33, "system.gpu.1.memory_allocated": 97.47, "system.gpu.1.temp": 73.0, "system.gpu.2.gpu": 64.4, "system.gpu.2.memory": 9.4, "system.gpu.2.memory_allocated": 97.42, "system.gpu.2.temp": 71.73, "system.gpu.3.gpu": 62.8, "system.gpu.3.memory": 9.2, "system.gpu.3.memory_allocated": 97.47, "system.gpu.3.temp": 75.0, "system.cpu": 19.91, "system.memory": 16.37, "system.disk": 1.2, "system.proc.memory.availableMB": 53719.42, "system.proc.memory.rssMB": 8631.35, "system.proc.memory.percent": 13.44, "system.proc.cpu.threads": 1545.2, "system.network.sent": 85983608, "system.network.recv": 23828721, "_wandb": true, "_timestamp": 1578850943, "_runtime": 1266}
{"system.gpu.0.gpu": 59.6, "system.gpu.0.memory": 11.73, "system.gpu.0.memory_allocated": 97.42, "system.gpu.0.temp": 69.93, "system.gpu.1.gpu": 61.0, "system.gpu.1.memory": 11.87, "system.gpu.1.memory_allocated": 97.47, "system.gpu.1.temp": 72.87, "system.gpu.2.gpu": 59.13, "system.gpu.2.memory": 9.6, "system.gpu.2.memory_allocated": 97.42, "system.gpu.2.temp": 71.8, "system.gpu.3.gpu": 60.8, "system.gpu.3.memory": 9.67, "system.gpu.3.memory_allocated": 97.47, "system.gpu.3.temp": 75.0, "system.cpu": 19.93, "system.memory": 16.3, "system.disk": 1.2, "system.proc.memory.availableMB": 53752.34, "system.proc.memory.rssMB": 8597.47, "system.proc.memory.percent": 13.39, "system.proc.cpu.threads": 1570.53, "system.network.sent": 86569828, "system.network.recv": 24007640, "_wandb": true, "_timestamp": 1578850973, "_runtime": 1296}
{"system.gpu.0.gpu": 65.6, "system.gpu.0.memory": 11.87, "system.gpu.0.memory_allocated": 97.42, "system.gpu.0.temp": 69.87, "system.gpu.1.gpu": 67.73, "system.gpu.1.memory": 11.8, "system.gpu.1.memory_allocated": 97.47, "system.gpu.1.temp": 73.0, "system.gpu.2.gpu": 64.0, "system.gpu.2.memory": 9.87, "system.gpu.2.memory_allocated": 97.42, "system.gpu.2.temp": 72.0, "system.gpu.3.gpu": 64.87, "system.gpu.3.memory": 10.0, "system.gpu.3.memory_allocated": 97.47, "system.gpu.3.temp": 75.0, "system.cpu": 19.77, "system.memory": 16.59, "system.disk": 1.2, "system.proc.memory.availableMB": 53581.7, "system.proc.memory.rssMB": 8767.64, "system.proc.memory.percent": 13.65, "system.proc.cpu.threads": 1591.0, "system.network.sent": 87171579, "system.network.recv": 24189571, "_wandb": true, "_timestamp": 1578851003, "_runtime": 1326}
{"system.gpu.0.gpu": 70.87, "system.gpu.0.memory": 12.13, "system.gpu.0.memory_allocated": 97.42, "system.gpu.0.temp": 70.0, "system.gpu.1.gpu": 67.33, "system.gpu.1.memory": 11.53, "system.gpu.1.memory_allocated": 97.47, "system.gpu.1.temp": 73.0, "system.gpu.2.gpu": 70.13, "system.gpu.2.memory": 10.0, "system.gpu.2.memory_allocated": 97.42, "system.gpu.2.temp": 72.0, "system.gpu.3.gpu": 70.33, "system.gpu.3.memory": 10.07, "system.gpu.3.memory_allocated": 97.47, "system.gpu.3.temp": 75.0, "system.cpu": 20.01, "system.memory": 16.45, "system.disk": 1.2, "system.proc.memory.availableMB": 53672.26, "system.proc.memory.rssMB": 8676.72, "system.proc.memory.percent": 13.51, "system.proc.cpu.threads": 1614.2, "system.network.sent": 87766291, "system.network.recv": 24373780, "_wandb": true, "_timestamp": 1578851034, "_runtime": 1356}
{"system.gpu.0.gpu": 59.4, "system.gpu.0.memory": 11.0, "system.gpu.0.memory_allocated": 97.42, "system.gpu.0.temp": 69.87, "system.gpu.1.gpu": 60.93, "system.gpu.1.memory": 10.73, "system.gpu.1.memory_allocated": 97.47, "system.gpu.1.temp": 73.13, "system.gpu.2.gpu": 60.07, "system.gpu.2.memory": 8.93, "system.gpu.2.memory_allocated": 97.42, "system.gpu.2.temp": 71.93, "system.gpu.3.gpu": 59.6, "system.gpu.3.memory": 9.07, "system.gpu.3.memory_allocated": 97.47, "system.gpu.3.temp": 75.0, "system.cpu": 19.81, "system.memory": 16.25, "system.disk": 1.2, "system.proc.memory.availableMB": 53789.75, "system.proc.memory.rssMB": 8558.93, "system.proc.memory.percent": 13.33, "system.proc.cpu.threads": 1634.0, "system.network.sent": 88364221, "system.network.recv": 24554789, "_wandb": true, "_timestamp": 1578851064, "_runtime": 1386}
{"system.gpu.0.gpu": 64.67, "system.gpu.0.memory": 11.4, "system.gpu.0.memory_allocated": 97.42, "system.gpu.0.temp": 70.0, "system.gpu.1.gpu": 60.6, "system.gpu.1.memory": 11.27, "system.gpu.1.memory_allocated": 97.47, "system.gpu.1.temp": 73.4, "system.gpu.2.gpu": 61.53, "system.gpu.2.memory": 9.4, "system.gpu.2.memory_allocated": 97.42, "system.gpu.2.temp": 72.0, "system.gpu.3.gpu": 63.53, "system.gpu.3.memory": 9.6, "system.gpu.3.memory_allocated": 97.47, "system.gpu.3.temp": 75.0, "system.cpu": 19.95, "system.memory": 16.31, "system.disk": 1.2, "system.proc.memory.availableMB": 53762.75, "system.proc.memory.rssMB": 8583.76, "system.proc.memory.percent": 13.36, "system.proc.cpu.threads": 1652.27, "system.network.sent": 88964556, "system.network.recv": 24735357, "_wandb": true, "_timestamp": 1578851094, "_runtime": 1416}
{"system.gpu.0.gpu": 62.33, "system.gpu.0.memory": 11.2, "system.gpu.0.memory_allocated": 97.42, "system.gpu.0.temp": 70.0, "system.gpu.1.gpu": 64.33, "system.gpu.1.memory": 11.6, "system.gpu.1.memory_allocated": 97.47, "system.gpu.1.temp": 73.2, "system.gpu.2.gpu": 62.6, "system.gpu.2.memory": 9.8, "system.gpu.2.memory_allocated": 97.42, "system.gpu.2.temp": 72.0, "system.gpu.3.gpu": 62.93, "system.gpu.3.memory": 9.53, "system.gpu.3.memory_allocated": 97.47, "system.gpu.3.temp": 75.0, "system.cpu": 20.24, "system.memory": 16.21, "system.disk": 1.2, "system.proc.memory.availableMB": 53810.1, "system.proc.memory.rssMB": 8535.94, "system.proc.memory.percent": 13.29, "system.proc.cpu.threads": 1667.47, "system.network.sent": 89575079, "system.network.recv": 24916601, "_wandb": true, "_timestamp": 1578851124, "_runtime": 1446}
{"system.gpu.0.gpu": 68.0, "system.gpu.0.memory": 11.8, "system.gpu.0.memory_allocated": 97.42, "system.gpu.0.temp": 70.0, "system.gpu.1.gpu": 69.93, "system.gpu.1.memory": 12.0, "system.gpu.1.memory_allocated": 97.47, "system.gpu.1.temp": 73.4, "system.gpu.2.gpu": 69.07, "system.gpu.2.memory": 9.87, "system.gpu.2.memory_allocated": 97.42, "system.gpu.2.temp": 72.0, "system.gpu.3.gpu": 67.8, "system.gpu.3.memory": 9.87, "system.gpu.3.memory_allocated": 97.47, "system.gpu.3.temp": 75.07, "system.cpu": 19.79, "system.memory": 16.31, "system.disk": 1.2, "system.proc.memory.availableMB": 53757.43, "system.proc.memory.rssMB": 8588.01, "system.proc.memory.percent": 13.37, "system.proc.cpu.threads": 1682.07, "system.network.sent": 90173316, "system.network.recv": 25097792, "_wandb": true, "_timestamp": 1578851154, "_runtime": 1477}
{"system.gpu.0.gpu": 64.13, "system.gpu.0.memory": 11.53, "system.gpu.0.memory_allocated": 97.42, "system.gpu.0.temp": 70.0, "system.gpu.1.gpu": 58.6, "system.gpu.1.memory": 10.2, "system.gpu.1.memory_allocated": 97.47, "system.gpu.1.temp": 73.2, "system.gpu.2.gpu": 58.0, "system.gpu.2.memory": 8.6, "system.gpu.2.memory_allocated": 97.42, "system.gpu.2.temp": 72.0, "system.gpu.3.gpu": 63.93, "system.gpu.3.memory": 9.8, "system.gpu.3.memory_allocated": 97.47, "system.gpu.3.temp": 75.0, "system.cpu": 19.97, "system.memory": 16.38, "system.disk": 1.2, "system.proc.memory.availableMB": 53707.93, "system.proc.memory.rssMB": 8637.87, "system.proc.memory.percent": 13.45, "system.proc.cpu.threads": 1691.93, "system.network.sent": 90754331, "system.network.recv": 25275077, "_wandb": true, "_timestamp": 1578851184, "_runtime": 1507}
{"system.gpu.0.gpu": 58.73, "system.gpu.0.memory": 10.33, "system.gpu.0.memory_allocated": 97.42, "system.gpu.0.temp": 70.0, "system.gpu.1.gpu": 59.2, "system.gpu.1.memory": 11.33, "system.gpu.1.memory_allocated": 97.47, "system.gpu.1.temp": 73.4, "system.gpu.2.gpu": 59.2, "system.gpu.2.memory": 9.33, "system.gpu.2.memory_allocated": 97.42, "system.gpu.2.temp": 71.93, "system.gpu.3.gpu": 58.73, "system.gpu.3.memory": 8.73, "system.gpu.3.memory_allocated": 97.47, "system.gpu.3.temp": 75.0, "system.cpu": 19.86, "system.memory": 16.35, "system.disk": 1.2, "system.proc.memory.availableMB": 53723.81, "system.proc.memory.rssMB": 8619.22, "system.proc.memory.percent": 13.42, "system.proc.cpu.threads": 1705.73, "system.network.sent": 91372657, "system.network.recv": 25452382, "_wandb": true, "_timestamp": 1578851214, "_runtime": 1537}
{"system.gpu.0.gpu": 60.73, "system.gpu.0.memory": 12.0, "system.gpu.0.memory_allocated": 97.42, "system.gpu.0.temp": 70.07, "system.gpu.1.gpu": 60.67, "system.gpu.1.memory": 11.93, "system.gpu.1.memory_allocated": 97.47, "system.gpu.1.temp": 73.27, "system.gpu.2.gpu": 60.33, "system.gpu.2.memory": 9.8, "system.gpu.2.memory_allocated": 97.42, "system.gpu.2.temp": 72.0, "system.gpu.3.gpu": 59.87, "system.gpu.3.memory": 9.87, "system.gpu.3.memory_allocated": 97.47, "system.gpu.3.temp": 75.07, "system.cpu": 19.94, "system.memory": 16.31, "system.disk": 1.2, "system.proc.memory.availableMB": 53759.07, "system.proc.memory.rssMB": 8584.14, "system.proc.memory.percent": 13.36, "system.proc.cpu.threads": 1719.93, "system.network.sent": 91962691, "system.network.recv": 25631514, "_wandb": true, "_timestamp": 1578851244, "_runtime": 1567}
{"system.gpu.0.gpu": 0.0, "system.gpu.0.memory": 0.0, "system.gpu.0.memory_allocated": 97.42, "system.gpu.0.temp": 69.0, "system.gpu.1.gpu": 0.0, "system.gpu.1.memory": 0.0, "system.gpu.1.memory_allocated": 97.47, "system.gpu.1.temp": 73.0, "system.gpu.2.gpu": 0.0, "system.gpu.2.memory": 0.0, "system.gpu.2.memory_allocated": 97.42, "system.gpu.2.temp": 71.0, "system.gpu.3.gpu": 0.0, "system.gpu.3.memory": 0.0, "system.gpu.3.memory_allocated": 97.47, "system.gpu.3.temp": 75.0, "system.cpu": 4.9, "system.memory": 14.8, "system.disk": 1.2, "system.proc.memory.availableMB": 54728.73, "system.proc.memory.rssMB": 7680.38, "system.proc.memory.percent": 11.96, "system.proc.cpu.threads": 100.0, "system.network.sent": 91990980, "system.network.recv": 25640651, "_wandb": true, "_timestamp": 1578851246, "_runtime": 1569}
