{
    "root": "/home/ozastrow/image-analysis",
    "program": "train.py",
    "git": {
        "remote": "git@gitlab.com:robotic-startup/Platform/image-analysis.git",
        "commit": "6f80313b83236634a1a072c8fc1b7511cfbb3e15"
    },
    "email": "otto.zastrow@hotmail.de",
    "startedAt": "2020-01-10T17:06:46.432861",
    "host": "octane008.ziti.uni-heidelberg.de",
    "username": "ozastrow",
    "executable": "/opt/anaconda3/bin/python3",
    "os": "Linux-3.10.0-957.12.2.el7.x86_64-x86_64-with-centos-7.4.1708-Core",
    "python": "3.6.7",
    "gpu": "TITAN X (Pascal)",
    "gpu_count": 4,
    "cpu_count": 12,
    "cuda": "9.1.85",
    "args": [
        "--train_steps=110",
        "--epochs=80",
        "--model_name=segnet_dropout",
        "--experiment_name=dropout_sweep_v2",
        "--val_steps=20",
        "--optimizer_name=rmsprop",
        "--options={\"dropout_rate_a\":0.3, \"dropout_rate_b\":0.15, \"dropout_rate_c\":0.05}",
        "--initialize_weights=selected_trained_models/segnet_dropout_138_0.902.h5"
    ],
    "state": "finished",
    "jobType": null,
    "mode": "run",
    "project": "lawnrobot",
    "heartbeatAt": "2020-01-10T18:32:49.733296",
    "exitcode": 0
}
