{"epoch": 0, "loss": 0.4986240893602371, "iou_score": 0.5094417929649353, "iou_score_student_hard": 0.5094417929649353, "val_loss": 0.6392122209072113, "val_iou_score": 0.35947009921073914, "val_iou_score_student_hard": 0.35947009921073914, "_runtime": 85.62052249908447, "_timestamp": 1578937778.8388777, "_step": 0}
{"epoch": 1, "loss": 0.3572788739746267, "iou_score": 0.6271928548812866, "iou_score_student_hard": 0.6271928548812866, "val_loss": 4.397531628608704, "val_iou_score": 0.09618498384952545, "val_iou_score_student_hard": 0.09618498384952545, "_runtime": 163.45432925224304, "_timestamp": 1578937856.6726844, "_step": 1}
{"epoch": 2, "loss": 0.16184006766839462, "iou_score": 0.8204576373100281, "iou_score_student_hard": 0.8204576373100281, "val_loss": 3.2141120553016664, "val_iou_score": 0.10874225199222565, "val_iou_score_student_hard": 0.10874225199222565, "_runtime": 239.98430919647217, "_timestamp": 1578937933.2026644, "_step": 2}
{"epoch": 3, "loss": 0.09718379029496149, "iou_score": 0.8938218951225281, "iou_score_student_hard": 0.8938218951225281, "val_loss": 1.820688259601593, "val_iou_score": 0.7090059518814087, "val_iou_score_student_hard": 0.7090059518814087, "_runtime": 316.7179958820343, "_timestamp": 1578938009.936351, "_step": 3}
{"epoch": 4, "loss": 0.08139995255253532, "iou_score": 0.9133813381195068, "iou_score_student_hard": 0.9133813381195068, "val_loss": 0.20033764019608497, "val_iou_score": 0.7652087211608887, "val_iou_score_student_hard": 0.7652087211608887, "_runtime": 394.7567892074585, "_timestamp": 1578938087.9751444, "_step": 4}
{"epoch": 5, "loss": 0.07557880793782798, "iou_score": 0.9238948225975037, "iou_score_student_hard": 0.9238948225975037, "val_loss": 2.73068368434906, "val_iou_score": 0.7112273573875427, "val_iou_score_student_hard": 0.7112273573875427, "_runtime": 472.12782287597656, "_timestamp": 1578938165.346178, "_step": 5}
{"epoch": 6, "loss": 0.0648105416785587, "iou_score": 0.9302184581756592, "iou_score_student_hard": 0.9302184581756592, "val_loss": 2.7183539807796477, "val_iou_score": 0.7121255993843079, "val_iou_score_student_hard": 0.7121255993843079, "_runtime": 549.1819071769714, "_timestamp": 1578938242.4002624, "_step": 6}
{"epoch": 7, "loss": 0.06082090200348334, "iou_score": 0.9377899169921875, "iou_score_student_hard": 0.9377899169921875, "val_loss": 7.807720732688904, "val_iou_score": 0.09167154133319855, "val_iou_score_student_hard": 0.09167154133319855, "_runtime": 625.6596248149872, "_timestamp": 1578938318.87798, "_step": 7}
{"epoch": 8, "loss": 0.0637599407102574, "iou_score": 0.9387368559837341, "iou_score_student_hard": 0.9387368559837341, "val_loss": 13.037351655960084, "val_iou_score": 0.09169593453407288, "val_iou_score_student_hard": 0.09169593453407288, "_runtime": 703.8901624679565, "_timestamp": 1578938397.1085176, "_step": 8}
{"epoch": 9, "loss": 0.052925627187571746, "iou_score": 0.943182110786438, "iou_score_student_hard": 0.943182110786438, "val_loss": 13.403324317932128, "val_iou_score": 0.09220367670059204, "val_iou_score_student_hard": 0.09220367670059204, "_runtime": 780.1939725875854, "_timestamp": 1578938473.4123278, "_step": 9}
{"epoch": 10, "loss": 0.04898169392889196, "iou_score": 0.9478757977485657, "iou_score_student_hard": 0.9478757977485657, "val_loss": 2.702875739336014, "val_iou_score": 0.7144778370857239, "val_iou_score_student_hard": 0.7144778370857239, "_runtime": 857.0812516212463, "_timestamp": 1578938550.2996068, "_step": 10}
{"epoch": 11, "loss": 0.05945158944549886, "iou_score": 0.9438814520835876, "iou_score_student_hard": 0.9438814520835876, "val_loss": 13.397295379638672, "val_iou_score": 0.09248917549848557, "val_iou_score_student_hard": 0.09248917549848557, "_runtime": 934.6276390552521, "_timestamp": 1578938627.8459942, "_step": 11}
{"epoch": 12, "loss": 0.04767187867652286, "iou_score": 0.9487001299858093, "iou_score_student_hard": 0.9487001299858093, "val_loss": 13.453070211410523, "val_iou_score": 0.09062997996807098, "val_iou_score_student_hard": 0.09062997996807098, "_runtime": 1011.4529700279236, "_timestamp": 1578938704.6713252, "_step": 12}
{"epoch": 13, "loss": 0.04858995516869155, "iou_score": 0.9506220817565918, "iou_score_student_hard": 0.9506220817565918, "val_loss": 2.7378978729248047, "val_iou_score": 0.710822582244873, "val_iou_score_student_hard": 0.710822582244873, "_runtime": 1088.0648972988129, "_timestamp": 1578938781.2832525, "_step": 13}
{"epoch": 14, "loss": 0.048732279986143115, "iou_score": 0.9495803117752075, "iou_score_student_hard": 0.9495803117752075, "val_loss": 0.7885633498430252, "val_iou_score": 0.7471137642860413, "val_iou_score_student_hard": 0.7471137642860413, "_runtime": 1164.9640595912933, "_timestamp": 1578938858.1824148, "_step": 14}
{"epoch": 15, "loss": 0.0483073804019527, "iou_score": 0.9491645097732544, "iou_score_student_hard": 0.9491645097732544, "val_loss": 13.368629598617554, "val_iou_score": 0.09376116842031479, "val_iou_score_student_hard": 0.09376116842031479, "_runtime": 1242.728783607483, "_timestamp": 1578938935.9471388, "_step": 15}
{"epoch": 16, "loss": 0.04522861611436714, "iou_score": 0.9517411589622498, "iou_score_student_hard": 0.9517411589622498, "val_loss": 13.387124681472779, "val_iou_score": 0.09298689663410187, "val_iou_score_student_hard": 0.09298689663410187, "_runtime": 1319.8325548171997, "_timestamp": 1578939013.05091, "_step": 16}
{"epoch": 17, "loss": 0.2729731609875506, "iou_score": 0.8222936987876892, "iou_score_student_hard": 0.8222936987876892, "val_loss": 13.391978120803833, "val_iou_score": 0.09274622797966003, "val_iou_score_student_hard": 0.09274622797966003, "_runtime": 1396.161448955536, "_timestamp": 1578939089.3798041, "_step": 17}
{"epoch": 18, "loss": 0.050277359478852965, "iou_score": 0.9419945478439331, "iou_score_student_hard": 0.9419945478439331, "val_loss": 4.047764277458191, "val_iou_score": 0.10359187424182892, "val_iou_score_student_hard": 0.10359187424182892, "_runtime": 1474.1279513835907, "_timestamp": 1578939167.3463066, "_step": 18}
{"epoch": 19, "loss": 0.049543946829031814, "iou_score": 0.9462636113166809, "iou_score_student_hard": 0.9462636113166809, "val_loss": 2.7471503973007203, "val_iou_score": 0.7097266912460327, "val_iou_score_student_hard": 0.7097266912460327, "_runtime": 1551.2136030197144, "_timestamp": 1578939244.4319582, "_step": 19}
{"epoch": 20, "loss": 0.045457636361772365, "iou_score": 0.9513281583786011, "iou_score_student_hard": 0.9513281583786011, "val_loss": 13.405160522460937, "val_iou_score": 0.09238274395465851, "val_iou_score_student_hard": 0.09238274395465851, "_runtime": 1627.8220257759094, "_timestamp": 1578939321.040381, "_step": 20}
{"epoch": 21, "loss": 0.046401426721025596, "iou_score": 0.9517598152160645, "iou_score_student_hard": 0.9517598152160645, "val_loss": 2.667820876836777, "val_iou_score": 0.7172092795372009, "val_iou_score_student_hard": 0.7172092795372009, "_runtime": 1704.7041690349579, "_timestamp": 1578939397.9225242, "_step": 21}
{"epoch": 22, "loss": 0.04396889428184791, "iou_score": 0.9543737173080444, "iou_score_student_hard": 0.9543737173080444, "val_loss": 2.754687637090683, "val_iou_score": 0.7090753316879272, "val_iou_score_student_hard": 0.7090753316879272, "_runtime": 1782.3351030349731, "_timestamp": 1578939475.5534582, "_step": 22}
{"epoch": 23, "loss": 0.04271950269625945, "iou_score": 0.9555873274803162, "iou_score_student_hard": 0.9555873274803162, "val_loss": 2.722223162651062, "val_iou_score": 0.7119748592376709, "val_iou_score_student_hard": 0.7119748592376709, "_runtime": 1859.1288075447083, "_timestamp": 1578939552.3471627, "_step": 23}
{"epoch": 24, "loss": 0.07002717664634639, "iou_score": 0.945229709148407, "iou_score_student_hard": 0.945229709148407, "val_loss": 2.673231673240662, "val_iou_score": 0.7168465852737427, "val_iou_score_student_hard": 0.7168465852737427, "_runtime": 1935.8110044002533, "_timestamp": 1578939629.0293596, "_step": 24}
{"epoch": 25, "loss": 0.04142789872871204, "iou_score": 0.954670250415802, "iou_score_student_hard": 0.954670250415802, "val_loss": 2.739799964427948, "val_iou_score": 0.7107266187667847, "val_iou_score_student_hard": 0.7107266187667847, "_runtime": 2013.4185564517975, "_timestamp": 1578939706.6369116, "_step": 25}
{"epoch": 26, "loss": 0.042087970724837345, "iou_score": 0.956453800201416, "iou_score_student_hard": 0.956453800201416, "val_loss": 13.428836584091187, "val_iou_score": 0.0915081650018692, "val_iou_score_student_hard": 0.0915081650018692, "_runtime": 2090.4450027942657, "_timestamp": 1578939783.663358, "_step": 26}
{"epoch": 27, "loss": 0.041335507651621646, "iou_score": 0.9554980397224426, "iou_score_student_hard": 0.9554980397224426, "val_loss": 12.07329077720642, "val_iou_score": 0.09298552572727203, "val_iou_score_student_hard": 0.09298552572727203, "_runtime": 2166.910798549652, "_timestamp": 1578939860.1291537, "_step": 27}
{"epoch": 28, "loss": 0.08086207947609099, "iou_score": 0.9389927983283997, "iou_score_student_hard": 0.9389927983283997, "val_loss": 2.7203541696071625, "val_iou_score": 0.7124401926994324, "val_iou_score_student_hard": 0.7124401926994324, "_runtime": 2243.3020441532135, "_timestamp": 1578939936.5203993, "_step": 28}
{"epoch": 29, "loss": 0.0377403077330779, "iou_score": 0.9577128887176514, "iou_score_student_hard": 0.9577128887176514, "val_loss": 13.411259889602661, "val_iou_score": 0.09202981740236282, "val_iou_score_student_hard": 0.09202981740236282, "_runtime": 2321.0698359012604, "_timestamp": 1578940014.288191, "_step": 29}
{"epoch": 30, "loss": 0.04316329106011174, "iou_score": 0.9574689269065857, "iou_score_student_hard": 0.9574689269065857, "val_loss": 2.7013017892837525, "val_iou_score": 0.7138012051582336, "val_iou_score_student_hard": 0.7138012051582336, "_runtime": 2397.084648132324, "_timestamp": 1578940090.3030033, "_step": 30}
{"epoch": 31, "loss": 0.037956780889494855, "iou_score": 0.9600012898445129, "iou_score_student_hard": 0.9600012898445129, "val_loss": 0.15053521506488324, "val_iou_score": 0.8840500116348267, "val_iou_score_student_hard": 0.8840500116348267, "_runtime": 2474.4917447566986, "_timestamp": 1578940167.7101, "_step": 31}
{"epoch": 32, "loss": 0.0377080676315183, "iou_score": 0.9610661864280701, "iou_score_student_hard": 0.9610661864280701, "val_loss": 2.7022853672504423, "val_iou_score": 0.7137646079063416, "val_iou_score_student_hard": 0.7137646079063416, "_runtime": 2552.3052501678467, "_timestamp": 1578940245.5236053, "_step": 32}
{"epoch": 33, "loss": 0.18995211695066908, "iou_score": 0.8645623922348022, "iou_score_student_hard": 0.8645623922348022, "val_loss": 13.392961883544922, "val_iou_score": 0.09256216883659363, "val_iou_score_student_hard": 0.09256216883659363, "_runtime": 2630.0239975452423, "_timestamp": 1578940323.2423527, "_step": 33}
{"epoch": 34, "loss": 0.03786712207577445, "iou_score": 0.9587675333023071, "iou_score_student_hard": 0.9587675333023071, "val_loss": 2.733405292034149, "val_iou_score": 0.7107658982276917, "val_iou_score_student_hard": 0.7107658982276917, "_runtime": 2707.0791444778442, "_timestamp": 1578940400.2974997, "_step": 34}
{"epoch": 35, "loss": 0.03749932672151111, "iou_score": 0.9605440497398376, "iou_score_student_hard": 0.9605440497398376, "val_loss": 2.6788389503955843, "val_iou_score": 0.7159648537635803, "val_iou_score_student_hard": 0.7159648537635803, "_runtime": 2784.015986442566, "_timestamp": 1578940477.2343416, "_step": 35}
{"epoch": 36, "loss": 0.041586970520967784, "iou_score": 0.9587283730506897, "iou_score_student_hard": 0.9587283730506897, "val_loss": 2.005461239814758, "val_iou_score": 0.7147677540779114, "val_iou_score_student_hard": 0.7147677540779114, "_runtime": 2862.2806248664856, "_timestamp": 1578940555.49898, "_step": 36}
{"epoch": 37, "loss": 0.033675611222332175, "iou_score": 0.965023398399353, "iou_score_student_hard": 0.965023398399353, "val_loss": 13.46369514465332, "val_iou_score": 0.09015918523073196, "val_iou_score_student_hard": 0.09015918523073196, "_runtime": 2938.900826692581, "_timestamp": 1578940632.1191819, "_step": 37}
{"epoch": 38, "loss": 0.03861613316800107, "iou_score": 0.9613491296768188, "iou_score_student_hard": 0.9613491296768188, "val_loss": 2.7237640142440798, "val_iou_score": 0.7117211818695068, "val_iou_score_student_hard": 0.7117211818695068, "_runtime": 3015.9384467601776, "_timestamp": 1578940709.156802, "_step": 38}
{"epoch": 39, "loss": 0.04369866178286347, "iou_score": 0.961003303527832, "iou_score_student_hard": 0.961003303527832, "val_loss": 2.640274393558502, "val_iou_score": 0.71604984998703, "val_iou_score_student_hard": 0.71604984998703, "_runtime": 3094.0644035339355, "_timestamp": 1578940787.2827587, "_step": 39}
{"epoch": 40, "loss": 0.03370552278885787, "iou_score": 0.9656310081481934, "iou_score_student_hard": 0.9656310081481934, "val_loss": 2.7392426431179047, "val_iou_score": 0.7108265161514282, "val_iou_score_student_hard": 0.7108265161514282, "_runtime": 3170.8455815315247, "_timestamp": 1578940864.0639367, "_step": 40}
{"epoch": 41, "loss": 0.09591582903469151, "iou_score": 0.9287120699882507, "iou_score_student_hard": 0.9287120699882507, "val_loss": 2.7356398522853853, "val_iou_score": 0.7085322737693787, "val_iou_score_student_hard": 0.7085322737693787, "_runtime": 3247.7221372127533, "_timestamp": 1578940940.9404924, "_step": 41}
{"epoch": 42, "loss": 0.04546835312450474, "iou_score": 0.9581722021102905, "iou_score_student_hard": 0.9581722021102905, "val_loss": 13.38741979598999, "val_iou_score": 0.0928853303194046, "val_iou_score_student_hard": 0.0928853303194046, "_runtime": 3325.7981853485107, "_timestamp": 1578941019.0165405, "_step": 42}
{"epoch": 43, "loss": 0.034374476884576406, "iou_score": 0.9634029865264893, "iou_score_student_hard": 0.9634029865264893, "val_loss": 2.71113942861557, "val_iou_score": 0.7132670283317566, "val_iou_score_student_hard": 0.7132670283317566, "_runtime": 3403.7620334625244, "_timestamp": 1578941096.9803886, "_step": 43}
{"epoch": 44, "loss": 0.03198041912506927, "iou_score": 0.9662088751792908, "iou_score_student_hard": 0.9662088751792908, "val_loss": 13.434772300720216, "val_iou_score": 0.09122499823570251, "val_iou_score_student_hard": 0.09122499823570251, "_runtime": 3480.7585866451263, "_timestamp": 1578941173.9769418, "_step": 44}
{"epoch": 45, "loss": 0.035523710281334143, "iou_score": 0.9629868865013123, "iou_score_student_hard": 0.9629868865013123, "val_loss": 2.7180585741996763, "val_iou_score": 0.7123335599899292, "val_iou_score_student_hard": 0.7123335599899292, "_runtime": 3557.704381942749, "_timestamp": 1578941250.9227371, "_step": 45}
{"epoch": 46, "loss": 0.07231587970798665, "iou_score": 0.9506264328956604, "iou_score_student_hard": 0.9506264328956604, "val_loss": 2.754064804315567, "val_iou_score": 0.709884524345398, "val_iou_score_student_hard": 0.709884524345398, "_runtime": 3635.6062400341034, "_timestamp": 1578941328.8245952, "_step": 46}
{"epoch": 47, "loss": 0.030443146943368696, "iou_score": 0.9675155878067017, "iou_score_student_hard": 0.9675155878067017, "val_loss": 2.6820062518119814, "val_iou_score": 0.7156062126159668, "val_iou_score_student_hard": 0.7156062126159668, "_runtime": 3713.110291957855, "_timestamp": 1578941406.3286471, "_step": 47}
{"epoch": 48, "loss": 0.03065418621355837, "iou_score": 0.9699506759643555, "iou_score_student_hard": 0.9699506759643555, "val_loss": 2.2467605113983153, "val_iou_score": 0.7122331261634827, "val_iou_score_student_hard": 0.7122331261634827, "_runtime": 3790.391623735428, "_timestamp": 1578941483.609979, "_step": 48}
{"epoch": 49, "loss": 0.030474984798241744, "iou_score": 0.9710556268692017, "iou_score_student_hard": 0.9710556268692017, "val_loss": 13.382402753829956, "val_iou_score": 0.0930715948343277, "val_iou_score_student_hard": 0.0930715948343277, "_runtime": 3866.9087057113647, "_timestamp": 1578941560.127061, "_step": 49}
{"epoch": 50, "loss": 0.05705580215223811, "iou_score": 0.957672119140625, "iou_score_student_hard": 0.957672119140625, "val_loss": 13.399290847778321, "val_iou_score": 0.09236098825931549, "val_iou_score_student_hard": 0.09236098825931549, "_runtime": 3945.5041217803955, "_timestamp": 1578941638.722477, "_step": 50}
{"epoch": 51, "loss": 0.027070953586900776, "iou_score": 0.9725404381752014, "iou_score_student_hard": 0.9725404381752014, "val_loss": 2.7308479845523834, "val_iou_score": 0.7114845514297485, "val_iou_score_student_hard": 0.7114845514297485, "_runtime": 4022.574140548706, "_timestamp": 1578941715.7924957, "_step": 51}
{"epoch": 52, "loss": 0.06733964706178416, "iou_score": 0.9469612836837769, "iou_score_student_hard": 0.9469612836837769, "val_loss": 2.679757523536682, "val_iou_score": 0.7162675261497498, "val_iou_score_student_hard": 0.7162675261497498, "_runtime": 4100.048874378204, "_timestamp": 1578941793.2672296, "_step": 52}
{"epoch": 53, "loss": 0.031032476684247905, "iou_score": 0.9704135060310364, "iou_score_student_hard": 0.9704135060310364, "val_loss": 0.9368444532155991, "val_iou_score": 0.524408221244812, "val_iou_score_student_hard": 0.524408221244812, "_runtime": 4177.8360476493835, "_timestamp": 1578941871.0544028, "_step": 53}
{"epoch": 54, "loss": 0.025813749576495452, "iou_score": 0.9724172949790955, "iou_score_student_hard": 0.9724172949790955, "val_loss": 2.75157271027565, "val_iou_score": 0.709297239780426, "val_iou_score_student_hard": 0.709297239780426, "_runtime": 4255.110993146896, "_timestamp": 1578941948.3293483, "_step": 54}
{"epoch": 55, "loss": 0.03849242829971693, "iou_score": 0.9675065875053406, "iou_score_student_hard": 0.9675065875053406, "val_loss": 2.730224770307541, "val_iou_score": 0.711898922920227, "val_iou_score_student_hard": 0.711898922920227, "_runtime": 4331.953341722488, "_timestamp": 1578942025.171697, "_step": 55}
{"epoch": 56, "loss": 0.023209564836526458, "iou_score": 0.975456178188324, "iou_score_student_hard": 0.975456178188324, "val_loss": 0.9399185240268707, "val_iou_score": 0.7504933476448059, "val_iou_score_student_hard": 0.7504933476448059, "_runtime": 4408.8847188949585, "_timestamp": 1578942102.103074, "_step": 56}
{"epoch": 57, "loss": 0.02719268013130535, "iou_score": 0.9724018573760986, "iou_score_student_hard": 0.9724018573760986, "val_loss": 2.6917594492435457, "val_iou_score": 0.7166633009910583, "val_iou_score_student_hard": 0.7166633009910583, "_runtime": 4486.638379096985, "_timestamp": 1578942179.8567343, "_step": 57}
{"epoch": 58, "loss": 0.022513256095011126, "iou_score": 0.9767316579818726, "iou_score_student_hard": 0.9767316579818726, "val_loss": 0.06175259985029698, "val_iou_score": 0.9419182538986206, "val_iou_score_student_hard": 0.9419182538986206, "_runtime": 4563.748832464218, "_timestamp": 1578942256.9671876, "_step": 58}
{"epoch": 59, "loss": 0.10965158329768614, "iou_score": 0.9208682179450989, "iou_score_student_hard": 0.9208682179450989, "val_loss": 13.37787709236145, "val_iou_score": 0.09333077073097229, "val_iou_score_student_hard": 0.09333077073097229, "_runtime": 4641.236125230789, "_timestamp": 1578942334.4544804, "_step": 59}
{"epoch": 60, "loss": 0.026635001100261103, "iou_score": 0.9708205461502075, "iou_score_student_hard": 0.9708205461502075, "val_loss": 13.402930688858032, "val_iou_score": 0.09222222119569778, "val_iou_score_student_hard": 0.09222222119569778, "_runtime": 4719.567994356155, "_timestamp": 1578942412.7863495, "_step": 60}
{"epoch": 61, "loss": 0.027961403935809027, "iou_score": 0.9717147946357727, "iou_score_student_hard": 0.9717147946357727, "val_loss": 2.6981211721897127, "val_iou_score": 0.7146632075309753, "val_iou_score_student_hard": 0.7146632075309753, "_runtime": 4796.74449300766, "_timestamp": 1578942489.9628482, "_step": 61}
{"epoch": 62, "loss": 0.026870309421792627, "iou_score": 0.9714503288269043, "iou_score_student_hard": 0.9714503288269043, "val_loss": 13.425229692459107, "val_iou_score": 0.09138999879360199, "val_iou_score_student_hard": 0.09138999879360199, "_runtime": 4873.8008642196655, "_timestamp": 1578942567.0192194, "_step": 62}
{"epoch": 63, "loss": 0.2014664359560067, "iou_score": 0.8401064872741699, "iou_score_student_hard": 0.8401064872741699, "val_loss": 2.7455494940280913, "val_iou_score": 0.7113767862319946, "val_iou_score_student_hard": 0.7113767862319946, "_runtime": 4951.0704433918, "_timestamp": 1578942644.2887986, "_step": 63}
{"epoch": 64, "loss": 0.02622848295352676, "iou_score": 0.9696112871170044, "iou_score_student_hard": 0.9696112871170044, "val_loss": 2.726775813102722, "val_iou_score": 0.7111228108406067, "val_iou_score_student_hard": 0.7111228108406067, "_runtime": 5029.7107656002045, "_timestamp": 1578942722.9291208, "_step": 64}
{"epoch": 65, "loss": 0.025765410069884226, "iou_score": 0.9727024435997009, "iou_score_student_hard": 0.9727024435997009, "val_loss": 2.706745558977127, "val_iou_score": 0.7136234641075134, "val_iou_score_student_hard": 0.7136234641075134, "_runtime": 5106.778184890747, "_timestamp": 1578942799.99654, "_step": 65}
{"epoch": 66, "loss": 0.2900879642164165, "iou_score": 0.7657446265220642, "iou_score_student_hard": 0.7657446265220642, "val_loss": 2.7147137045860292, "val_iou_score": 0.7132465243339539, "val_iou_score_student_hard": 0.7132465243339539, "_runtime": 5183.47974896431, "_timestamp": 1578942876.6981041, "_step": 66}
{"epoch": 67, "loss": 0.1174585713412274, "iou_score": 0.881834089756012, "iou_score_student_hard": 0.881834089756012, "val_loss": 13.42440972328186, "val_iou_score": 0.09147332608699799, "val_iou_score_student_hard": 0.09147332608699799, "_runtime": 5262.053009986877, "_timestamp": 1578942955.2713652, "_step": 67}
{"epoch": 68, "loss": 0.046311247746714135, "iou_score": 0.9580687284469604, "iou_score_student_hard": 0.9580687284469604, "val_loss": 2.7428169667720796, "val_iou_score": 0.7102245688438416, "val_iou_score_student_hard": 0.7102245688438416, "_runtime": 5338.694788455963, "_timestamp": 1578943031.9131436, "_step": 68}
{"epoch": 69, "loss": 0.11311085691506212, "iou_score": 0.8936159014701843, "iou_score_student_hard": 0.8936159014701843, "val_loss": 2.014687156677246, "val_iou_score": 0.7157658338546753, "val_iou_score_student_hard": 0.7157658338546753, "_runtime": 5415.866386651993, "_timestamp": 1578943109.0847418, "_step": 69}
{"epoch": 70, "loss": 0.10237598842517896, "iou_score": 0.9098460078239441, "iou_score_student_hard": 0.9098460078239441, "val_loss": 2.6600160539150237, "val_iou_score": 0.7186786532402039, "val_iou_score_student_hard": 0.7186786532402039, "_runtime": 5493.85609126091, "_timestamp": 1578943187.0744464, "_step": 70}
{"epoch": 71, "loss": 0.06256225354630839, "iou_score": 0.9381365776062012, "iou_score_student_hard": 0.9381365776062012, "val_loss": 13.433132648468018, "val_iou_score": 0.09108789265155792, "val_iou_score_student_hard": 0.09108789265155792, "_runtime": 5570.506790399551, "_timestamp": 1578943263.7251456, "_step": 71}
{"epoch": 72, "loss": 0.03958585183559494, "iou_score": 0.9596283435821533, "iou_score_student_hard": 0.9596283435821533, "val_loss": 13.427820301055908, "val_iou_score": 0.09148696810007095, "val_iou_score_student_hard": 0.09148696810007095, "_runtime": 5647.093749284744, "_timestamp": 1578943340.3121045, "_step": 72}
{"epoch": 73, "loss": 0.028539286096664992, "iou_score": 0.9688258767127991, "iou_score_student_hard": 0.9688258767127991, "val_loss": 13.435001945495605, "val_iou_score": 0.09110726416110992, "val_iou_score_student_hard": 0.09110726416110992, "_runtime": 5723.646117210388, "_timestamp": 1578943416.8644724, "_step": 73}
{"epoch": 74, "loss": 0.03243816803124818, "iou_score": 0.9655753374099731, "iou_score_student_hard": 0.9655753374099731, "val_loss": 2.730913496017456, "val_iou_score": 0.7119436264038086, "val_iou_score_student_hard": 0.7119436264038086, "_runtime": 5801.7298719882965, "_timestamp": 1578943494.9482272, "_step": 74}
{"epoch": 75, "loss": 0.03564549553292719, "iou_score": 0.9637802243232727, "iou_score_student_hard": 0.9637802243232727, "val_loss": 2.6636559844017027, "val_iou_score": 0.7179708480834961, "val_iou_score_student_hard": 0.7179708480834961, "_runtime": 5879.093723773956, "_timestamp": 1578943572.312079, "_step": 75}
{"epoch": 76, "loss": 0.03193870594894344, "iou_score": 0.9694257378578186, "iou_score_student_hard": 0.9694257378578186, "val_loss": 2.6914319694042206, "val_iou_score": 0.7159417867660522, "val_iou_score_student_hard": 0.7159417867660522, "_runtime": 5955.63512969017, "_timestamp": 1578943648.8534849, "_step": 76}
{"epoch": 77, "loss": 0.027270642600276254, "iou_score": 0.9716800451278687, "iou_score_student_hard": 0.9716800451278687, "val_loss": 2.689562177658081, "val_iou_score": 0.7160372734069824, "val_iou_score_student_hard": 0.7160372734069824, "_runtime": 6033.131089687347, "_timestamp": 1578943726.3494449, "_step": 77}
{"epoch": 78, "loss": 0.02624480002136393, "iou_score": 0.9741527438163757, "iou_score_student_hard": 0.9741527438163757, "val_loss": 2.7191558599472048, "val_iou_score": 0.7114783525466919, "val_iou_score_student_hard": 0.7114783525466919, "_runtime": 6109.735635280609, "_timestamp": 1578943802.9539905, "_step": 78}
{"epoch": 79, "loss": 0.02731782150539485, "iou_score": 0.970611572265625, "iou_score_student_hard": 0.970611572265625, "val_loss": 13.352364683151245, "val_iou_score": 0.09424655139446259, "val_iou_score_student_hard": 0.09424655139446259, "_runtime": 6186.729209661484, "_timestamp": 1578943879.9475648, "_step": 79}
{"epoch": 80, "loss": 0.02324898370795629, "iou_score": 0.9756232500076294, "iou_score_student_hard": 0.9756232500076294, "val_loss": 13.41221113204956, "val_iou_score": 0.0919376090168953, "val_iou_score_student_hard": 0.0919376090168953, "_runtime": 6263.770764827728, "_timestamp": 1578943956.98912, "_step": 80}
{"epoch": 81, "loss": 0.022098986427723007, "iou_score": 0.9768497943878174, "iou_score_student_hard": 0.9768497943878174, "val_loss": 2.7088437914848327, "val_iou_score": 0.713334858417511, "val_iou_score_student_hard": 0.713334858417511, "_runtime": 6342.511563777924, "_timestamp": 1578944035.729919, "_step": 81}
{"epoch": 82, "loss": 0.03980679332532666, "iou_score": 0.9707034826278687, "iou_score_student_hard": 0.9707034826278687, "val_loss": 2.7415704786777497, "val_iou_score": 0.7101379632949829, "val_iou_score_student_hard": 0.7101379632949829, "_runtime": 6419.487206220627, "_timestamp": 1578944112.7055614, "_step": 82}
{"epoch": 83, "loss": 0.05865829378281805, "iou_score": 0.9504514932632446, "iou_score_student_hard": 0.9504514932632446, "val_loss": 13.414736127853393, "val_iou_score": 0.09199028462171555, "val_iou_score_student_hard": 0.09199028462171555, "_runtime": 6496.706570148468, "_timestamp": 1578944189.9249253, "_step": 83}
{"epoch": 84, "loss": 0.03456567861563103, "iou_score": 0.9725880026817322, "iou_score_student_hard": 0.9725880026817322, "val_loss": 2.709100341796875, "val_iou_score": 0.7133503556251526, "val_iou_score_student_hard": 0.7133503556251526, "_runtime": 6574.666115760803, "_timestamp": 1578944267.884471, "_step": 84}
{"epoch": 85, "loss": 0.017808341146023435, "iou_score": 0.9800423979759216, "iou_score_student_hard": 0.9800423979759216, "val_loss": 6.9819224834442135, "val_iou_score": 0.09195724129676819, "val_iou_score_student_hard": 0.09195724129676819, "_runtime": 6651.898478031158, "_timestamp": 1578944345.1168332, "_step": 85}
{"epoch": 86, "loss": 0.03412724183872342, "iou_score": 0.9625396728515625, "iou_score_student_hard": 0.9625396728515625, "val_loss": 13.390797567367553, "val_iou_score": 0.09269600361585617, "val_iou_score_student_hard": 0.09269600361585617, "_runtime": 6728.868120670319, "_timestamp": 1578944422.0864758, "_step": 86}
{"epoch": 87, "loss": 0.03378396233205091, "iou_score": 0.9642364382743835, "iou_score_student_hard": 0.9642364382743835, "val_loss": 2.7055651187896728, "val_iou_score": 0.7138198018074036, "val_iou_score_student_hard": 0.7138198018074036, "_runtime": 6805.969478368759, "_timestamp": 1578944499.1878335, "_step": 87}
{"epoch": 88, "loss": 0.03051495501263575, "iou_score": 0.9716164469718933, "iou_score_student_hard": 0.9716164469718933, "val_loss": 2.718714737892151, "val_iou_score": 0.7125479578971863, "val_iou_score_student_hard": 0.7125479578971863, "_runtime": 6883.941787719727, "_timestamp": 1578944577.160143, "_step": 88}
{"epoch": 89, "loss": 0.02401921255090697, "iou_score": 0.9756149053573608, "iou_score_student_hard": 0.9756149053573608, "val_loss": 0.833379152417183, "val_iou_score": 0.646466076374054, "val_iou_score_student_hard": 0.646466076374054, "_runtime": 6960.65723991394, "_timestamp": 1578944653.875595, "_step": 89}
{"epoch": 90, "loss": 0.023814309439198537, "iou_score": 0.9754379391670227, "iou_score_student_hard": 0.9754379391670227, "val_loss": 2.6804129242897035, "val_iou_score": 0.7157533168792725, "val_iou_score_student_hard": 0.7157533168792725, "_runtime": 7037.087928533554, "_timestamp": 1578944730.3062837, "_step": 90}
{"epoch": 91, "loss": 0.02550140545618805, "iou_score": 0.973228931427002, "iou_score_student_hard": 0.973228931427002, "val_loss": 13.351676273345948, "val_iou_score": 0.09438510239124298, "val_iou_score_student_hard": 0.09438510239124298, "_runtime": 7114.565847873688, "_timestamp": 1578944807.784203, "_step": 91}
{"epoch": 92, "loss": 0.09766676082191142, "iou_score": 0.9381932616233826, "iou_score_student_hard": 0.9381932616233826, "val_loss": 2.652900403738022, "val_iou_score": 0.7187281847000122, "val_iou_score_student_hard": 0.7187281847000122, "_runtime": 7191.779141902924, "_timestamp": 1578944884.997497, "_step": 92}
{"epoch": 93, "loss": 0.03081977127797224, "iou_score": 0.9672532677650452, "iou_score_student_hard": 0.9672532677650452, "val_loss": 13.439002466201782, "val_iou_score": 0.09108112752437592, "val_iou_score_student_hard": 0.09108112752437592, "_runtime": 7268.418423175812, "_timestamp": 1578944961.6367784, "_step": 93}
{"epoch": 94, "loss": 0.02068807276135141, "iou_score": 0.9785144329071045, "iou_score_student_hard": 0.9785144329071045, "val_loss": 2.7085485994815826, "val_iou_score": 0.7132942080497742, "val_iou_score_student_hard": 0.7132942080497742, "_runtime": 7345.606472492218, "_timestamp": 1578945038.8248277, "_step": 94}
{"epoch": 95, "loss": 0.05624854308129711, "iou_score": 0.9537761807441711, "iou_score_student_hard": 0.9537761807441711, "val_loss": 2.7096639275550842, "val_iou_score": 0.7135034799575806, "val_iou_score_student_hard": 0.7135034799575806, "_runtime": 7423.780915260315, "_timestamp": 1578945116.9992704, "_step": 95}
{"epoch": 96, "loss": 0.11621932185847651, "iou_score": 0.8934758901596069, "iou_score_student_hard": 0.8934758901596069, "val_loss": 2.7225511848926542, "val_iou_score": 0.7128908634185791, "val_iou_score_student_hard": 0.7128908634185791, "_runtime": 7501.556715488434, "_timestamp": 1578945194.7750707, "_step": 96}
{"epoch": 97, "loss": 0.17826862882145428, "iou_score": 0.8854416608810425, "iou_score_student_hard": 0.8854416608810425, "val_loss": 2.713238298892975, "val_iou_score": 0.7129130363464355, "val_iou_score_student_hard": 0.7129130363464355, "_runtime": 7578.747387886047, "_timestamp": 1578945271.965743, "_step": 97}
{"epoch": 98, "loss": 0.0769524248316884, "iou_score": 0.9232878684997559, "iou_score_student_hard": 0.9232878684997559, "val_loss": 13.332000970840454, "val_iou_score": 0.09526330232620239, "val_iou_score_student_hard": 0.09526330232620239, "_runtime": 7656.962016820908, "_timestamp": 1578945350.180372, "_step": 98}
{"epoch": 99, "loss": 0.04572227091782472, "iou_score": 0.9534286260604858, "iou_score_student_hard": 0.9534286260604858, "val_loss": 13.400504016876221, "val_iou_score": 0.09234051406383514, "val_iou_score_student_hard": 0.09234051406383514, "_runtime": 7734.269415855408, "_timestamp": 1578945427.487771, "_step": 99}
{"epoch": 100, "loss": 0.02525740604509007, "iou_score": 0.9717056751251221, "iou_score_student_hard": 0.9717056751251221, "val_loss": 13.392961692810058, "val_iou_score": 0.09249598532915115, "val_iou_score_student_hard": 0.09249598532915115, "_runtime": 7811.498425960541, "_timestamp": 1578945504.7167811, "_step": 100}
{"epoch": 101, "loss": 0.028418457364155488, "iou_score": 0.970828652381897, "iou_score_student_hard": 0.970828652381897, "val_loss": 2.6720511436462404, "val_iou_score": 0.7172453999519348, "val_iou_score_student_hard": 0.7172453999519348, "_runtime": 7888.090291261673, "_timestamp": 1578945581.3086464, "_step": 101}
{"epoch": 102, "loss": 0.02114448288286274, "iou_score": 0.9784591794013977, "iou_score_student_hard": 0.9784591794013977, "val_loss": 2.737438994646072, "val_iou_score": 0.7113245129585266, "val_iou_score_student_hard": 0.7113245129585266, "_runtime": 7966.656103372574, "_timestamp": 1578945659.8744586, "_step": 102}
{"epoch": 103, "loss": 0.06342825266447934, "iou_score": 0.9498854875564575, "iou_score_student_hard": 0.9498854875564575, "val_loss": 2.7074015140533447, "val_iou_score": 0.7136589884757996, "val_iou_score_student_hard": 0.7136589884757996, "_runtime": 8044.249871492386, "_timestamp": 1578945737.4682267, "_step": 103}
{"epoch": 104, "loss": 0.030224370753223245, "iou_score": 0.9679458141326904, "iou_score_student_hard": 0.9679458141326904, "val_loss": 13.373843908309937, "val_iou_score": 0.09343644976615906, "val_iou_score_student_hard": 0.09343644976615906, "_runtime": 8121.860422611237, "_timestamp": 1578945815.0787778, "_step": 104}
{"epoch": 105, "loss": 0.0865935873663561, "iou_score": 0.9200933575630188, "iou_score_student_hard": 0.9200933575630188, "val_loss": 2.725108778476715, "val_iou_score": 0.7116206884384155, "val_iou_score_student_hard": 0.7116206884384155, "_runtime": 8200.529981136322, "_timestamp": 1578945893.7483363, "_step": 105}
{"epoch": 106, "loss": 0.11710139304738153, "iou_score": 0.9051932096481323, "iou_score_student_hard": 0.9051932096481323, "val_loss": 13.401323652267456, "val_iou_score": 0.09255870431661606, "val_iou_score_student_hard": 0.09255870431661606, "_runtime": 8277.770861387253, "_timestamp": 1578945970.9892166, "_step": 106}
{"epoch": 107, "loss": 0.049081583973020315, "iou_score": 0.9424840807914734, "iou_score_student_hard": 0.9424840807914734, "val_loss": 13.39253568649292, "val_iou_score": 0.09252460300922394, "val_iou_score_student_hard": 0.09252460300922394, "_runtime": 8355.521513462067, "_timestamp": 1578946048.7398686, "_step": 107}
{"epoch": 108, "loss": 0.034111310973424805, "iou_score": 0.9659342169761658, "iou_score_student_hard": 0.9659342169761658, "val_loss": 13.384304857254028, "val_iou_score": 0.09285666793584824, "val_iou_score_student_hard": 0.09285666793584824, "_runtime": 8433.68672823906, "_timestamp": 1578946126.9050834, "_step": 108}
{"epoch": 109, "loss": 0.028538768730041655, "iou_score": 0.9706324934959412, "iou_score_student_hard": 0.9706324934959412, "val_loss": 2.720944732427597, "val_iou_score": 0.7123492360115051, "val_iou_score_student_hard": 0.7123492360115051, "_runtime": 8511.838844299316, "_timestamp": 1578946205.0571995, "_step": 109}
{"epoch": 110, "loss": 0.02938750349831852, "iou_score": 0.969554603099823, "iou_score_student_hard": 0.969554603099823, "val_loss": 0.4803681954741478, "val_iou_score": 0.7793614864349365, "val_iou_score_student_hard": 0.7793614864349365, "_runtime": 8589.654896259308, "_timestamp": 1578946282.8732514, "_step": 110}
{"epoch": 111, "loss": 0.0549074117178944, "iou_score": 0.957766056060791, "iou_score_student_hard": 0.957766056060791, "val_loss": 2.7130087852478026, "val_iou_score": 0.7131209373474121, "val_iou_score_student_hard": 0.7131209373474121, "_runtime": 8667.277905225754, "_timestamp": 1578946360.4962604, "_step": 111}
{"epoch": 112, "loss": 0.04803326480429281, "iou_score": 0.9534544348716736, "iou_score_student_hard": 0.9534544348716736, "val_loss": 2.7006136178970337, "val_iou_score": 0.7142500877380371, "val_iou_score_student_hard": 0.7142500877380371, "_runtime": 8745.02353477478, "_timestamp": 1578946438.24189, "_step": 112}
{"epoch": 113, "loss": 0.049589279835874384, "iou_score": 0.9530964493751526, "iou_score_student_hard": 0.9530964493751526, "val_loss": 2.715337115526199, "val_iou_score": 0.7127734422683716, "val_iou_score_student_hard": 0.7127734422683716, "_runtime": 8822.241528749466, "_timestamp": 1578946515.459884, "_step": 113}
{"epoch": 114, "loss": 0.04139655471186746, "iou_score": 0.9597815871238708, "iou_score_student_hard": 0.9597815871238708, "val_loss": 13.401028680801392, "val_iou_score": 0.09254749119281769, "val_iou_score_student_hard": 0.09254749119281769, "_runtime": 8899.522713661194, "_timestamp": 1578946592.7410688, "_step": 114}
{"epoch": 115, "loss": 0.03084542151032524, "iou_score": 0.966301679611206, "iou_score_student_hard": 0.966301679611206, "val_loss": 13.336919164657592, "val_iou_score": 0.09493380784988403, "val_iou_score_student_hard": 0.09493380784988403, "_runtime": 8977.802166700363, "_timestamp": 1578946671.0205219, "_step": 115}
{"epoch": 116, "loss": 0.026950184746899388, "iou_score": 0.9711569547653198, "iou_score_student_hard": 0.9711569547653198, "val_loss": 13.13979263305664, "val_iou_score": 0.0940774530172348, "val_iou_score_student_hard": 0.0940774530172348, "_runtime": 9055.166985273361, "_timestamp": 1578946748.3853405, "_step": 116}
{"epoch": 117, "loss": 0.026132523323493924, "iou_score": 0.9745251536369324, "iou_score_student_hard": 0.9745251536369324, "val_loss": 0.7373468235135079, "val_iou_score": 0.7337192296981812, "val_iou_score_student_hard": 0.7337192296981812, "_runtime": 9132.421456336975, "_timestamp": 1578946825.6398115, "_step": 117}
{"epoch": 118, "loss": 0.02730144987898794, "iou_score": 0.9715678095817566, "iou_score_student_hard": 0.9715678095817566, "val_loss": 2.691891831159592, "val_iou_score": 0.7100690603256226, "val_iou_score_student_hard": 0.7100690603256226, "_runtime": 9209.415110588074, "_timestamp": 1578946902.6334658, "_step": 118}
{"epoch": 119, "loss": 0.03194737613878467, "iou_score": 0.9718069434165955, "iou_score_student_hard": 0.9718069434165955, "val_loss": 2.7207806169986726, "val_iou_score": 0.7124119997024536, "val_iou_score_student_hard": 0.7124119997024536, "_runtime": 9287.10300898552, "_timestamp": 1578946980.3213642, "_step": 119}
{"epoch": 120, "loss": 0.04469404228200967, "iou_score": 0.9587555527687073, "iou_score_student_hard": 0.9587555527687073, "val_loss": 12.344260263442994, "val_iou_score": 0.12239348888397217, "val_iou_score_student_hard": 0.12239348888397217, "_runtime": 9364.474684715271, "_timestamp": 1578947057.69304, "_step": 120}
{"epoch": 121, "loss": 0.05265549446710131, "iou_score": 0.9560847282409668, "iou_score_student_hard": 0.9560847282409668, "val_loss": 2.329962158203125, "val_iou_score": 0.7093032002449036, "val_iou_score_student_hard": 0.7093032002449036, "_runtime": 9441.728152990341, "_timestamp": 1578947134.9465082, "_step": 121}
{"epoch": 122, "loss": 0.04482569395649162, "iou_score": 0.960065484046936, "iou_score_student_hard": 0.960065484046936, "val_loss": 2.2125728607177733, "val_iou_score": 0.18882501125335693, "val_iou_score_student_hard": 0.18882501125335693, "_runtime": 9519.957973003387, "_timestamp": 1578947213.1763282, "_step": 122}
{"epoch": 123, "loss": 0.03366005235266956, "iou_score": 0.96757972240448, "iou_score_student_hard": 0.96757972240448, "val_loss": 2.6828676760196686, "val_iou_score": 0.7159565687179565, "val_iou_score_student_hard": 0.7159565687179565, "_runtime": 9597.336844921112, "_timestamp": 1578947290.5552, "_step": 123}
{"epoch": 124, "loss": 0.18359630464322188, "iou_score": 0.8589385747909546, "iou_score_student_hard": 0.8589385747909546, "val_loss": 2.6858347952365875, "val_iou_score": 0.7151679396629333, "val_iou_score_student_hard": 0.7151679396629333, "_runtime": 9674.30163860321, "_timestamp": 1578947367.5199938, "_step": 124}
{"epoch": 125, "loss": 0.04372087266634811, "iou_score": 0.9536705017089844, "iou_score_student_hard": 0.9536705017089844, "val_loss": 2.6864798188209535, "val_iou_score": 0.7153445482254028, "val_iou_score_student_hard": 0.7153445482254028, "_runtime": 9752.194642305374, "_timestamp": 1578947445.4129975, "_step": 125}
{"epoch": 126, "loss": 0.028180153600194238, "iou_score": 0.9717382788658142, "iou_score_student_hard": 0.9717382788658142, "val_loss": 13.397126483917237, "val_iou_score": 0.0924333706498146, "val_iou_score_student_hard": 0.0924333706498146, "_runtime": 9829.697616815567, "_timestamp": 1578947522.915972, "_step": 126}
{"epoch": 127, "loss": 0.019264113500883633, "iou_score": 0.9793325662612915, "iou_score_student_hard": 0.9793325662612915, "val_loss": 2.6428622901439667, "val_iou_score": 0.7122275829315186, "val_iou_score_student_hard": 0.7122275829315186, "_runtime": 9907.486526727676, "_timestamp": 1578947600.704882, "_step": 127}
{"epoch": 128, "loss": 0.016501626567068425, "iou_score": 0.9822920560836792, "iou_score_student_hard": 0.9822920560836792, "val_loss": 2.7195670306682587, "val_iou_score": 0.7119983434677124, "val_iou_score_student_hard": 0.7119983434677124, "_runtime": 9985.005137681961, "_timestamp": 1578947678.2234929, "_step": 128}
{"epoch": 129, "loss": 0.02202186423607848, "iou_score": 0.9773442149162292, "iou_score_student_hard": 0.9773442149162292, "val_loss": 2.711139577627182, "val_iou_score": 0.7142452001571655, "val_iou_score_student_hard": 0.7142452001571655, "_runtime": 10062.868403196335, "_timestamp": 1578947756.0867584, "_step": 129}
{"epoch": 130, "loss": 0.015920284420082514, "iou_score": 0.9834785461425781, "iou_score_student_hard": 0.9834785461425781, "val_loss": 2.5949940204620363, "val_iou_score": 0.7108637690544128, "val_iou_score_student_hard": 0.7108637690544128, "_runtime": 10140.560827970505, "_timestamp": 1578947833.7791831, "_step": 130}
{"epoch": 131, "loss": 0.017048300586810165, "iou_score": 0.9826473593711853, "iou_score_student_hard": 0.9826473593711853, "val_loss": 13.019017219543457, "val_iou_score": 0.09200151264667511, "val_iou_score_student_hard": 0.09200151264667511, "_runtime": 10217.766085147858, "_timestamp": 1578947910.9844403, "_step": 131}
{"epoch": 132, "loss": 0.017378665710037405, "iou_score": 0.9814988374710083, "iou_score_student_hard": 0.9814988374710083, "val_loss": 13.399149560928345, "val_iou_score": 0.09241349250078201, "val_iou_score_student_hard": 0.09241349250078201, "_runtime": 10296.308923244476, "_timestamp": 1578947989.5272784, "_step": 132}
{"epoch": 133, "loss": 0.017800077419220045, "iou_score": 0.9815137982368469, "iou_score_student_hard": 0.9815137982368469, "val_loss": 0.7406509518623352, "val_iou_score": 0.741934597492218, "val_iou_score_student_hard": 0.741934597492218, "_runtime": 10373.506887435913, "_timestamp": 1578948066.7252426, "_step": 133}
{"epoch": 134, "loss": 0.019272712770510802, "iou_score": 0.9795681238174438, "iou_score_student_hard": 0.9795681238174438, "val_loss": 13.41532621383667, "val_iou_score": 0.09188768267631531, "val_iou_score_student_hard": 0.09188768267631531, "_runtime": 10450.600603580475, "_timestamp": 1578948143.8189588, "_step": 134}
{"epoch": 135, "loss": 0.014737463670528748, "iou_score": 0.9848135709762573, "iou_score_student_hard": 0.9848135709762573, "val_loss": 13.401192617416381, "val_iou_score": 0.09235648810863495, "val_iou_score_student_hard": 0.09235648810863495, "_runtime": 10528.2034907341, "_timestamp": 1578948221.421846, "_step": 135}
{"epoch": 136, "loss": 0.02610631229948591, "iou_score": 0.9763073921203613, "iou_score_student_hard": 0.9763073921203613, "val_loss": 2.734028559923172, "val_iou_score": 0.7110141515731812, "val_iou_score_student_hard": 0.7110141515731812, "_runtime": 10607.19253730774, "_timestamp": 1578948300.4108925, "_step": 136}
{"epoch": 137, "loss": 0.05603863436051391, "iou_score": 0.9601632952690125, "iou_score_student_hard": 0.9601632952690125, "val_loss": 2.748719924688339, "val_iou_score": 0.7104122638702393, "val_iou_score_student_hard": 0.7104122638702393, "_runtime": 10684.852990627289, "_timestamp": 1578948378.0713458, "_step": 137}
{"epoch": 138, "loss": 0.04357447795231234, "iou_score": 0.955745279788971, "iou_score_student_hard": 0.955745279788971, "val_loss": 13.441560220718383, "val_iou_score": 0.09089409559965134, "val_iou_score_student_hard": 0.09089409559965134, "_runtime": 10762.362793684006, "_timestamp": 1578948455.5811489, "_step": 138}
{"epoch": 139, "loss": 0.03243593635376204, "iou_score": 0.9651292562484741, "iou_score_student_hard": 0.9651292562484741, "val_loss": 0.567850923538208, "val_iou_score": 0.7772660255432129, "val_iou_score_student_hard": 0.7772660255432129, "_runtime": 10840.469525814056, "_timestamp": 1578948533.687881, "_step": 139}
{"epoch": 140, "loss": 0.02997730318456888, "iou_score": 0.9705802798271179, "iou_score_student_hard": 0.9705802798271179, "val_loss": 2.7152385473251344, "val_iou_score": 0.712699294090271, "val_iou_score_student_hard": 0.712699294090271, "_runtime": 10917.428522586823, "_timestamp": 1578948610.6468778, "_step": 140}
{"epoch": 141, "loss": 0.02492941873656078, "iou_score": 0.9752786159515381, "iou_score_student_hard": 0.9752786159515381, "val_loss": 13.412112665176391, "val_iou_score": 0.0919545441865921, "val_iou_score_student_hard": 0.0919545441865921, "_runtime": 10994.410488128662, "_timestamp": 1578948687.6288433, "_step": 141}
{"epoch": 142, "loss": 0.10840327708389272, "iou_score": 0.9199469089508057, "iou_score_student_hard": 0.9199469089508057, "val_loss": 13.387911605834962, "val_iou_score": 0.09285970777273178, "val_iou_score_student_hard": 0.09285970777273178, "_runtime": 11072.058938503265, "_timestamp": 1578948765.2772937, "_step": 142}
{"epoch": 143, "loss": 0.02245383533564481, "iou_score": 0.9754592180252075, "iou_score_student_hard": 0.9754592180252075, "val_loss": 13.437133264541625, "val_iou_score": 0.09121618419885635, "val_iou_score_student_hard": 0.09121618419885635, "_runtime": 11149.75544142723, "_timestamp": 1578948842.9737966, "_step": 143}
{"epoch": 144, "loss": 0.03746151364493099, "iou_score": 0.9657645225524902, "iou_score_student_hard": 0.9657645225524902, "val_loss": 13.380828619003296, "val_iou_score": 0.09319238364696503, "val_iou_score_student_hard": 0.09319238364696503, "_runtime": 11227.066179037094, "_timestamp": 1578948920.2845342, "_step": 144}
{"epoch": 145, "loss": 0.03334257439286872, "iou_score": 0.9677976369857788, "iou_score_student_hard": 0.9677976369857788, "val_loss": 2.7433088541030886, "val_iou_score": 0.7112399339675903, "val_iou_score_student_hard": 0.7112399339675903, "_runtime": 11304.046907186508, "_timestamp": 1578948997.2652624, "_step": 145}
{"epoch": 146, "loss": 0.028477965600111267, "iou_score": 0.9722236394882202, "iou_score_student_hard": 0.9722236394882202, "val_loss": 12.820798778533936, "val_iou_score": 0.09279505908489227, "val_iou_score_student_hard": 0.09279505908489227, "_runtime": 11381.973728179932, "_timestamp": 1578949075.1920834, "_step": 146}
{"epoch": 147, "loss": 0.032902347067879006, "iou_score": 0.9729061722755432, "iou_score_student_hard": 0.9729061722755432, "val_loss": 2.741734915971756, "val_iou_score": 0.7104641199111938, "val_iou_score_student_hard": 0.7104641199111938, "_runtime": 11458.85474896431, "_timestamp": 1578949152.0731041, "_step": 147}
{"epoch": 148, "loss": 0.024254686529324814, "iou_score": 0.9761407971382141, "iou_score_student_hard": 0.9761407971382141, "val_loss": 13.391781330108643, "val_iou_score": 0.09263477474451065, "val_iou_score_student_hard": 0.09263477474451065, "_runtime": 11536.403740882874, "_timestamp": 1578949229.622096, "_step": 148}
{"epoch": 149, "loss": 0.027610352626917037, "iou_score": 0.9742226600646973, "iou_score_student_hard": 0.9742226600646973, "val_loss": 13.3683265209198, "val_iou_score": 0.09367505460977554, "val_iou_score_student_hard": 0.09367505460977554, "_runtime": 11614.502787590027, "_timestamp": 1578949307.7211428, "_step": 149}
{"epoch": 150, "loss": 0.021736792267554185, "iou_score": 0.9773420095443726, "iou_score_student_hard": 0.9773420095443726, "val_loss": 1.923147016763687, "val_iou_score": 0.7141435146331787, "val_iou_score_student_hard": 0.7141435146331787, "_runtime": 11691.892107009888, "_timestamp": 1578949385.1104622, "_step": 150}
{"epoch": 151, "loss": 0.02297915256243538, "iou_score": 0.9765280485153198, "iou_score_student_hard": 0.9765280485153198, "val_loss": 13.417752838134765, "val_iou_score": 0.09187968075275421, "val_iou_score_student_hard": 0.09187968075275421, "_runtime": 11769.0839138031, "_timestamp": 1578949462.302269, "_step": 151}
{"epoch": 152, "loss": 0.026445955943993547, "iou_score": 0.9755542278289795, "iou_score_student_hard": 0.9755542278289795, "val_loss": 13.400835657119751, "val_iou_score": 0.09234548360109329, "val_iou_score_student_hard": 0.09234548360109329, "_runtime": 11846.307650089264, "_timestamp": 1578949539.5260053, "_step": 152}
{"epoch": 153, "loss": 0.0926302953707901, "iou_score": 0.931064784526825, "iou_score_student_hard": 0.931064784526825, "val_loss": 12.041303586959838, "val_iou_score": 0.09259305894374847, "val_iou_score_student_hard": 0.09259305894374847, "_runtime": 11924.598306179047, "_timestamp": 1578949617.8166614, "_step": 153}
{"epoch": 154, "loss": 0.03516037092459473, "iou_score": 0.9635983109474182, "iou_score_student_hard": 0.9635983109474182, "val_loss": 13.416473865509033, "val_iou_score": 0.09203850477933884, "val_iou_score_student_hard": 0.09203850477933884, "_runtime": 12001.673281669617, "_timestamp": 1578949694.8916368, "_step": 154}
{"epoch": 155, "loss": 0.028052802883427253, "iou_score": 0.9718099236488342, "iou_score_student_hard": 0.9718099236488342, "val_loss": 2.4307674944400786, "val_iou_score": 0.7147840261459351, "val_iou_score_student_hard": 0.7147840261459351, "_runtime": 12078.657153367996, "_timestamp": 1578949771.8755085, "_step": 155}
{"epoch": 156, "loss": 0.10696626274253834, "iou_score": 0.9076189398765564, "iou_score_student_hard": 0.9076189398765564, "val_loss": 13.245335578918457, "val_iou_score": 0.09150861948728561, "val_iou_score_student_hard": 0.09150861948728561, "_runtime": 12156.903713703156, "_timestamp": 1578949850.122069, "_step": 156}
{"epoch": 157, "loss": 0.04995801251550967, "iou_score": 0.9518546462059021, "iou_score_student_hard": 0.9518546462059021, "val_loss": 13.411948633193969, "val_iou_score": 0.0922149047255516, "val_iou_score_student_hard": 0.0922149047255516, "_runtime": 12233.818392276764, "_timestamp": 1578949927.0367475, "_step": 157}
{"epoch": 158, "loss": 0.03447183159772645, "iou_score": 0.9632664322853088, "iou_score_student_hard": 0.9632664322853088, "val_loss": 13.400995826721191, "val_iou_score": 0.09232105314731598, "val_iou_score_student_hard": 0.09232105314731598, "_runtime": 12310.231622219086, "_timestamp": 1578950003.4499774, "_step": 158}
{"epoch": 159, "loss": 0.03770780780945312, "iou_score": 0.9607081413269043, "iou_score_student_hard": 0.9607081413269043, "val_loss": 2.684774613380432, "val_iou_score": 0.7157114744186401, "val_iou_score_student_hard": 0.7157114744186401, "_runtime": 12387.4367582798, "_timestamp": 1578950080.6551135, "_step": 159}
{"epoch": 160, "loss": 0.033299296874214304, "iou_score": 0.9665078520774841, "iou_score_student_hard": 0.9665078520774841, "val_loss": 2.7128449022769927, "val_iou_score": 0.712990403175354, "val_iou_score_student_hard": 0.712990403175354, "_runtime": 12465.797419548035, "_timestamp": 1578950159.0157747, "_step": 160}
{"epoch": 161, "loss": 0.03462362932887944, "iou_score": 0.9644231796264648, "iou_score_student_hard": 0.9644231796264648, "val_loss": 13.376631212234496, "val_iou_score": 0.0931900218129158, "val_iou_score_student_hard": 0.0931900218129158, "_runtime": 12542.830398321152, "_timestamp": 1578950236.0487535, "_step": 161}
{"epoch": 162, "loss": 0.0374916661827063, "iou_score": 0.9667760729789734, "iou_score_student_hard": 0.9667760729789734, "val_loss": 2.684085899591446, "val_iou_score": 0.7161937355995178, "val_iou_score_student_hard": 0.7161937355995178, "_runtime": 12619.773019313812, "_timestamp": 1578950312.9913745, "_step": 162}
{"epoch": 163, "loss": 0.023125894418494268, "iou_score": 0.97535240650177, "iou_score_student_hard": 0.97535240650177, "val_loss": 0.14842294305562972, "val_iou_score": 0.8973437547683716, "val_iou_score_student_hard": 0.8973437547683716, "_runtime": 12697.827968358994, "_timestamp": 1578950391.0463235, "_step": 163}
{"epoch": 164, "loss": 0.03536308526315472, "iou_score": 0.9731230735778809, "iou_score_student_hard": 0.9731230735778809, "val_loss": 13.384599494934083, "val_iou_score": 0.09289972484111786, "val_iou_score_student_hard": 0.09289972484111786, "_runtime": 12775.002676010132, "_timestamp": 1578950468.2210312, "_step": 164}
{"epoch": 165, "loss": 0.0239178212528879, "iou_score": 0.9745452404022217, "iou_score_student_hard": 0.9745452404022217, "val_loss": 0.5261843577027321, "val_iou_score": 0.8003411293029785, "val_iou_score_student_hard": 0.8003411293029785, "_runtime": 12851.817072153091, "_timestamp": 1578950545.0354273, "_step": 165}
{"epoch": 166, "loss": 0.030560923579402946, "iou_score": 0.9671939015388489, "iou_score_student_hard": 0.9671939015388489, "val_loss": 13.377975559234619, "val_iou_score": 0.09326199442148209, "val_iou_score_student_hard": 0.09326199442148209, "_runtime": 12928.657092571259, "_timestamp": 1578950621.8754478, "_step": 166}
{"epoch": 167, "loss": 0.029841630838134073, "iou_score": 0.9692883491516113, "iou_score_student_hard": 0.9692883491516113, "val_loss": 2.7247154295444487, "val_iou_score": 0.7117108106613159, "val_iou_score_student_hard": 0.7117108106613159, "_runtime": 13007.18500828743, "_timestamp": 1578950700.4033635, "_step": 167}
{"epoch": 168, "loss": 0.02992413438517939, "iou_score": 0.9684621691703796, "iou_score_student_hard": 0.9684621691703796, "val_loss": 0.771697998046875, "val_iou_score": 0.7660099267959595, "val_iou_score_student_hard": 0.7660099267959595, "_runtime": 13083.869634866714, "_timestamp": 1578950777.08799, "_step": 168}
{"epoch": 169, "loss": 0.03487640846182, "iou_score": 0.9633392095565796, "iou_score_student_hard": 0.9633392095565796, "val_loss": 2.680970859527588, "val_iou_score": 0.7159261703491211, "val_iou_score_student_hard": 0.7159261703491211, "_runtime": 13160.777546405792, "_timestamp": 1578950853.9959016, "_step": 169}
{"epoch": 170, "loss": 0.04301313961940733, "iou_score": 0.9690219759941101, "iou_score_student_hard": 0.9690219759941101, "val_loss": 2.707762050628662, "val_iou_score": 0.7133412957191467, "val_iou_score_student_hard": 0.7133412957191467, "_runtime": 13238.686021089554, "_timestamp": 1578950931.9043763, "_step": 170}
{"epoch": 171, "loss": 0.02619577819820155, "iou_score": 0.9748220443725586, "iou_score_student_hard": 0.9748220443725586, "val_loss": 2.6848728895187377, "val_iou_score": 0.7155887484550476, "val_iou_score_student_hard": 0.7155887484550476, "_runtime": 13315.370147705078, "_timestamp": 1578951008.588503, "_step": 171}
{"epoch": 172, "loss": 0.03286962785165418, "iou_score": 0.9714427590370178, "iou_score_student_hard": 0.9714427590370178, "val_loss": 13.370859527587891, "val_iou_score": 0.09345729649066925, "val_iou_score_student_hard": 0.09345729649066925, "_runtime": 13392.328441858292, "_timestamp": 1578951085.546797, "_step": 172}
{"epoch": 173, "loss": 0.03248329646885395, "iou_score": 0.9637778401374817, "iou_score_student_hard": 0.9637778401374817, "val_loss": 13.431689500808716, "val_iou_score": 0.09120044857263565, "val_iou_score_student_hard": 0.09120044857263565, "_runtime": 13468.972628831863, "_timestamp": 1578951162.190984, "_step": 173}
{"epoch": 174, "loss": 0.03548076852986758, "iou_score": 0.9684664607048035, "iou_score_student_hard": 0.9684664607048035, "val_loss": 2.699071264266968, "val_iou_score": 0.7137748003005981, "val_iou_score_student_hard": 0.7137748003005981, "_runtime": 13547.422275066376, "_timestamp": 1578951240.6406302, "_step": 174}
{"epoch": 175, "loss": 0.05486017584123395, "iou_score": 0.955623209476471, "iou_score_student_hard": 0.955623209476471, "val_loss": 13.416900539398194, "val_iou_score": 0.09183324873447418, "val_iou_score_student_hard": 0.09183324873447418, "_runtime": 13624.246770143509, "_timestamp": 1578951317.4651253, "_step": 175}
{"epoch": 176, "loss": 0.038229737777940254, "iou_score": 0.9616113901138306, "iou_score_student_hard": 0.9616113901138306, "val_loss": 13.419621753692628, "val_iou_score": 0.09159804880619049, "val_iou_score_student_hard": 0.09159804880619049, "_runtime": 13701.219312429428, "_timestamp": 1578951394.4376676, "_step": 176}
{"epoch": 177, "loss": 0.03710056583143093, "iou_score": 0.9591279029846191, "iou_score_student_hard": 0.9591279029846191, "val_loss": 2.7046462535858153, "val_iou_score": 0.7133170962333679, "val_iou_score_student_hard": 0.7133170962333679, "_runtime": 13779.204301834106, "_timestamp": 1578951472.422657, "_step": 177}
{"epoch": 178, "loss": 0.02382448919286782, "iou_score": 0.9769492149353027, "iou_score_student_hard": 0.9769492149353027, "val_loss": 0.20298362374305726, "val_iou_score": 0.8946502804756165, "val_iou_score_student_hard": 0.8946502804756165, "_runtime": 13856.308867454529, "_timestamp": 1578951549.5272226, "_step": 178}
{"epoch": 179, "loss": 0.03280897101556713, "iou_score": 0.9650844931602478, "iou_score_student_hard": 0.9650844931602478, "val_loss": 13.39328989982605, "val_iou_score": 0.09269389510154724, "val_iou_score_student_hard": 0.09269389510154724, "_runtime": 13932.800733804703, "_timestamp": 1578951626.019089, "_step": 179}
{"epoch": 180, "loss": 0.03839639113707976, "iou_score": 0.9619204998016357, "iou_score_student_hard": 0.9619204998016357, "val_loss": 2.724781173467636, "val_iou_score": 0.7121517658233643, "val_iou_score_student_hard": 0.7121517658233643, "_runtime": 14010.162176847458, "_timestamp": 1578951703.380532, "_step": 180}
{"epoch": 181, "loss": 0.040651607919823037, "iou_score": 0.9670685529708862, "iou_score_student_hard": 0.9670685529708862, "val_loss": 5.66282548904419, "val_iou_score": 0.12938639521598816, "val_iou_score_student_hard": 0.12938639521598816, "_runtime": 14087.788336515427, "_timestamp": 1578951781.0066917, "_step": 181}
{"epoch": 182, "loss": 0.04403104859150269, "iou_score": 0.9604268074035645, "iou_score_student_hard": 0.9604268074035645, "val_loss": 2.6748050689697265, "val_iou_score": 0.7163387537002563, "val_iou_score_student_hard": 0.7163387537002563, "_runtime": 14165.06544470787, "_timestamp": 1578951858.2838, "_step": 182}
{"epoch": 183, "loss": 0.04290736575864933, "iou_score": 0.9601125717163086, "iou_score_student_hard": 0.9601125717163086, "val_loss": 2.6934975147247315, "val_iou_score": 0.7146432399749756, "val_iou_score_student_hard": 0.7146432399749756, "_runtime": 14241.84394621849, "_timestamp": 1578951935.0623014, "_step": 183}
{"epoch": 184, "loss": 0.03356012955985286, "iou_score": 0.9662683010101318, "iou_score_student_hard": 0.9662683010101318, "val_loss": 0.29389021545648575, "val_iou_score": 0.8451464772224426, "val_iou_score_student_hard": 0.8451464772224426, "_runtime": 14319.931559085846, "_timestamp": 1578952013.1499143, "_step": 184}
{"epoch": 185, "loss": 0.03610776394012977, "iou_score": 0.9669824838638306, "iou_score_student_hard": 0.9669824838638306, "val_loss": 2.7357017040252685, "val_iou_score": 0.7114702463150024, "val_iou_score_student_hard": 0.7114702463150024, "_runtime": 14396.839673280716, "_timestamp": 1578952090.0580285, "_step": 185}
{"epoch": 186, "loss": 0.036443058706142686, "iou_score": 0.9655574560165405, "iou_score_student_hard": 0.9655574560165405, "val_loss": 2.691824573278427, "val_iou_score": 0.7146685123443604, "val_iou_score_student_hard": 0.7146685123443604, "_runtime": 14474.354404449463, "_timestamp": 1578952167.5727596, "_step": 186}
{"epoch": 187, "loss": 0.02487739941782572, "iou_score": 0.9744717478752136, "iou_score_student_hard": 0.9744717478752136, "val_loss": 2.7644602954387665, "val_iou_score": 0.7095640897750854, "val_iou_score_student_hard": 0.7095640897750854, "_runtime": 14551.457380056381, "_timestamp": 1578952244.6757352, "_step": 187}
{"epoch": 188, "loss": 0.048104507941752674, "iou_score": 0.9512671232223511, "iou_score_student_hard": 0.9512671232223511, "val_loss": 13.360038042068481, "val_iou_score": 0.09407345950603485, "val_iou_score_student_hard": 0.09407345950603485, "_runtime": 14629.290145635605, "_timestamp": 1578952322.5085008, "_step": 188}
{"epoch": 189, "loss": 0.037991547914729876, "iou_score": 0.9659775495529175, "iou_score_student_hard": 0.9659775495529175, "val_loss": 13.39692964553833, "val_iou_score": 0.09266506135463715, "val_iou_score_student_hard": 0.09266506135463715, "_runtime": 14706.119392871857, "_timestamp": 1578952399.337748, "_step": 189}
{"epoch": 190, "loss": 0.03678884512998841, "iou_score": 0.9671180248260498, "iou_score_student_hard": 0.9671180248260498, "val_loss": 2.698711186647415, "val_iou_score": 0.7146908640861511, "val_iou_score_student_hard": 0.7146908640861511, "_runtime": 14782.946069717407, "_timestamp": 1578952476.164425, "_step": 190}
{"epoch": 191, "loss": 0.025615932995622807, "iou_score": 0.9736642837524414, "iou_score_student_hard": 0.9736642837524414, "val_loss": 2.6938991010189057, "val_iou_score": 0.7131260633468628, "val_iou_score_student_hard": 0.7131260633468628, "_runtime": 14861.122509002686, "_timestamp": 1578952554.3408642, "_step": 191}
{"epoch": 192, "loss": 0.034847012187608266, "iou_score": 0.9698038697242737, "iou_score_student_hard": 0.9698038697242737, "val_loss": 2.7456046521663664, "val_iou_score": 0.7114951014518738, "val_iou_score_student_hard": 0.7114951014518738, "_runtime": 14938.152621746063, "_timestamp": 1578952631.370977, "_step": 192}
{"epoch": 193, "loss": 0.02121243030679497, "iou_score": 0.9783178567886353, "iou_score_student_hard": 0.9783178567886353, "val_loss": 2.734586226940155, "val_iou_score": 0.7101664543151855, "val_iou_score_student_hard": 0.7101664543151855, "_runtime": 15015.073606967926, "_timestamp": 1578952708.2919621, "_step": 193}
{"epoch": 194, "loss": 0.032690633393146776, "iou_score": 0.9715384840965271, "iou_score_student_hard": 0.9715384840965271, "val_loss": 13.435362529754638, "val_iou_score": 0.09108205884695053, "val_iou_score_student_hard": 0.09108205884695053, "_runtime": 15093.186788797379, "_timestamp": 1578952786.405144, "_step": 194}
{"epoch": 195, "loss": 0.031074729028411886, "iou_score": 0.9703405499458313, "iou_score_student_hard": 0.9703405499458313, "val_loss": 1.2931827664375306, "val_iou_score": 0.6783536076545715, "val_iou_score_student_hard": 0.6783536076545715, "_runtime": 15170.60602259636, "_timestamp": 1578952863.8243778, "_step": 195}
{"epoch": 196, "loss": 0.022527684652331202, "iou_score": 0.97761070728302, "iou_score_student_hard": 0.97761070728302, "val_loss": 2.674183022975922, "val_iou_score": 0.718652069568634, "val_iou_score_student_hard": 0.718652069568634, "_runtime": 15247.514457941055, "_timestamp": 1578952940.7328131, "_step": 196}
{"epoch": 197, "loss": 0.02481669346717271, "iou_score": 0.9765666127204895, "iou_score_student_hard": 0.9765666127204895, "val_loss": 1.4395233511924743, "val_iou_score": 0.7211522459983826, "val_iou_score_student_hard": 0.7211522459983826, "_runtime": 15324.652412891388, "_timestamp": 1578953017.870768, "_step": 197}
{"epoch": 198, "loss": 0.02182491674003276, "iou_score": 0.977948009967804, "iou_score_student_hard": 0.977948009967804, "val_loss": 10.028189706802369, "val_iou_score": 0.0943770706653595, "val_iou_score_student_hard": 0.0943770706653595, "_runtime": 15402.509737491608, "_timestamp": 1578953095.7280927, "_step": 198}
{"epoch": 199, "loss": 0.023657677712088283, "iou_score": 0.9769225120544434, "iou_score_student_hard": 0.9769225120544434, "val_loss": 2.608886992931366, "val_iou_score": 0.713509202003479, "val_iou_score_student_hard": 0.713509202003479, "_runtime": 15479.443576097488, "_timestamp": 1578953172.6619313, "_step": 199}
{"epoch": 200, "loss": 0.033571142694828186, "iou_score": 0.9703565835952759, "iou_score_student_hard": 0.9703565835952759, "val_loss": 13.320511960983277, "val_iou_score": 0.09172157198190689, "val_iou_score_student_hard": 0.09172157198190689, "_runtime": 15556.250492334366, "_timestamp": 1578953249.4688475, "_step": 200}
{"epoch": 201, "loss": 0.04672188546762548, "iou_score": 0.9612850546836853, "iou_score_student_hard": 0.9612850546836853, "val_loss": 13.414899969100953, "val_iou_score": 0.09184581786394119, "val_iou_score_student_hard": 0.09184581786394119, "_runtime": 15633.934181213379, "_timestamp": 1578953327.1525364, "_step": 201}
{"epoch": 202, "loss": 0.029556219398298045, "iou_score": 0.968157947063446, "iou_score_student_hard": 0.968157947063446, "val_loss": 13.453562164306641, "val_iou_score": 0.09059394150972366, "val_iou_score_student_hard": 0.09059394150972366, "_runtime": 15711.491332054138, "_timestamp": 1578953404.7096872, "_step": 202}
{"epoch": 203, "loss": 0.12184020346030593, "iou_score": 0.8930851817131042, "iou_score_student_hard": 0.8930851817131042, "val_loss": 13.383681488037109, "val_iou_score": 0.0929148942232132, "val_iou_score_student_hard": 0.0929148942232132, "_runtime": 15789.058748483658, "_timestamp": 1578953482.2771037, "_step": 203}
{"epoch": 204, "loss": 0.07111487839032303, "iou_score": 0.9240413308143616, "iou_score_student_hard": 0.9240413308143616, "val_loss": 13.43165693283081, "val_iou_score": 0.09130233526229858, "val_iou_score_student_hard": 0.09130233526229858, "_runtime": 15866.385980129242, "_timestamp": 1578953559.6043353, "_step": 204}
{"epoch": 205, "loss": 0.1524037588895722, "iou_score": 0.8804478049278259, "iou_score_student_hard": 0.8804478049278259, "val_loss": 2.7103124380111696, "val_iou_score": 0.7144842743873596, "val_iou_score_student_hard": 0.7144842743873596, "_runtime": 15944.44714140892, "_timestamp": 1578953637.6654966, "_step": 205}
{"epoch": 206, "loss": 0.08239504254677078, "iou_score": 0.9197494387626648, "iou_score_student_hard": 0.9197494387626648, "val_loss": 2.6895621955394744, "val_iou_score": 0.7153463363647461, "val_iou_score_student_hard": 0.7153463363647461, "_runtime": 16021.971068620682, "_timestamp": 1578953715.1894238, "_step": 206}
{"epoch": 207, "loss": 0.04329306555234573, "iou_score": 0.9618119597434998, "iou_score_student_hard": 0.9618119597434998, "val_loss": 13.389912223815918, "val_iou_score": 0.09269487857818604, "val_iou_score_student_hard": 0.09269487857818604, "_runtime": 16099.263759851456, "_timestamp": 1578953792.482115, "_step": 207}
{"epoch": 208, "loss": 0.02220839335667816, "iou_score": 0.9766656160354614, "iou_score_student_hard": 0.9766656160354614, "val_loss": 13.421523809432983, "val_iou_score": 0.09166832268238068, "val_iou_score_student_hard": 0.09166832268238068, "_runtime": 16177.099442243576, "_timestamp": 1578953870.3177974, "_step": 208}
{"epoch": 209, "loss": 0.06311433810571378, "iou_score": 0.9432805776596069, "iou_score_student_hard": 0.9432805776596069, "val_loss": 13.359021949768067, "val_iou_score": 0.09404297173023224, "val_iou_score_student_hard": 0.09404297173023224, "_runtime": 16254.258801937103, "_timestamp": 1578953947.477157, "_step": 209}
{"epoch": 210, "loss": 0.03574579999866811, "iou_score": 0.958736002445221, "iou_score_student_hard": 0.958736002445221, "val_loss": 13.447200489044189, "val_iou_score": 0.09066761285066605, "val_iou_score_student_hard": 0.09066761285066605, "_runtime": 16331.222439289093, "_timestamp": 1578954024.4407945, "_step": 210}
{"epoch": 211, "loss": 0.03208018973977728, "iou_score": 0.9677324891090393, "iou_score_student_hard": 0.9677324891090393, "val_loss": 13.371515369415283, "val_iou_score": 0.0935179740190506, "val_iou_score_student_hard": 0.0935179740190506, "_runtime": 16408.74587416649, "_timestamp": 1578954101.9642293, "_step": 211}
{"epoch": 212, "loss": 0.03471156435764649, "iou_score": 0.9635443687438965, "iou_score_student_hard": 0.9635443687438965, "val_loss": 13.387256240844726, "val_iou_score": 0.09287750720977783, "val_iou_score_student_hard": 0.09287750720977783, "_runtime": 16486.67202782631, "_timestamp": 1578954179.890383, "_step": 212}
{"epoch": 213, "loss": 0.03484834788197821, "iou_score": 0.9630711078643799, "iou_score_student_hard": 0.9630711078643799, "val_loss": 0.602504026889801, "val_iou_score": 0.7430223226547241, "val_iou_score_student_hard": 0.7430223226547241, "_runtime": 16563.740753173828, "_timestamp": 1578954256.9591084, "_step": 213}
{"epoch": 214, "loss": 0.12881623123857108, "iou_score": 0.9046881794929504, "iou_score_student_hard": 0.9046881794929504, "val_loss": 2.692382073402405, "val_iou_score": 0.7151057124137878, "val_iou_score_student_hard": 0.7151057124137878, "_runtime": 16641.30196404457, "_timestamp": 1578954334.5203192, "_step": 214}
{"epoch": 215, "loss": 0.04436622741208835, "iou_score": 0.9531197547912598, "iou_score_student_hard": 0.9531197547912598, "val_loss": 7.599183464050293, "val_iou_score": 0.12624120712280273, "val_iou_score_student_hard": 0.12624120712280273, "_runtime": 16719.672292470932, "_timestamp": 1578954412.8906476, "_step": 215}
{"epoch": 216, "loss": 0.054758313636888156, "iou_score": 0.9488295912742615, "iou_score_student_hard": 0.9488295912742615, "val_loss": 2.7362258553504946, "val_iou_score": 0.7110319137573242, "val_iou_score_student_hard": 0.7110319137573242, "_runtime": 16796.828902244568, "_timestamp": 1578954490.0472574, "_step": 216}
{"epoch": 217, "loss": 0.0630696735937487, "iou_score": 0.9413847923278809, "iou_score_student_hard": 0.9413847923278809, "val_loss": 2.7812171459197996, "val_iou_score": 0.7073076963424683, "val_iou_score_student_hard": 0.7073076963424683, "_runtime": 16874.06034398079, "_timestamp": 1578954567.2786992, "_step": 217}
{"epoch": 218, "loss": 0.048148415593261065, "iou_score": 0.9524128437042236, "iou_score_student_hard": 0.9524128437042236, "val_loss": 13.421261835098267, "val_iou_score": 0.09167113900184631, "val_iou_score_student_hard": 0.09167113900184631, "_runtime": 16952.69229745865, "_timestamp": 1578954645.9106526, "_step": 218}
{"epoch": 219, "loss": 0.04785085532136939, "iou_score": 0.9538007974624634, "iou_score_student_hard": 0.9538007974624634, "val_loss": 13.41952404975891, "val_iou_score": 0.0915064662694931, "val_iou_score_student_hard": 0.0915064662694931, "_runtime": 17030.41630268097, "_timestamp": 1578954723.6346579, "_step": 219}
{"epoch": 220, "loss": 0.05605907963419503, "iou_score": 0.952777087688446, "iou_score_student_hard": 0.952777087688446, "val_loss": 2.6840862035751343, "val_iou_score": 0.7167646288871765, "val_iou_score_student_hard": 0.7167646288871765, "_runtime": 17107.565358400345, "_timestamp": 1578954800.7837136, "_step": 220}
{"epoch": 221, "loss": 0.02920825295996937, "iou_score": 0.9741426110267639, "iou_score_student_hard": 0.9741426110267639, "val_loss": 2.6689683139324187, "val_iou_score": 0.7174862623214722, "val_iou_score_student_hard": 0.7174862623214722, "_runtime": 17184.244794368744, "_timestamp": 1578954877.4631495, "_step": 221}
{"epoch": 222, "loss": 0.02731608541851694, "iou_score": 0.9730450510978699, "iou_score_student_hard": 0.9730450510978699, "val_loss": 13.410767984390258, "val_iou_score": 0.09193471074104309, "val_iou_score_student_hard": 0.09193471074104309, "_runtime": 17262.471123456955, "_timestamp": 1578954955.6894786, "_step": 222}
{"epoch": 223, "loss": 0.028076832428235898, "iou_score": 0.9714687466621399, "iou_score_student_hard": 0.9714687466621399, "val_loss": 8.378466391563416, "val_iou_score": 0.09604530036449432, "val_iou_score_student_hard": 0.09604530036449432, "_runtime": 17339.795117855072, "_timestamp": 1578955033.013473, "_step": 223}
{"epoch": 224, "loss": 0.0507178811695088, "iou_score": 0.9473283290863037, "iou_score_student_hard": 0.9473283290863037, "val_loss": 13.389157629013061, "val_iou_score": 0.09276829659938812, "val_iou_score_student_hard": 0.09276829659938812, "_runtime": 17417.149349451065, "_timestamp": 1578955110.3677046, "_step": 224}
{"epoch": 225, "loss": 0.03536284863948822, "iou_score": 0.9603784680366516, "iou_score_student_hard": 0.9603784680366516, "val_loss": 13.365846967697143, "val_iou_score": 0.0931522473692894, "val_iou_score_student_hard": 0.0931522473692894, "_runtime": 17495.526542901993, "_timestamp": 1578955188.744898, "_step": 225}
{"epoch": 226, "loss": 0.03453860152512789, "iou_score": 0.9636896252632141, "iou_score_student_hard": 0.9636896252632141, "val_loss": 2.72035436630249, "val_iou_score": 0.7123358249664307, "val_iou_score_student_hard": 0.7123358249664307, "_runtime": 17572.809559822083, "_timestamp": 1578955266.027915, "_step": 226}
{"epoch": 227, "loss": 0.03478785723617131, "iou_score": 0.9659847617149353, "iou_score_student_hard": 0.9659847617149353, "val_loss": 13.444387912750244, "val_iou_score": 0.09015070647001266, "val_iou_score_student_hard": 0.09015070647001266, "_runtime": 17649.96343779564, "_timestamp": 1578955343.181793, "_step": 227}
{"epoch": 228, "loss": 0.023296262899583035, "iou_score": 0.9748392105102539, "iou_score_student_hard": 0.9748392105102539, "val_loss": 2.656426990032196, "val_iou_score": 0.717555582523346, "val_iou_score_student_hard": 0.717555582523346, "_runtime": 17727.231196641922, "_timestamp": 1578955420.4495518, "_step": 228}
{"epoch": 229, "loss": 0.02879559514536099, "iou_score": 0.9692962169647217, "iou_score_student_hard": 0.9692962169647217, "val_loss": 13.42017970085144, "val_iou_score": 0.09172715246677399, "val_iou_score_student_hard": 0.09172715246677399, "_runtime": 17805.759173631668, "_timestamp": 1578955498.9775288, "_step": 229}
{"epoch": 230, "loss": 0.03208537748591466, "iou_score": 0.9667370319366455, "iou_score_student_hard": 0.9667370319366455, "val_loss": 1.2866824328899384, "val_iou_score": 0.6915714740753174, "val_iou_score_student_hard": 0.6915714740753174, "_runtime": 17882.67258620262, "_timestamp": 1578955575.8909414, "_step": 230}
{"epoch": 231, "loss": 0.02669249355623668, "iou_score": 0.9746749401092529, "iou_score_student_hard": 0.9746749401092529, "val_loss": 2.7116644740104676, "val_iou_score": 0.713556170463562, "val_iou_score_student_hard": 0.713556170463562, "_runtime": 17959.810829639435, "_timestamp": 1578955653.0291848, "_step": 231}
{"epoch": 232, "loss": 0.025447672279551626, "iou_score": 0.9741073846817017, "iou_score_student_hard": 0.9741073846817017, "val_loss": 2.7459628343582154, "val_iou_score": 0.7093559503555298, "val_iou_score_student_hard": 0.7093559503555298, "_runtime": 18038.070487499237, "_timestamp": 1578955731.2888427, "_step": 232}
{"epoch": 233, "loss": 0.06347162401811643, "iou_score": 0.9459682106971741, "iou_score_student_hard": 0.9459682106971741, "val_loss": 2.7695758402347566, "val_iou_score": 0.708503246307373, "val_iou_score_student_hard": 0.708503246307373, "_runtime": 18115.24315404892, "_timestamp": 1578955808.4615092, "_step": 233}
{"epoch": 234, "loss": 0.037357018303803426, "iou_score": 0.9624367952346802, "iou_score_student_hard": 0.9624367952346802, "val_loss": 2.7353402078151703, "val_iou_score": 0.7107259631156921, "val_iou_score_student_hard": 0.7107259631156921, "_runtime": 18192.744940280914, "_timestamp": 1578955885.9632955, "_step": 234}
{"epoch": 235, "loss": 0.0252087553455071, "iou_score": 0.975747287273407, "iou_score_student_hard": 0.975747287273407, "val_loss": 13.385124158859252, "val_iou_score": 0.09306202828884125, "val_iou_score_student_hard": 0.09306202828884125, "_runtime": 18270.10329580307, "_timestamp": 1578955963.321651, "_step": 235}
{"epoch": 236, "loss": 0.03554842697287148, "iou_score": 0.9642294645309448, "iou_score_student_hard": 0.9642294645309448, "val_loss": 13.387452602386475, "val_iou_score": 0.09292638301849365, "val_iou_score_student_hard": 0.09292638301849365, "_runtime": 18348.4125521183, "_timestamp": 1578956041.6309073, "_step": 236}
{"epoch": 237, "loss": 0.03088385353542187, "iou_score": 0.9655292630195618, "iou_score_student_hard": 0.9655292630195618, "val_loss": 13.423229360580445, "val_iou_score": 0.09159007668495178, "val_iou_score_student_hard": 0.09159007668495178, "_runtime": 18425.813104391098, "_timestamp": 1578956119.0314596, "_step": 237}
{"epoch": 238, "loss": 0.03073527972975915, "iou_score": 0.9685353636741638, "iou_score_student_hard": 0.9685353636741638, "val_loss": 2.6728871166706085, "val_iou_score": 0.7145988941192627, "val_iou_score_student_hard": 0.7145988941192627, "_runtime": 18502.38986992836, "_timestamp": 1578956195.608225, "_step": 238}
{"epoch": 239, "loss": 0.024151717651296745, "iou_score": 0.9737515449523926, "iou_score_student_hard": 0.9737515449523926, "val_loss": 0.30121481195092203, "val_iou_score": 0.8232154846191406, "val_iou_score_student_hard": 0.8232154846191406, "_runtime": 18580.782369613647, "_timestamp": 1578956274.0007248, "_step": 239}
{"epoch": 240, "loss": 0.03361611429771239, "iou_score": 0.97062087059021, "iou_score_student_hard": 0.97062087059021, "val_loss": 2.6960879623889924, "val_iou_score": 0.7144295573234558, "val_iou_score_student_hard": 0.7144295573234558, "_runtime": 18658.032111644745, "_timestamp": 1578956351.2504668, "_step": 240}
{"epoch": 241, "loss": 0.02512309325181625, "iou_score": 0.9774189591407776, "iou_score_student_hard": 0.9774189591407776, "val_loss": 13.436542749404907, "val_iou_score": 0.09114064276218414, "val_iou_score_student_hard": 0.09114064276218414, "_runtime": 18735.466517448425, "_timestamp": 1578956428.6848726, "_step": 241}
{"epoch": 242, "loss": 0.031950970679860226, "iou_score": 0.9640541076660156, "iou_score_student_hard": 0.9640541076660156, "val_loss": 13.396929788589478, "val_iou_score": 0.09260135143995285, "val_iou_score_student_hard": 0.09260135143995285, "_runtime": 18813.95958018303, "_timestamp": 1578956507.1779354, "_step": 242}
{"epoch": 243, "loss": 0.04085214682431384, "iou_score": 0.9623532295227051, "iou_score_student_hard": 0.9623532295227051, "val_loss": 13.404701423645019, "val_iou_score": 0.09229013323783875, "val_iou_score_student_hard": 0.09229013323783875, "_runtime": 18891.31680393219, "_timestamp": 1578956584.535159, "_step": 243}
{"epoch": 244, "loss": 0.03260648372498426, "iou_score": 0.9654884934425354, "iou_score_student_hard": 0.9654884934425354, "val_loss": 2.691825103759766, "val_iou_score": 0.7148765921592712, "val_iou_score_student_hard": 0.7148765921592712, "_runtime": 18968.056688308716, "_timestamp": 1578956661.2750435, "_step": 244}
{"epoch": 245, "loss": 0.025322528395124458, "iou_score": 0.9730959534645081, "iou_score_student_hard": 0.9730959534645081, "val_loss": 2.7019270956516266, "val_iou_score": 0.7139665484428406, "val_iou_score_student_hard": 0.7139665484428406, "_runtime": 19045.44092297554, "_timestamp": 1578956738.6592782, "_step": 245}
{"epoch": 246, "loss": 0.029560472113503652, "iou_score": 0.9692085385322571, "iou_score_student_hard": 0.9692085385322571, "val_loss": 12.536229372024536, "val_iou_score": 0.09561219066381454, "val_iou_score_student_hard": 0.09561219066381454, "_runtime": 19123.416602373123, "_timestamp": 1578956816.6349576, "_step": 246}
{"epoch": 247, "loss": 0.030378235563297162, "iou_score": 0.9701728224754333, "iou_score_student_hard": 0.9701728224754333, "val_loss": 2.6924203515052794, "val_iou_score": 0.7145981192588806, "val_iou_score_student_hard": 0.7145981192588806, "_runtime": 19200.42777991295, "_timestamp": 1578956893.646135, "_step": 247}
{"epoch": 248, "loss": 0.035879462034526195, "iou_score": 0.9683502912521362, "iou_score_student_hard": 0.9683502912521362, "val_loss": 2.587157964706421, "val_iou_score": 0.7189825773239136, "val_iou_score_student_hard": 0.7189825773239136, "_runtime": 19277.726576328278, "_timestamp": 1578956970.9449315, "_step": 248}
{"epoch": 249, "loss": 0.020692766339264132, "iou_score": 0.9776523113250732, "iou_score_student_hard": 0.9776523113250732, "val_loss": 7.842352795600891, "val_iou_score": 0.09500373899936676, "val_iou_score_student_hard": 0.09500373899936676, "_runtime": 19355.85179400444, "_timestamp": 1578957049.0701492, "_step": 249}
{"epoch": 250, "loss": 0.022120076511055232, "iou_score": 0.9785839319229126, "iou_score_student_hard": 0.9785839319229126, "val_loss": 2.6775272130966186, "val_iou_score": 0.7160316109657288, "val_iou_score_student_hard": 0.7160316109657288, "_runtime": 19433.354618549347, "_timestamp": 1578957126.5729737, "_step": 250}
{"epoch": 251, "loss": 0.02331507746130228, "iou_score": 0.9775041937828064, "iou_score_student_hard": 0.9775041937828064, "val_loss": 13.377352380752564, "val_iou_score": 0.09351015836000443, "val_iou_score_student_hard": 0.09351015836000443, "_runtime": 19510.577932596207, "_timestamp": 1578957203.7962878, "_step": 251}
{"epoch": 252, "loss": 0.0310493164526468, "iou_score": 0.9663745760917664, "iou_score_student_hard": 0.9663745760917664, "val_loss": 13.345872068405152, "val_iou_score": 0.09457097947597504, "val_iou_score_student_hard": 0.09457097947597504, "_runtime": 19587.796883821487, "_timestamp": 1578957281.015239, "_step": 252}
{"epoch": 253, "loss": 0.024088506984778425, "iou_score": 0.9754538536071777, "iou_score_student_hard": 0.9754538536071777, "val_loss": 13.377746057510375, "val_iou_score": 0.09330110251903534, "val_iou_score_student_hard": 0.09330110251903534, "_runtime": 19666.557588100433, "_timestamp": 1578957359.7759433, "_step": 253}
{"epoch": 254, "loss": 0.025353119928728452, "iou_score": 0.9734311699867249, "iou_score_student_hard": 0.9734311699867249, "val_loss": 13.430968475341796, "val_iou_score": 0.09144468605518341, "val_iou_score_student_hard": 0.09144468605518341, "_runtime": 19744.03269124031, "_timestamp": 1578957437.2510464, "_step": 254}
{"epoch": 255, "loss": 0.028864156065339392, "iou_score": 0.9693816304206848, "iou_score_student_hard": 0.9693816304206848, "val_loss": 13.40460295677185, "val_iou_score": 0.09222374856472015, "val_iou_score_student_hard": 0.09222374856472015, "_runtime": 19821.453255414963, "_timestamp": 1578957514.6716106, "_step": 255}
{"epoch": 256, "loss": 0.02653503886170008, "iou_score": 0.9762278199195862, "iou_score_student_hard": 0.9762278199195862, "val_loss": 2.6634270787239074, "val_iou_score": 0.7106918096542358, "val_iou_score_student_hard": 0.7106918096542358, "_runtime": 19899.92705988884, "_timestamp": 1578957593.145415, "_step": 256}
{"epoch": 257, "loss": 0.020299452246928758, "iou_score": 0.9790180325508118, "iou_score_student_hard": 0.9790180325508118, "val_loss": 13.436346197128296, "val_iou_score": 0.09104876220226288, "val_iou_score_student_hard": 0.09104876220226288, "_runtime": 19977.269915103912, "_timestamp": 1578957670.4882703, "_step": 257}
{"epoch": 258, "loss": 0.02198022421957417, "iou_score": 0.9766759872436523, "iou_score_student_hard": 0.9766759872436523, "val_loss": 2.744356596469879, "val_iou_score": 0.7103518843650818, "val_iou_score_student_hard": 0.7103518843650818, "_runtime": 20053.9467253685, "_timestamp": 1578957747.1650805, "_step": 258}
{"epoch": 259, "loss": 0.02598898810842498, "iou_score": 0.9752857685089111, "iou_score_student_hard": 0.9752857685089111, "val_loss": 2.5903083741664887, "val_iou_score": 0.7111163139343262, "val_iou_score_student_hard": 0.7111163139343262, "_runtime": 20131.96699166298, "_timestamp": 1578957825.1853468, "_step": 259}
{"epoch": 260, "loss": 0.021398060510612348, "iou_score": 0.9779015183448792, "iou_score_student_hard": 0.9779015183448792, "val_loss": 13.396438026428223, "val_iou_score": 0.09266803413629532, "val_iou_score_student_hard": 0.09266803413629532, "_runtime": 20209.726613998413, "_timestamp": 1578957902.9449692, "_step": 260}
{"epoch": 261, "loss": 0.02852652741765434, "iou_score": 0.968972384929657, "iou_score_student_hard": 0.968972384929657, "val_loss": 12.9357759475708, "val_iou_score": 0.09165046364068985, "val_iou_score_student_hard": 0.09165046364068985, "_runtime": 20286.875991106033, "_timestamp": 1578957980.0943463, "_step": 261}
{"epoch": 262, "loss": 0.023205404948781837, "iou_score": 0.9752606749534607, "iou_score_student_hard": 0.9752606749534607, "val_loss": 2.6934383690357206, "val_iou_score": 0.7089764475822449, "val_iou_score_student_hard": 0.7089764475822449, "_runtime": 20364.21212363243, "_timestamp": 1578958057.4304788, "_step": 262}
{"epoch": 263, "loss": 0.02424366623586552, "iou_score": 0.9762595891952515, "iou_score_student_hard": 0.9762595891952515, "val_loss": 13.401881408691406, "val_iou_score": 0.09234485030174255, "val_iou_score_student_hard": 0.09234485030174255, "_runtime": 20442.644782304764, "_timestamp": 1578958135.8631375, "_step": 263}
{"epoch": 264, "loss": 0.030013763244179162, "iou_score": 0.965975284576416, "iou_score_student_hard": 0.965975284576416, "val_loss": 13.436379051208496, "val_iou_score": 0.09096561372280121, "val_iou_score_student_hard": 0.09096561372280121, "_runtime": 20520.027158260345, "_timestamp": 1578958213.2455134, "_step": 264}
{"epoch": 265, "loss": 0.03457077340307561, "iou_score": 0.9634087085723877, "iou_score_student_hard": 0.9634087085723877, "val_loss": 13.441741895675658, "val_iou_score": 0.09070813655853271, "val_iou_score_student_hard": 0.09070813655853271, "_runtime": 20597.171402931213, "_timestamp": 1578958290.389758, "_step": 265}
{"epoch": 266, "loss": 0.02297503115947951, "iou_score": 0.9769541025161743, "iou_score_student_hard": 0.9769541025161743, "val_loss": 2.6922183096408845, "val_iou_score": 0.7152212262153625, "val_iou_score_student_hard": 0.7152212262153625, "_runtime": 20675.139930725098, "_timestamp": 1578958368.358286, "_step": 266}
{"epoch": 267, "loss": 0.02549545685760677, "iou_score": 0.9779340028762817, "iou_score_student_hard": 0.9779340028762817, "val_loss": 2.7224198937416078, "val_iou_score": 0.7121216058731079, "val_iou_score_student_hard": 0.7121216058731079, "_runtime": 20752.964770793915, "_timestamp": 1578958446.183126, "_step": 267}
{"epoch": 268, "loss": 0.019327835518528114, "iou_score": 0.9810632467269897, "iou_score_student_hard": 0.9810632467269897, "val_loss": 2.732880747318268, "val_iou_score": 0.7117806673049927, "val_iou_score_student_hard": 0.7117806673049927, "_runtime": 20830.068341255188, "_timestamp": 1578958523.2866964, "_step": 268}
{"epoch": 269, "loss": 0.02238000142388046, "iou_score": 0.9776033759117126, "iou_score_student_hard": 0.9776033759117126, "val_loss": 0.6823993861675263, "val_iou_score": 0.7678775191307068, "val_iou_score_student_hard": 0.7678775191307068, "_runtime": 20907.29022669792, "_timestamp": 1578958600.5085819, "_step": 269}
{"epoch": 270, "loss": 0.019825178393247454, "iou_score": 0.9800710678100586, "iou_score_student_hard": 0.9800710678100586, "val_loss": 2.732486975193024, "val_iou_score": 0.7107270359992981, "val_iou_score_student_hard": 0.7107270359992981, "_runtime": 20985.032512187958, "_timestamp": 1578958678.2508674, "_step": 270}
{"epoch": 271, "loss": 0.020342411342161623, "iou_score": 0.9791402816772461, "iou_score_student_hard": 0.9791402816772461, "val_loss": 13.387977361679077, "val_iou_score": 0.09285514056682587, "val_iou_score_student_hard": 0.09285514056682587, "_runtime": 21061.85430264473, "_timestamp": 1578958755.0726578, "_step": 271}
{"epoch": 272, "loss": 0.03703268552199006, "iou_score": 0.9600474238395691, "iou_score_student_hard": 0.9600474238395691, "val_loss": 13.28423900604248, "val_iou_score": 0.09175658226013184, "val_iou_score_student_hard": 0.09175658226013184, "_runtime": 21139.021255016327, "_timestamp": 1578958832.2396102, "_step": 272}
{"epoch": 273, "loss": 0.020225978685034948, "iou_score": 0.9789217114448547, "iou_score_student_hard": 0.9789217114448547, "val_loss": 13.394961977005005, "val_iou_score": 0.09243438392877579, "val_iou_score_student_hard": 0.09243438392877579, "_runtime": 21217.291156053543, "_timestamp": 1578958910.5095112, "_step": 273}
{"epoch": 274, "loss": 0.030764070779762485, "iou_score": 0.9663332104682922, "iou_score_student_hard": 0.9663332104682922, "val_loss": 13.463072443008423, "val_iou_score": 0.09017623960971832, "val_iou_score_student_hard": 0.09017623960971832, "_runtime": 21294.422470092773, "_timestamp": 1578958987.6408253, "_step": 274}
{"epoch": 275, "loss": 0.029908422533084046, "iou_score": 0.967270016670227, "iou_score_student_hard": 0.967270016670227, "val_loss": 13.431558465957641, "val_iou_score": 0.09129008650779724, "val_iou_score_student_hard": 0.09129008650779724, "_runtime": 21371.384286403656, "_timestamp": 1578959064.6026416, "_step": 275}
{"epoch": 276, "loss": 0.028587799972261897, "iou_score": 0.9696583151817322, "iou_score_student_hard": 0.9696583151817322, "val_loss": 2.6681815147399903, "val_iou_score": 0.7169660329818726, "val_iou_score_student_hard": 0.7169660329818726, "_runtime": 21448.743210077286, "_timestamp": 1578959141.9615653, "_step": 276}
{"epoch": 277, "loss": 0.029415631010620433, "iou_score": 0.9757741093635559, "iou_score_student_hard": 0.9757741093635559, "val_loss": 2.7186821579933165, "val_iou_score": 0.7130712270736694, "val_iou_score_student_hard": 0.7130712270736694, "_runtime": 21526.82441020012, "_timestamp": 1578959220.0427654, "_step": 277}
{"epoch": 278, "loss": 0.02327836089428853, "iou_score": 0.9781861305236816, "iou_score_student_hard": 0.9781861305236816, "val_loss": 13.394962072372437, "val_iou_score": 0.09259798377752304, "val_iou_score_student_hard": 0.09259798377752304, "_runtime": 21604.223828077316, "_timestamp": 1578959297.4421833, "_step": 278}
{"epoch": 279, "loss": 0.02644056751054119, "iou_score": 0.9760538935661316, "iou_score_student_hard": 0.9760538935661316, "val_loss": 2.7098933696746825, "val_iou_score": 0.7131268382072449, "val_iou_score_student_hard": 0.7131268382072449, "_runtime": 21681.447273015976, "_timestamp": 1578959374.6656282, "_step": 279}
{"epoch": 280, "loss": 0.02197472562336109, "iou_score": 0.9797295928001404, "iou_score_student_hard": 0.9797295928001404, "val_loss": 2.7176977336406707, "val_iou_score": 0.7126957178115845, "val_iou_score_student_hard": 0.7126957178115845, "_runtime": 21759.820658683777, "_timestamp": 1578959453.0390139, "_step": 280}
{"epoch": 281, "loss": 0.02070660291832279, "iou_score": 0.9801783561706543, "iou_score_student_hard": 0.9801783561706543, "val_loss": 13.407357597351075, "val_iou_score": 0.09214416146278381, "val_iou_score_student_hard": 0.09214416146278381, "_runtime": 21836.98716378212, "_timestamp": 1578959530.205519, "_step": 281}
{"epoch": 282, "loss": 0.021262610733339734, "iou_score": 0.9778990745544434, "iou_score_student_hard": 0.9778990745544434, "val_loss": 13.40768551826477, "val_iou_score": 0.09211698919534683, "val_iou_score_student_hard": 0.09211698919534683, "_runtime": 21914.040143966675, "_timestamp": 1578959607.2584991, "_step": 282}
{"epoch": 283, "loss": 0.01939174814827063, "iou_score": 0.9804272651672363, "iou_score_student_hard": 0.9804272651672363, "val_loss": 2.711609309911728, "val_iou_score": 0.7112497687339783, "val_iou_score_student_hard": 0.7112497687339783, "_runtime": 21991.37585091591, "_timestamp": 1578959684.594206, "_step": 283}
{"epoch": 284, "loss": 0.01738205296834084, "iou_score": 0.9828203916549683, "iou_score_student_hard": 0.9828203916549683, "val_loss": 2.7410790503025053, "val_iou_score": 0.7104419469833374, "val_iou_score_student_hard": 0.7104419469833374, "_runtime": 22068.7151157856, "_timestamp": 1578959761.933471, "_step": 284}
{"epoch": 285, "loss": 0.02137498834424398, "iou_score": 0.9803197979927063, "iou_score_student_hard": 0.9803197979927063, "val_loss": 13.395060443878174, "val_iou_score": 0.09296350926160812, "val_iou_score_student_hard": 0.09296350926160812, "_runtime": 22145.655637979507, "_timestamp": 1578959838.8739932, "_step": 285}
{"epoch": 286, "loss": 0.022164640634913337, "iou_score": 0.9777635335922241, "iou_score_student_hard": 0.9777635335922241, "val_loss": 13.408439826965331, "val_iou_score": 0.0921863541007042, "val_iou_score_student_hard": 0.0921863541007042, "_runtime": 22222.57142162323, "_timestamp": 1578959915.7897768, "_step": 286}
{"epoch": 287, "loss": 0.021413219478827985, "iou_score": 0.978840172290802, "iou_score_student_hard": 0.978840172290802, "val_loss": 13.42692232131958, "val_iou_score": 0.09104987978935242, "val_iou_score_student_hard": 0.09104987978935242, "_runtime": 22300.420773506165, "_timestamp": 1578959993.6391287, "_step": 287}
{"epoch": 288, "loss": 0.021373502325943924, "iou_score": 0.9779751896858215, "iou_score_student_hard": 0.9779751896858215, "val_loss": 13.407718563079834, "val_iou_score": 0.09215004742145538, "val_iou_score_student_hard": 0.09215004742145538, "_runtime": 22378.074471235275, "_timestamp": 1578960071.2928264, "_step": 288}
{"epoch": 289, "loss": 0.021391842886805533, "iou_score": 0.9795400500297546, "iou_score_student_hard": 0.9795400500297546, "val_loss": 13.434214639663697, "val_iou_score": 0.09132660180330276, "val_iou_score_student_hard": 0.09132660180330276, "_runtime": 22455.164670705795, "_timestamp": 1578960148.383026, "_step": 289}
{"epoch": 290, "loss": 0.02145618264224719, "iou_score": 0.9792231321334839, "iou_score_student_hard": 0.9792231321334839, "val_loss": 13.438936853408814, "val_iou_score": 0.0910973995923996, "val_iou_score_student_hard": 0.0910973995923996, "_runtime": 22533.63686132431, "_timestamp": 1578960226.8552165, "_step": 290}
{"epoch": 291, "loss": 0.018740876014767722, "iou_score": 0.9813881516456604, "iou_score_student_hard": 0.9813881516456604, "val_loss": 2.697204315662384, "val_iou_score": 0.7144442796707153, "val_iou_score_student_hard": 0.7144442796707153, "_runtime": 22611.63871526718, "_timestamp": 1578960304.8570704, "_step": 291}
{"epoch": 292, "loss": 0.020549424695359034, "iou_score": 0.9800974726676941, "iou_score_student_hard": 0.9800974726676941, "val_loss": 13.173872423171996, "val_iou_score": 0.0932270810008049, "val_iou_score_student_hard": 0.0932270810008049, "_runtime": 22688.587799072266, "_timestamp": 1578960381.8061543, "_step": 292}
{"epoch": 293, "loss": 0.025661352297968485, "iou_score": 0.9802279472351074, "iou_score_student_hard": 0.9802279472351074, "val_loss": 2.6991700649261476, "val_iou_score": 0.7141568660736084, "val_iou_score_student_hard": 0.7141568660736084, "_runtime": 22765.472861289978, "_timestamp": 1578960458.6912165, "_step": 293}
{"epoch": 294, "loss": 0.028674807128581135, "iou_score": 0.9722319841384888, "iou_score_student_hard": 0.9722319841384888, "val_loss": 13.423360586166382, "val_iou_score": 0.09145572036504745, "val_iou_score_student_hard": 0.09145572036504745, "_runtime": 22843.608957529068, "_timestamp": 1578960536.8273127, "_step": 294}
{"epoch": 295, "loss": 0.02169921534051272, "iou_score": 0.980129063129425, "iou_score_student_hard": 0.980129063129425, "val_loss": 13.42001552581787, "val_iou_score": 0.09160403162240982, "val_iou_score_student_hard": 0.09160403162240982, "_runtime": 22920.567917585373, "_timestamp": 1578960613.7862728, "_step": 295}
{"epoch": 296, "loss": 0.018101286409761417, "iou_score": 0.9821776151657104, "iou_score_student_hard": 0.9821776151657104, "val_loss": 13.371121788024903, "val_iou_score": 0.0934995487332344, "val_iou_score_student_hard": 0.0934995487332344, "_runtime": 22997.88846182823, "_timestamp": 1578960691.106817, "_step": 296}
{"epoch": 297, "loss": 0.026015228981321508, "iou_score": 0.9786527752876282, "iou_score_student_hard": 0.9786527752876282, "val_loss": 2.694054681062698, "val_iou_score": 0.7145955562591553, "val_iou_score_student_hard": 0.7145955562591553, "_runtime": 23075.86738872528, "_timestamp": 1578960769.085744, "_step": 297}
{"epoch": 298, "loss": 0.020892106170173397, "iou_score": 0.981007993221283, "iou_score_student_hard": 0.981007993221283, "val_loss": 13.380435037612916, "val_iou_score": 0.09325272589921951, "val_iou_score_student_hard": 0.09325272589921951, "_runtime": 23152.684899568558, "_timestamp": 1578960845.9032547, "_step": 298}
{"epoch": 299, "loss": 0.016605035876008596, "iou_score": 0.9830564856529236, "iou_score_student_hard": 0.9830564856529236, "val_loss": 13.390453004837036, "val_iou_score": 0.09245271235704422, "val_iou_score_student_hard": 0.09245271235704422, "_runtime": 23230.39173078537, "_timestamp": 1578960923.610086, "_step": 299}
