{
    "root": "/home/ozastrow/image-analysis",
    "program": "train.py",
    "git": {
        "remote": "git@gitlab.com:robotic-startup/Platform/image-analysis.git",
        "commit": "6f80313b83236634a1a072c8fc1b7511cfbb3e15"
    },
    "email": "otto.zastrow@hotmail.de",
    "startedAt": "2020-01-28T21:28:42.518247",
    "host": "ceg-octane.ziti.uni-heidelberg.de",
    "username": "ozastrow",
    "executable": "/home/ozastrow/anaconda3/envs/tf2/bin/python3",
    "os": "Linux-3.10.0-693.11.6.el7.x86_64-x86_64-with-centos-7.4.1708-Core",
    "python": "3.7.5",
    "cpu_count": 8,
    "cuda": "9.1.85",
    "args": [
        "--experiment_name=debug"
    ],
    "state": "failed",
    "jobType": null,
    "mode": "run",
    "project": "lawnrobot",
    "heartbeatAt": "2020-01-28T21:28:47.411367",
    "exitcode": 1
}
