{"epoch": 0, "loss": 0.0712708024920258, "iou_score": 0.12418833374977112, "iou_score_student_hard": 0.12418833374977112, "val_loss": 0.07816140716895462, "val_iou_score": 0.12156450748443604, "val_iou_score_student_hard": 0.12156450748443604, "_runtime": 16.858020067214966, "_timestamp": 1578770828.8714988, "_step": 0}
{"epoch": 1, "loss": 0.005269830043597391, "iou_score": 0.1848280131816864, "iou_score_student_hard": 0.1848280131816864, "val_loss": 0.0317013988038525, "val_iou_score": 0.13923266530036926, "val_iou_score_student_hard": 0.13923266530036926, "_runtime": 22.303667783737183, "_timestamp": 1578770834.3171465, "_step": 1}
{"epoch": 2, "loss": 0.0002923227742510516, "iou_score": 0.14669248461723328, "iou_score_student_hard": 0.14669248461723328, "val_loss": 0.005272348139988026, "val_iou_score": 0.11537586152553558, "val_iou_score_student_hard": 0.11537586152553558, "_runtime": 27.527299642562866, "_timestamp": 1578770839.5407784, "_step": 2}
{"epoch": 3, "loss": 0.00016302339896859908, "iou_score": 0.22956809401512146, "iou_score_student_hard": 0.22956809401512146, "val_loss": 0.002236361417817534, "val_iou_score": 0.14162865281105042, "val_iou_score_student_hard": 0.14162865281105042, "_runtime": 33.06549572944641, "_timestamp": 1578770845.0789745, "_step": 3}
{"epoch": 4, "loss": 1.000533725676272e-06, "iou_score": 0.19127383828163147, "iou_score_student_hard": 0.19127383828163147, "val_loss": 0.0006020481229882079, "val_iou_score": 0.13698938488960266, "val_iou_score_student_hard": 0.13698938488960266, "_runtime": 38.20694017410278, "_timestamp": 1578770850.220419, "_step": 4}
{"epoch": 5, "loss": 0.0002120710919361133, "iou_score": 0.17470552027225494, "iou_score_student_hard": 0.17470552027225494, "val_loss": 2.811654743073433e-06, "val_iou_score": 0.1771092265844345, "val_iou_score_student_hard": 0.1771092265844345, "_runtime": 43.498268842697144, "_timestamp": 1578770855.5117476, "_step": 5}
{"epoch": 6, "loss": 7.797298900562174e-08, "iou_score": 0.18602654337882996, "iou_score_student_hard": 0.18602654337882996, "val_loss": 0.0007181585961380438, "val_iou_score": 0.10770096629858017, "val_iou_score_student_hard": 0.10770096629858017, "_runtime": 48.50686526298523, "_timestamp": 1578770860.520344, "_step": 6}
{"epoch": 7, "loss": 0.00019081966831572576, "iou_score": 0.17810125648975372, "iou_score_student_hard": 0.17810125648975372, "val_loss": 0.3516686588024006, "val_iou_score": 0.0871540755033493, "val_iou_score_student_hard": 0.0871540755033493, "_runtime": 53.28219938278198, "_timestamp": 1578770865.2956781, "_step": 7}
{"epoch": 8, "loss": 0.0001922719156330559, "iou_score": 0.14087627828121185, "iou_score_student_hard": 0.14087627828121185, "val_loss": 0.001049378910101914, "val_iou_score": 0.19933918118476868, "val_iou_score_student_hard": 0.19933918118476868, "_runtime": 58.22473216056824, "_timestamp": 1578770870.238211, "_step": 8}
{"epoch": 9, "loss": 0.00019081473618772908, "iou_score": 0.15355148911476135, "iou_score_student_hard": 0.15355148911476135, "val_loss": 0.0010493713353451756, "val_iou_score": 0.13464881479740143, "val_iou_score_student_hard": 0.13464881479740143, "_runtime": 63.00576949119568, "_timestamp": 1578770875.0192482, "_step": 9}
{"epoch": 10, "loss": 0.00016963010407892784, "iou_score": 0.18485970795154572, "iou_score_student_hard": 0.18485970795154572, "val_loss": 4.5061765141518603e-08, "val_iou_score": 0.22191151976585388, "val_iou_score_student_hard": 0.22191151976585388, "_runtime": 67.93901824951172, "_timestamp": 1578770879.952497, "_step": 10}
{"epoch": 11, "loss": 2.7970387739942064e-07, "iou_score": 0.1809075027704239, "iou_score_student_hard": 0.1809075027704239, "val_loss": 3.797484799950013e-08, "val_iou_score": 0.19869957864284515, "val_iou_score_student_hard": 0.19869957864284515, "_runtime": 73.17330265045166, "_timestamp": 1578770885.1867814, "_step": 11}
{"epoch": 12, "loss": 2.131460930771999e-08, "iou_score": 0.14979317784309387, "iou_score_student_hard": 0.14979317784309387, "val_loss": 1.64665724555757e-07, "val_iou_score": 0.17152106761932373, "val_iou_score_student_hard": 0.17152106761932373, "_runtime": 78.39865255355835, "_timestamp": 1578770890.4121313, "_step": 12}
{"epoch": 13, "loss": 0.00019081112096146, "iou_score": 0.15558189153671265, "iou_score_student_hard": 0.15558189153671265, "val_loss": 1.0426934509144558e-07, "val_iou_score": 0.20611169934272766, "val_iou_score_student_hard": 0.20611169934272766, "_runtime": 83.19258046150208, "_timestamp": 1578770895.2060592, "_step": 13}
{"epoch": 14, "loss": 1.7071425084669302e-08, "iou_score": 0.1409505009651184, "iou_score_student_hard": 0.1409505009651184, "val_loss": 4.340739288011264e-08, "val_iou_score": 0.19772431254386902, "val_iou_score_student_hard": 0.19772431254386902, "_runtime": 87.95960712432861, "_timestamp": 1578770899.9730859, "_step": 14}
{"epoch": 15, "loss": 1.9061774187751294e-08, "iou_score": 0.15876582264900208, "iou_score_student_hard": 0.15876582264900208, "val_loss": 1.9631503780925818e-08, "val_iou_score": 0.13342000544071198, "val_iou_score_student_hard": 0.13342000544071198, "_runtime": 92.74893712997437, "_timestamp": 1578770904.762416, "_step": 15}
{"epoch": 16, "loss": 0.00019081616703650958, "iou_score": 0.20328253507614136, "iou_score_student_hard": 0.20328253507614136, "val_loss": 1.9767321732255815e-08, "val_iou_score": 0.12607279419898987, "val_iou_score_student_hard": 0.12607279419898987, "_runtime": 98.03340601921082, "_timestamp": 1578770910.0468848, "_step": 16}
{"epoch": 17, "loss": 0.0001908172204188667, "iou_score": 0.21243040263652802, "iou_score_student_hard": 0.21243040263652802, "val_loss": 2.559584884875843e-08, "val_iou_score": 0.18641088902950287, "val_iou_score_student_hard": 0.18641088902950287, "_runtime": 102.8139271736145, "_timestamp": 1578770914.827406, "_step": 17}
{"epoch": 18, "loss": 2.6316212735860207e-08, "iou_score": 0.22091268002986908, "iou_score_student_hard": 0.22091268002986908, "val_loss": 1.6402918994601335e-08, "val_iou_score": 0.12431726604700089, "val_iou_score_student_hard": 0.12431726604700089, "_runtime": 107.57140779495239, "_timestamp": 1578770919.5848866, "_step": 18}
{"epoch": 19, "loss": 2.0156783901588553e-08, "iou_score": 0.1697363257408142, "iou_score_student_hard": 0.1697363257408142, "val_loss": 2.8979653829419583e-08, "val_iou_score": 0.24317292869091034, "val_iou_score_student_hard": 0.24317292869091034, "_runtime": 112.93538188934326, "_timestamp": 1578770924.9488606, "_step": 19}
{"epoch": 20, "loss": 0.00019080993423070618, "iou_score": 0.1528865247964859, "iou_score_student_hard": 0.1528865247964859, "val_loss": 2.0772374192262744e-08, "val_iou_score": 0.17477239668369293, "val_iou_score_student_hard": 0.17477239668369293, "_runtime": 117.8299491405487, "_timestamp": 1578770929.843428, "_step": 20}
{"epoch": 21, "loss": 2.1015434877288712e-08, "iou_score": 0.17730233073234558, "iou_score_student_hard": 0.17730233073234558, "val_loss": 2.1719218473714717e-08, "val_iou_score": 0.1831599324941635, "val_iou_score_student_hard": 0.1831599324941635, "_runtime": 122.62324666976929, "_timestamp": 1578770934.6367254, "_step": 21}
{"epoch": 22, "loss": 2.415229876903427e-08, "iou_score": 0.2036411315202713, "iou_score_student_hard": 0.2036411315202713, "val_loss": 2.4734375408952403e-08, "val_iou_score": 0.20851752161979675, "val_iou_score_student_hard": 0.20851752161979675, "_runtime": 127.39760971069336, "_timestamp": 1578770939.4110885, "_step": 22}
{"epoch": 23, "loss": 0.00019081325806443703, "iou_score": 0.18089213967323303, "iou_score_student_hard": 0.18089213967323303, "val_loss": 2.6573737832435995e-08, "val_iou_score": 0.22392717003822327, "val_iou_score_student_hard": 0.22392717003822327, "_runtime": 132.2044882774353, "_timestamp": 1578770944.217967, "_step": 23}
{"epoch": 24, "loss": 0.00019081471008106478, "iou_score": 0.19318969547748566, "iou_score_student_hard": 0.19318969547748566, "val_loss": 1.5118469653963017e-08, "val_iou_score": 0.12795837223529816, "val_iou_score_student_hard": 0.12795837223529816, "_runtime": 136.9847354888916, "_timestamp": 1578770948.9982142, "_step": 24}
{"epoch": 25, "loss": 2.1091634168862222e-08, "iou_score": 0.1779998391866684, "iou_score_student_hard": 0.1779998391866684, "val_loss": 0.0010493720959250386, "val_iou_score": 0.1443338394165039, "val_iou_score_student_hard": 0.1443338394165039, "_runtime": 141.97487211227417, "_timestamp": 1578770953.9883509, "_step": 25}
{"epoch": 26, "loss": 0.00019081567668090095, "iou_score": 0.20106178522109985, "iou_score_student_hard": 0.20106178522109985, "val_loss": 1.552204287325054e-08, "val_iou_score": 0.13133938610553741, "val_iou_score_student_hard": 0.13133938610553741, "_runtime": 146.73902535438538, "_timestamp": 1578770958.752504, "_step": 26}
{"epoch": 27, "loss": 2.5212030935447852e-08, "iou_score": 0.21251922845840454, "iou_score_student_hard": 0.21251922845840454, "val_loss": 2.4400651582601185e-08, "val_iou_score": 0.2057216912508011, "val_iou_score_student_hard": 0.2057216912508011, "_runtime": 151.51069688796997, "_timestamp": 1578770963.5241756, "_step": 27}
{"epoch": 28, "loss": 0.0005723940871769195, "iou_score": 0.15785524249076843, "iou_score_student_hard": 0.15785524249076843, "val_loss": 0.0010493788635358354, "val_iou_score": 0.20132918655872345, "val_iou_score_student_hard": 0.20132918655872345, "_runtime": 156.31099772453308, "_timestamp": 1578770968.3244765, "_step": 28}
{"epoch": 29, "loss": 0.00019081331027502742, "iou_score": 0.1816025823354721, "iou_score_student_hard": 0.1816025823354721, "val_loss": 1.2518527438970528e-08, "val_iou_score": 0.10617685317993164, "val_iou_score_student_hard": 0.10617685317993164, "_runtime": 161.12845158576965, "_timestamp": 1578770973.1419303, "_step": 29}
{"epoch": 30, "loss": 0.00019081219127685376, "iou_score": 0.17222796380519867, "iou_score_student_hard": 0.17222796380519867, "val_loss": 1.9782843824200925e-08, "val_iou_score": 0.1670350879430771, "val_iou_score_student_hard": 0.1670350879430771, "_runtime": 166.16583967208862, "_timestamp": 1578770978.1793184, "_step": 30}
{"epoch": 31, "loss": 2.048909658779564e-08, "iou_score": 0.17295187711715698, "iou_score_student_hard": 0.17295187711715698, "val_loss": 1.4714896695577906e-08, "val_iou_score": 0.1245773434638977, "val_iou_score_student_hard": 0.1245773434638977, "_runtime": 171.002295255661, "_timestamp": 1578770983.015774, "_step": 31}
{"epoch": 32, "loss": 0.00019081416822067844, "iou_score": 0.18910250067710876, "iou_score_student_hard": 0.18910250067710876, "val_loss": 1.8983458494048476e-08, "val_iou_score": 0.16033808887004852, "val_iou_score_student_hard": 0.16033808887004852, "_runtime": 175.77487087249756, "_timestamp": 1578770987.7883496, "_step": 32}
{"epoch": 33, "loss": 2.5698858668750506e-08, "iou_score": 0.21659769117832184, "iou_score_student_hard": 0.21659769117832184, "val_loss": 2.0031196404368677e-08, "val_iou_score": 0.16911573708057404, "val_iou_score_student_hard": 0.16911573708057404, "_runtime": 180.57659935951233, "_timestamp": 1578770992.590078, "_step": 33}
{"epoch": 34, "loss": 1.75243863761241e-08, "iou_score": 0.14811444282531738, "iou_score_student_hard": 0.14811444282531738, "val_loss": 1.6639629976666902e-08, "val_iou_score": 0.14070220291614532, "val_iou_score_student_hard": 0.14070220291614532, "_runtime": 185.39576148986816, "_timestamp": 1578770997.4092402, "_step": 34}
{"epoch": 35, "loss": 1.857141873504417e-08, "iou_score": 0.15688620507717133, "iou_score_student_hard": 0.15688620507717133, "val_loss": 1.6197251734295648e-08, "val_iou_score": 0.1369960904121399, "val_iou_score_student_hard": 0.1369960904121399, "_runtime": 190.19677901268005, "_timestamp": 1578771002.2102578, "_step": 35}
