{
  "name": "bishop",
  "ixx": 0.00000286,
  "ixy": -0.00000002,
  "ixz": -0.00000014,
  "iyy": 0.00000277,
  "iyz": 0.000000,
  "izz": 0.00000029,
  "massSDF": 0.000018,
  "posX": 0.040000,
  "posY": 0.000031,
  "posZ": 0.024266,
  "eulerX": 0.000000,
  "eulerY": 0.000000,
  "eulerZ": -89.99999999999977,
  "stl": "sdf_generation/bishop/meshes/bishop.stl",
  "friction": -89.99999999999977
}


