{
  "name": "rook",
  "ixx": 0.00000058,
  "ixy": 0.00000002,
  "ixz": -0.00000001,
  "iyy": 0.00000057,
  "izz": 0.00000023,
  "massSDF": 0.017063515037115735,
  "posX": 0.000156,
  "posY": 0.000001,
  "posZ": -0.000002,
  "eulerX": 0.0,
  "eulerY": 0.0,
  "eulerZ": -1.5707963267948966,
  "iyz": 0.000000,
  "stl": "sdf_generation/rook/meshes/rook.stl",
  "friction": -1.5707963267948966
}

