*ZETEX BCX5616 Spice Model v2.0 Last Revised 24/2/05
    *
    .MODEL BCX5616 NPN IS =6E-14 NF =0.99 BF =250 IKF=0.9
    +NK=0.7 VAF=270 ISE=1E-14 NE =1.2 NR =0.98 BR =30 IKR=0.5
    +VAR=27 ISC=1.2e-13 NC =1.2 RB =0.2 RE =0.08 RC =0.08 RCO=5
    +GAMMA=5E-9 CJC=15.9E-12 MJC=0.4 VJC=0.51 CJE=108E-12 
    +MJE=0.35 VJE=0.7 TF =0.8E-9 TR =55e-9 XTB=1.4 QUASIMOD=1
    *
    *$
    *