G04*
G04 #@! TF.GenerationSoftware,Altium Limited,Altium Designer,23.9.2 (47)*
G04*
G04 Layer_Physical_Order=2*
G04 Layer_Color=16711680*
%FSLAX25Y25*%
%MOIN*%
G70*
G04*
G04 #@! TF.SameCoordinates,DA2D0295-69C4-49C4-B128-BB8DEC2FDA8F*
G04*
G04*
G04 #@! TF.FilePolarity,Positive*
G04*
G01*
G75*
%ADD18C,0.00327*%
%ADD22C,0.00787*%
%ADD23C,0.01575*%
%ADD25C,0.01181*%
%ADD26C,0.01575*%
D18*
X207874Y190968D02*
X208793Y190049D01*
Y189429D02*
Y190049D01*
X208341Y188976D02*
X208793Y189429D01*
X210388Y190991D02*
X210401Y191004D01*
X210388Y189726D02*
Y190991D01*
X208721Y188059D02*
X210388Y189726D01*
X200914Y188059D02*
X208721D01*
X195669Y181496D02*
Y181592D01*
X198031Y181496D02*
Y181678D01*
X197311Y183234D02*
X198291D01*
X195669Y181592D02*
X197311Y183234D01*
X198982Y183926D02*
Y187424D01*
X200534Y188976D01*
X198031Y181678D02*
X199900Y183546D01*
X198291Y183234D02*
X198982Y183926D01*
X199900Y183546D02*
Y187044D01*
X200914Y188059D01*
X200534Y188976D02*
X208341D01*
D22*
X218898Y196636D02*
G03*
X218442Y198031I-2362J0D01*
G01*
X214629D02*
G03*
X218898Y196636I1906J-1395D01*
G01*
X221052Y184271D02*
G03*
X221052Y184271I-2362J0D01*
G01*
X219519Y122893D02*
G03*
X215033Y122323I-2156J-964D01*
G01*
X211367Y189289D02*
G03*
X215354Y191004I1625J1715D01*
G01*
D02*
G03*
X211367Y192719I-2362J0D01*
G01*
X211033Y189140D02*
G03*
X211367Y189289I-633J1864D01*
G01*
X209449Y196636D02*
G03*
X208993Y198031I-2362J0D01*
G01*
X211367Y192719D02*
G03*
X209116Y192495I-967J-1715D01*
G01*
X209116D02*
G03*
X206255Y189848I-1242J-1527D01*
G01*
X214508Y185039D02*
G03*
X210010Y186048I-2362J0D01*
G01*
X215794Y181302D02*
G03*
X213708Y183267I-1969J0D01*
G01*
D02*
G03*
X214508Y185039I-1562J1772D01*
G01*
X212046Y180461D02*
G03*
X215794Y181302I1780J841D01*
G01*
X210010Y184030D02*
G03*
X210395Y183453I2136J1009D01*
G01*
X208840Y187195D02*
G03*
X209337Y187442I-119J864D01*
G01*
X210010Y186048D02*
G03*
X208840Y187195I-2136J-1009D01*
G01*
D02*
G03*
X209337Y187442I-119J864D01*
G01*
X209625Y183453D02*
G03*
X210010Y184030I-1750J1586D01*
G01*
X206890Y187187D02*
G03*
X206124Y183453I984J-2148D01*
G01*
X222047Y121006D02*
G03*
X219519Y122893I-1969J0D01*
G01*
X219084Y119308D02*
G03*
X222047Y121006I995J1698D01*
G01*
X218178Y118858D02*
G03*
X218957Y119181I0J1102D01*
G01*
X218178Y118858D02*
G03*
X218957Y119181I0J1102D01*
G01*
X215767D02*
G03*
X216547Y118858I779J779D01*
G01*
X215767Y119181D02*
G03*
X216547Y118858I779J779D01*
G01*
X220472Y115748D02*
G03*
X216412Y117390I-2362J0D01*
G01*
X216412D02*
G03*
X214587Y117993I-1452J-1330D01*
G01*
X216123Y114471D02*
G03*
X220472Y115748I1987J1277D01*
G01*
X218898Y110318D02*
G03*
X214185Y110552I-2362J0D01*
G01*
X214175Y110231D02*
G03*
X218898Y110318I2361J86D01*
G01*
X213690Y118890D02*
G03*
X212911Y119213I-779J-779D01*
G01*
X213690Y118890D02*
G03*
X212911Y119213I-779J-779D01*
G01*
X213656Y114586D02*
G03*
X216123Y114471I1304J1474D01*
G01*
X209816Y114796D02*
G03*
X213656Y114586I1995J1264D01*
G01*
X205676Y117008D02*
G03*
X209816Y114796I2198J-866D01*
G01*
X214185Y110552D02*
G03*
X214175Y110231I-2361J-86D01*
G01*
X205180Y198031D02*
G03*
X209449Y196636I1906J-1395D01*
G01*
X204724D02*
G03*
X204269Y198031I-2362J0D01*
G01*
X200456D02*
G03*
X204724Y196636I1906J-1395D01*
G01*
X204000Y184646D02*
G03*
X201012Y186923I-2362J0D01*
G01*
X200831Y182426D02*
G03*
X204022Y180461I1912J-469D01*
G01*
X203773Y183635D02*
G03*
X204000Y184646I-2135J1011D01*
G01*
X204022Y183453D02*
G03*
X203773Y183635I-1279J-1496D01*
G01*
X199666Y196131D02*
G03*
X198706Y198031I-2362J0D01*
G01*
X195901D02*
G03*
X199666Y196131I1402J-1901D01*
G01*
X200534Y189848D02*
G03*
X199918Y189593I0J-872D01*
G01*
X200534Y189848D02*
G03*
X199918Y189593I0J-872D01*
G01*
X198366Y188041D02*
G03*
X198110Y187424I617J-617D01*
G01*
X198366Y188041D02*
G03*
X198110Y187424I617J-617D01*
G01*
X200292Y182704D02*
G03*
X200831Y182426I1346J1941D01*
G01*
X196850Y179921D02*
G03*
X200000Y181496I1181J1575D01*
G01*
D02*
G03*
X199846Y182259I-1969J0D01*
G01*
X198110Y187162D02*
G03*
X195422Y183449I-882J-2191D01*
G01*
D02*
G03*
X196850Y179921I248J-1953D01*
G01*
X206749Y122323D02*
G03*
X206749Y120118I-1631J-1102D01*
G01*
X204724Y116060D02*
G03*
X204526Y117008I-2362J0D01*
G01*
X209449Y110630D02*
G03*
X209449Y110630I-2362J0D01*
G01*
X201662Y118316D02*
G03*
X204724Y116060I700J-2256D01*
G01*
X202250Y120847D02*
G03*
X202286Y121220I-1933J374D01*
G01*
D02*
G03*
X200691Y119288I-1969J0D01*
G01*
X197638Y120472D02*
G03*
X197638Y120472I-2362J0D01*
G01*
X199882Y110184D02*
G03*
X199882Y110184I-2362J0D01*
G01*
X230686Y198031D02*
X231102Y197615D01*
X227902Y198031D02*
X231102Y194831D01*
X225118Y198031D02*
X231102Y192047D01*
X218898Y196627D02*
X220303Y198031D01*
X218442D02*
X231102D01*
X219775Y186369D02*
X231102Y197696D01*
X218808Y195991D02*
X231102Y183696D01*
X220992Y184801D02*
X231102Y194912D01*
X222334Y198031D02*
X231102Y189263D01*
X219550Y198031D02*
X231102Y186480D01*
X215188Y190133D02*
X223086Y198031D01*
X214142Y186303D02*
X225870Y198031D01*
X214798Y192527D02*
X216545Y194274D01*
X217523Y194491D02*
X231102Y180912D01*
X211199Y198031D02*
X231102Y178128D01*
X215353Y191094D02*
X231102Y175344D01*
X213893Y183270D02*
X228654Y198031D01*
X214487Y189175D02*
X217408Y186255D01*
X215587Y182181D02*
X216592Y183185D01*
X218596Y123944D02*
X231102Y136451D01*
X215306Y180005D02*
X231102Y164208D01*
X220386Y122950D02*
X231102Y133667D01*
X220674Y182989D02*
X231102Y172560D01*
X218955Y181923D02*
X231102Y169776D01*
X209282Y180461D02*
X231102Y158641D01*
X206498Y180461D02*
X231102Y155857D01*
X213021Y179506D02*
X231102Y161425D01*
X212034Y188845D02*
X216343Y184536D01*
X214208Y183887D02*
X231102Y166992D01*
X211407Y122323D02*
X231102Y142018D01*
X208623Y122323D02*
X231102Y144802D01*
X214191Y122323D02*
X231102Y139234D01*
X206306Y122790D02*
X231102Y147586D01*
X212849Y193362D02*
X214672Y195185D01*
X213983Y198031D02*
X214390Y197624D01*
X209406Y192703D02*
X214451Y197748D01*
X209416Y197031D02*
X213082Y193364D01*
X208993Y198031D02*
X214629D01*
X208726Y194936D02*
X210715Y192947D01*
X209239Y186968D02*
X211469Y189198D01*
X206540Y194338D02*
X207943Y192935D01*
X212438Y187383D02*
X213863Y188808D01*
X209995Y188100D02*
X210993Y187101D01*
X209625Y183453D02*
X210395D01*
X209337Y187442D02*
X211004Y189110D01*
X206749Y122323D02*
X215033D01*
X205724Y183453D02*
X205946Y183675D01*
X221921Y121701D02*
X231102Y130883D01*
X218320Y118101D02*
X219384Y119164D01*
X231102Y105315D02*
Y198031D01*
X218898Y110326D02*
X231102Y122531D01*
X220541Y119093D02*
X231102Y108531D01*
X220070Y117067D02*
X231102Y128099D01*
X221967Y120450D02*
X231102Y111315D01*
X216547Y118858D02*
X218178D01*
X217991D02*
X218862Y117987D01*
X217977Y112189D02*
X231102Y125315D01*
X216670Y105315D02*
X231102Y119747D01*
X213947Y120118D02*
X216547Y117519D01*
X220350Y116500D02*
X231102Y105747D01*
X219454Y105315D02*
X231102Y116963D01*
X217885Y113397D02*
X225967Y105315D01*
X218812Y109686D02*
X223183Y105315D01*
X227806D02*
X231102Y108612D01*
X225022Y105315D02*
X231102Y111396D01*
X230590Y105315D02*
X231102Y105828D01*
X219881Y114185D02*
X228751Y105315D01*
X222238D02*
X231102Y114179D01*
X215383Y112380D02*
X216792Y113788D01*
X217536Y108178D02*
X220399Y105315D01*
X213784Y109146D02*
X217615Y105315D01*
X213886D02*
X216527Y107955D01*
X214830Y120118D02*
X215767Y119181D01*
X213612Y118960D02*
X214770Y120118D01*
X213690Y118890D02*
X214587Y117993D01*
X211163Y120118D02*
X212069Y119213D01*
X215412Y117976D02*
X216318Y118882D01*
X214287Y114211D02*
X215904Y112594D01*
X212825Y112605D02*
X214395Y114175D01*
X211081Y119213D02*
X211986Y120118D01*
X208380D02*
X209285Y119213D01*
X206749Y120118D02*
X214830D01*
X208297Y119213D02*
X209202Y120118D01*
X206162Y119552D02*
X206501Y119213D01*
X208911Y114019D02*
X210505Y112425D01*
X212007Y113706D02*
X214396Y111318D01*
X214100Y111097D02*
X214473Y111470D01*
X211102Y105315D02*
X214664Y108876D01*
X212034Y108112D02*
X214831Y105315D01*
X209173Y111737D02*
X211211Y113776D01*
X207590Y112938D02*
X208522Y113870D01*
X208570Y108792D02*
X212047Y105315D01*
X205535D02*
X209684Y109465D01*
X208318Y105315D02*
X211192Y108189D01*
X206090Y108488D02*
X209263Y105315D01*
X204269Y198031D02*
X205180D01*
X203518Y194577D02*
X206159Y191935D01*
X205340Y187187D02*
X206022Y186505D01*
X203768Y189848D02*
X211951Y198031D01*
X203996Y184509D02*
X206674Y187187D01*
X203157Y186454D02*
X203890Y187187D01*
X202556D02*
X205762Y183981D01*
X200984Y189848D02*
X205795Y194659D01*
X200534Y189848D02*
X206255D01*
X201275Y187187D02*
X206890D01*
X199624Y195687D02*
X205463Y189848D01*
X198458Y194070D02*
X202679Y189848D01*
X185827Y144069D02*
X231102Y189344D01*
X185827Y146853D02*
X231102Y192128D01*
X185827Y187213D02*
X231102Y141937D01*
X185827Y177475D02*
X202643Y194291D01*
X204022Y183453D02*
X206124D01*
X204022Y180461D02*
X212046D01*
X199997Y181394D02*
X231102Y150289D01*
X198885Y179722D02*
X231102Y147505D01*
X196218Y179606D02*
X231102Y144721D01*
X203847Y180328D02*
X231102Y153073D01*
X185827Y152420D02*
X212947Y179541D01*
X185827Y157988D02*
X208300Y180461D01*
X185827Y149636D02*
X218159Y181969D01*
X185827Y155204D02*
X211084Y180461D01*
X185827Y160772D02*
X205516Y180461D01*
X185827Y163556D02*
X202308Y180037D01*
X185827Y181645D02*
X231102Y136370D01*
X185827Y138501D02*
X231102Y183776D01*
X185827Y135717D02*
X231102Y180992D01*
X185827Y141285D02*
X231102Y186560D01*
X185827Y184429D02*
X231102Y139154D01*
X200063Y198031D02*
X200302Y197793D01*
X198706Y198031D02*
X200456D01*
X199572Y196788D02*
X200100Y197316D01*
X194495Y198031D02*
X195242Y197285D01*
X185827Y198031D02*
X195901D01*
X191712D02*
X200045Y189698D01*
X185827Y194178D02*
X189680Y198031D01*
X185827Y196962D02*
X186896Y198031D01*
X185827Y191395D02*
X192464Y198031D01*
X186144D02*
X196870Y187305D01*
X185827Y188611D02*
X195248Y198031D01*
X188928D02*
X198642Y188317D01*
X185827Y195565D02*
X195204Y186188D01*
X185827Y185827D02*
X195153Y195153D01*
X201012Y186923D02*
X201275Y187187D01*
X198366Y188041D02*
X199918Y189593D01*
X199846Y182259D02*
X200292Y182704D01*
X185827Y183043D02*
X196646Y193862D01*
X185827Y180259D02*
X200615Y195047D01*
X185827Y192781D02*
X195200Y183408D01*
X185827Y189997D02*
X193779Y182045D01*
X185827Y166340D02*
X200862Y181375D01*
X185827Y169123D02*
X196354Y179650D01*
X185827Y174691D02*
X195094Y183959D01*
X185827Y171907D02*
X194156Y180237D01*
X197117Y121952D02*
X231102Y155938D01*
X195215Y122834D02*
X231102Y158721D01*
X201011Y123063D02*
X231102Y153154D01*
X185827Y153806D02*
X215872Y123762D01*
X185827Y156590D02*
X218336Y124081D01*
X185827Y151023D02*
X214527Y122323D01*
X185827Y116230D02*
X231102Y161505D01*
X185827Y162158D02*
X231102Y116883D01*
X185827Y159374D02*
X231102Y114099D01*
X185827Y119014D02*
X231102Y164289D01*
X202262Y121529D02*
X231102Y150370D01*
X185827Y173294D02*
X231102Y128018D01*
X185827Y130149D02*
X231102Y175425D01*
X185827Y127365D02*
X231102Y172641D01*
X185827Y132933D02*
X231102Y178209D01*
X185827Y178861D02*
X231102Y133586D01*
X185827Y176078D02*
X231102Y130802D01*
X185827Y121798D02*
X231102Y167073D01*
X185827Y167726D02*
X231102Y122450D01*
X185827Y164942D02*
X231102Y119667D01*
X185827Y170510D02*
X231102Y125234D01*
X185827Y124581D02*
X231102Y169857D01*
X202262Y121529D02*
X231102Y150370D01*
X203884Y119213D02*
X212911D01*
X204526Y117008D02*
X205676D01*
X204678Y115594D02*
X205532Y116448D01*
X204655Y115491D02*
X207155Y112991D01*
X202751Y105315D02*
X205979Y108543D01*
X203416Y113946D02*
X205249Y112114D01*
X185827Y145455D02*
X208959Y122323D01*
X185827Y148239D02*
X211743Y122323D01*
X185827Y142671D02*
X205319Y123179D01*
X202250Y120847D02*
X203884Y119213D01*
X197183Y105315D02*
X206273Y114405D01*
X185827Y125968D02*
X206480Y105315D01*
X185827D02*
X231102D01*
X196255Y118323D02*
X204945Y109634D01*
X199967Y105315D02*
X204779Y110127D01*
X203307Y119790D02*
X203549Y120032D01*
X197411Y119462D02*
X198475Y120527D01*
X197545Y119817D02*
X200248Y117114D01*
X200691Y119288D02*
X201662Y118316D01*
X185827Y137103D02*
X199808Y123122D01*
X185827Y139887D02*
X203449Y122265D01*
X185827Y134319D02*
X198416Y121730D01*
X185827Y128752D02*
X193126Y121452D01*
X185827Y131535D02*
X194620Y122742D01*
X185827Y113446D02*
X192914Y120533D01*
X186047Y105315D02*
X200009Y119276D01*
X185827Y123184D02*
X196636Y112374D01*
X186047Y105315D02*
X200009Y119276D01*
X185827Y105315D02*
Y198031D01*
Y120400D02*
X195283Y110943D01*
X199818Y110733D02*
X202829Y113745D01*
X198590Y112290D02*
X200691Y114391D01*
X199711Y109300D02*
X203696Y105315D01*
X198280Y107947D02*
X200912Y105315D01*
X185827Y117616D02*
X198128Y105315D01*
X185827Y107878D02*
X196286Y118337D01*
X185827Y114832D02*
X195344Y105315D01*
X185827Y110662D02*
X193796Y118631D01*
X185827Y112048D02*
X192560Y105315D01*
X191615D02*
X195414Y109114D01*
X188831Y105315D02*
X200047Y116531D01*
X194399Y105315D02*
X196971Y107887D01*
X185827Y109265D02*
X189776Y105315D01*
X185827Y106481D02*
X186992Y105315D01*
X200317Y121220D02*
X203428Y118110D01*
X212911D01*
X219072Y120855D02*
X219928D01*
X216547Y119961D02*
X218178D01*
X215287Y121221D02*
X216547Y119961D01*
X205118Y121221D02*
X215287D01*
X218178Y119961D02*
X219072Y120855D01*
X219928D02*
X220079Y121006D01*
X212911Y118110D02*
X214961Y116060D01*
D23*
X212985Y181957D02*
X213639Y181302D01*
X213826D01*
X202743Y181957D02*
X212985D01*
D25*
X217092Y196080D02*
X217927Y195245D01*
X217092Y197193D02*
X217927Y198028D01*
X219247Y184827D02*
X220082Y185662D01*
X219247Y183714D02*
X220082Y182879D01*
X217298D02*
X218133Y183714D01*
X217298Y185662D02*
X218133Y184827D01*
X215143Y195245D02*
X215979Y196080D01*
X215143Y198028D02*
X215979Y197193D01*
X213549Y190447D02*
X214384Y189612D01*
X213549Y191561D02*
X214384Y192396D01*
X207643Y196080D02*
X208478Y195245D01*
X207643Y197193D02*
X208478Y198028D01*
X205695D02*
X206530Y197193D01*
X205695Y195245D02*
X206530Y196080D01*
X212702Y185596D02*
X213538Y186431D01*
X210754D02*
X211589Y185596D01*
X212702Y184483D02*
X213538Y183647D01*
X206482Y186431D02*
X207317Y185596D01*
X208431D02*
X209266Y186431D01*
X217919Y122486D02*
X218754Y123321D01*
X215970D02*
X216805Y122486D01*
X218667Y115191D02*
X219502Y114356D01*
X218667Y116305D02*
X219502Y117140D01*
X217092Y110874D02*
X217927Y111709D01*
X216718Y114356D02*
X217553Y115191D01*
X217092Y109761D02*
X217927Y108926D01*
X212368Y115504D02*
X213203Y114668D01*
X206482Y114750D02*
X207317Y115585D01*
X210419Y114668D02*
X211254Y115504D01*
X208431Y115585D02*
X209266Y114750D01*
X215143Y111709D02*
X215979Y110874D01*
X212381Y111022D02*
X213216Y111857D01*
X210432D02*
X211267Y111022D01*
X210432Y109073D02*
X211267Y109908D01*
X215143Y108926D02*
X215979Y109761D01*
X212381Y109908D02*
X213216Y109073D01*
X207643Y111187D02*
X208478Y112022D01*
X205695D02*
X206530Y111187D01*
X205695Y109238D02*
X206530Y110073D01*
X207643D02*
X208478Y109238D01*
X202919Y197193D02*
X203754Y198028D01*
X202919Y196080D02*
X203754Y195245D01*
X202195Y185202D02*
X203030Y186038D01*
X200970Y198028D02*
X201805Y197193D01*
X197860Y196687D02*
X198695Y197523D01*
X195912D02*
X196747Y196687D01*
X200970Y195245D02*
X201805Y196080D01*
X195912Y194739D02*
X196747Y195574D01*
X197860D02*
X198695Y194739D01*
X195837Y186362D02*
X196672Y185527D01*
X202919Y115504D02*
X203754Y114668D01*
X195832Y121029D02*
X196668Y121864D01*
X193884D02*
X194719Y121029D01*
X193884Y119080D02*
X194719Y119916D01*
X195832D02*
X196668Y119080D01*
X200970Y114668D02*
X201805Y115504D01*
X200970Y117452D02*
X201805Y116617D01*
X196128Y111576D02*
X196963Y110741D01*
X198077D02*
X198912Y111576D01*
X196128Y108792D02*
X196963Y109627D01*
X198077D02*
X198912Y108792D01*
D26*
X200317Y121220D02*
D03*
X220079Y121006D02*
D03*
X205118Y121221D02*
D03*
X216535Y110318D02*
D03*
X207874Y190968D02*
D03*
X210401Y191004D02*
D03*
X195669Y181496D02*
D03*
X198031D02*
D03*
X197229Y184970D02*
D03*
X201638Y184646D02*
D03*
X216535Y196636D02*
D03*
X212992Y191004D02*
D03*
X207087Y196636D02*
D03*
X202362D02*
D03*
X197303Y196131D02*
D03*
X202743Y181957D02*
D03*
X213826Y181302D02*
D03*
X212146Y185039D02*
D03*
X218690Y184271D02*
D03*
X207874Y185039D02*
D03*
X202362Y116060D02*
D03*
X197520Y110184D02*
D03*
X207874Y116142D02*
D03*
X207087Y110630D02*
D03*
X211824Y110465D02*
D03*
X217362Y121929D02*
D03*
X218110Y115748D02*
D03*
X214961Y116060D02*
D03*
X211811D02*
D03*
X195276Y120472D02*
D03*
M02*
