ISO-10303-21;
HEADER;
FILE_DESCRIPTION(('STEP AP203'),'1');
FILE_NAME('Maxon EC-22 40W.stp','2022-09-01T20:00:26',(' '),(' '),'Spatial InterOp 3D',' ',' ');
FILE_SCHEMA(('CONFIG_CONTROL_DESIGN'));
ENDSEC;
DATA;
#1=DESIGN_CONTEXT('',#93,'design');
#2=APPLICATION_PROTOCOL_DEFINITION('INTERNATIONAL STANDARD','config_control_design',1994,#93);
#3=PRODUCT_CATEGORY_RELATIONSHIP('NONE','NONE',#94,#95);
#4=DATE_AND_TIME(#96,#97);
#5=DATE_TIME_ROLE('creation_date');
#6=DATE_TIME_ROLE('classification_date');
#7=PERSON_AND_ORGANIZATION_ROLE('creator');
#8=PERSON_AND_ORGANIZATION_ROLE('design_supplier');
#9=PERSON_AND_ORGANIZATION_ROLE('classification_officer');
#10=PERSON_AND_ORGANIZATION_ROLE('design_owner');
#11=APPROVAL_PERSON_ORGANIZATION(#98,#99,#100);
#12=APPROVAL_DATE_TIME(#4,#99);
#13=CC_DESIGN_APPROVAL(#99,(#101,#102,#103));
#14=CC_DESIGN_DATE_AND_TIME_ASSIGNMENT(#4,#5,(#103));
#15=CC_DESIGN_DATE_AND_TIME_ASSIGNMENT(#4,#6,(#101));
#16=CC_DESIGN_PERSON_AND_ORGANIZATION_ASSIGNMENT(#98,#10,(#104));
#17=CC_DESIGN_PERSON_AND_ORGANIZATION_ASSIGNMENT(#98,#7,(#103));
#18=CC_DESIGN_PERSON_AND_ORGANIZATION_ASSIGNMENT(#98,#7,(#102));
#19=CC_DESIGN_PERSON_AND_ORGANIZATION_ASSIGNMENT(#98,#8,(#102));
#20=CC_DESIGN_SECURITY_CLASSIFICATION(#101,(#102));
#21=CC_DESIGN_PERSON_AND_ORGANIZATION_ASSIGNMENT(#98,#9,(#101));
#22=SHAPE_DEFINITION_REPRESENTATION(#105,#106);
#23=DESIGN_CONTEXT('',#107,'design');
#24=APPLICATION_PROTOCOL_DEFINITION('INTERNATIONAL STANDARD','config_control_design',1994,#107);
#25=PRODUCT_CATEGORY_RELATIONSHIP('NONE','NONE',#108,#109);
#26=DATE_AND_TIME(#110,#111);
#27=DATE_TIME_ROLE('creation_date');
#28=DATE_TIME_ROLE('classification_date');
#29=PERSON_AND_ORGANIZATION_ROLE('creator');
#30=PERSON_AND_ORGANIZATION_ROLE('design_supplier');
#31=PERSON_AND_ORGANIZATION_ROLE('classification_officer');
#32=PERSON_AND_ORGANIZATION_ROLE('design_owner');
#33=APPROVAL_PERSON_ORGANIZATION(#112,#113,#114);
#34=APPROVAL_DATE_TIME(#26,#113);
#35=CC_DESIGN_APPROVAL(#113,(#115,#116,#117));
#36=CC_DESIGN_DATE_AND_TIME_ASSIGNMENT(#26,#27,(#117));
#37=CC_DESIGN_DATE_AND_TIME_ASSIGNMENT(#26,#28,(#115));
#38=CC_DESIGN_PERSON_AND_ORGANIZATION_ASSIGNMENT(#112,#32,(#118));
#39=CC_DESIGN_PERSON_AND_ORGANIZATION_ASSIGNMENT(#112,#29,(#117));
#40=CC_DESIGN_PERSON_AND_ORGANIZATION_ASSIGNMENT(#112,#29,(#116));
#41=CC_DESIGN_PERSON_AND_ORGANIZATION_ASSIGNMENT(#112,#30,(#116));
#42=CC_DESIGN_SECURITY_CLASSIFICATION(#115,(#116));
#43=CC_DESIGN_PERSON_AND_ORGANIZATION_ASSIGNMENT(#112,#31,(#115));
#44=CONTEXT_DEPENDENT_SHAPE_REPRESENTATION(#119,#120);
#45=SHAPE_DEFINITION_REPRESENTATION(#121,#122);
#46=SHAPE_REPRESENTATION_RELATIONSHIP('NONE','NONE',#122,#123);
#47=PROPERTY_DEFINITION_REPRESENTATION(#124,#125);
#48=GENERAL_PROPERTY_ASSOCIATION('','',#126,#124);
#49=PROPERTY_DEFINITION_REPRESENTATION(#127,#128);
#50=GENERAL_PROPERTY_ASSOCIATION('','',#129,#127);
#51=PROPERTY_DEFINITION_REPRESENTATION(#130,#131);
#52=GENERAL_PROPERTY_ASSOCIATION('','',#132,#130);
#53=DESIGN_CONTEXT('',#133,'design');
#54=APPLICATION_PROTOCOL_DEFINITION('INTERNATIONAL STANDARD','config_control_design',1994,#133);
#55=PRODUCT_CATEGORY_RELATIONSHIP('NONE','NONE',#134,#135);
#56=DATE_AND_TIME(#136,#137);
#57=DATE_TIME_ROLE('creation_date');
#58=DATE_TIME_ROLE('classification_date');
#59=PERSON_AND_ORGANIZATION_ROLE('creator');
#60=PERSON_AND_ORGANIZATION_ROLE('design_supplier');
#61=PERSON_AND_ORGANIZATION_ROLE('classification_officer');
#62=PERSON_AND_ORGANIZATION_ROLE('design_owner');
#63=APPROVAL_PERSON_ORGANIZATION(#138,#139,#140);
#64=APPROVAL_DATE_TIME(#56,#139);
#65=CC_DESIGN_APPROVAL(#139,(#141,#142,#143));
#66=CC_DESIGN_DATE_AND_TIME_ASSIGNMENT(#56,#57,(#143));
#67=CC_DESIGN_DATE_AND_TIME_ASSIGNMENT(#56,#58,(#141));
#68=CC_DESIGN_PERSON_AND_ORGANIZATION_ASSIGNMENT(#138,#62,(#144));
#69=CC_DESIGN_PERSON_AND_ORGANIZATION_ASSIGNMENT(#138,#59,(#143));
#70=CC_DESIGN_PERSON_AND_ORGANIZATION_ASSIGNMENT(#138,#59,(#142));
#71=CC_DESIGN_PERSON_AND_ORGANIZATION_ASSIGNMENT(#138,#60,(#142));
#72=CC_DESIGN_SECURITY_CLASSIFICATION(#141,(#142));
#73=CC_DESIGN_PERSON_AND_ORGANIZATION_ASSIGNMENT(#138,#61,(#141));
#74=CONTEXT_DEPENDENT_SHAPE_REPRESENTATION(#145,#146);
#75=SHAPE_DEFINITION_REPRESENTATION(#147,#148);
#76=SHAPE_REPRESENTATION_RELATIONSHIP('NONE','NONE',#148,#149);
#77=PROPERTY_DEFINITION_REPRESENTATION(#150,#151);
#78=GENERAL_PROPERTY_ASSOCIATION('','',#152,#150);
#79=PROPERTY_DEFINITION_REPRESENTATION(#153,#154);
#80=GENERAL_PROPERTY_ASSOCIATION('','',#155,#153);
#81=PROPERTY_DEFINITION_REPRESENTATION(#156,#157);
#82=GENERAL_PROPERTY_ASSOCIATION('','',#158,#156);
#83= (GEOMETRIC_REPRESENTATION_CONTEXT(3)GLOBAL_UNCERTAINTY_ASSIGNED_CONTEXT((#161))GLOBAL_UNIT_ASSIGNED_CONTEXT((#163,#164,#165))REPRESENTATION_CONTEXT('NONE','WORKSPACE'));
#84=PROPERTY_DEFINITION_REPRESENTATION(#167,#168);
#85=GENERAL_PROPERTY_ASSOCIATION('','',#169,#167);
#86=PROPERTY_DEFINITION_REPRESENTATION(#170,#171);
#87=GENERAL_PROPERTY_ASSOCIATION('','',#172,#170);
#88=PROPERTY_DEFINITION_REPRESENTATION(#173,#174);
#89=GENERAL_PROPERTY_ASSOCIATION('','',#175,#173);
#93=APPLICATION_CONTEXT('CONFIGURATION CONTROLLED 3D DESIGNS OF MECHANICAL PARTS AND ASSEMBLIES');
#94=PRODUCT_CATEGORY('part','NONE');
#95=PRODUCT_RELATED_PRODUCT_CATEGORY('detail',' ',(#104));
#96=CALENDAR_DATE(2022,1,8);
#97=LOCAL_TIME(17,0,26.0,#176);
#98=PERSON_AND_ORGANIZATION(#177,#178);
#99=APPROVAL(#179,'SOLID MODEL');
#100=APPROVAL_ROLE('APPROVED');
#101=SECURITY_CLASSIFICATION('','',#180);
#102=PRODUCT_DEFINITION_FORMATION_WITH_SPECIFIED_SOURCE('A','NONE',#104,.NOT_KNOWN.);
#103=PRODUCT_DEFINITION('Maxon EC-22 40W','Maxon EC-22 40W',#102,#1);
#104=PRODUCT('Maxon EC-22 40W','Maxon EC-22 40W','PART--DESC',(#181));
#105=PRODUCT_DEFINITION_SHAPE('NONE','NONE',#103);
#106=SHAPE_REPRESENTATION('Maxon EC-22 40W',(#182,#183,#184),#185);
#107=APPLICATION_CONTEXT('CONFIGURATION CONTROLLED 3D DESIGNS OF MECHANICAL PARTS AND ASSEMBLIES');
#108=PRODUCT_CATEGORY('part','NONE');
#109=PRODUCT_RELATED_PRODUCT_CATEGORY('detail',' ',(#118));
#110=CALENDAR_DATE(2022,1,8);
#111=LOCAL_TIME(17,0,26.0,#186);
#112=PERSON_AND_ORGANIZATION(#187,#188);
#113=APPROVAL(#189,'SOLID MODEL');
#114=APPROVAL_ROLE('APPROVED');
#115=SECURITY_CLASSIFICATION('','',#190);
#116=PRODUCT_DEFINITION_FORMATION_WITH_SPECIFIED_SOURCE('A','NONE',#118,.NOT_KNOWN.);
#117=PRODUCT_DEFINITION('Eixo do Motor','Eixo do Motor',#116,#23);
#118=PRODUCT('Eixo do Motor','p10','Eixo do Motor',(#191));
#119=(REPRESENTATION_RELATIONSHIP('','',#122,#106)REPRESENTATION_RELATIONSHIP_WITH_TRANSFORMATION(#194)SHAPE_REPRESENTATION_RELATIONSHIP());
#120=PRODUCT_DEFINITION_SHAPE('NAUO-PROD-DEF','NAUO-PROD-DEF',#196);
#121=PRODUCT_DEFINITION_SHAPE('NONE','NONE',#117);
#122=SHAPE_REPRESENTATION('Eixo do Motor',(#182),#185);
#123=ADVANCED_BREP_SHAPE_REPRESENTATION('',(#197),#83);
#124=PROPERTY_DEFINITION('PdmObjectId','',#117);
#125=REPRESENTATION('',(#198),#185);
#126=GENERAL_PROPERTY('','19_b70fef60-344e-44ce-883c-7e387b7bfa7a&2_21_0_2','');
#127=PROPERTY_DEFINITION('CreationDate','',#117);
#128=REPRESENTATION('',(#199),#185);
#129=GENERAL_PROPERTY('','24/08/2021 00:36:57','');
#130=PROPERTY_DEFINITION('Minor Revision','',#117);
#131=REPRESENTATION('',(#200),#185);
#132=GENERAL_PROPERTY('','0','');
#133=APPLICATION_CONTEXT('CONFIGURATION CONTROLLED 3D DESIGNS OF MECHANICAL PARTS AND ASSEMBLIES');
#134=PRODUCT_CATEGORY('part','NONE');
#135=PRODUCT_RELATED_PRODUCT_CATEGORY('detail',' ',(#144));
#136=CALENDAR_DATE(2022,1,8);
#137=LOCAL_TIME(17,0,26.0,#201);
#138=PERSON_AND_ORGANIZATION(#202,#203);
#139=APPROVAL(#204,'SOLID MODEL');
#140=APPROVAL_ROLE('APPROVED');
#141=SECURITY_CLASSIFICATION('','',#205);
#142=PRODUCT_DEFINITION_FORMATION_WITH_SPECIFIED_SOURCE('A','NONE',#144,.NOT_KNOWN.);
#143=PRODUCT_DEFINITION('Corpo do motor Maxon EC-22 40W','Corpo do motor Maxon EC-22 40W',#142,#53);
#144=PRODUCT('Corpo do motor Maxon EC-22 40W','p09','Corpo do motor Maxon EC-22 40W',(#206));
#145=(REPRESENTATION_RELATIONSHIP('','',#148,#106)REPRESENTATION_RELATIONSHIP_WITH_TRANSFORMATION(#209)SHAPE_REPRESENTATION_RELATIONSHIP());
#146=PRODUCT_DEFINITION_SHAPE('NAUO-PROD-DEF','NAUO-PROD-DEF',#211);
#147=PRODUCT_DEFINITION_SHAPE('NONE','NONE',#143);
#148=SHAPE_REPRESENTATION('Corpo do motor Maxon EC-22 40W',(#182),#185);
#149=ADVANCED_BREP_SHAPE_REPRESENTATION('',(#212),#83);
#150=PROPERTY_DEFINITION('PdmObjectId','',#143);
#151=REPRESENTATION('',(#213),#185);
#152=GENERAL_PROPERTY('','19_b70fef60-344e-44ce-883c-7e387b7bfa7a&2_20_0_6','');
#153=PROPERTY_DEFINITION('CreationDate','',#143);
#154=REPRESENTATION('',(#214),#185);
#155=GENERAL_PROPERTY('','24/08/2021 00:28:49','');
#156=PROPERTY_DEFINITION('Minor Revision','',#143);
#157=REPRESENTATION('',(#215),#185);
#158=GENERAL_PROPERTY('','1','');
#161=UNCERTAINTY_MEASURE_WITH_UNIT(LENGTH_MEASURE(0.001),#163,'','');
#163= (CONVERSION_BASED_UNIT('MILLIMETRE',#218)LENGTH_UNIT()NAMED_UNIT(#221));
#164= (NAMED_UNIT(#223)PLANE_ANGLE_UNIT()SI_UNIT($,.RADIAN.));
#165= (NAMED_UNIT(#223)SOLID_ANGLE_UNIT()SI_UNIT($,.STERADIAN.));
#167=PROPERTY_DEFINITION('PdmObjectId','',#103);
#168=REPRESENTATION('',(#229),#83);
#169=GENERAL_PROPERTY('','19_7683ec67-2c7c-47a4-b1d3-44d0ea5bc769&2_1_0_2','');
#170=PROPERTY_DEFINITION('CreationDate','',#103);
#171=REPRESENTATION('',(#230),#83);
#172=GENERAL_PROPERTY('','21/04/2022 15:54:53','');
#173=PROPERTY_DEFINITION('Minor Revision','',#103);
#174=REPRESENTATION('',(#231),#83);
#175=GENERAL_PROPERTY('','1','');
#176=COORDINATED_UNIVERSAL_TIME_OFFSET(3,0,.BEHIND.);
#177=PERSON('','UNSPECIFIED',$,$,$,$);
#178=ORGANIZATION('UNSPECIFIED','UNSPECIFIED','UNSPECIFIED');
#179=APPROVAL_STATUS('approved');
#180=SECURITY_CLASSIFICATION_LEVEL('unclassified');
#181=MECHANICAL_CONTEXT('',#93,'mechanical');
#182=AXIS2_PLACEMENT_3D('',#232,#233,#234);
#183=AXIS2_PLACEMENT_3D('',#235,#236,#237);
#184=AXIS2_PLACEMENT_3D('',#238,#239,#240);
#185= (GEOMETRIC_REPRESENTATION_CONTEXT(3)GLOBAL_UNCERTAINTY_ASSIGNED_CONTEXT((#243))GLOBAL_UNIT_ASSIGNED_CONTEXT((#245,#246,#247))REPRESENTATION_CONTEXT('NONE','WORKSPACE'));
#186=COORDINATED_UNIVERSAL_TIME_OFFSET(3,0,.BEHIND.);
#187=PERSON('','UNSPECIFIED',$,$,$,$);
#188=ORGANIZATION('UNSPECIFIED','UNSPECIFIED','UNSPECIFIED');
#189=APPROVAL_STATUS('approved');
#190=SECURITY_CLASSIFICATION_LEVEL('unclassified');
#191=MECHANICAL_CONTEXT('',#107,'mechanical');
#194=ITEM_DEFINED_TRANSFORMATION('','',#182,#183);
#196=NEXT_ASSEMBLY_USAGE_OCCURRENCE('Eixo do Motor <139>','Eixo do Motor <139>','Eixo do Motor <139>',#103,#117,$);
#197=MANIFOLD_SOLID_BREP('',#249);
#198=VALUE_REPRESENTATION_ITEM('19_b70fef60-344e-44ce-883c-7e387b7bfa7a&2_21_0_2',);
#199=VALUE_REPRESENTATION_ITEM('24/08/2021 00:36:57',);
#200=VALUE_REPRESENTATION_ITEM('0',);
#201=COORDINATED_UNIVERSAL_TIME_OFFSET(3,0,.BEHIND.);
#202=PERSON('','UNSPECIFIED',$,$,$,$);
#203=ORGANIZATION('UNSPECIFIED','UNSPECIFIED','UNSPECIFIED');
#204=APPROVAL_STATUS('approved');
#205=SECURITY_CLASSIFICATION_LEVEL('unclassified');
#206=MECHANICAL_CONTEXT('',#133,'mechanical');
#209=ITEM_DEFINED_TRANSFORMATION('','',#182,#184);
#211=NEXT_ASSEMBLY_USAGE_OCCURRENCE('Corpo do motor Maxon EC-22 40W <129>','Corpo do motor Maxon EC-22 40W <129>','Corpo do motor Maxon EC-22 40W <129>',#103,#143,$);
#212=MANIFOLD_SOLID_BREP('',#250);
#213=VALUE_REPRESENTATION_ITEM('19_b70fef60-344e-44ce-883c-7e387b7bfa7a&2_20_0_6',);
#214=VALUE_REPRESENTATION_ITEM('24/08/2021 00:28:49',);
#215=VALUE_REPRESENTATION_ITEM('1',);
#218=LENGTH_MEASURE_WITH_UNIT(LENGTH_MEASURE(1.0),#251);
#221=DIMENSIONAL_EXPONENTS(1.0,0.0,0.0,0.0,0.0,0.0,0.0);
#223=DIMENSIONAL_EXPONENTS(0.0,0.0,0.0,0.0,0.0,0.0,0.0);
#229=VALUE_REPRESENTATION_ITEM('19_7683ec67-2c7c-47a4-b1d3-44d0ea5bc769&2_1_0_2',);
#230=VALUE_REPRESENTATION_ITEM('21/04/2022 15:54:53',);
#231=VALUE_REPRESENTATION_ITEM('1',);
#232=CARTESIAN_POINT('',(0.0,0.0,0.0));
#233=DIRECTION('',(0.0,0.0,1.0));
#234=DIRECTION('',(1.0,0.0,0.0));
#235=CARTESIAN_POINT('',(4.8529175284549E-16,38.5,2.83290673461226E-16));
#236=DIRECTION('',(-0.381782407957448,2.37172752836163E-17,-0.92425223449782));
#237=DIRECTION('',(-0.92425223449782,1.17863612561775E-16,0.381782407957448));
#238=CARTESIAN_POINT('',(0.0,0.0,0.0));
#239=DIRECTION('',(0.0,0.0,1.0));
#240=DIRECTION('',(1.0,0.0,0.0));
#243=UNCERTAINTY_MEASURE_WITH_UNIT(LENGTH_MEASURE(0.001),#245,'','');
#245= (CONVERSION_BASED_UNIT('MILLIMETRE',#254)LENGTH_UNIT()NAMED_UNIT(#257));
#246= (NAMED_UNIT(#259)PLANE_ANGLE_UNIT()SI_UNIT($,.RADIAN.));
#247= (NAMED_UNIT(#259)SOLID_ANGLE_UNIT()SI_UNIT($,.STERADIAN.));
#249=CLOSED_SHELL('',(#265,#266,#267,#268,#269));
#250=CLOSED_SHELL('',(#270,#271,#272,#273,#274,#275,#276,#277,#278,#279,#280,#281,#282,#283,#284));
#251= (NAMED_UNIT(#221)LENGTH_UNIT()SI_UNIT(.MILLI.,.METRE.));
#254=LENGTH_MEASURE_WITH_UNIT(LENGTH_MEASURE(1.0),#286);
#257=DIMENSIONAL_EXPONENTS(1.0,0.0,0.0,0.0,0.0,0.0,0.0);
#259=DIMENSIONAL_EXPONENTS(0.0,0.0,0.0,0.0,0.0,0.0,0.0);
#265=ADVANCED_FACE('',(#287),#288,.T.);
#266=ADVANCED_FACE('',(#289,#290),#291,.T.);
#267=ADVANCED_FACE('',(#292),#293,.T.);
#268=ADVANCED_FACE('',(#294,#295),#296,.T.);
#269=ADVANCED_FACE('',(#297,#298),#299,.T.);
#270=ADVANCED_FACE('',(#300,#301),#302,.F.);
#271=ADVANCED_FACE('',(#303,#304),#305,.F.);
#272=ADVANCED_FACE('',(#306),#307,.T.);
#273=ADVANCED_FACE('',(#308),#309,.T.);
#274=ADVANCED_FACE('',(#310,#311,#312,#313,#314),#315,.T.);
#275=ADVANCED_FACE('',(#316,#317),#318,.T.);
#276=ADVANCED_FACE('',(#319,#320),#321,.T.);
#277=ADVANCED_FACE('',(#322,#323),#324,.T.);
#278=ADVANCED_FACE('',(#325,#326),#327,.F.);
#279=ADVANCED_FACE('',(#328,#329),#330,.T.);
#280=ADVANCED_FACE('',(#331,#332),#333,.F.);
#281=ADVANCED_FACE('',(#334,#335),#336,.F.);
#282=ADVANCED_FACE('',(#337,#338),#339,.F.);
#283=ADVANCED_FACE('',(#340,#341),#342,.F.);
#284=ADVANCED_FACE('',(#343,#344),#345,.F.);
#286= (NAMED_UNIT(#257)LENGTH_UNIT()SI_UNIT(.MILLI.,.METRE.));
#287=FACE_OUTER_BOUND('',#347,.T.);
#288=PLANE('',#348);
#289=FACE_OUTER_BOUND('',#349,.T.);
#290=FACE_OUTER_BOUND('',#350,.T.);
#291=CYLINDRICAL_SURFACE('',#351,1.5);
#292=FACE_OUTER_BOUND('',#352,.T.);
#293=PLANE('',#353);
#294=FACE_OUTER_BOUND('',#354,.T.);
#295=FACE_OUTER_BOUND('',#355,.T.);
#296=CYLINDRICAL_SURFACE('',#356,5.0);
#297=FACE_BOUND('',#357,.T.);
#298=FACE_OUTER_BOUND('',#358,.T.);
#299=PLANE('',#359);
#300=FACE_OUTER_BOUND('',#360,.T.);
#301=FACE_BOUND('',#361,.T.);
#302=CONICAL_SURFACE('',#362,866.025403784438,1.0471975511966);
#303=FACE_OUTER_BOUND('',#363,.T.);
#304=FACE_OUTER_BOUND('',#364,.T.);
#305=CYLINDRICAL_SURFACE('',#365,0.799999999999999);
#306=FACE_OUTER_BOUND('',#366,.T.);
#307=PLANE('',#367);
#308=FACE_OUTER_BOUND('',#368,.T.);
#309=PLANE('',#369);
#310=FACE_BOUND('',#370,.T.);
#311=FACE_BOUND('',#371,.T.);
#312=FACE_BOUND('',#372,.T.);
#313=FACE_BOUND('',#373,.T.);
#314=FACE_OUTER_BOUND('',#374,.T.);
#315=PLANE('',#375);
#316=FACE_OUTER_BOUND('',#376,.T.);
#317=FACE_OUTER_BOUND('',#377,.T.);
#318=CYLINDRICAL_SURFACE('',#378,5.0);
#319=FACE_OUTER_BOUND('',#379,.T.);
#320=FACE_OUTER_BOUND('',#380,.T.);
#321=CYLINDRICAL_SURFACE('',#381,11.0);
#322=FACE_BOUND('',#382,.T.);
#323=FACE_OUTER_BOUND('',#383,.T.);
#324=PLANE('',#384);
#325=FACE_OUTER_BOUND('',#385,.T.);
#326=FACE_OUTER_BOUND('',#386,.T.);
#327=CYLINDRICAL_SURFACE('',#387,1.5);
#328=FACE_OUTER_BOUND('',#388,.T.);
#329=FACE_BOUND('',#389,.T.);
#330=PLANE('',#390);
#331=FACE_OUTER_BOUND('',#391,.T.);
#332=FACE_OUTER_BOUND('',#392,.T.);
#333=CYLINDRICAL_SURFACE('',#393,5.0);
#334=FACE_OUTER_BOUND('',#394,.T.);
#335=FACE_OUTER_BOUND('',#395,.T.);
#336=CYLINDRICAL_SURFACE('',#396,0.8);
#337=FACE_OUTER_BOUND('',#397,.T.);
#338=FACE_BOUND('',#398,.T.);
#339=CONICAL_SURFACE('',#399,866.025403784439,1.0471975511966);
#340=FACE_OUTER_BOUND('',#400,.T.);
#341=FACE_OUTER_BOUND('',#401,.T.);
#342=CYLINDRICAL_SURFACE('',#402,0.8);
#343=FACE_OUTER_BOUND('',#403,.T.);
#344=FACE_BOUND('',#404,.T.);
#345=CONICAL_SURFACE('',#405,866.025403784439,1.0471975511966);
#347=EDGE_LOOP('',(#406));
#348=AXIS2_PLACEMENT_3D('',#407,#408,#409);
#349=EDGE_LOOP('',(#410));
#350=EDGE_LOOP('',(#411));
#351=AXIS2_PLACEMENT_3D('',#412,#413,#414);
#352=EDGE_LOOP('',(#415));
#353=AXIS2_PLACEMENT_3D('',#416,#417,#418);
#354=EDGE_LOOP('',(#419));
#355=EDGE_LOOP('',(#420));
#356=AXIS2_PLACEMENT_3D('',#421,#422,#423);
#357=EDGE_LOOP('',(#424));
#358=EDGE_LOOP('',(#425));
#359=AXIS2_PLACEMENT_3D('',#426,#427,#428);
#360=EDGE_LOOP('',(#429));
#361=VERTEX_LOOP('',#430);
#362=AXIS2_PLACEMENT_3D('',#431,#432,#433);
#363=EDGE_LOOP('',(#434));
#364=EDGE_LOOP('',(#435));
#365=AXIS2_PLACEMENT_3D('',#436,#437,#438);
#366=EDGE_LOOP('',(#439));
#367=AXIS2_PLACEMENT_3D('',#440,#441,#442);
#368=EDGE_LOOP('',(#443));
#369=AXIS2_PLACEMENT_3D('',#444,#445,#446);
#370=EDGE_LOOP('',(#447));
#371=EDGE_LOOP('',(#448));
#372=EDGE_LOOP('',(#449));
#373=EDGE_LOOP('',(#450));
#374=EDGE_LOOP('',(#451));
#375=AXIS2_PLACEMENT_3D('',#452,#453,#454);
#376=EDGE_LOOP('',(#455));
#377=EDGE_LOOP('',(#456));
#378=AXIS2_PLACEMENT_3D('',#457,#458,#459);
#379=EDGE_LOOP('',(#460));
#380=EDGE_LOOP('',(#461));
#381=AXIS2_PLACEMENT_3D('',#462,#463,#464);
#382=EDGE_LOOP('',(#465));
#383=EDGE_LOOP('',(#466));
#384=AXIS2_PLACEMENT_3D('',#467,#468,#469);
#385=EDGE_LOOP('',(#470));
#386=EDGE_LOOP('',(#471));
#387=AXIS2_PLACEMENT_3D('',#472,#473,#474);
#388=EDGE_LOOP('',(#475));
#389=EDGE_LOOP('',(#476));
#390=AXIS2_PLACEMENT_3D('',#477,#478,#479);
#391=EDGE_LOOP('',(#480));
#392=EDGE_LOOP('',(#481));
#393=AXIS2_PLACEMENT_3D('',#482,#483,#484);
#394=EDGE_LOOP('',(#485));
#395=EDGE_LOOP('',(#486));
#396=AXIS2_PLACEMENT_3D('',#487,#488,#489);
#397=EDGE_LOOP('',(#490));
#398=VERTEX_LOOP('',#491);
#399=AXIS2_PLACEMENT_3D('',#492,#493,#494);
#400=EDGE_LOOP('',(#495));
#401=EDGE_LOOP('',(#496));
#402=AXIS2_PLACEMENT_3D('',#497,#498,#499);
#403=EDGE_LOOP('',(#500));
#404=VERTEX_LOOP('',#501);
#405=AXIS2_PLACEMENT_3D('',#502,#503,#504);
#406=ORIENTED_EDGE('',*,*,#505,.F.);
#407=CARTESIAN_POINT('',(0.75,17.3,0.0));
#408=DIRECTION('',(6.12303176911189E-17,1.0,0.0));
#409=DIRECTION('',(-1.0,6.12303176911189E-17,0.0));
#410=ORIENTED_EDGE('',*,*,#505,.T.);
#411=ORIENTED_EDGE('',*,*,#506,.F.);
#412=CARTESIAN_POINT('',(-7.46482682525279E-16,0.0,0.0));
#413=DIRECTION('',(-6.12303176911189E-17,-1.0,0.0));
#414=DIRECTION('',(1.0,-6.12303176911189E-17,0.0));
#415=ORIENTED_EDGE('',*,*,#507,.T.);
#416=CARTESIAN_POINT('',(2.5,-2.65544173850755E-32,0.0));
#417=DIRECTION('',(-6.12303176911189E-17,-1.0,0.0));
#418=DIRECTION('',(1.0,-6.12303176911189E-17,0.0));
#419=ORIENTED_EDGE('',*,*,#508,.T.);
#420=ORIENTED_EDGE('',*,*,#507,.F.);
#421=CARTESIAN_POINT('',(-7.46482682525279E-16,0.0,0.0));
#422=DIRECTION('',(-6.12303176911189E-17,-1.0,0.0));
#423=DIRECTION('',(1.0,-6.12303176911189E-17,0.0));
#424=ORIENTED_EDGE('',*,*,#506,.T.);
#425=ORIENTED_EDGE('',*,*,#508,.F.);
#426=CARTESIAN_POINT('',(3.25,2.0,0.0));
#427=DIRECTION('',(6.12303176911189E-17,1.0,0.0));
#428=DIRECTION('',(-1.0,6.12303176911189E-17,0.0));
#429=ORIENTED_EDGE('',*,*,#509,.F.);
#430=VERTEX_POINT('',#510);
#431=CARTESIAN_POINT('',(7.36121593216776,534.038119784648,-4.25));
#432=DIRECTION('',(6.12303176911189E-17,1.0,4.10865054802611E-33));
#433=DIRECTION('',(0.5,-3.06151588455595E-17,0.866025403784438));
#434=ORIENTED_EDGE('',*,*,#511,.T.);
#435=ORIENTED_EDGE('',*,*,#509,.T.);
#436=CARTESIAN_POINT('',(7.36121593216773,44.5,-4.25));
#437=DIRECTION('',(-6.12303176911189E-17,-1.0,0.0));
#438=DIRECTION('',(0.5,-3.06151588455595E-17,0.866025403784438));
#439=ORIENTED_EDGE('',*,*,#512,.F.);
#440=CARTESIAN_POINT('',(2.5,38.5,0.0));
#441=DIRECTION('',(6.12303176911189E-17,1.0,0.0));
#442=DIRECTION('',(-1.0,6.12303176911189E-17,0.0));
#443=ORIENTED_EDGE('',*,*,#513,.T.);
#444=CARTESIAN_POINT('',(5.5,3.36766747301154E-16,0.0));
#445=DIRECTION('',(-6.12303176911189E-17,-1.0,0.0));
#446=DIRECTION('',(1.0,-6.12303176911189E-17,0.0));
#447=ORIENTED_EDGE('',*,*,#511,.F.);
#448=ORIENTED_EDGE('',*,*,#514,.F.);
#449=ORIENTED_EDGE('',*,*,#515,.F.);
#450=ORIENTED_EDGE('',*,*,#516,.T.);
#451=ORIENTED_EDGE('',*,*,#517,.F.);
#452=CARTESIAN_POINT('',(8.0,44.5,0.0));
#453=DIRECTION('',(6.12303176911189E-17,1.0,0.0));
#454=DIRECTION('',(-1.0,6.12303176911189E-17,0.0));
#455=ORIENTED_EDGE('',*,*,#518,.T.);
#456=ORIENTED_EDGE('',*,*,#516,.F.);
#457=CARTESIAN_POINT('',(-1.17868361555404E-15,0.0,0.0));
#458=DIRECTION('',(-6.12303176911189E-17,-1.0,0.0));
#459=DIRECTION('',(1.0,-6.12303176911189E-17,0.0));
#460=ORIENTED_EDGE('',*,*,#517,.T.);
#461=ORIENTED_EDGE('',*,*,#513,.F.);
#462=CARTESIAN_POINT('',(-1.17868361555404E-15,0.0,0.0));
#463=DIRECTION('',(-6.12303176911189E-17,-1.0,0.0));
#464=DIRECTION('',(1.0,-6.12303176911189E-17,0.0));
#465=ORIENTED_EDGE('',*,*,#519,.T.);
#466=ORIENTED_EDGE('',*,*,#518,.F.);
#467=CARTESIAN_POINT('',(3.25,45.5,0.0));
#468=DIRECTION('',(6.12303176911189E-17,1.0,0.0));
#469=DIRECTION('',(-1.0,6.12303176911189E-17,0.0));
#470=ORIENTED_EDGE('',*,*,#520,.T.);
#471=ORIENTED_EDGE('',*,*,#519,.F.);
#472=CARTESIAN_POINT('',(-1.17868361555404E-15,0.0,0.0));
#473=DIRECTION('',(-6.12303176911189E-17,-1.0,0.0));
#474=DIRECTION('',(1.0,-6.12303176911189E-17,0.0));
#475=ORIENTED_EDGE('',*,*,#521,.T.);
#476=ORIENTED_EDGE('',*,*,#520,.F.);
#477=CARTESIAN_POINT('',(3.25,40.5,0.0));
#478=DIRECTION('',(-6.12303176911189E-17,-1.0,0.0));
#479=DIRECTION('',(1.0,-6.12303176911189E-17,0.0));
#480=ORIENTED_EDGE('',*,*,#512,.T.);
#481=ORIENTED_EDGE('',*,*,#521,.F.);
#482=CARTESIAN_POINT('',(-1.17868361555404E-15,0.0,0.0));
#483=DIRECTION('',(-6.12303176911189E-17,-1.0,0.0));
#484=DIRECTION('',(1.0,-6.12303176911189E-17,0.0));
#485=ORIENTED_EDGE('',*,*,#515,.T.);
#486=ORIENTED_EDGE('',*,*,#522,.T.);
#487=CARTESIAN_POINT('',(3.46944695195361E-15,44.5,8.5));
#488=DIRECTION('',(-6.12303176911189E-17,-1.0,0.0));
#489=DIRECTION('',(-1.0,6.12303176911189E-17,0.0));
#490=ORIENTED_EDGE('',*,*,#522,.F.);
#491=VERTEX_POINT('',#523);
#492=CARTESIAN_POINT('',(3.34440215482806E-14,534.038119784648,8.5));
#493=DIRECTION('',(6.12303176911189E-17,1.0,-0.0));
#494=DIRECTION('',(-1.0,6.12303176911189E-17,0.0));
#495=ORIENTED_EDGE('',*,*,#514,.T.);
#496=ORIENTED_EDGE('',*,*,#524,.T.);
#497=CARTESIAN_POINT('',(-7.36121593216773,44.5,-4.25));
#498=DIRECTION('',(-6.12303176911189E-17,-1.0,0.0));
#499=DIRECTION('',(0.5,-3.06151588455594E-17,-0.866025403784439));
#500=ORIENTED_EDGE('',*,*,#524,.F.);
#501=VERTEX_POINT('',#525);
#502=CARTESIAN_POINT('',(-7.3612159321677,534.038119784648,-4.25));
#503=DIRECTION('',(6.12303176911189E-17,1.0,-4.1086505480261E-33));
#504=DIRECTION('',(0.5,-3.06151588455594E-17,-0.866025403784439));
#505=EDGE_CURVE('',#526,#526,#527,.T.);
#506=EDGE_CURVE('',#528,#528,#529,.T.);
#507=EDGE_CURVE('',#530,#530,#531,.T.);
#508=EDGE_CURVE('',#532,#532,#533,.T.);
#509=EDGE_CURVE('',#534,#534,#535,.T.);
#510=CARTESIAN_POINT('',(7.36121593216773,34.0381197846483,-4.25));
#511=EDGE_CURVE('',#536,#536,#537,.T.);
#512=EDGE_CURVE('',#538,#538,#539,.T.);
#513=EDGE_CURVE('',#540,#540,#541,.T.);
#514=EDGE_CURVE('',#542,#542,#543,.T.);
#515=EDGE_CURVE('',#544,#544,#545,.T.);
#516=EDGE_CURVE('',#546,#546,#547,.T.);
#517=EDGE_CURVE('',#548,#548,#549,.T.);
#518=EDGE_CURVE('',#550,#550,#551,.T.);
#519=EDGE_CURVE('',#552,#552,#553,.T.);
#520=EDGE_CURVE('',#554,#554,#555,.T.);
#521=EDGE_CURVE('',#556,#556,#557,.T.);
#522=EDGE_CURVE('',#558,#558,#559,.T.);
#523=CARTESIAN_POINT('',(2.8288627027212E-15,34.0381197846483,8.5));
#524=EDGE_CURVE('',#560,#560,#561,.T.);
#525=CARTESIAN_POINT('',(-7.36121593216773,34.0381197846483,-4.25));
#526=VERTEX_POINT('',#562);
#527=CIRCLE('',#563,1.5);
#528=VERTEX_POINT('',#564);
#529=CIRCLE('',#565,1.5);
#530=VERTEX_POINT('',#566);
#531=CIRCLE('',#567,5.0);
#532=VERTEX_POINT('',#568);
#533=CIRCLE('',#569,5.0);
#534=VERTEX_POINT('',#570);
#535=CIRCLE('',#571,0.799999999999999);
#536=VERTEX_POINT('',#572);
#537=CIRCLE('',#573,0.799999999999999);
#538=VERTEX_POINT('',#574);
#539=CIRCLE('',#575,5.0);
#540=VERTEX_POINT('',#576);
#541=CIRCLE('',#577,11.0);
#542=VERTEX_POINT('',#578);
#543=CIRCLE('',#579,0.8);
#544=VERTEX_POINT('',#580);
#545=CIRCLE('',#581,0.8);
#546=VERTEX_POINT('',#582);
#547=CIRCLE('',#583,5.0);
#548=VERTEX_POINT('',#584);
#549=CIRCLE('',#585,11.0);
#550=VERTEX_POINT('',#586);
#551=CIRCLE('',#587,5.0);
#552=VERTEX_POINT('',#588);
#553=CIRCLE('',#589,1.5);
#554=VERTEX_POINT('',#590);
#555=CIRCLE('',#591,1.5);
#556=VERTEX_POINT('',#592);
#557=CIRCLE('',#593,5.0);
#558=VERTEX_POINT('',#594);
#559=CIRCLE('',#595,0.8);
#560=VERTEX_POINT('',#596);
#561=CIRCLE('',#597,0.8);
#562=CARTESIAN_POINT('',(1.5,17.3,0.0));
#563=AXIS2_PLACEMENT_3D('',#598,#599,#600);
#564=CARTESIAN_POINT('',(1.5,2.0,0.0));
#565=AXIS2_PLACEMENT_3D('',#601,#602,#603);
#566=CARTESIAN_POINT('',(5.0,9.86076131526265E-32,0.0));
#567=AXIS2_PLACEMENT_3D('',#604,#605,#606);
#568=CARTESIAN_POINT('',(5.0,2.0,0.0));
#569=AXIS2_PLACEMENT_3D('',#607,#608,#609);
#570=CARTESIAN_POINT('',(7.76121593216773,34.5,-3.55717967697245));
#571=AXIS2_PLACEMENT_3D('',#610,#611,#612);
#572=CARTESIAN_POINT('',(7.76121593216773,44.5,-3.55717967697245));
#573=AXIS2_PLACEMENT_3D('',#613,#614,#615);
#574=CARTESIAN_POINT('',(5.0,38.5,0.0));
#575=AXIS2_PLACEMENT_3D('',#616,#617,#618);
#576=CARTESIAN_POINT('',(11.0,1.97215226305253E-31,0.0));
#577=AXIS2_PLACEMENT_3D('',#619,#620,#621);
#578=CARTESIAN_POINT('',(-6.96121593216773,44.5,-4.94282032302755));
#579=AXIS2_PLACEMENT_3D('',#622,#623,#624);
#580=CARTESIAN_POINT('',(-0.799999999999997,44.5,8.5));
#581=AXIS2_PLACEMENT_3D('',#625,#626,#627);
#582=CARTESIAN_POINT('',(5.0,44.5,0.0));
#583=AXIS2_PLACEMENT_3D('',#628,#629,#630);
#584=CARTESIAN_POINT('',(11.0,44.5,0.0));
#585=AXIS2_PLACEMENT_3D('',#631,#632,#633);
#586=CARTESIAN_POINT('',(5.0,45.5,0.0));
#587=AXIS2_PLACEMENT_3D('',#634,#635,#636);
#588=CARTESIAN_POINT('',(1.5,45.5,0.0));
#589=AXIS2_PLACEMENT_3D('',#637,#638,#639);
#590=CARTESIAN_POINT('',(1.5,40.5,0.0));
#591=AXIS2_PLACEMENT_3D('',#640,#641,#642);
#592=CARTESIAN_POINT('',(5.0,40.5,0.0));
#593=AXIS2_PLACEMENT_3D('',#643,#644,#645);
#594=CARTESIAN_POINT('',(-0.799999999999997,34.5,8.5));
#595=AXIS2_PLACEMENT_3D('',#646,#647,#648);
#596=CARTESIAN_POINT('',(-6.96121593216773,34.5,-4.94282032302755));
#597=AXIS2_PLACEMENT_3D('',#649,#650,#651);
#598=CARTESIAN_POINT('',(3.12801813531077E-16,17.3,0.0));
#599=DIRECTION('',(-6.12303176911189E-17,-1.0,0.0));
#600=DIRECTION('',(1.0,-6.12303176911189E-17,0.0));
#601=CARTESIAN_POINT('',(-6.24022047143041E-16,2.0,0.0));
#602=DIRECTION('',(-6.12303176911189E-17,-1.0,0.0));
#603=DIRECTION('',(1.0,-6.12303176911189E-17,0.0));
#604=CARTESIAN_POINT('',(-7.46482682525279E-16,3.06151588455595E-16,0.0));
#605=DIRECTION('',(-6.12303176911189E-17,-1.0,0.0));
#606=DIRECTION('',(1.0,-6.12303176911189E-17,0.0));
#607=CARTESIAN_POINT('',(-6.24022047143041E-16,2.0,0.0));
#608=DIRECTION('',(-6.12303176911189E-17,-1.0,0.0));
#609=DIRECTION('',(1.0,-6.12303176911189E-17,0.0));
#610=CARTESIAN_POINT('',(7.36121593216773,34.5,-4.25));
#611=DIRECTION('',(-6.12303176911189E-17,-1.0,0.0));
#612=DIRECTION('',(0.5,-3.06151588455595E-17,0.866025403784438));
#613=CARTESIAN_POINT('',(7.36121593216773,44.5,-4.25));
#614=DIRECTION('',(6.12303176911189E-17,1.0,0.0));
#615=DIRECTION('',(0.5,-3.06151588455595E-17,0.866025403784438));
#616=CARTESIAN_POINT('',(1.17868361555404E-15,38.5,0.0));
#617=DIRECTION('',(-6.12303176911189E-17,-1.0,0.0));
#618=DIRECTION('',(1.0,-6.12303176911189E-17,0.0));
#619=CARTESIAN_POINT('',(-1.17868361555404E-15,6.73533494602308E-16,0.0));
#620=DIRECTION('',(-6.12303176911189E-17,-1.0,0.0));
#621=DIRECTION('',(1.0,-6.12303176911189E-17,0.0));
#622=CARTESIAN_POINT('',(-7.36121593216773,44.5,-4.25));
#623=DIRECTION('',(6.12303176911189E-17,1.0,0.0));
#624=DIRECTION('',(0.5,-3.06151588455594E-17,-0.866025403784439));
#625=CARTESIAN_POINT('',(3.46944695195361E-15,44.5,8.5));
#626=DIRECTION('',(6.12303176911189E-17,1.0,0.0));
#627=DIRECTION('',(-1.0,6.12303176911189E-17,0.0));
#628=CARTESIAN_POINT('',(1.54606552170075E-15,44.5,0.0));
#629=DIRECTION('',(-6.12303176911189E-17,-1.0,0.0));
#630=DIRECTION('',(1.0,-6.12303176911189E-17,0.0));
#631=CARTESIAN_POINT('',(1.54606552170075E-15,44.5,0.0));
#632=DIRECTION('',(-6.12303176911189E-17,-1.0,0.0));
#633=DIRECTION('',(1.0,-6.12303176911189E-17,0.0));
#634=CARTESIAN_POINT('',(1.60729583939187E-15,45.5,0.0));
#635=DIRECTION('',(-6.12303176911189E-17,-1.0,0.0));
#636=DIRECTION('',(1.0,-6.12303176911189E-17,0.0));
#637=CARTESIAN_POINT('',(1.60729583939187E-15,45.5,0.0));
#638=DIRECTION('',(-6.12303176911189E-17,-1.0,0.0));
#639=DIRECTION('',(1.0,-6.12303176911189E-17,0.0));
#640=CARTESIAN_POINT('',(1.30114425093628E-15,40.5,0.0));
#641=DIRECTION('',(-6.12303176911189E-17,-1.0,0.0));
#642=DIRECTION('',(1.0,-6.12303176911189E-17,0.0));
#643=CARTESIAN_POINT('',(1.30114425093628E-15,40.5,0.0));
#644=DIRECTION('',(-6.12303176911189E-17,-1.0,0.0));
#645=DIRECTION('',(1.0,-6.12303176911189E-17,0.0));
#646=CARTESIAN_POINT('',(2.85714377504243E-15,34.5,8.5));
#647=DIRECTION('',(-6.12303176911189E-17,-1.0,0.0));
#648=DIRECTION('',(-1.0,6.12303176911189E-17,0.0));
#649=CARTESIAN_POINT('',(-7.36121593216773,34.5,-4.25));
#650=DIRECTION('',(-6.12303176911189E-17,-1.0,0.0));
#651=DIRECTION('',(0.5,-3.06151588455594E-17,-0.866025403784439));
ENDSEC;
END-ISO-10303-21;
