ISO-10303-21;
HEADER;
FILE_DESCRIPTION(('STEP AP203'),'1');
FILE_NAME('lo.stp','2022-08-30T18:58:25',(' '),(' '),'Spatial InterOp 3D',' ',' ');
FILE_SCHEMA(('CONFIG_CONTROL_DESIGN'));
ENDSEC;
DATA;
#1=DESIGN_CONTEXT('',#33,'design');
#2=APPLICATION_PROTOCOL_DEFINITION('INTERNATIONAL STANDARD','config_control_design',1994,#33);
#3=PRODUCT_CATEGORY_RELATIONSHIP('NONE','NONE',#34,#35);
#4=DATE_AND_TIME(#36,#37);
#5=DATE_TIME_ROLE('creation_date');
#6=DATE_TIME_ROLE('classification_date');
#7=PERSON_AND_ORGANIZATION_ROLE('creator');
#8=PERSON_AND_ORGANIZATION_ROLE('design_supplier');
#9=PERSON_AND_ORGANIZATION_ROLE('classification_officer');
#10=PERSON_AND_ORGANIZATION_ROLE('design_owner');
#11=APPROVAL_PERSON_ORGANIZATION(#38,#39,#40);
#12=APPROVAL_DATE_TIME(#4,#39);
#13=CC_DESIGN_APPROVAL(#39,(#41,#42,#43));
#14=CC_DESIGN_DATE_AND_TIME_ASSIGNMENT(#4,#5,(#43));
#15=CC_DESIGN_DATE_AND_TIME_ASSIGNMENT(#4,#6,(#41));
#16=CC_DESIGN_PERSON_AND_ORGANIZATION_ASSIGNMENT(#38,#10,(#44));
#17=CC_DESIGN_PERSON_AND_ORGANIZATION_ASSIGNMENT(#38,#7,(#43));
#18=CC_DESIGN_PERSON_AND_ORGANIZATION_ASSIGNMENT(#38,#7,(#42));
#19=CC_DESIGN_PERSON_AND_ORGANIZATION_ASSIGNMENT(#38,#8,(#42));
#20=CC_DESIGN_SECURITY_CLASSIFICATION(#41,(#42));
#21=CC_DESIGN_PERSON_AND_ORGANIZATION_ASSIGNMENT(#38,#9,(#41));
#22=SHAPE_DEFINITION_REPRESENTATION(#45,#46);
#23= (GEOMETRIC_REPRESENTATION_CONTEXT(3)GLOBAL_UNCERTAINTY_ASSIGNED_CONTEXT((#49))GLOBAL_UNIT_ASSIGNED_CONTEXT((#51,#52,#53))REPRESENTATION_CONTEXT('NONE','WORKSPACE'));
#24=PROPERTY_DEFINITION_REPRESENTATION(#55,#56);
#25=GENERAL_PROPERTY_ASSOCIATION('','',#57,#55);
#26=PROPERTY_DEFINITION_REPRESENTATION(#58,#59);
#27=GENERAL_PROPERTY_ASSOCIATION('','',#60,#58);
#28=PROPERTY_DEFINITION_REPRESENTATION(#61,#62);
#29=GENERAL_PROPERTY_ASSOCIATION('','',#63,#61);
#33=APPLICATION_CONTEXT('CONFIGURATION CONTROLLED 3D DESIGNS OF MECHANICAL PARTS AND ASSEMBLIES');
#34=PRODUCT_CATEGORY('part','NONE');
#35=PRODUCT_RELATED_PRODUCT_CATEGORY('detail',' ',(#44));
#36=CALENDAR_DATE(2022,30,7);
#37=LOCAL_TIME(15,58,25.0,#64);
#38=PERSON_AND_ORGANIZATION(#65,#66);
#39=APPROVAL(#67,'SOLID MODEL');
#40=APPROVAL_ROLE('APPROVED');
#41=SECURITY_CLASSIFICATION('','',#68);
#42=PRODUCT_DEFINITION_FORMATION_WITH_SPECIFIED_SOURCE('A','NONE',#44,.NOT_KNOWN.);
#43=PRODUCT_DEFINITION('','NONE',#42,#1);
#44=PRODUCT('Emb\X2\00F4\X0\lo','','1',(#69));
#45=PRODUCT_DEFINITION_SHAPE('NONE','NONE',#43);
#46=ADVANCED_BREP_SHAPE_REPRESENTATION('1',(#70,#71),#23);
#49=UNCERTAINTY_MEASURE_WITH_UNIT(LENGTH_MEASURE(0.001),#51,'','');
#51= (CONVERSION_BASED_UNIT('MILLIMETRE',#74)LENGTH_UNIT()NAMED_UNIT(#77));
#52= (NAMED_UNIT(#79)PLANE_ANGLE_UNIT()SI_UNIT($,.RADIAN.));
#53= (NAMED_UNIT(#79)SOLID_ANGLE_UNIT()SI_UNIT($,.STERADIAN.));
#55=PROPERTY_DEFINITION('PdmObjectId','',#43);
#56=REPRESENTATION('',(#85),#23);
#57=GENERAL_PROPERTY('','19_2d33aa80-3400-4df2-88c1-bd50ab977ea6&2_59_0_3','');
#58=PROPERTY_DEFINITION('CreationDate','',#43);
#59=REPRESENTATION('',(#86),#23);
#60=GENERAL_PROPERTY('','31/03/2022 19:55:35','');
#61=PROPERTY_DEFINITION('Minor Revision','',#43);
#62=REPRESENTATION('',(#87),#23);
#63=GENERAL_PROPERTY('','3','');
#64=COORDINATED_UNIVERSAL_TIME_OFFSET(3,0,.BEHIND.);
#65=PERSON('','UNSPECIFIED',$,$,$,$);
#66=ORGANIZATION('UNSPECIFIED','UNSPECIFIED','UNSPECIFIED');
#67=APPROVAL_STATUS('approved');
#68=SECURITY_CLASSIFICATION_LEVEL('unclassified');
#69=MECHANICAL_CONTEXT('',#33,'mechanical');
#70=MANIFOLD_SOLID_BREP('1',#88);
#71=AXIS2_PLACEMENT_3D('',#89,#90,#91);
#74=LENGTH_MEASURE_WITH_UNIT(LENGTH_MEASURE(1.0),#92);
#77=DIMENSIONAL_EXPONENTS(1.0,0.0,0.0,0.0,0.0,0.0,0.0);
#79=DIMENSIONAL_EXPONENTS(0.0,0.0,0.0,0.0,0.0,0.0,0.0);
#85=VALUE_REPRESENTATION_ITEM('19_2d33aa80-3400-4df2-88c1-bd50ab977ea6&2_59_0_3',);
#86=VALUE_REPRESENTATION_ITEM('31/03/2022 19:55:35',);
#87=VALUE_REPRESENTATION_ITEM('3',);
#88=CLOSED_SHELL('',(#93,#94,#95,#96,#97,#98,#99,#100,#101,#102,#103,#104,#105,#106,#107,#108,#109,#110,#111,#112,#113,#114,#115,#116,#117,#118,#119,#120,#121,#122,#123));
#89=CARTESIAN_POINT('',(0.0,0.0,0.0));
#90=DIRECTION('',(0.0,0.0,1.0));
#91=DIRECTION('',(1.0,0.0,0.0));
#92= (NAMED_UNIT(#77)LENGTH_UNIT()SI_UNIT(.MILLI.,.METRE.));
#93=ADVANCED_FACE('',(#125,#126),#127,.T.);
#94=ADVANCED_FACE('',(#128),#129,.F.);
#95=ADVANCED_FACE('',(#130,#131),#132,.T.);
#96=ADVANCED_FACE('',(#133,#134),#135,.F.);
#97=ADVANCED_FACE('',(#136,#137),#138,.F.);
#98=ADVANCED_FACE('',(#139),#140,.T.);
#99=ADVANCED_FACE('',(#141),#142,.T.);
#100=ADVANCED_FACE('',(#143),#144,.T.);
#101=ADVANCED_FACE('',(#145),#146,.T.);
#102=ADVANCED_FACE('',(#147),#148,.F.);
#103=ADVANCED_FACE('',(#149),#150,.T.);
#104=ADVANCED_FACE('',(#151),#152,.T.);
#105=ADVANCED_FACE('',(#153),#154,.T.);
#106=ADVANCED_FACE('',(#155,#156),#157,.T.);
#107=ADVANCED_FACE('',(#158),#159,.T.);
#108=ADVANCED_FACE('',(#160),#161,.T.);
#109=ADVANCED_FACE('',(#162),#163,.T.);
#110=ADVANCED_FACE('',(#164),#165,.F.);
#111=ADVANCED_FACE('',(#166),#167,.F.);
#112=ADVANCED_FACE('',(#168),#169,.T.);
#113=ADVANCED_FACE('',(#170),#171,.T.);
#114=ADVANCED_FACE('',(#172),#173,.T.);
#115=ADVANCED_FACE('',(#174),#175,.F.);
#116=ADVANCED_FACE('',(#176),#177,.T.);
#117=ADVANCED_FACE('',(#178),#179,.F.);
#118=ADVANCED_FACE('',(#180),#181,.T.);
#119=ADVANCED_FACE('',(#182),#183,.F.);
#120=ADVANCED_FACE('',(#184),#185,.T.);
#121=ADVANCED_FACE('',(#186),#187,.F.);
#122=ADVANCED_FACE('',(#188,#189),#190,.T.);
#123=ADVANCED_FACE('',(#191),#192,.T.);
#125=FACE_BOUND('',#193,.T.);
#126=FACE_OUTER_BOUND('',#194,.T.);
#127=CONICAL_SURFACE('',#195,6.5,0.785398163397448);
#128=FACE_OUTER_BOUND('',#196,.T.);
#129=CYLINDRICAL_SURFACE('',#197,0.5);
#130=FACE_BOUND('',#198,.T.);
#131=FACE_OUTER_BOUND('',#199,.T.);
#132=PLANE('',#200);
#133=FACE_OUTER_BOUND('',#201,.T.);
#134=FACE_BOUND('',#202,.T.);
#135=PLANE('',#203);
#136=FACE_BOUND('',#204,.T.);
#137=FACE_OUTER_BOUND('',#205,.T.);
#138=PLANE('',#206);
#139=FACE_OUTER_BOUND('',#207,.T.);
#140=CYLINDRICAL_SURFACE('',#208,0.5);
#141=FACE_OUTER_BOUND('',#209,.T.);
#142=PLANE('',#210);
#143=FACE_OUTER_BOUND('',#211,.T.);
#144=CYLINDRICAL_SURFACE('',#212,5.9);
#145=FACE_OUTER_BOUND('',#213,.T.);
#146=PLANE('',#214);
#147=FACE_OUTER_BOUND('',#215,.T.);
#148=CYLINDRICAL_SURFACE('',#216,0.5);
#149=FACE_OUTER_BOUND('',#217,.T.);
#150=PLANE('',#218);
#151=FACE_OUTER_BOUND('',#219,.T.);
#152=CYLINDRICAL_SURFACE('',#220,5.9);
#153=FACE_OUTER_BOUND('',#221,.T.);
#154=PLANE('',#222);
#155=FACE_OUTER_BOUND('',#223,.T.);
#156=FACE_OUTER_BOUND('',#224,.T.);
#157=CYLINDRICAL_SURFACE('',#225,7.5);
#158=FACE_OUTER_BOUND('',#226,.T.);
#159=PLANE('',#227);
#160=FACE_OUTER_BOUND('',#228,.T.);
#161=CYLINDRICAL_SURFACE('',#229,0.5);
#162=FACE_OUTER_BOUND('',#230,.T.);
#163=CYLINDRICAL_SURFACE('',#231,0.5);
#164=FACE_OUTER_BOUND('',#232,.T.);
#165=CYLINDRICAL_SURFACE('',#233,0.5);
#166=FACE_OUTER_BOUND('',#234,.T.);
#167=CYLINDRICAL_SURFACE('',#235,0.5);
#168=FACE_OUTER_BOUND('',#236,.T.);
#169=PLANE('',#237);
#170=FACE_OUTER_BOUND('',#238,.T.);
#171=CYLINDRICAL_SURFACE('',#239,0.5);
#172=FACE_OUTER_BOUND('',#240,.T.);
#173=PLANE('',#241);
#174=FACE_OUTER_BOUND('',#242,.T.);
#175=PLANE('',#243);
#176=FACE_OUTER_BOUND('',#244,.T.);
#177=CYLINDRICAL_SURFACE('',#245,4.0);
#178=FACE_OUTER_BOUND('',#246,.T.);
#179=PLANE('',#247);
#180=FACE_OUTER_BOUND('',#248,.T.);
#181=PLANE('',#249);
#182=FACE_OUTER_BOUND('',#250,.T.);
#183=CYLINDRICAL_SURFACE('',#251,2.0);
#184=FACE_OUTER_BOUND('',#252,.T.);
#185=PLANE('',#253);
#186=FACE_OUTER_BOUND('',#254,.T.);
#187=CYLINDRICAL_SURFACE('',#255,2.0);
#188=FACE_BOUND('',#256,.T.);
#189=FACE_OUTER_BOUND('',#257,.T.);
#190=PLANE('',#258);
#191=FACE_OUTER_BOUND('',#259,.T.);
#192=CYLINDRICAL_SURFACE('',#260,4.0);
#193=EDGE_LOOP('',(#261));
#194=EDGE_LOOP('',(#262));
#195=AXIS2_PLACEMENT_3D('',#263,#264,#265);
#196=EDGE_LOOP('',(#266,#267,#268,#269));
#197=AXIS2_PLACEMENT_3D('',#270,#271,#272);
#198=EDGE_LOOP('',(#273,#274,#275,#276));
#199=EDGE_LOOP('',(#277,#278,#279,#280,#281));
#200=AXIS2_PLACEMENT_3D('',#282,#283,#284);
#201=EDGE_LOOP('',(#285,#286,#287,#288,#289,#290,#291,#292,#293,#294,#295,#296,#297,#298,#299,#300));
#202=EDGE_LOOP('',(#301,#302,#303,#304));
#203=AXIS2_PLACEMENT_3D('',#305,#306,#307);
#204=EDGE_LOOP('',(#308,#309,#310,#311,#312,#313,#314,#315,#316,#317,#318,#319,#320,#321,#322,#323));
#205=EDGE_LOOP('',(#324));
#206=AXIS2_PLACEMENT_3D('',#325,#326,#327);
#207=EDGE_LOOP('',(#328,#329,#330,#331));
#208=AXIS2_PLACEMENT_3D('',#332,#333,#334);
#209=EDGE_LOOP('',(#335,#336,#337,#338));
#210=AXIS2_PLACEMENT_3D('',#339,#340,#341);
#211=EDGE_LOOP('',(#342,#343,#344,#345));
#212=AXIS2_PLACEMENT_3D('',#346,#347,#348);
#213=EDGE_LOOP('',(#349,#350,#351,#352));
#214=AXIS2_PLACEMENT_3D('',#353,#354,#355);
#215=EDGE_LOOP('',(#356,#357,#358,#359));
#216=AXIS2_PLACEMENT_3D('',#360,#361,#362);
#217=EDGE_LOOP('',(#363,#364,#365,#366));
#218=AXIS2_PLACEMENT_3D('',#367,#368,#369);
#219=EDGE_LOOP('',(#370,#371,#372,#373));
#220=AXIS2_PLACEMENT_3D('',#374,#375,#376);
#221=EDGE_LOOP('',(#377,#378,#379,#380));
#222=AXIS2_PLACEMENT_3D('',#381,#382,#383);
#223=EDGE_LOOP('',(#384));
#224=EDGE_LOOP('',(#385));
#225=AXIS2_PLACEMENT_3D('',#386,#387,#388);
#226=EDGE_LOOP('',(#389,#390,#391,#392));
#227=AXIS2_PLACEMENT_3D('',#393,#394,#395);
#228=EDGE_LOOP('',(#396,#397,#398,#399));
#229=AXIS2_PLACEMENT_3D('',#400,#401,#402);
#230=EDGE_LOOP('',(#403,#404,#405,#406));
#231=AXIS2_PLACEMENT_3D('',#407,#408,#409);
#232=EDGE_LOOP('',(#410,#411,#412,#413));
#233=AXIS2_PLACEMENT_3D('',#414,#415,#416);
#234=EDGE_LOOP('',(#417,#418,#419,#420));
#235=AXIS2_PLACEMENT_3D('',#421,#422,#423);
#236=EDGE_LOOP('',(#424,#425,#426,#427));
#237=AXIS2_PLACEMENT_3D('',#428,#429,#430);
#238=EDGE_LOOP('',(#431,#432,#433,#434));
#239=AXIS2_PLACEMENT_3D('',#435,#436,#437);
#240=EDGE_LOOP('',(#438));
#241=AXIS2_PLACEMENT_3D('',#439,#440,#441);
#242=EDGE_LOOP('',(#442,#443,#444,#445));
#243=AXIS2_PLACEMENT_3D('',#446,#447,#448);
#244=EDGE_LOOP('',(#449,#450,#451,#452));
#245=AXIS2_PLACEMENT_3D('',#453,#454,#455);
#246=EDGE_LOOP('',(#456,#457,#458,#459));
#247=AXIS2_PLACEMENT_3D('',#460,#461,#462);
#248=EDGE_LOOP('',(#463,#464,#465,#466));
#249=AXIS2_PLACEMENT_3D('',#467,#468,#469);
#250=EDGE_LOOP('',(#470,#471,#472,#473));
#251=AXIS2_PLACEMENT_3D('',#474,#475,#476);
#252=EDGE_LOOP('',(#477,#478,#479,#480));
#253=AXIS2_PLACEMENT_3D('',#481,#482,#483);
#254=EDGE_LOOP('',(#484,#485,#486,#487));
#255=AXIS2_PLACEMENT_3D('',#488,#489,#490);
#256=EDGE_LOOP('',(#491,#492,#493,#494));
#257=EDGE_LOOP('',(#495,#496,#497,#498,#499));
#258=AXIS2_PLACEMENT_3D('',#500,#501,#502);
#259=EDGE_LOOP('',(#503,#504,#505,#506));
#260=AXIS2_PLACEMENT_3D('',#507,#508,#509);
#261=ORIENTED_EDGE('',*,*,#510,.F.);
#262=ORIENTED_EDGE('',*,*,#511,.F.);
#263=CARTESIAN_POINT('',(0.0,0.0,103.0));
#264=DIRECTION('',(-0.0,0.0,-1.0));
#265=DIRECTION('',(-1.0,0.0,0.0));
#266=ORIENTED_EDGE('',*,*,#512,.F.);
#267=ORIENTED_EDGE('',*,*,#513,.F.);
#268=ORIENTED_EDGE('',*,*,#514,.T.);
#269=ORIENTED_EDGE('',*,*,#515,.T.);
#270=CARTESIAN_POINT('',(-0.7,3.87667724561448,0.0));
#271=DIRECTION('',(0.0,0.0,1.0));
#272=DIRECTION('',(1.0,0.0,0.0));
#273=ORIENTED_EDGE('',*,*,#516,.T.);
#274=ORIENTED_EDGE('',*,*,#517,.T.);
#275=ORIENTED_EDGE('',*,*,#518,.T.);
#276=ORIENTED_EDGE('',*,*,#519,.T.);
#277=ORIENTED_EDGE('',*,*,#520,.T.);
#278=ORIENTED_EDGE('',*,*,#521,.T.);
#279=ORIENTED_EDGE('',*,*,#522,.T.);
#280=ORIENTED_EDGE('',*,*,#523,.T.);
#281=ORIENTED_EDGE('',*,*,#524,.T.);
#282=CARTESIAN_POINT('',(0.0,1.4,0.0));
#283=DIRECTION('',(1.22460635382238E-16,1.0,0.0));
#284=DIRECTION('',(1.0,-1.22460635382238E-16,0.0));
#285=ORIENTED_EDGE('',*,*,#525,.F.);
#286=ORIENTED_EDGE('',*,*,#514,.F.);
#287=ORIENTED_EDGE('',*,*,#526,.F.);
#288=ORIENTED_EDGE('',*,*,#527,.F.);
#289=ORIENTED_EDGE('',*,*,#528,.F.);
#290=ORIENTED_EDGE('',*,*,#529,.F.);
#291=ORIENTED_EDGE('',*,*,#530,.F.);
#292=ORIENTED_EDGE('',*,*,#531,.F.);
#293=ORIENTED_EDGE('',*,*,#532,.F.);
#294=ORIENTED_EDGE('',*,*,#533,.F.);
#295=ORIENTED_EDGE('',*,*,#534,.F.);
#296=ORIENTED_EDGE('',*,*,#535,.F.);
#297=ORIENTED_EDGE('',*,*,#536,.F.);
#298=ORIENTED_EDGE('',*,*,#537,.F.);
#299=ORIENTED_EDGE('',*,*,#538,.F.);
#300=ORIENTED_EDGE('',*,*,#539,.F.);
#301=ORIENTED_EDGE('',*,*,#540,.F.);
#302=ORIENTED_EDGE('',*,*,#541,.F.);
#303=ORIENTED_EDGE('',*,*,#520,.F.);
#304=ORIENTED_EDGE('',*,*,#542,.T.);
#305=CARTESIAN_POINT('',(-0.7,3.87667724561448,0.0));
#306=DIRECTION('',(0.0,0.0,1.0));
#307=DIRECTION('',(1.0,0.0,0.0));
#308=ORIENTED_EDGE('',*,*,#512,.T.);
#309=ORIENTED_EDGE('',*,*,#543,.T.);
#310=ORIENTED_EDGE('',*,*,#544,.T.);
#311=ORIENTED_EDGE('',*,*,#545,.T.);
#312=ORIENTED_EDGE('',*,*,#546,.T.);
#313=ORIENTED_EDGE('',*,*,#547,.T.);
#314=ORIENTED_EDGE('',*,*,#548,.T.);
#315=ORIENTED_EDGE('',*,*,#549,.T.);
#316=ORIENTED_EDGE('',*,*,#550,.T.);
#317=ORIENTED_EDGE('',*,*,#551,.T.);
#318=ORIENTED_EDGE('',*,*,#552,.T.);
#319=ORIENTED_EDGE('',*,*,#553,.T.);
#320=ORIENTED_EDGE('',*,*,#554,.T.);
#321=ORIENTED_EDGE('',*,*,#555,.T.);
#322=ORIENTED_EDGE('',*,*,#556,.T.);
#323=ORIENTED_EDGE('',*,*,#557,.T.);
#324=ORIENTED_EDGE('',*,*,#558,.F.);
#325=CARTESIAN_POINT('',(0.0,0.0,100.0));
#326=DIRECTION('',(0.0,0.0,1.0));
#327=DIRECTION('',(1.0,0.0,0.0));
#328=ORIENTED_EDGE('',*,*,#544,.F.);
#329=ORIENTED_EDGE('',*,*,#559,.F.);
#330=ORIENTED_EDGE('',*,*,#539,.T.);
#331=ORIENTED_EDGE('',*,*,#560,.T.);
#332=CARTESIAN_POINT('',(-1.7,5.1254268114958,0.0));
#333=DIRECTION('',(0.0,0.0,1.0));
#334=DIRECTION('',(1.0,0.0,0.0));
#335=ORIENTED_EDGE('',*,*,#543,.F.);
#336=ORIENTED_EDGE('',*,*,#515,.F.);
#337=ORIENTED_EDGE('',*,*,#525,.T.);
#338=ORIENTED_EDGE('',*,*,#559,.T.);
#339=CARTESIAN_POINT('',(-1.2,4.57667724561447,0.0));
#340=DIRECTION('',(1.0,6.12303176911189E-17,0.0));
#341=DIRECTION('',(-6.12303176911189E-17,1.0,0.0));
#342=ORIENTED_EDGE('',*,*,#545,.F.);
#343=ORIENTED_EDGE('',*,*,#560,.F.);
#344=ORIENTED_EDGE('',*,*,#538,.T.);
#345=ORIENTED_EDGE('',*,*,#561,.T.);
#346=CARTESIAN_POINT('',(1.35525271560688E-17,2.40741243048404E-32,0.0));
#347=DIRECTION('',(0.0,0.0,1.0));
#348=DIRECTION('',(1.0,0.0,0.0));
#349=ORIENTED_EDGE('',*,*,#557,.F.);
#350=ORIENTED_EDGE('',*,*,#562,.F.);
#351=ORIENTED_EDGE('',*,*,#526,.T.);
#352=ORIENTED_EDGE('',*,*,#513,.T.);
#353=CARTESIAN_POINT('',(-6.7762635780344E-17,3.37667724561448,0.0));
#354=DIRECTION('',(-0.0,1.0,0.0));
#355=DIRECTION('',(1.0,0.0,0.0));
#356=ORIENTED_EDGE('',*,*,#556,.F.);
#357=ORIENTED_EDGE('',*,*,#563,.F.);
#358=ORIENTED_EDGE('',*,*,#527,.T.);
#359=ORIENTED_EDGE('',*,*,#562,.T.);
#360=CARTESIAN_POINT('',(0.7,3.87667724561448,0.0));
#361=DIRECTION('',(0.0,0.0,1.0));
#362=DIRECTION('',(1.0,0.0,0.0));
#363=ORIENTED_EDGE('',*,*,#549,.F.);
#364=ORIENTED_EDGE('',*,*,#564,.F.);
#365=ORIENTED_EDGE('',*,*,#534,.T.);
#366=ORIENTED_EDGE('',*,*,#565,.T.);
#367=CARTESIAN_POINT('',(-1.49077798716757E-16,-3.37667724561448,0.0));
#368=DIRECTION('',(0.0,-1.0,0.0));
#369=DIRECTION('',(0.0,0.0,-1.0));
#370=ORIENTED_EDGE('',*,*,#553,.F.);
#371=ORIENTED_EDGE('',*,*,#566,.F.);
#372=ORIENTED_EDGE('',*,*,#530,.T.);
#373=ORIENTED_EDGE('',*,*,#567,.T.);
#374=CARTESIAN_POINT('',(1.35525271560688E-17,2.40741243048404E-32,0.0));
#375=DIRECTION('',(0.0,0.0,1.0));
#376=DIRECTION('',(1.0,0.0,0.0));
#377=ORIENTED_EDGE('',*,*,#551,.F.);
#378=ORIENTED_EDGE('',*,*,#568,.F.);
#379=ORIENTED_EDGE('',*,*,#532,.T.);
#380=ORIENTED_EDGE('',*,*,#569,.T.);
#381=CARTESIAN_POINT('',(1.2,-4.57667724561447,0.0));
#382=DIRECTION('',(-1.0,-6.12303176911189E-17,0.0));
#383=DIRECTION('',(-6.12303176911189E-17,1.0,0.0));
#384=ORIENTED_EDGE('',*,*,#511,.T.);
#385=ORIENTED_EDGE('',*,*,#558,.T.);
#386=CARTESIAN_POINT('',(0.0,0.0,100.0));
#387=DIRECTION('',(0.0,0.0,1.0));
#388=DIRECTION('',(1.0,0.0,0.0));
#389=ORIENTED_EDGE('',*,*,#555,.F.);
#390=ORIENTED_EDGE('',*,*,#570,.F.);
#391=ORIENTED_EDGE('',*,*,#528,.T.);
#392=ORIENTED_EDGE('',*,*,#563,.T.);
#393=CARTESIAN_POINT('',(1.2,4.57667724561447,0.0));
#394=DIRECTION('',(-1.0,6.12303176911189E-17,0.0));
#395=DIRECTION('',(0.0,0.0,1.0));
#396=ORIENTED_EDGE('',*,*,#554,.F.);
#397=ORIENTED_EDGE('',*,*,#567,.F.);
#398=ORIENTED_EDGE('',*,*,#529,.T.);
#399=ORIENTED_EDGE('',*,*,#570,.T.);
#400=CARTESIAN_POINT('',(1.7,5.1254268114958,0.0));
#401=DIRECTION('',(0.0,0.0,1.0));
#402=DIRECTION('',(1.0,0.0,0.0));
#403=ORIENTED_EDGE('',*,*,#552,.F.);
#404=ORIENTED_EDGE('',*,*,#569,.F.);
#405=ORIENTED_EDGE('',*,*,#531,.T.);
#406=ORIENTED_EDGE('',*,*,#566,.T.);
#407=CARTESIAN_POINT('',(1.7,-5.1254268114958,0.0));
#408=DIRECTION('',(0.0,0.0,1.0));
#409=DIRECTION('',(1.0,0.0,0.0));
#410=ORIENTED_EDGE('',*,*,#550,.F.);
#411=ORIENTED_EDGE('',*,*,#565,.F.);
#412=ORIENTED_EDGE('',*,*,#533,.T.);
#413=ORIENTED_EDGE('',*,*,#568,.T.);
#414=CARTESIAN_POINT('',(0.7,-3.87667724561448,0.0));
#415=DIRECTION('',(0.0,0.0,1.0));
#416=DIRECTION('',(1.0,0.0,0.0));
#417=ORIENTED_EDGE('',*,*,#548,.F.);
#418=ORIENTED_EDGE('',*,*,#571,.F.);
#419=ORIENTED_EDGE('',*,*,#535,.T.);
#420=ORIENTED_EDGE('',*,*,#564,.T.);
#421=CARTESIAN_POINT('',(-0.7,-3.87667724561448,0.0));
#422=DIRECTION('',(0.0,0.0,1.0));
#423=DIRECTION('',(1.0,0.0,0.0));
#424=ORIENTED_EDGE('',*,*,#547,.F.);
#425=ORIENTED_EDGE('',*,*,#572,.F.);
#426=ORIENTED_EDGE('',*,*,#536,.T.);
#427=ORIENTED_EDGE('',*,*,#571,.T.);
#428=CARTESIAN_POINT('',(-1.2,-4.57667724561447,0.0));
#429=DIRECTION('',(1.0,-6.12303176911189E-17,0.0));
#430=DIRECTION('',(-6.12303176911189E-17,-1.0,0.0));
#431=ORIENTED_EDGE('',*,*,#546,.F.);
#432=ORIENTED_EDGE('',*,*,#561,.F.);
#433=ORIENTED_EDGE('',*,*,#537,.T.);
#434=ORIENTED_EDGE('',*,*,#572,.T.);
#435=CARTESIAN_POINT('',(-1.7,-5.1254268114958,0.0));
#436=DIRECTION('',(0.0,0.0,1.0));
#437=DIRECTION('',(1.0,0.0,0.0));
#438=ORIENTED_EDGE('',*,*,#510,.T.);
#439=CARTESIAN_POINT('',(0.0,0.0,103.0));
#440=DIRECTION('',(0.0,0.0,1.0));
#441=DIRECTION('',(1.0,0.0,0.0));
#442=ORIENTED_EDGE('',*,*,#573,.F.);
#443=ORIENTED_EDGE('',*,*,#574,.F.);
#444=ORIENTED_EDGE('',*,*,#521,.F.);
#445=ORIENTED_EDGE('',*,*,#541,.T.);
#446=CARTESIAN_POINT('',(4.0,1.4,-1.99999999993086));
#447=DIRECTION('',(-1.0,1.22460635382238E-16,6.12303176911189E-17));
#448=DIRECTION('',(-6.12303176911189E-17,7.4983036091107E-33,-1.0));
#449=ORIENTED_EDGE('',*,*,#575,.F.);
#450=ORIENTED_EDGE('',*,*,#522,.F.);
#451=ORIENTED_EDGE('',*,*,#574,.T.);
#452=ORIENTED_EDGE('',*,*,#576,.F.);
#453=CARTESIAN_POINT('',(1.5150393171712E-16,1.4,-4.0));
#454=DIRECTION('',(-1.22460635382238E-16,-1.0,0.0));
#455=DIRECTION('',(-1.0,1.22460635382238E-16,0.0));
#456=ORIENTED_EDGE('',*,*,#577,.F.);
#457=ORIENTED_EDGE('',*,*,#542,.F.);
#458=ORIENTED_EDGE('',*,*,#524,.F.);
#459=ORIENTED_EDGE('',*,*,#578,.T.);
#460=CARTESIAN_POINT('',(-4.0,1.4,-1.99999999992862));
#461=DIRECTION('',(1.0,-1.22460635382238E-16,-6.12303176911189E-17));
#462=DIRECTION('',(6.12303176911189E-17,-7.4983036091107E-33,1.0));
#463=ORIENTED_EDGE('',*,*,#579,.F.);
#464=ORIENTED_EDGE('',*,*,#580,.T.);
#465=ORIENTED_EDGE('',*,*,#581,.T.);
#466=ORIENTED_EDGE('',*,*,#517,.F.);
#467=CARTESIAN_POINT('',(-5.01768765426291E-16,-1.4,-7.0));
#468=DIRECTION('',(1.22460635382238E-16,0.0,1.0));
#469=DIRECTION('',(1.0,0.0,-1.22460635382238E-16));
#470=ORIENTED_EDGE('',*,*,#582,.F.);
#471=ORIENTED_EDGE('',*,*,#583,.T.);
#472=ORIENTED_EDGE('',*,*,#579,.T.);
#473=ORIENTED_EDGE('',*,*,#516,.F.);
#474=CARTESIAN_POINT('',(-0.75,-1.4,-5.0));
#475=DIRECTION('',(-0.0,1.0,0.0));
#476=DIRECTION('',(1.0,0.0,0.0));
#477=ORIENTED_EDGE('',*,*,#584,.F.);
#478=ORIENTED_EDGE('',*,*,#585,.T.);
#479=ORIENTED_EDGE('',*,*,#582,.T.);
#480=ORIENTED_EDGE('',*,*,#519,.F.);
#481=CARTESIAN_POINT('',(-2.51968584885632E-16,-1.4,-3.0));
#482=DIRECTION('',(0.0,0.0,-1.0));
#483=DIRECTION('',(-1.0,0.0,0.0));
#484=ORIENTED_EDGE('',*,*,#581,.F.);
#485=ORIENTED_EDGE('',*,*,#586,.T.);
#486=ORIENTED_EDGE('',*,*,#584,.T.);
#487=ORIENTED_EDGE('',*,*,#518,.F.);
#488=CARTESIAN_POINT('',(0.75,-1.4,-5.0));
#489=DIRECTION('',(-0.0,1.0,0.0));
#490=DIRECTION('',(1.0,0.0,0.0));
#491=ORIENTED_EDGE('',*,*,#586,.F.);
#492=ORIENTED_EDGE('',*,*,#580,.F.);
#493=ORIENTED_EDGE('',*,*,#583,.F.);
#494=ORIENTED_EDGE('',*,*,#585,.F.);
#495=ORIENTED_EDGE('',*,*,#587,.T.);
#496=ORIENTED_EDGE('',*,*,#576,.T.);
#497=ORIENTED_EDGE('',*,*,#573,.T.);
#498=ORIENTED_EDGE('',*,*,#540,.T.);
#499=ORIENTED_EDGE('',*,*,#577,.T.);
#500=CARTESIAN_POINT('',(0.0,-1.4,0.0));
#501=DIRECTION('',(0.0,-1.0,0.0));
#502=DIRECTION('',(0.0,0.0,-1.0));
#503=ORIENTED_EDGE('',*,*,#523,.F.);
#504=ORIENTED_EDGE('',*,*,#575,.T.);
#505=ORIENTED_EDGE('',*,*,#587,.F.);
#506=ORIENTED_EDGE('',*,*,#578,.F.);
#507=CARTESIAN_POINT('',(1.5150393171712E-16,1.4,-4.0));
#508=DIRECTION('',(-1.22460635382238E-16,-1.0,0.0));
#509=DIRECTION('',(-1.0,1.22460635382238E-16,0.0));
#510=EDGE_CURVE('',#588,#588,#589,.T.);
#511=EDGE_CURVE('',#590,#590,#591,.T.);
#512=EDGE_CURVE('',#592,#593,#594,.T.);
#513=EDGE_CURVE('',#595,#592,#596,.T.);
#514=EDGE_CURVE('',#595,#597,#598,.T.);
#515=EDGE_CURVE('',#597,#593,#599,.T.);
#516=EDGE_CURVE('',#600,#601,#602,.F.);
#517=EDGE_CURVE('',#601,#603,#604,.T.);
#518=EDGE_CURVE('',#603,#605,#606,.F.);
#519=EDGE_CURVE('',#605,#600,#607,.T.);
#520=EDGE_CURVE('',#608,#609,#610,.T.);
#521=EDGE_CURVE('',#609,#611,#612,.T.);
#522=EDGE_CURVE('',#611,#613,#614,.T.);
#523=EDGE_CURVE('',#613,#615,#616,.T.);
#524=EDGE_CURVE('',#615,#608,#617,.T.);
#525=EDGE_CURVE('',#597,#618,#619,.T.);
#526=EDGE_CURVE('',#620,#595,#621,.T.);
#527=EDGE_CURVE('',#622,#620,#623,.T.);
#528=EDGE_CURVE('',#624,#622,#625,.T.);
#529=EDGE_CURVE('',#626,#624,#627,.T.);
#530=EDGE_CURVE('',#628,#626,#629,.T.);
#531=EDGE_CURVE('',#630,#628,#631,.T.);
#532=EDGE_CURVE('',#632,#630,#633,.T.);
#533=EDGE_CURVE('',#634,#632,#635,.T.);
#534=EDGE_CURVE('',#636,#634,#637,.T.);
#535=EDGE_CURVE('',#638,#636,#639,.T.);
#536=EDGE_CURVE('',#640,#638,#641,.T.);
#537=EDGE_CURVE('',#642,#640,#643,.T.);
#538=EDGE_CURVE('',#644,#642,#645,.T.);
#539=EDGE_CURVE('',#618,#644,#646,.T.);
#540=EDGE_CURVE('',#647,#648,#649,.T.);
#541=EDGE_CURVE('',#609,#647,#650,.T.);
#542=EDGE_CURVE('',#608,#648,#651,.T.);
#543=EDGE_CURVE('',#593,#652,#653,.T.);
#544=EDGE_CURVE('',#652,#654,#655,.T.);
#545=EDGE_CURVE('',#654,#656,#657,.T.);
#546=EDGE_CURVE('',#656,#658,#659,.T.);
#547=EDGE_CURVE('',#658,#660,#661,.T.);
#548=EDGE_CURVE('',#660,#662,#663,.T.);
#549=EDGE_CURVE('',#662,#664,#665,.T.);
#550=EDGE_CURVE('',#664,#666,#667,.T.);
#551=EDGE_CURVE('',#666,#668,#669,.T.);
#552=EDGE_CURVE('',#668,#670,#671,.T.);
#553=EDGE_CURVE('',#670,#672,#673,.T.);
#554=EDGE_CURVE('',#672,#674,#675,.T.);
#555=EDGE_CURVE('',#674,#676,#677,.T.);
#556=EDGE_CURVE('',#676,#678,#679,.T.);
#557=EDGE_CURVE('',#678,#592,#680,.T.);
#558=EDGE_CURVE('',#681,#681,#682,.T.);
#559=EDGE_CURVE('',#618,#652,#683,.T.);
#560=EDGE_CURVE('',#644,#654,#684,.T.);
#561=EDGE_CURVE('',#642,#656,#685,.T.);
#562=EDGE_CURVE('',#620,#678,#686,.T.);
#563=EDGE_CURVE('',#622,#676,#687,.T.);
#564=EDGE_CURVE('',#636,#662,#688,.T.);
#565=EDGE_CURVE('',#634,#664,#689,.T.);
#566=EDGE_CURVE('',#628,#670,#690,.T.);
#567=EDGE_CURVE('',#626,#672,#691,.T.);
#568=EDGE_CURVE('',#632,#666,#692,.T.);
#569=EDGE_CURVE('',#630,#668,#693,.T.);
#570=EDGE_CURVE('',#624,#674,#694,.T.);
#571=EDGE_CURVE('',#638,#660,#695,.T.);
#572=EDGE_CURVE('',#640,#658,#696,.T.);
#573=EDGE_CURVE('',#697,#647,#698,.T.);
#574=EDGE_CURVE('',#611,#697,#699,.T.);
#575=EDGE_CURVE('',#613,#700,#701,.T.);
#576=EDGE_CURVE('',#700,#697,#702,.T.);
#577=EDGE_CURVE('',#648,#703,#704,.T.);
#578=EDGE_CURVE('',#615,#703,#705,.T.);
#579=EDGE_CURVE('',#706,#601,#707,.T.);
#580=EDGE_CURVE('',#706,#708,#709,.T.);
#581=EDGE_CURVE('',#708,#603,#710,.T.);
#582=EDGE_CURVE('',#711,#600,#712,.T.);
#583=EDGE_CURVE('',#711,#706,#713,.T.);
#584=EDGE_CURVE('',#714,#605,#715,.T.);
#585=EDGE_CURVE('',#714,#711,#716,.T.);
#586=EDGE_CURVE('',#708,#714,#717,.T.);
#587=EDGE_CURVE('',#703,#700,#718,.T.);
#588=VERTEX_POINT('',#719);
#589=CIRCLE('',#720,6.5);
#590=VERTEX_POINT('',#721);
#591=CIRCLE('',#722,7.5);
#592=VERTEX_POINT('',#723);
#593=VERTEX_POINT('',#724);
#594=CIRCLE('',#725,0.5);
#595=VERTEX_POINT('',#726);
#596=LINE('',#727,#728);
#597=VERTEX_POINT('',#729);
#598=CIRCLE('',#730,0.5);
#599=LINE('',#731,#732);
#600=VERTEX_POINT('',#733);
#601=VERTEX_POINT('',#734);
#602=CIRCLE('',#735,2.0);
#603=VERTEX_POINT('',#736);
#604=LINE('',#737,#738);
#605=VERTEX_POINT('',#739);
#606=CIRCLE('',#740,2.0);
#607=LINE('',#741,#742);
#608=VERTEX_POINT('',#743);
#609=VERTEX_POINT('',#744);
#610=LINE('',#745,#746);
#611=VERTEX_POINT('',#747);
#612=LINE('',#748,#749);
#613=VERTEX_POINT('',#750);
#614=CIRCLE('',#751,4.0);
#615=VERTEX_POINT('',#752);
#616=CIRCLE('',#753,4.0);
#617=LINE('',#754,#755);
#618=VERTEX_POINT('',#756);
#619=LINE('',#757,#758);
#620=VERTEX_POINT('',#759);
#621=LINE('',#760,#761);
#622=VERTEX_POINT('',#762);
#623=CIRCLE('',#763,0.5);
#624=VERTEX_POINT('',#764);
#625=LINE('',#765,#766);
#626=VERTEX_POINT('',#767);
#627=CIRCLE('',#768,0.5);
#628=VERTEX_POINT('',#769);
#629=CIRCLE('',#770,5.9);
#630=VERTEX_POINT('',#771);
#631=CIRCLE('',#772,0.5);
#632=VERTEX_POINT('',#773);
#633=LINE('',#774,#775);
#634=VERTEX_POINT('',#776);
#635=CIRCLE('',#777,0.5);
#636=VERTEX_POINT('',#778);
#637=LINE('',#779,#780);
#638=VERTEX_POINT('',#781);
#639=CIRCLE('',#782,0.5);
#640=VERTEX_POINT('',#783);
#641=LINE('',#784,#785);
#642=VERTEX_POINT('',#786);
#643=CIRCLE('',#787,0.5);
#644=VERTEX_POINT('',#788);
#645=CIRCLE('',#789,5.9);
#646=CIRCLE('',#790,0.5);
#647=VERTEX_POINT('',#791);
#648=VERTEX_POINT('',#792);
#649=LINE('',#793,#794);
#650=LINE('',#795,#796);
#651=LINE('',#797,#798);
#652=VERTEX_POINT('',#799);
#653=LINE('',#800,#801);
#654=VERTEX_POINT('',#802);
#655=CIRCLE('',#803,0.5);
#656=VERTEX_POINT('',#804);
#657=CIRCLE('',#805,5.9);
#658=VERTEX_POINT('',#806);
#659=CIRCLE('',#807,0.5);
#660=VERTEX_POINT('',#808);
#661=LINE('',#809,#810);
#662=VERTEX_POINT('',#811);
#663=CIRCLE('',#812,0.5);
#664=VERTEX_POINT('',#813);
#665=LINE('',#814,#815);
#666=VERTEX_POINT('',#816);
#667=CIRCLE('',#817,0.5);
#668=VERTEX_POINT('',#818);
#669=LINE('',#819,#820);
#670=VERTEX_POINT('',#821);
#671=CIRCLE('',#822,0.5);
#672=VERTEX_POINT('',#823);
#673=CIRCLE('',#824,5.9);
#674=VERTEX_POINT('',#825);
#675=CIRCLE('',#826,0.5);
#676=VERTEX_POINT('',#827);
#677=LINE('',#828,#829);
#678=VERTEX_POINT('',#830);
#679=CIRCLE('',#831,0.5);
#680=LINE('',#832,#833);
#681=VERTEX_POINT('',#834);
#682=CIRCLE('',#835,7.5);
#683=LINE('',#836,#837);
#684=LINE('',#838,#839);
#685=LINE('',#840,#841);
#686=LINE('',#842,#843);
#687=LINE('',#844,#845);
#688=LINE('',#846,#847);
#689=LINE('',#848,#849);
#690=LINE('',#850,#851);
#691=LINE('',#852,#853);
#692=LINE('',#854,#855);
#693=LINE('',#856,#857);
#694=LINE('',#858,#859);
#695=LINE('',#860,#861);
#696=LINE('',#862,#863);
#697=VERTEX_POINT('',#864);
#698=LINE('',#865,#866);
#699=LINE('',#867,#868);
#700=VERTEX_POINT('',#869);
#701=LINE('',#870,#871);
#702=CIRCLE('',#872,4.0);
#703=VERTEX_POINT('',#873);
#704=LINE('',#874,#875);
#705=LINE('',#876,#877);
#706=VERTEX_POINT('',#878);
#707=LINE('',#879,#880);
#708=VERTEX_POINT('',#881);
#709=LINE('',#882,#883);
#710=LINE('',#884,#885);
#711=VERTEX_POINT('',#886);
#712=LINE('',#887,#888);
#713=CIRCLE('',#889,2.0);
#714=VERTEX_POINT('',#890);
#715=LINE('',#891,#892);
#716=LINE('',#893,#894);
#717=CIRCLE('',#895,2.0);
#718=CIRCLE('',#896,4.0);
#719=CARTESIAN_POINT('',(6.5,0.0,103.0));
#720=AXIS2_PLACEMENT_3D('',#897,#898,#899);
#721=CARTESIAN_POINT('',(7.5,-1.83697019872103E-15,102.0));
#722=AXIS2_PLACEMENT_3D('',#900,#901,#902);
#723=CARTESIAN_POINT('',(-0.7,3.37667724561448,100.0));
#724=CARTESIAN_POINT('',(-1.2,3.87667724561448,100.0));
#725=AXIS2_PLACEMENT_3D('',#903,#904,#905);
#726=CARTESIAN_POINT('',(-0.7,3.37667724561448,0.0));
#727=CARTESIAN_POINT('',(-0.7,3.37667724561448,0.0));
#728=VECTOR('',#906,1.0);
#729=CARTESIAN_POINT('',(-1.2,3.87667724561448,0.0));
#730=AXIS2_PLACEMENT_3D('',#907,#908,#909);
#731=CARTESIAN_POINT('',(-1.2,3.87667724561448,0.0));
#732=VECTOR('',#910,1.0);
#733=CARTESIAN_POINT('',(-0.75,1.4,-3.0));
#734=CARTESIAN_POINT('',(-0.75,1.4,-7.0));
#735=AXIS2_PLACEMENT_3D('',#911,#912,#913);
#736=CARTESIAN_POINT('',(0.75,1.4,-7.0));
#737=CARTESIAN_POINT('',(-8.57224447675664E-16,1.4,-7.0));
#738=VECTOR('',#914,1.0);
#739=CARTESIAN_POINT('',(0.75,1.4,-3.0));
#740=AXIS2_PLACEMENT_3D('',#915,#916,#917);
#741=CARTESIAN_POINT('',(0.0,1.4,-3.0));
#742=VECTOR('',#918,1.0);
#743=CARTESIAN_POINT('',(-4.0,1.4,0.0));
#744=CARTESIAN_POINT('',(4.0,1.4,0.0));
#745=CARTESIAN_POINT('',(0.0,1.4,0.0));
#746=VECTOR('',#919,1.0);
#747=CARTESIAN_POINT('',(4.0,1.4,-3.99999999986173));
#748=CARTESIAN_POINT('',(4.0,1.4,-1.99999999993086));
#749=VECTOR('',#920,1.0);
#750=CARTESIAN_POINT('',(-8.57224447675664E-17,1.4,-8.0));
#751=AXIS2_PLACEMENT_3D('',#921,#922,#923);
#752=CARTESIAN_POINT('',(-4.0,1.4,-3.99999999985726));
#753=AXIS2_PLACEMENT_3D('',#924,#925,#926);
#754=CARTESIAN_POINT('',(-4.0,1.4,-1.99999999992862));
#755=VECTOR('',#927,1.0);
#756=CARTESIAN_POINT('',(-1.2,5.1254268114958,0.0));
#757=CARTESIAN_POINT('',(-1.2,4.57667724561447,0.0));
#758=VECTOR('',#928,1.0);
#759=CARTESIAN_POINT('',(0.7,3.37667724561448,0.0));
#760=CARTESIAN_POINT('',(-6.7762635780344E-17,3.37667724561448,0.0));
#761=VECTOR('',#929,1.0);
#762=CARTESIAN_POINT('',(1.2,3.87667724561448,0.0));
#763=AXIS2_PLACEMENT_3D('',#930,#931,#932);
#764=CARTESIAN_POINT('',(1.2,5.1254268114958,0.0));
#765=CARTESIAN_POINT('',(1.2,4.57667724561447,0.0));
#766=VECTOR('',#933,1.0);
#767=CARTESIAN_POINT('',(1.85740740740741,5.60000336811578,0.0));
#768=AXIS2_PLACEMENT_3D('',#934,#935,#936);
#769=CARTESIAN_POINT('',(1.8574074074074,-5.60000336811578,0.0));
#770=AXIS2_PLACEMENT_3D('',#937,#938,#939);
#771=CARTESIAN_POINT('',(1.2,-5.1254268114958,0.0));
#772=AXIS2_PLACEMENT_3D('',#940,#941,#942);
#773=CARTESIAN_POINT('',(1.2,-3.87667724561448,0.0));
#774=CARTESIAN_POINT('',(1.2,-4.57667724561447,0.0));
#775=VECTOR('',#943,1.0);
#776=CARTESIAN_POINT('',(0.7,-3.37667724561448,0.0));
#777=AXIS2_PLACEMENT_3D('',#944,#945,#946);
#778=CARTESIAN_POINT('',(-0.7,-3.37667724561448,0.0));
#779=CARTESIAN_POINT('',(-1.49077798716757E-16,-3.37667724561448,0.0));
#780=VECTOR('',#947,1.0);
#781=CARTESIAN_POINT('',(-1.2,-3.87667724561448,0.0));
#782=AXIS2_PLACEMENT_3D('',#948,#949,#950);
#783=CARTESIAN_POINT('',(-1.2,-5.1254268114958,0.0));
#784=CARTESIAN_POINT('',(-1.2,-4.57667724561447,0.0));
#785=VECTOR('',#951,1.0);
#786=CARTESIAN_POINT('',(-1.85740740740741,-5.60000336811578,0.0));
#787=AXIS2_PLACEMENT_3D('',#952,#953,#954);
#788=CARTESIAN_POINT('',(-1.85740740740741,5.60000336811578,0.0));
#789=AXIS2_PLACEMENT_3D('',#955,#956,#957);
#790=AXIS2_PLACEMENT_3D('',#958,#959,#960);
#791=CARTESIAN_POINT('',(4.0,-1.4,0.0));
#792=CARTESIAN_POINT('',(-4.0,-1.4,0.0));
#793=CARTESIAN_POINT('',(0.0,-1.4,0.0));
#794=VECTOR('',#961,1.0);
#795=CARTESIAN_POINT('',(4.0,1.4,0.0));
#796=VECTOR('',#962,1.0);
#797=CARTESIAN_POINT('',(-4.0,1.4,0.0));
#798=VECTOR('',#963,1.0);
#799=CARTESIAN_POINT('',(-1.2,5.1254268114958,100.0));
#800=CARTESIAN_POINT('',(-1.2,4.57667724561447,100.0));
#801=VECTOR('',#964,1.0);
#802=CARTESIAN_POINT('',(-1.85740740740741,5.60000336811578,100.0));
#803=AXIS2_PLACEMENT_3D('',#965,#966,#967);
#804=CARTESIAN_POINT('',(-1.85740740740741,-5.60000336811578,100.0));
#805=AXIS2_PLACEMENT_3D('',#968,#969,#970);
#806=CARTESIAN_POINT('',(-1.2,-5.1254268114958,100.0));
#807=AXIS2_PLACEMENT_3D('',#971,#972,#973);
#808=CARTESIAN_POINT('',(-1.2,-3.87667724561448,100.0));
#809=CARTESIAN_POINT('',(-1.2,-4.57667724561447,100.0));
#810=VECTOR('',#974,1.0);
#811=CARTESIAN_POINT('',(-0.7,-3.37667724561448,100.0));
#812=AXIS2_PLACEMENT_3D('',#975,#976,#977);
#813=CARTESIAN_POINT('',(0.7,-3.37667724561448,100.0));
#814=CARTESIAN_POINT('',(-1.49077798716757E-16,-3.37667724561448,100.0));
#815=VECTOR('',#978,1.0);
#816=CARTESIAN_POINT('',(1.2,-3.87667724561448,100.0));
#817=AXIS2_PLACEMENT_3D('',#979,#980,#981);
#818=CARTESIAN_POINT('',(1.2,-5.1254268114958,100.0));
#819=CARTESIAN_POINT('',(1.2,-4.57667724561447,100.0));
#820=VECTOR('',#982,1.0);
#821=CARTESIAN_POINT('',(1.8574074074074,-5.60000336811578,100.0));
#822=AXIS2_PLACEMENT_3D('',#983,#984,#985);
#823=CARTESIAN_POINT('',(1.85740740740741,5.60000336811578,100.0));
#824=AXIS2_PLACEMENT_3D('',#986,#987,#988);
#825=CARTESIAN_POINT('',(1.2,5.1254268114958,100.0));
#826=AXIS2_PLACEMENT_3D('',#989,#990,#991);
#827=CARTESIAN_POINT('',(1.2,3.87667724561448,100.0));
#828=CARTESIAN_POINT('',(1.2,4.57667724561447,100.0));
#829=VECTOR('',#992,1.0);
#830=CARTESIAN_POINT('',(0.7,3.37667724561448,100.0));
#831=AXIS2_PLACEMENT_3D('',#993,#994,#995);
#832=CARTESIAN_POINT('',(-6.7762635780344E-17,3.37667724561448,100.0));
#833=VECTOR('',#996,1.0);
#834=CARTESIAN_POINT('',(7.5,0.0,100.0));
#835=AXIS2_PLACEMENT_3D('',#997,#998,#999);
#836=CARTESIAN_POINT('',(-1.2,5.1254268114958,0.0));
#837=VECTOR('',#1000,1.0);
#838=CARTESIAN_POINT('',(-1.85740740740741,5.60000336811578,0.0));
#839=VECTOR('',#1001,1.0);
#840=CARTESIAN_POINT('',(-1.85740740740741,-5.60000336811578,0.0));
#841=VECTOR('',#1002,1.0);
#842=CARTESIAN_POINT('',(0.7,3.37667724561448,0.0));
#843=VECTOR('',#1003,1.0);
#844=CARTESIAN_POINT('',(1.2,3.87667724561448,0.0));
#845=VECTOR('',#1004,1.0);
#846=CARTESIAN_POINT('',(-0.7,-3.37667724561448,0.0));
#847=VECTOR('',#1005,1.0);
#848=CARTESIAN_POINT('',(0.7,-3.37667724561448,0.0));
#849=VECTOR('',#1006,1.0);
#850=CARTESIAN_POINT('',(1.8574074074074,-5.60000336811578,0.0));
#851=VECTOR('',#1007,1.0);
#852=CARTESIAN_POINT('',(1.85740740740741,5.60000336811578,0.0));
#853=VECTOR('',#1008,1.0);
#854=CARTESIAN_POINT('',(1.2,-3.87667724561448,0.0));
#855=VECTOR('',#1009,1.0);
#856=CARTESIAN_POINT('',(1.2,-5.1254268114958,0.0));
#857=VECTOR('',#1010,1.0);
#858=CARTESIAN_POINT('',(1.2,5.1254268114958,0.0));
#859=VECTOR('',#1011,1.0);
#860=CARTESIAN_POINT('',(-1.2,-3.87667724561448,0.0));
#861=VECTOR('',#1012,1.0);
#862=CARTESIAN_POINT('',(-1.2,-5.1254268114958,0.0));
#863=VECTOR('',#1013,1.0);
#864=CARTESIAN_POINT('',(4.0,-1.4,-3.99999999986173));
#865=CARTESIAN_POINT('',(4.0,-1.4,-1.99999999993086));
#866=VECTOR('',#1014,1.0);
#867=CARTESIAN_POINT('',(4.0,1.4,-3.99999999986173));
#868=VECTOR('',#1015,1.0);
#869=CARTESIAN_POINT('',(8.57224447675664E-17,-1.4,-8.0));
#870=CARTESIAN_POINT('',(5.98228734540392E-17,-2.16840434497101E-16,-8.0));
#871=VECTOR('',#1016,1.0);
#872=AXIS2_PLACEMENT_3D('',#1017,#1018,#1019);
#873=CARTESIAN_POINT('',(-4.0,-1.4,-3.99999999985726));
#874=CARTESIAN_POINT('',(-4.0,-1.4,-1.99999999992862));
#875=VECTOR('',#1020,1.0);
#876=CARTESIAN_POINT('',(-4.0,1.4,-3.99999999985726));
#877=VECTOR('',#1021,1.0);
#878=CARTESIAN_POINT('',(-0.75,-1.4,-7.0));
#879=CARTESIAN_POINT('',(-0.75,-1.4,-7.0));
#880=VECTOR('',#1022,1.0);
#881=CARTESIAN_POINT('',(0.75,-1.4,-7.0));
#882=CARTESIAN_POINT('',(-5.01768765426291E-16,-1.4,-7.0));
#883=VECTOR('',#1023,1.0);
#884=CARTESIAN_POINT('',(0.75,-1.4,-7.0));
#885=VECTOR('',#1024,1.0);
#886=CARTESIAN_POINT('',(-0.75,-1.4,-3.0));
#887=CARTESIAN_POINT('',(-0.75,-1.4,-3.0));
#888=VECTOR('',#1025,1.0);
#889=AXIS2_PLACEMENT_3D('',#1026,#1027,#1028);
#890=CARTESIAN_POINT('',(0.75,-1.4,-3.0));
#891=CARTESIAN_POINT('',(0.75,-1.4,-3.0));
#892=VECTOR('',#1029,1.0);
#893=CARTESIAN_POINT('',(-2.51968584885632E-16,-1.4,-3.0));
#894=VECTOR('',#1030,1.0);
#895=AXIS2_PLACEMENT_3D('',#1031,#1032,#1033);
#896=AXIS2_PLACEMENT_3D('',#1034,#1035,#1036);
#897=CARTESIAN_POINT('',(0.0,0.0,103.0));
#898=DIRECTION('',(0.0,0.0,1.0));
#899=DIRECTION('',(1.0,0.0,0.0));
#900=CARTESIAN_POINT('',(0.0,0.0,102.0));
#901=DIRECTION('',(0.0,0.0,-1.0));
#902=DIRECTION('',(1.0,0.0,0.0));
#903=CARTESIAN_POINT('',(-0.7,3.87667724561448,100.0));
#904=DIRECTION('',(0.0,0.0,-1.0));
#905=DIRECTION('',(1.0,0.0,0.0));
#906=DIRECTION('',(0.0,0.0,1.0));
#907=CARTESIAN_POINT('',(-0.7,3.87667724561448,0.0));
#908=DIRECTION('',(0.0,0.0,-1.0));
#909=DIRECTION('',(1.0,0.0,0.0));
#910=DIRECTION('',(0.0,0.0,1.0));
#911=CARTESIAN_POINT('',(-0.75,1.4,-5.0));
#912=DIRECTION('',(1.22460635382238E-16,1.0,0.0));
#913=DIRECTION('',(-1.0,1.22460635382238E-16,0.0));
#914=DIRECTION('',(1.0,-1.22460635382238E-16,-1.22460635382238E-16));
#915=CARTESIAN_POINT('',(0.75,1.4,-5.0));
#916=DIRECTION('',(1.22460635382238E-16,1.0,0.0));
#917=DIRECTION('',(-1.0,1.22460635382238E-16,0.0));
#918=DIRECTION('',(-1.0,1.22460635382238E-16,0.0));
#919=DIRECTION('',(1.0,-1.22460635382238E-16,0.0));
#920=DIRECTION('',(-6.12303176911189E-17,7.4983036091107E-33,-1.0));
#921=CARTESIAN_POINT('',(1.5150393171712E-16,1.4,-4.0));
#922=DIRECTION('',(1.22460635382238E-16,1.0,0.0));
#923=DIRECTION('',(-1.0,1.22460635382238E-16,0.0));
#924=CARTESIAN_POINT('',(1.5150393171712E-16,1.4,-4.0));
#925=DIRECTION('',(1.22460635382238E-16,1.0,0.0));
#926=DIRECTION('',(-1.0,1.22460635382238E-16,0.0));
#927=DIRECTION('',(6.12303176911189E-17,-7.4983036091107E-33,1.0));
#928=DIRECTION('',(-6.12303176911189E-17,1.0,0.0));
#929=DIRECTION('',(-1.0,0.0,0.0));
#930=CARTESIAN_POINT('',(0.7,3.87667724561448,0.0));
#931=DIRECTION('',(0.0,0.0,-1.0));
#932=DIRECTION('',(1.0,0.0,0.0));
#933=DIRECTION('',(-6.12303176911189E-17,-1.0,0.0));
#934=CARTESIAN_POINT('',(1.7,5.1254268114958,0.0));
#935=DIRECTION('',(0.0,0.0,1.0));
#936=DIRECTION('',(1.0,0.0,0.0));
#937=CARTESIAN_POINT('',(1.35525271560688E-17,2.40741243048404E-32,0.0));
#938=DIRECTION('',(0.0,0.0,1.0));
#939=DIRECTION('',(1.0,0.0,0.0));
#940=CARTESIAN_POINT('',(1.7,-5.1254268114958,0.0));
#941=DIRECTION('',(0.0,0.0,1.0));
#942=DIRECTION('',(1.0,0.0,0.0));
#943=DIRECTION('',(6.12303176911189E-17,-1.0,0.0));
#944=CARTESIAN_POINT('',(0.7,-3.87667724561448,0.0));
#945=DIRECTION('',(0.0,0.0,-1.0));
#946=DIRECTION('',(1.0,0.0,0.0));
#947=DIRECTION('',(1.0,0.0,0.0));
#948=CARTESIAN_POINT('',(-0.7,-3.87667724561448,0.0));
#949=DIRECTION('',(0.0,0.0,-1.0));
#950=DIRECTION('',(1.0,0.0,0.0));
#951=DIRECTION('',(6.12303176911189E-17,1.0,0.0));
#952=CARTESIAN_POINT('',(-1.7,-5.1254268114958,0.0));
#953=DIRECTION('',(0.0,0.0,1.0));
#954=DIRECTION('',(1.0,0.0,0.0));
#955=CARTESIAN_POINT('',(1.35525271560688E-17,2.40741243048404E-32,0.0));
#956=DIRECTION('',(0.0,0.0,1.0));
#957=DIRECTION('',(1.0,0.0,0.0));
#958=CARTESIAN_POINT('',(-1.7,5.1254268114958,0.0));
#959=DIRECTION('',(0.0,0.0,1.0));
#960=DIRECTION('',(1.0,0.0,0.0));
#961=DIRECTION('',(-1.0,0.0,0.0));
#962=DIRECTION('',(-1.22460635382238E-16,-1.0,0.0));
#963=DIRECTION('',(-1.22460635382238E-16,-1.0,0.0));
#964=DIRECTION('',(-6.12303176911189E-17,1.0,0.0));
#965=CARTESIAN_POINT('',(-1.7,5.1254268114958,100.0));
#966=DIRECTION('',(0.0,0.0,1.0));
#967=DIRECTION('',(1.0,0.0,0.0));
#968=CARTESIAN_POINT('',(1.35525271560688E-17,2.40741243048404E-32,100.0));
#969=DIRECTION('',(0.0,0.0,1.0));
#970=DIRECTION('',(1.0,0.0,0.0));
#971=CARTESIAN_POINT('',(-1.7,-5.1254268114958,100.0));
#972=DIRECTION('',(0.0,0.0,1.0));
#973=DIRECTION('',(1.0,0.0,0.0));
#974=DIRECTION('',(6.12303176911189E-17,1.0,0.0));
#975=CARTESIAN_POINT('',(-0.7,-3.87667724561448,100.0));
#976=DIRECTION('',(0.0,0.0,-1.0));
#977=DIRECTION('',(1.0,0.0,0.0));
#978=DIRECTION('',(1.0,0.0,0.0));
#979=CARTESIAN_POINT('',(0.7,-3.87667724561448,100.0));
#980=DIRECTION('',(0.0,0.0,-1.0));
#981=DIRECTION('',(1.0,0.0,0.0));
#982=DIRECTION('',(6.12303176911189E-17,-1.0,0.0));
#983=CARTESIAN_POINT('',(1.7,-5.1254268114958,100.0));
#984=DIRECTION('',(0.0,0.0,1.0));
#985=DIRECTION('',(1.0,0.0,0.0));
#986=CARTESIAN_POINT('',(1.35525271560688E-17,2.40741243048404E-32,100.0));
#987=DIRECTION('',(0.0,0.0,1.0));
#988=DIRECTION('',(1.0,0.0,0.0));
#989=CARTESIAN_POINT('',(1.7,5.1254268114958,100.0));
#990=DIRECTION('',(0.0,0.0,1.0));
#991=DIRECTION('',(1.0,0.0,0.0));
#992=DIRECTION('',(-6.12303176911189E-17,-1.0,0.0));
#993=CARTESIAN_POINT('',(0.7,3.87667724561448,100.0));
#994=DIRECTION('',(0.0,0.0,-1.0));
#995=DIRECTION('',(1.0,0.0,0.0));
#996=DIRECTION('',(-1.0,0.0,0.0));
#997=CARTESIAN_POINT('',(0.0,0.0,100.0));
#998=DIRECTION('',(0.0,0.0,1.0));
#999=DIRECTION('',(1.0,0.0,0.0));
#1000=DIRECTION('',(0.0,0.0,1.0));
#1001=DIRECTION('',(0.0,0.0,1.0));
#1002=DIRECTION('',(0.0,0.0,1.0));
#1003=DIRECTION('',(0.0,0.0,1.0));
#1004=DIRECTION('',(0.0,0.0,1.0));
#1005=DIRECTION('',(0.0,0.0,1.0));
#1006=DIRECTION('',(0.0,0.0,1.0));
#1007=DIRECTION('',(0.0,0.0,1.0));
#1008=DIRECTION('',(0.0,0.0,1.0));
#1009=DIRECTION('',(0.0,0.0,1.0));
#1010=DIRECTION('',(0.0,0.0,1.0));
#1011=DIRECTION('',(0.0,0.0,1.0));
#1012=DIRECTION('',(0.0,0.0,1.0));
#1013=DIRECTION('',(0.0,0.0,1.0));
#1014=DIRECTION('',(6.12303176911189E-17,0.0,1.0));
#1015=DIRECTION('',(-1.22460635382238E-16,-1.0,0.0));
#1016=DIRECTION('',(-1.22460635382238E-16,-1.0,0.0));
#1017=CARTESIAN_POINT('',(-1.91385847353146E-16,-1.4,-4.0));
#1018=DIRECTION('',(0.0,-1.0,0.0));
#1019=DIRECTION('',(0.0,0.0,-1.0));
#1020=DIRECTION('',(-6.12303176911189E-17,0.0,-1.0));
#1021=DIRECTION('',(-1.22460635382238E-16,-1.0,0.0));
#1022=DIRECTION('',(0.0,1.0,0.0));
#1023=DIRECTION('',(1.0,0.0,-1.22460635382238E-16));
#1024=DIRECTION('',(0.0,1.0,0.0));
#1025=DIRECTION('',(0.0,1.0,0.0));
#1026=CARTESIAN_POINT('',(-0.75,-1.4,-5.0));
#1027=DIRECTION('',(0.0,-1.0,0.0));
#1028=DIRECTION('',(1.0,0.0,0.0));
#1029=DIRECTION('',(0.0,1.0,0.0));
#1030=DIRECTION('',(-1.0,0.0,0.0));
#1031=CARTESIAN_POINT('',(0.75,-1.4,-5.0));
#1032=DIRECTION('',(0.0,-1.0,0.0));
#1033=DIRECTION('',(1.0,0.0,0.0));
#1034=CARTESIAN_POINT('',(-1.91385847353146E-16,-1.4,-4.0));
#1035=DIRECTION('',(0.0,-1.0,0.0));
#1036=DIRECTION('',(0.0,0.0,-1.0));
ENDSEC;
END-ISO-10303-21;
