ISO-10303-21;
HEADER;
FILE_DESCRIPTION(('STEP AP203'),'1');
FILE_NAME('RBF22.P505-1 Hastes de Suporte.stp','2022-08-30T19:41:49',(' '),(' '),'Spatial InterOp 3D',' ',' ');
FILE_SCHEMA(('CONFIG_CONTROL_DESIGN'));
ENDSEC;
DATA;
#1=DESIGN_CONTEXT('',#33,'design');
#2=APPLICATION_PROTOCOL_DEFINITION('INTERNATIONAL STANDARD','config_control_design',1994,#33);
#3=PRODUCT_CATEGORY_RELATIONSHIP('NONE','NONE',#34,#35);
#4=DATE_AND_TIME(#36,#37);
#5=DATE_TIME_ROLE('creation_date');
#6=DATE_TIME_ROLE('classification_date');
#7=PERSON_AND_ORGANIZATION_ROLE('creator');
#8=PERSON_AND_ORGANIZATION_ROLE('design_supplier');
#9=PERSON_AND_ORGANIZATION_ROLE('classification_officer');
#10=PERSON_AND_ORGANIZATION_ROLE('design_owner');
#11=APPROVAL_PERSON_ORGANIZATION(#38,#39,#40);
#12=APPROVAL_DATE_TIME(#4,#39);
#13=CC_DESIGN_APPROVAL(#39,(#41,#42,#43));
#14=CC_DESIGN_DATE_AND_TIME_ASSIGNMENT(#4,#5,(#43));
#15=CC_DESIGN_DATE_AND_TIME_ASSIGNMENT(#4,#6,(#41));
#16=CC_DESIGN_PERSON_AND_ORGANIZATION_ASSIGNMENT(#38,#10,(#44));
#17=CC_DESIGN_PERSON_AND_ORGANIZATION_ASSIGNMENT(#38,#7,(#43));
#18=CC_DESIGN_PERSON_AND_ORGANIZATION_ASSIGNMENT(#38,#7,(#42));
#19=CC_DESIGN_PERSON_AND_ORGANIZATION_ASSIGNMENT(#38,#8,(#42));
#20=CC_DESIGN_SECURITY_CLASSIFICATION(#41,(#42));
#21=CC_DESIGN_PERSON_AND_ORGANIZATION_ASSIGNMENT(#38,#9,(#41));
#22=SHAPE_DEFINITION_REPRESENTATION(#45,#46);
#23= (GEOMETRIC_REPRESENTATION_CONTEXT(3)GLOBAL_UNCERTAINTY_ASSIGNED_CONTEXT((#49))GLOBAL_UNIT_ASSIGNED_CONTEXT((#51,#52,#53))REPRESENTATION_CONTEXT('NONE','WORKSPACE'));
#24=PROPERTY_DEFINITION_REPRESENTATION(#55,#56);
#25=GENERAL_PROPERTY_ASSOCIATION('','',#57,#55);
#26=PROPERTY_DEFINITION_REPRESENTATION(#58,#59);
#27=GENERAL_PROPERTY_ASSOCIATION('','',#60,#58);
#28=PROPERTY_DEFINITION_REPRESENTATION(#61,#62);
#29=GENERAL_PROPERTY_ASSOCIATION('','',#63,#61);
#33=APPLICATION_CONTEXT('CONFIGURATION CONTROLLED 3D DESIGNS OF MECHANICAL PARTS AND ASSEMBLIES');
#34=PRODUCT_CATEGORY('part','NONE');
#35=PRODUCT_RELATED_PRODUCT_CATEGORY('detail',' ',(#44));
#36=CALENDAR_DATE(2022,30,7);
#37=LOCAL_TIME(16,41,49.0,#64);
#38=PERSON_AND_ORGANIZATION(#65,#66);
#39=APPROVAL(#67,'SOLID MODEL');
#40=APPROVAL_ROLE('APPROVED');
#41=SECURITY_CLASSIFICATION('','',#68);
#42=PRODUCT_DEFINITION_FORMATION_WITH_SPECIFIED_SOURCE('A','NONE',#44,.NOT_KNOWN.);
#43=PRODUCT_DEFINITION('','NONE',#42,#1);
#44=PRODUCT('Hastes de Suporte','','1',(#69));
#45=PRODUCT_DEFINITION_SHAPE('NONE','NONE',#43);
#46=ADVANCED_BREP_SHAPE_REPRESENTATION('1',(#70,#71),#23);
#49=UNCERTAINTY_MEASURE_WITH_UNIT(LENGTH_MEASURE(0.001),#51,'','');
#51= (CONVERSION_BASED_UNIT('MILLIMETRE',#74)LENGTH_UNIT()NAMED_UNIT(#77));
#52= (NAMED_UNIT(#79)PLANE_ANGLE_UNIT()SI_UNIT($,.RADIAN.));
#53= (NAMED_UNIT(#79)SOLID_ANGLE_UNIT()SI_UNIT($,.STERADIAN.));
#55=PROPERTY_DEFINITION('PdmObjectId','',#43);
#56=REPRESENTATION('',(#85),#23);
#57=GENERAL_PROPERTY('','19_2d33aa80-3400-4df2-88c1-bd50ab977ea6&2_75_0_165','');
#58=PROPERTY_DEFINITION('CreationDate','',#43);
#59=REPRESENTATION('',(#86),#23);
#60=GENERAL_PROPERTY('','31/03/2022 19:56:31','');
#61=PROPERTY_DEFINITION('Minor Revision','',#43);
#62=REPRESENTATION('',(#87),#23);
#63=GENERAL_PROPERTY('','28','');
#64=COORDINATED_UNIVERSAL_TIME_OFFSET(3,0,.BEHIND.);
#65=PERSON('','UNSPECIFIED',$,$,$,$);
#66=ORGANIZATION('UNSPECIFIED','UNSPECIFIED','UNSPECIFIED');
#67=APPROVAL_STATUS('approved');
#68=SECURITY_CLASSIFICATION_LEVEL('unclassified');
#69=MECHANICAL_CONTEXT('',#33,'mechanical');
#70=MANIFOLD_SOLID_BREP('1',#88);
#71=AXIS2_PLACEMENT_3D('',#89,#90,#91);
#74=LENGTH_MEASURE_WITH_UNIT(LENGTH_MEASURE(1.0),#92);
#77=DIMENSIONAL_EXPONENTS(1.0,0.0,0.0,0.0,0.0,0.0,0.0);
#79=DIMENSIONAL_EXPONENTS(0.0,0.0,0.0,0.0,0.0,0.0,0.0);
#85=VALUE_REPRESENTATION_ITEM('19_2d33aa80-3400-4df2-88c1-bd50ab977ea6&2_75_0_165',);
#86=VALUE_REPRESENTATION_ITEM('31/03/2022 19:56:31',);
#87=VALUE_REPRESENTATION_ITEM('28',);
#88=CLOSED_SHELL('',(#93,#94,#95,#96,#97,#98,#99,#100,#101,#102,#103,#104));
#89=CARTESIAN_POINT('',(0.0,0.0,0.0));
#90=DIRECTION('',(0.0,0.0,1.0));
#91=DIRECTION('',(1.0,0.0,0.0));
#92= (NAMED_UNIT(#77)LENGTH_UNIT()SI_UNIT(.MILLI.,.METRE.));
#93=ADVANCED_FACE('',(#106,#107),#108,.F.);
#94=ADVANCED_FACE('',(#109,#110),#111,.T.);
#95=ADVANCED_FACE('',(#112,#113),#114,.F.);
#96=ADVANCED_FACE('',(#115,#116),#117,.T.);
#97=ADVANCED_FACE('',(#118,#119),#120,.T.);
#98=ADVANCED_FACE('',(#121,#122),#123,.T.);
#99=ADVANCED_FACE('',(#124,#125),#126,.T.);
#100=ADVANCED_FACE('',(#127,#128),#129,.T.);
#101=ADVANCED_FACE('',(#130,#131),#132,.T.);
#102=ADVANCED_FACE('',(#133,#134),#135,.T.);
#103=ADVANCED_FACE('',(#136),#137,.T.);
#104=ADVANCED_FACE('',(#138,#139),#140,.F.);
#106=FACE_OUTER_BOUND('',#141,.T.);
#107=FACE_BOUND('',#142,.T.);
#108=CONICAL_SURFACE('',#143,866.025403784438,1.0471975511966);
#109=FACE_BOUND('',#144,.T.);
#110=FACE_OUTER_BOUND('',#145,.T.);
#111=PLANE('',#146);
#112=FACE_OUTER_BOUND('',#147,.T.);
#113=FACE_OUTER_BOUND('',#148,.T.);
#114=CYLINDRICAL_SURFACE('',#149,1.25);
#115=FACE_OUTER_BOUND('',#150,.T.);
#116=FACE_OUTER_BOUND('',#151,.T.);
#117=CYLINDRICAL_SURFACE('',#152,4.0);
#118=FACE_BOUND('',#153,.T.);
#119=FACE_OUTER_BOUND('',#154,.T.);
#120=PLANE('',#155);
#121=FACE_OUTER_BOUND('',#156,.T.);
#122=FACE_OUTER_BOUND('',#157,.T.);
#123=CYLINDRICAL_SURFACE('',#158,5.0);
#124=FACE_BOUND('',#159,.T.);
#125=FACE_OUTER_BOUND('',#160,.T.);
#126=PLANE('',#161);
#127=FACE_OUTER_BOUND('',#162,.T.);
#128=FACE_OUTER_BOUND('',#163,.T.);
#129=CYLINDRICAL_SURFACE('',#164,3.0);
#130=FACE_BOUND('',#165,.T.);
#131=FACE_OUTER_BOUND('',#166,.T.);
#132=PLANE('',#167);
#133=FACE_OUTER_BOUND('',#168,.T.);
#134=FACE_OUTER_BOUND('',#169,.T.);
#135=CYLINDRICAL_SURFACE('',#170,1.5);
#136=FACE_OUTER_BOUND('',#171,.T.);
#137=PLANE('',#172);
#138=FACE_OUTER_BOUND('',#173,.T.);
#139=FACE_OUTER_BOUND('',#174,.T.);
#140=CYLINDRICAL_SURFACE('',#175,1.25);
#141=EDGE_LOOP('',(#176));
#142=VERTEX_LOOP('',#177);
#143=AXIS2_PLACEMENT_3D('',#178,#179,#180);
#144=EDGE_LOOP('',(#181));
#145=EDGE_LOOP('',(#182));
#146=AXIS2_PLACEMENT_3D('',#183,#184,#185);
#147=EDGE_LOOP('',(#186));
#148=EDGE_LOOP('',(#187));
#149=AXIS2_PLACEMENT_3D('',#188,#189,#190);
#150=EDGE_LOOP('',(#191));
#151=EDGE_LOOP('',(#192));
#152=AXIS2_PLACEMENT_3D('',#193,#194,#195);
#153=EDGE_LOOP('',(#196));
#154=EDGE_LOOP('',(#197));
#155=AXIS2_PLACEMENT_3D('',#198,#199,#200);
#156=EDGE_LOOP('',(#201));
#157=EDGE_LOOP('',(#202));
#158=AXIS2_PLACEMENT_3D('',#203,#204,#205);
#159=EDGE_LOOP('',(#206));
#160=EDGE_LOOP('',(#207));
#161=AXIS2_PLACEMENT_3D('',#208,#209,#210);
#162=EDGE_LOOP('',(#211));
#163=EDGE_LOOP('',(#212));
#164=AXIS2_PLACEMENT_3D('',#213,#214,#215);
#165=EDGE_LOOP('',(#216));
#166=EDGE_LOOP('',(#217));
#167=AXIS2_PLACEMENT_3D('',#218,#219,#220);
#168=EDGE_LOOP('',(#221));
#169=EDGE_LOOP('',(#222));
#170=AXIS2_PLACEMENT_3D('',#223,#224,#225);
#171=EDGE_LOOP('',(#226));
#172=AXIS2_PLACEMENT_3D('',#227,#228,#229);
#173=EDGE_LOOP('',(#230));
#174=EDGE_LOOP('',(#231));
#175=AXIS2_PLACEMENT_3D('',#232,#233,#234);
#176=ORIENTED_EDGE('',*,*,#235,.F.);
#177=VERTEX_POINT('',#236);
#178=CARTESIAN_POINT('',(1.38805785674693E-14,1.50539680888016E-18,524.128312163513));
#179=DIRECTION('',(5.73312241959216E-21,3.09257165174295E-21,1.0));
#180=DIRECTION('',(0.87987677964539,0.475201907236132,-6.51403723903618E-21));
#181=ORIENTED_EDGE('',*,*,#237,.F.);
#182=ORIENTED_EDGE('',*,*,#238,.T.);
#183=CARTESIAN_POINT('',(0.0,0.0,-41.5));
#184=DIRECTION('',(0.0,0.0,-1.0));
#185=DIRECTION('',(-1.0,0.0,0.0));
#186=ORIENTED_EDGE('',*,*,#239,.T.);
#187=ORIENTED_EDGE('',*,*,#235,.T.);
#188=CARTESIAN_POINT('',(1.38777742776455E-14,-7.29846909811335E-21,34.99));
#189=DIRECTION('',(-5.73312241959216E-21,-3.09257165174295E-21,-1.0));
#190=DIRECTION('',(0.87987677964539,0.475201907236132,-6.51403723903618E-21));
#191=ORIENTED_EDGE('',*,*,#240,.T.);
#192=ORIENTED_EDGE('',*,*,#238,.F.);
#193=CARTESIAN_POINT('',(0.0,0.0,-51.5));
#194=DIRECTION('',(0.0,0.0,1.0));
#195=DIRECTION('',(-1.0,0.0,0.0));
#196=ORIENTED_EDGE('',*,*,#240,.F.);
#197=ORIENTED_EDGE('',*,*,#241,.T.);
#198=CARTESIAN_POINT('',(0.0,0.0,-30.5));
#199=DIRECTION('',(0.0,0.0,-1.0));
#200=DIRECTION('',(-1.0,0.0,0.0));
#201=ORIENTED_EDGE('',*,*,#242,.T.);
#202=ORIENTED_EDGE('',*,*,#241,.F.);
#203=CARTESIAN_POINT('',(0.0,0.0,-30.5));
#204=DIRECTION('',(0.0,0.0,1.0));
#205=DIRECTION('',(-1.0,0.0,0.0));
#206=ORIENTED_EDGE('',*,*,#243,.T.);
#207=ORIENTED_EDGE('',*,*,#242,.F.);
#208=CARTESIAN_POINT('',(0.0,0.0,34.5));
#209=DIRECTION('',(0.0,0.0,1.0));
#210=DIRECTION('',(1.0,0.0,0.0));
#211=ORIENTED_EDGE('',*,*,#244,.F.);
#212=ORIENTED_EDGE('',*,*,#237,.T.);
#213=CARTESIAN_POINT('',(1.38777120062595E-14,-4.08890169913143E-20,-51.5));
#214=DIRECTION('',(0.0,0.0,-1.0));
#215=DIRECTION('',(-1.0,0.0,0.0));
#216=ORIENTED_EDGE('',*,*,#245,.F.);
#217=ORIENTED_EDGE('',*,*,#244,.T.);
#218=CARTESIAN_POINT('',(1.38777120062595E-14,-4.08890169913143E-20,-99.8));
#219=DIRECTION('',(0.0,0.0,-1.0));
#220=DIRECTION('',(-1.0,0.0,0.0));
#221=ORIENTED_EDGE('',*,*,#245,.T.);
#222=ORIENTED_EDGE('',*,*,#246,.F.);
#223=CARTESIAN_POINT('',(1.38777120062595E-14,-4.08890169913143E-20,-99.8));
#224=DIRECTION('',(0.0,0.0,-1.0));
#225=DIRECTION('',(-1.0,0.0,0.0));
#226=ORIENTED_EDGE('',*,*,#246,.T.);
#227=CARTESIAN_POINT('',(1.38777120062595E-14,-4.08890169913143E-20,-104.8));
#228=DIRECTION('',(0.0,0.0,-1.0));
#229=DIRECTION('',(-1.0,0.0,0.0));
#230=ORIENTED_EDGE('',*,*,#243,.F.);
#231=ORIENTED_EDGE('',*,*,#239,.F.);
#232=CARTESIAN_POINT('',(1.38777742776455E-14,-7.29846909811335E-21,34.99));
#233=DIRECTION('',(-5.73312241959216E-21,-3.09257165174295E-21,-1.0));
#234=DIRECTION('',(0.87987677964539,0.475201907236132,-6.51403723903618E-21));
#235=EDGE_CURVE('',#247,#247,#248,.T.);
#236=CARTESIAN_POINT('',(1.38777120062595E-14,-4.08890169913143E-20,24.1283121635129));
#237=EDGE_CURVE('',#249,#249,#250,.T.);
#238=EDGE_CURVE('',#251,#251,#252,.T.);
#239=EDGE_CURVE('',#253,#253,#254,.F.);
#240=EDGE_CURVE('',#255,#255,#256,.T.);
#241=EDGE_CURVE('',#257,#257,#258,.T.);
#242=EDGE_CURVE('',#259,#259,#260,.T.);
#243=EDGE_CURVE('',#261,#261,#262,.F.);
#244=EDGE_CURVE('',#263,#263,#264,.T.);
#245=EDGE_CURVE('',#265,#265,#266,.T.);
#246=EDGE_CURVE('',#267,#267,#268,.T.);
#247=VERTEX_POINT('',#269);
#248=CIRCLE('',#270,1.25);
#249=VERTEX_POINT('',#271);
#250=CIRCLE('',#272,3.0);
#251=VERTEX_POINT('',#273);
#252=CIRCLE('',#274,4.0);
#253=VERTEX_POINT('',#275);
#254=CIRCLE('',#276,1.25);
#255=VERTEX_POINT('',#277);
#256=CIRCLE('',#278,4.0);
#257=VERTEX_POINT('',#279);
#258=CIRCLE('',#280,5.0);
#259=VERTEX_POINT('',#281);
#260=CIRCLE('',#282,5.0);
#261=VERTEX_POINT('',#283);
#262=CIRCLE('',#284,1.25);
#263=VERTEX_POINT('',#285);
#264=CIRCLE('',#286,3.0);
#265=VERTEX_POINT('',#287);
#266=CIRCLE('',#288,1.5);
#267=VERTEX_POINT('',#289);
#268=CIRCLE('',#290,1.5);
#269=CARTESIAN_POINT('',(1.09984597455675,0.594002384045165,24.85));
#270=AXIS2_PLACEMENT_3D('',#291,#292,#293);
#271=CARTESIAN_POINT('',(-2.99999999999999,-4.08890169913143E-20,-41.5));
#272=AXIS2_PLACEMENT_3D('',#294,#295,#296);
#273=CARTESIAN_POINT('',(-4.0,0.0,-41.5));
#274=AXIS2_PLACEMENT_3D('',#297,#298,#299);
#275=CARTESIAN_POINT('',(1.09984597455675,0.594002384045163,27.35));
#276=AXIS2_PLACEMENT_3D('',#300,#301,#302);
#277=CARTESIAN_POINT('',(-4.0,0.0,-30.5));
#278=AXIS2_PLACEMENT_3D('',#303,#304,#305);
#279=CARTESIAN_POINT('',(-5.0,0.0,-30.5));
#280=AXIS2_PLACEMENT_3D('',#306,#307,#308);
#281=CARTESIAN_POINT('',(-5.0,0.0,34.5));
#282=AXIS2_PLACEMENT_3D('',#309,#310,#311);
#283=CARTESIAN_POINT('',(1.25000000000001,-3.06170513616046E-16,34.5));
#284=AXIS2_PLACEMENT_3D('',#312,#313,#314);
#285=CARTESIAN_POINT('',(-2.99999999999999,-4.08890169913143E-20,-99.8));
#286=AXIS2_PLACEMENT_3D('',#315,#316,#317);
#287=CARTESIAN_POINT('',(-1.49999999999999,-4.08890169913143E-20,-99.8));
#288=AXIS2_PLACEMENT_3D('',#318,#319,#320);
#289=CARTESIAN_POINT('',(-1.49999999999999,-4.08890169913143E-20,-104.8));
#290=AXIS2_PLACEMENT_3D('',#321,#322,#323);
#291=CARTESIAN_POINT('',(1.38777161437842E-14,-3.86571456467868E-20,24.85));
#292=DIRECTION('',(-5.73312241959216E-21,-3.09257165174295E-21,-1.0));
#293=DIRECTION('',(0.87987677964539,0.475201907236132,-6.51403723903618E-21));
#294=CARTESIAN_POINT('',(1.38777120062595E-14,-4.08890169913143E-20,-41.5));
#295=DIRECTION('',(0.0,0.0,-1.0));
#296=DIRECTION('',(-1.0,0.0,0.0));
#297=CARTESIAN_POINT('',(0.0,0.0,-41.5));
#298=DIRECTION('',(0.0,0.0,-1.0));
#299=DIRECTION('',(-1.0,0.0,0.0));
#300=CARTESIAN_POINT('',(1.38777304765903E-14,-3.09257165174294E-20,27.35));
#301=DIRECTION('',(-5.73312241959216E-21,-3.09257165174295E-21,-1.0));
#302=DIRECTION('',(-1.0,0.0,5.73312241959216E-21));
#303=CARTESIAN_POINT('',(0.0,0.0,-30.5));
#304=DIRECTION('',(0.0,0.0,-1.0));
#305=DIRECTION('',(-1.0,0.0,0.0));
#306=CARTESIAN_POINT('',(0.0,0.0,-30.5));
#307=DIRECTION('',(0.0,0.0,-1.0));
#308=DIRECTION('',(-1.0,0.0,0.0));
#309=CARTESIAN_POINT('',(0.0,0.0,34.5));
#310=DIRECTION('',(0.0,0.0,-1.0));
#311=DIRECTION('',(-1.0,0.0,0.0));
#312=CARTESIAN_POINT('',(1.38777714684156E-14,-8.81382920746739E-21,34.5));
#313=DIRECTION('',(0.0,0.0,1.0));
#314=DIRECTION('',(1.0,0.0,0.0));
#315=CARTESIAN_POINT('',(1.38777120062595E-14,-4.08890169913143E-20,-99.8));
#316=DIRECTION('',(0.0,0.0,-1.0));
#317=DIRECTION('',(-1.0,0.0,0.0));
#318=CARTESIAN_POINT('',(1.38777120062595E-14,-4.08890169913143E-20,-99.8));
#319=DIRECTION('',(0.0,0.0,-1.0));
#320=DIRECTION('',(-1.0,0.0,0.0));
#321=CARTESIAN_POINT('',(1.38777120062595E-14,-4.08890169913143E-20,-104.8));
#322=DIRECTION('',(0.0,0.0,-1.0));
#323=DIRECTION('',(-1.0,0.0,0.0));
ENDSEC;
END-ISO-10303-21;
