ISO-10303-21;
HEADER;
FILE_DESCRIPTION(('STEP AP203'),'1');
FILE_NAME('o das chapas inferiores dos capacitores.stp','2022-12-07T18:30:09',(' '),(' '),'Spatial InterOp 3D',' ',' ');
FILE_SCHEMA(('CONFIG_CONTROL_DESIGN'));
ENDSEC;
DATA;
#1=DESIGN_CONTEXT('',#33,'design');
#2=APPLICATION_PROTOCOL_DEFINITION('INTERNATIONAL STANDARD','config_control_design',1994,#33);
#3=PRODUCT_CATEGORY_RELATIONSHIP('NONE','NONE',#34,#35);
#4=DATE_AND_TIME(#36,#37);
#5=DATE_TIME_ROLE('creation_date');
#6=DATE_TIME_ROLE('classification_date');
#7=PERSON_AND_ORGANIZATION_ROLE('creator');
#8=PERSON_AND_ORGANIZATION_ROLE('design_supplier');
#9=PERSON_AND_ORGANIZATION_ROLE('classification_officer');
#10=PERSON_AND_ORGANIZATION_ROLE('design_owner');
#11=APPROVAL_PERSON_ORGANIZATION(#38,#39,#40);
#12=APPROVAL_DATE_TIME(#4,#39);
#13=CC_DESIGN_APPROVAL(#39,(#41,#42,#43));
#14=CC_DESIGN_DATE_AND_TIME_ASSIGNMENT(#4,#5,(#43));
#15=CC_DESIGN_DATE_AND_TIME_ASSIGNMENT(#4,#6,(#41));
#16=CC_DESIGN_PERSON_AND_ORGANIZATION_ASSIGNMENT(#38,#10,(#44));
#17=CC_DESIGN_PERSON_AND_ORGANIZATION_ASSIGNMENT(#38,#7,(#43));
#18=CC_DESIGN_PERSON_AND_ORGANIZATION_ASSIGNMENT(#38,#7,(#42));
#19=CC_DESIGN_PERSON_AND_ORGANIZATION_ASSIGNMENT(#38,#8,(#42));
#20=CC_DESIGN_SECURITY_CLASSIFICATION(#41,(#42));
#21=CC_DESIGN_PERSON_AND_ORGANIZATION_ASSIGNMENT(#38,#9,(#41));
#22=SHAPE_DEFINITION_REPRESENTATION(#45,#46);
#23= (GEOMETRIC_REPRESENTATION_CONTEXT(3)GLOBAL_UNCERTAINTY_ASSIGNED_CONTEXT((#49))GLOBAL_UNIT_ASSIGNED_CONTEXT((#51,#52,#53))REPRESENTATION_CONTEXT('NONE','WORKSPACE'));
#24=PROPERTY_DEFINITION_REPRESENTATION(#55,#56);
#25=GENERAL_PROPERTY_ASSOCIATION('','',#57,#55);
#26=PROPERTY_DEFINITION_REPRESENTATION(#58,#59);
#27=GENERAL_PROPERTY_ASSOCIATION('','',#60,#58);
#28=PROPERTY_DEFINITION_REPRESENTATION(#61,#62);
#29=GENERAL_PROPERTY_ASSOCIATION('','',#63,#61);
#33=APPLICATION_CONTEXT('CONFIGURATION CONTROLLED 3D DESIGNS OF MECHANICAL PARTS AND ASSEMBLIES');
#34=PRODUCT_CATEGORY('part','NONE');
#35=PRODUCT_RELATED_PRODUCT_CATEGORY('detail',' ',(#44));
#36=CALENDAR_DATE(2022,7,11);
#37=LOCAL_TIME(15,30,9.0,#64);
#38=PERSON_AND_ORGANIZATION(#65,#66);
#39=APPROVAL(#67,'SOLID MODEL');
#40=APPROVAL_ROLE('APPROVED');
#41=SECURITY_CLASSIFICATION('','',#68);
#42=PRODUCT_DEFINITION_FORMATION_WITH_SPECIFIED_SOURCE('A','NONE',#44,.NOT_KNOWN.);
#43=PRODUCT_DEFINITION('','NONE',#42,#1);
#44=PRODUCT('Fixa\X2\00E700E3\X0\o das chapas inferiores dos capacitores','','Fixa\X2\00E700E3\X0\o das chapas inferiores dos capacitores',(#69));
#45=PRODUCT_DEFINITION_SHAPE('NONE','NONE',#43);
#46=ADVANCED_BREP_SHAPE_REPRESENTATION('1',(#70,#71),#23);
#49=UNCERTAINTY_MEASURE_WITH_UNIT(LENGTH_MEASURE(0.001),#51,'','');
#51= (CONVERSION_BASED_UNIT('MILLIMETRE',#74)LENGTH_UNIT()NAMED_UNIT(#77));
#52= (NAMED_UNIT(#79)PLANE_ANGLE_UNIT()SI_UNIT($,.RADIAN.));
#53= (NAMED_UNIT(#79)SOLID_ANGLE_UNIT()SI_UNIT($,.STERADIAN.));
#55=PROPERTY_DEFINITION('PdmObjectId','',#43);
#56=REPRESENTATION('',(#85),#23);
#57=GENERAL_PROPERTY('','19_e53f71a6-0579-4bee-980f-c92e8fc169a4&2_327_0_3','');
#58=PROPERTY_DEFINITION('CreationDate','',#43);
#59=REPRESENTATION('',(#86),#23);
#60=GENERAL_PROPERTY('','18/10/2022 20:37:09','');
#61=PROPERTY_DEFINITION('Minor Revision','',#43);
#62=REPRESENTATION('',(#87),#23);
#63=GENERAL_PROPERTY('','1','');
#64=COORDINATED_UNIVERSAL_TIME_OFFSET(3,0,.BEHIND.);
#65=PERSON('','UNSPECIFIED',$,$,$,$);
#66=ORGANIZATION('UNSPECIFIED','UNSPECIFIED','UNSPECIFIED');
#67=APPROVAL_STATUS('approved');
#68=SECURITY_CLASSIFICATION_LEVEL('unclassified');
#69=MECHANICAL_CONTEXT('',#33,'mechanical');
#70=MANIFOLD_SOLID_BREP('1',#88);
#71=AXIS2_PLACEMENT_3D('',#89,#90,#91);
#74=LENGTH_MEASURE_WITH_UNIT(LENGTH_MEASURE(1.0),#92);
#77=DIMENSIONAL_EXPONENTS(1.0,0.0,0.0,0.0,0.0,0.0,0.0);
#79=DIMENSIONAL_EXPONENTS(0.0,0.0,0.0,0.0,0.0,0.0,0.0);
#85=VALUE_REPRESENTATION_ITEM('19_e53f71a6-0579-4bee-980f-c92e8fc169a4&2_327_0_3',);
#86=VALUE_REPRESENTATION_ITEM('18/10/2022 20:37:09',);
#87=VALUE_REPRESENTATION_ITEM('1',);
#88=CLOSED_SHELL('',(#93,#94,#95,#96,#97,#98,#99,#100,#101,#102,#103,#104,#105,#106,#107,#108,#109,#110,#111,#112,#113,#114,#115));
#89=CARTESIAN_POINT('',(0.0,0.0,0.0));
#90=DIRECTION('',(0.0,0.0,1.0));
#91=DIRECTION('',(1.0,0.0,0.0));
#92= (NAMED_UNIT(#77)LENGTH_UNIT()SI_UNIT(.MILLI.,.METRE.));
#93=ADVANCED_FACE('',(#117,#118),#119,.F.);
#94=ADVANCED_FACE('',(#120),#121,.F.);
#95=ADVANCED_FACE('',(#122),#123,.F.);
#96=ADVANCED_FACE('',(#124),#125,.F.);
#97=ADVANCED_FACE('',(#126),#127,.T.);
#98=ADVANCED_FACE('',(#128),#129,.T.);
#99=ADVANCED_FACE('',(#130),#131,.T.);
#100=ADVANCED_FACE('',(#132),#133,.T.);
#101=ADVANCED_FACE('',(#134,#135),#136,.T.);
#102=ADVANCED_FACE('',(#137,#138),#139,.T.);
#103=ADVANCED_FACE('',(#140),#141,.F.);
#104=ADVANCED_FACE('',(#142),#143,.F.);
#105=ADVANCED_FACE('',(#144),#145,.F.);
#106=ADVANCED_FACE('',(#146),#147,.F.);
#107=ADVANCED_FACE('',(#148,#149),#150,.F.);
#108=ADVANCED_FACE('',(#151,#152),#153,.T.);
#109=ADVANCED_FACE('',(#154),#155,.T.);
#110=ADVANCED_FACE('',(#156,#157),#158,.T.);
#111=ADVANCED_FACE('',(#159,#160),#161,.F.);
#112=ADVANCED_FACE('',(#162,#163),#164,.F.);
#113=ADVANCED_FACE('',(#165),#166,.T.);
#114=ADVANCED_FACE('',(#167,#168),#169,.F.);
#115=ADVANCED_FACE('',(#170),#171,.F.);
#117=FACE_BOUND('',#172,.T.);
#118=FACE_OUTER_BOUND('',#173,.T.);
#119=PLANE('',#174);
#120=FACE_OUTER_BOUND('',#175,.T.);
#121=PLANE('',#176);
#122=FACE_OUTER_BOUND('',#177,.T.);
#123=PLANE('',#178);
#124=FACE_OUTER_BOUND('',#179,.T.);
#125=PLANE('',#180);
#126=FACE_OUTER_BOUND('',#181,.T.);
#127=PLANE('',#182);
#128=FACE_OUTER_BOUND('',#183,.T.);
#129=PLANE('',#184);
#130=FACE_OUTER_BOUND('',#185,.T.);
#131=PLANE('',#186);
#132=FACE_OUTER_BOUND('',#187,.T.);
#133=PLANE('',#188);
#134=FACE_BOUND('',#189,.T.);
#135=FACE_OUTER_BOUND('',#190,.T.);
#136=PLANE('',#191);
#137=FACE_BOUND('',#192,.T.);
#138=FACE_OUTER_BOUND('',#193,.T.);
#139=PLANE('',#194);
#140=FACE_OUTER_BOUND('',#195,.T.);
#141=PLANE('',#196);
#142=FACE_OUTER_BOUND('',#197,.T.);
#143=PLANE('',#198);
#144=FACE_OUTER_BOUND('',#199,.T.);
#145=PLANE('',#200);
#146=FACE_OUTER_BOUND('',#201,.T.);
#147=PLANE('',#202);
#148=FACE_BOUND('',#203,.T.);
#149=FACE_OUTER_BOUND('',#204,.T.);
#150=PLANE('',#205);
#151=FACE_BOUND('',#206,.T.);
#152=FACE_OUTER_BOUND('',#207,.T.);
#153=PLANE('',#208);
#154=FACE_OUTER_BOUND('',#209,.T.);
#155=PLANE('',#210);
#156=FACE_BOUND('',#211,.T.);
#157=FACE_OUTER_BOUND('',#212,.T.);
#158=PLANE('',#213);
#159=FACE_OUTER_BOUND('',#214,.T.);
#160=FACE_OUTER_BOUND('',#215,.T.);
#161=CYLINDRICAL_SURFACE('',#216,1.65);
#162=FACE_OUTER_BOUND('',#217,.T.);
#163=FACE_OUTER_BOUND('',#218,.T.);
#164=CYLINDRICAL_SURFACE('',#219,1.65);
#165=FACE_OUTER_BOUND('',#220,.T.);
#166=PLANE('',#221);
#167=FACE_OUTER_BOUND('',#222,.T.);
#168=FACE_OUTER_BOUND('',#223,.T.);
#169=CYLINDRICAL_SURFACE('',#224,1.65);
#170=FACE_OUTER_BOUND('',#225,.T.);
#171=PLANE('',#226);
#172=EDGE_LOOP('',(#227));
#173=EDGE_LOOP('',(#228,#229,#230,#231,#232,#233));
#174=AXIS2_PLACEMENT_3D('',#234,#235,#236);
#175=EDGE_LOOP('',(#237,#238,#239,#240));
#176=AXIS2_PLACEMENT_3D('',#241,#242,#243);
#177=EDGE_LOOP('',(#244,#245,#246,#247));
#178=AXIS2_PLACEMENT_3D('',#248,#249,#250);
#179=EDGE_LOOP('',(#251,#252,#253,#254));
#180=AXIS2_PLACEMENT_3D('',#255,#256,#257);
#181=EDGE_LOOP('',(#258,#259,#260,#261));
#182=AXIS2_PLACEMENT_3D('',#262,#263,#264);
#183=EDGE_LOOP('',(#265,#266,#267,#268));
#184=AXIS2_PLACEMENT_3D('',#269,#270,#271);
#185=EDGE_LOOP('',(#272,#273,#274,#275));
#186=AXIS2_PLACEMENT_3D('',#276,#277,#278);
#187=EDGE_LOOP('',(#279,#280,#281,#282));
#188=AXIS2_PLACEMENT_3D('',#283,#284,#285);
#189=EDGE_LOOP('',(#286));
#190=EDGE_LOOP('',(#287,#288,#289,#290,#291,#292));
#191=AXIS2_PLACEMENT_3D('',#293,#294,#295);
#192=EDGE_LOOP('',(#296));
#193=EDGE_LOOP('',(#297,#298,#299,#300,#301,#302));
#194=AXIS2_PLACEMENT_3D('',#303,#304,#305);
#195=EDGE_LOOP('',(#306,#307,#308,#309,#310,#311,#312,#313,#314,#315,#316,#317));
#196=AXIS2_PLACEMENT_3D('',#318,#319,#320);
#197=EDGE_LOOP('',(#321,#322,#323,#324));
#198=AXIS2_PLACEMENT_3D('',#325,#326,#327);
#199=EDGE_LOOP('',(#328,#329,#330,#331));
#200=AXIS2_PLACEMENT_3D('',#332,#333,#334);
#201=EDGE_LOOP('',(#335,#336,#337,#338));
#202=AXIS2_PLACEMENT_3D('',#339,#340,#341);
#203=EDGE_LOOP('',(#342));
#204=EDGE_LOOP('',(#343,#344,#345,#346,#347,#348));
#205=AXIS2_PLACEMENT_3D('',#349,#350,#351);
#206=EDGE_LOOP('',(#352));
#207=EDGE_LOOP('',(#353,#354,#355,#356,#357,#358));
#208=AXIS2_PLACEMENT_3D('',#359,#360,#361);
#209=EDGE_LOOP('',(#362,#363,#364,#365));
#210=AXIS2_PLACEMENT_3D('',#366,#367,#368);
#211=EDGE_LOOP('',(#369));
#212=EDGE_LOOP('',(#370,#371,#372,#373,#374,#375));
#213=AXIS2_PLACEMENT_3D('',#376,#377,#378);
#214=EDGE_LOOP('',(#379));
#215=EDGE_LOOP('',(#380));
#216=AXIS2_PLACEMENT_3D('',#381,#382,#383);
#217=EDGE_LOOP('',(#384));
#218=EDGE_LOOP('',(#385));
#219=AXIS2_PLACEMENT_3D('',#386,#387,#388);
#220=EDGE_LOOP('',(#389,#390,#391,#392));
#221=AXIS2_PLACEMENT_3D('',#393,#394,#395);
#222=EDGE_LOOP('',(#396));
#223=EDGE_LOOP('',(#397));
#224=AXIS2_PLACEMENT_3D('',#398,#399,#400);
#225=EDGE_LOOP('',(#401,#402,#403,#404,#405,#406,#407,#408,#409,#410,#411,#412));
#226=AXIS2_PLACEMENT_3D('',#413,#414,#415);
#227=ORIENTED_EDGE('',*,*,#416,.F.);
#228=ORIENTED_EDGE('',*,*,#417,.T.);
#229=ORIENTED_EDGE('',*,*,#418,.T.);
#230=ORIENTED_EDGE('',*,*,#419,.T.);
#231=ORIENTED_EDGE('',*,*,#420,.T.);
#232=ORIENTED_EDGE('',*,*,#421,.T.);
#233=ORIENTED_EDGE('',*,*,#422,.T.);
#234=CARTESIAN_POINT('',(-15.0000000000011,-7.0,-65.0));
#235=DIRECTION('',(0.0,0.0,1.0));
#236=DIRECTION('',(1.0,0.0,0.0));
#237=ORIENTED_EDGE('',*,*,#423,.F.);
#238=ORIENTED_EDGE('',*,*,#424,.F.);
#239=ORIENTED_EDGE('',*,*,#425,.F.);
#240=ORIENTED_EDGE('',*,*,#426,.T.);
#241=CARTESIAN_POINT('',(-15.0000000000011,-3.0,-38.0));
#242=DIRECTION('',(1.22460635382238E-16,-1.0,-2.45190164888482E-29));
#243=DIRECTION('',(-1.0,-1.22460635382238E-16,1.23086802860452E-16));
#244=ORIENTED_EDGE('',*,*,#427,.F.);
#245=ORIENTED_EDGE('',*,*,#428,.T.);
#246=ORIENTED_EDGE('',*,*,#418,.F.);
#247=ORIENTED_EDGE('',*,*,#429,.F.);
#248=CARTESIAN_POINT('',(-15.0000000000011,-3.0,-38.0));
#249=DIRECTION('',(1.22460635382238E-16,-1.0,-2.45190164888482E-29));
#250=DIRECTION('',(-1.0,-1.22460635382238E-16,1.23086802860452E-16));
#251=ORIENTED_EDGE('',*,*,#430,.F.);
#252=ORIENTED_EDGE('',*,*,#431,.T.);
#253=ORIENTED_EDGE('',*,*,#432,.F.);
#254=ORIENTED_EDGE('',*,*,#433,.F.);
#255=CARTESIAN_POINT('',(-15.0000000000011,-3.0,-38.0));
#256=DIRECTION('',(1.22460635382238E-16,-1.0,-2.45190164888482E-29));
#257=DIRECTION('',(-1.0,-1.22460635382238E-16,1.23086802860452E-16));
#258=ORIENTED_EDGE('',*,*,#434,.T.);
#259=ORIENTED_EDGE('',*,*,#435,.T.);
#260=ORIENTED_EDGE('',*,*,#436,.F.);
#261=ORIENTED_EDGE('',*,*,#437,.F.);
#262=CARTESIAN_POINT('',(-17.9400000000011,-3.0,-41.4));
#263=DIRECTION('',(1.0,1.22460635382238E-16,6.12303176911189E-17));
#264=DIRECTION('',(-6.12303176911189E-17,-2.45265147924573E-29,1.0));
#265=ORIENTED_EDGE('',*,*,#438,.T.);
#266=ORIENTED_EDGE('',*,*,#439,.T.);
#267=ORIENTED_EDGE('',*,*,#440,.F.);
#268=ORIENTED_EDGE('',*,*,#441,.F.);
#269=CARTESIAN_POINT('',(-12.0600000000011,-3.0,-41.4));
#270=DIRECTION('',(-1.0,-1.22460635382238E-16,6.12303176911189E-17));
#271=DIRECTION('',(-6.12303176911189E-17,2.45115181852391E-29,-1.0));
#272=ORIENTED_EDGE('',*,*,#442,.T.);
#273=ORIENTED_EDGE('',*,*,#443,.T.);
#274=ORIENTED_EDGE('',*,*,#444,.F.);
#275=ORIENTED_EDGE('',*,*,#445,.F.);
#276=CARTESIAN_POINT('',(-17.9400000000011,-3.0,-61.6));
#277=DIRECTION('',(1.0,1.22460635382238E-16,6.12303176911189E-17));
#278=DIRECTION('',(-6.12303176911189E-17,-2.45265147924573E-29,1.0));
#279=ORIENTED_EDGE('',*,*,#446,.T.);
#280=ORIENTED_EDGE('',*,*,#447,.T.);
#281=ORIENTED_EDGE('',*,*,#448,.F.);
#282=ORIENTED_EDGE('',*,*,#449,.F.);
#283=CARTESIAN_POINT('',(-12.0600000000011,-3.0,-61.6));
#284=DIRECTION('',(-1.0,-1.22460635382238E-16,6.12303176911189E-17));
#285=DIRECTION('',(-6.12303176911189E-17,2.45115181852391E-29,-1.0));
#286=ORIENTED_EDGE('',*,*,#450,.T.);
#287=ORIENTED_EDGE('',*,*,#451,.T.);
#288=ORIENTED_EDGE('',*,*,#445,.T.);
#289=ORIENTED_EDGE('',*,*,#452,.F.);
#290=ORIENTED_EDGE('',*,*,#447,.F.);
#291=ORIENTED_EDGE('',*,*,#453,.T.);
#292=ORIENTED_EDGE('',*,*,#427,.T.);
#293=CARTESIAN_POINT('',(-15.0000000000011,-3.0,-63.0));
#294=DIRECTION('',(3.00261433817191E-45,-2.45190164888482E-29,1.0));
#295=DIRECTION('',(-1.0,-1.22460635382238E-16,-6.22301527786114E-61));
#296=ORIENTED_EDGE('',*,*,#454,.T.);
#297=ORIENTED_EDGE('',*,*,#455,.T.);
#298=ORIENTED_EDGE('',*,*,#432,.T.);
#299=ORIENTED_EDGE('',*,*,#456,.T.);
#300=ORIENTED_EDGE('',*,*,#449,.T.);
#301=ORIENTED_EDGE('',*,*,#457,.F.);
#302=ORIENTED_EDGE('',*,*,#443,.F.);
#303=CARTESIAN_POINT('',(-15.0000000000011,-3.0,-60.2));
#304=DIRECTION('',(-1.22460635382238E-16,2.450401988163E-29,-1.0));
#305=DIRECTION('',(1.0,1.22460635382238E-16,-1.22460635382238E-16));
#306=ORIENTED_EDGE('',*,*,#458,.F.);
#307=ORIENTED_EDGE('',*,*,#433,.T.);
#308=ORIENTED_EDGE('',*,*,#455,.F.);
#309=ORIENTED_EDGE('',*,*,#442,.F.);
#310=ORIENTED_EDGE('',*,*,#451,.F.);
#311=ORIENTED_EDGE('',*,*,#429,.T.);
#312=ORIENTED_EDGE('',*,*,#417,.F.);
#313=ORIENTED_EDGE('',*,*,#459,.F.);
#314=ORIENTED_EDGE('',*,*,#460,.F.);
#315=ORIENTED_EDGE('',*,*,#424,.T.);
#316=ORIENTED_EDGE('',*,*,#461,.F.);
#317=ORIENTED_EDGE('',*,*,#434,.F.);
#318=CARTESIAN_POINT('',(-18.4641016151389,-5.0,-38.0));
#319=DIRECTION('',(0.866025403784439,-0.5,-1.06596298147771E-16));
#320=DIRECTION('',(-0.5,-0.866025403784439,6.15434014302048E-17));
#321=ORIENTED_EDGE('',*,*,#462,.F.);
#322=ORIENTED_EDGE('',*,*,#459,.T.);
#323=ORIENTED_EDGE('',*,*,#422,.F.);
#324=ORIENTED_EDGE('',*,*,#463,.F.);
#325=CARTESIAN_POINT('',(-18.4641016151389,-9.0,-38.0));
#326=DIRECTION('',(0.866025403784439,0.5,-1.06596298147746E-16));
#327=DIRECTION('',(0.5,-0.866025403784439,-6.15434014302473E-17));
#328=ORIENTED_EDGE('',*,*,#464,.F.);
#329=ORIENTED_EDGE('',*,*,#465,.F.);
#330=ORIENTED_EDGE('',*,*,#463,.T.);
#331=ORIENTED_EDGE('',*,*,#421,.F.);
#332=CARTESIAN_POINT('',(-15.0000000000011,-11.0,-38.0));
#333=DIRECTION('',(-2.11528701825993E-16,1.0,2.45299795923837E-29));
#334=DIRECTION('',(1.0,2.11528701825993E-16,-1.23086802860452E-16));
#335=ORIENTED_EDGE('',*,*,#466,.F.);
#336=ORIENTED_EDGE('',*,*,#467,.F.);
#337=ORIENTED_EDGE('',*,*,#464,.T.);
#338=ORIENTED_EDGE('',*,*,#420,.F.);
#339=CARTESIAN_POINT('',(-11.5358983848634,-9.0,-38.0));
#340=DIRECTION('',(-0.866025403784438,0.5,1.06596298147771E-16));
#341=DIRECTION('',(0.5,0.866025403784438,-6.15434014302049E-17));
#342=ORIENTED_EDGE('',*,*,#468,.F.);
#343=ORIENTED_EDGE('',*,*,#460,.T.);
#344=ORIENTED_EDGE('',*,*,#462,.T.);
#345=ORIENTED_EDGE('',*,*,#465,.T.);
#346=ORIENTED_EDGE('',*,*,#467,.T.);
#347=ORIENTED_EDGE('',*,*,#469,.T.);
#348=ORIENTED_EDGE('',*,*,#425,.T.);
#349=CARTESIAN_POINT('',(-19.0000000013055,-54.9714052096399,-43.0));
#350=DIRECTION('',(-1.23086802860452E-16,2.45039432007627E-29,-1.0));
#351=DIRECTION('',(-1.0,0.0,1.23086802860452E-16));
#352=ORIENTED_EDGE('',*,*,#470,.T.);
#353=ORIENTED_EDGE('',*,*,#461,.T.);
#354=ORIENTED_EDGE('',*,*,#423,.T.);
#355=ORIENTED_EDGE('',*,*,#471,.T.);
#356=ORIENTED_EDGE('',*,*,#441,.T.);
#357=ORIENTED_EDGE('',*,*,#472,.F.);
#358=ORIENTED_EDGE('',*,*,#435,.F.);
#359=CARTESIAN_POINT('',(-15.0000000000011,-3.0,-45.0));
#360=DIRECTION('',(-1.22460635382238E-16,2.450401988163E-29,-1.0));
#361=DIRECTION('',(1.0,1.22460635382238E-16,-1.22460635382238E-16));
#362=ORIENTED_EDGE('',*,*,#440,.T.);
#363=ORIENTED_EDGE('',*,*,#473,.T.);
#364=ORIENTED_EDGE('',*,*,#436,.T.);
#365=ORIENTED_EDGE('',*,*,#472,.T.);
#366=CARTESIAN_POINT('',(3.181064649042E-16,-9.9,-1.69181213773053E-28));
#367=DIRECTION('',(-1.22460635382238E-16,1.0,2.45190164888482E-29));
#368=DIRECTION('',(-1.0,-1.22460635382238E-16,0.0));
#369=ORIENTED_EDGE('',*,*,#474,.T.);
#370=ORIENTED_EDGE('',*,*,#458,.T.);
#371=ORIENTED_EDGE('',*,*,#437,.T.);
#372=ORIENTED_EDGE('',*,*,#473,.F.);
#373=ORIENTED_EDGE('',*,*,#439,.F.);
#374=ORIENTED_EDGE('',*,*,#475,.T.);
#375=ORIENTED_EDGE('',*,*,#430,.T.);
#376=CARTESIAN_POINT('',(-15.0000000000011,-3.0,-47.8));
#377=DIRECTION('',(3.00261433817191E-45,-2.45190164888482E-29,1.0));
#378=DIRECTION('',(-1.0,-1.22460635382238E-16,-6.22301527786114E-61));
#379=ORIENTED_EDGE('',*,*,#470,.F.);
#380=ORIENTED_EDGE('',*,*,#468,.T.);
#381=CARTESIAN_POINT('',(-15.0000000000011,-7.0,-38.0));
#382=DIRECTION('',(-1.23086802860452E-16,2.45039432007628E-29,-1.0));
#383=DIRECTION('',(1.0,3.016112026056E-45,-1.23086802860452E-16));
#384=ORIENTED_EDGE('',*,*,#474,.F.);
#385=ORIENTED_EDGE('',*,*,#454,.F.);
#386=CARTESIAN_POINT('',(-15.0000000000011,-7.0,-38.0));
#387=DIRECTION('',(-1.23086802860452E-16,2.45039432007628E-29,-1.0));
#388=DIRECTION('',(1.0,3.016112026056E-45,-1.23086802860452E-16));
#389=ORIENTED_EDGE('',*,*,#448,.T.);
#390=ORIENTED_EDGE('',*,*,#452,.T.);
#391=ORIENTED_EDGE('',*,*,#444,.T.);
#392=ORIENTED_EDGE('',*,*,#457,.T.);
#393=CARTESIAN_POINT('',(3.181064649042E-16,-9.9,-1.69181213773053E-28));
#394=DIRECTION('',(-1.22460635382238E-16,1.0,2.45190164888482E-29));
#395=DIRECTION('',(-1.0,-1.22460635382238E-16,0.0));
#396=ORIENTED_EDGE('',*,*,#450,.F.);
#397=ORIENTED_EDGE('',*,*,#416,.T.);
#398=CARTESIAN_POINT('',(-15.0000000000011,-7.0,-65.0));
#399=DIRECTION('',(0.0,0.0,1.0));
#400=DIRECTION('',(-1.0,0.0,0.0));
#401=ORIENTED_EDGE('',*,*,#475,.F.);
#402=ORIENTED_EDGE('',*,*,#438,.F.);
#403=ORIENTED_EDGE('',*,*,#471,.F.);
#404=ORIENTED_EDGE('',*,*,#426,.F.);
#405=ORIENTED_EDGE('',*,*,#469,.F.);
#406=ORIENTED_EDGE('',*,*,#466,.T.);
#407=ORIENTED_EDGE('',*,*,#419,.F.);
#408=ORIENTED_EDGE('',*,*,#428,.F.);
#409=ORIENTED_EDGE('',*,*,#453,.F.);
#410=ORIENTED_EDGE('',*,*,#446,.F.);
#411=ORIENTED_EDGE('',*,*,#456,.F.);
#412=ORIENTED_EDGE('',*,*,#431,.F.);
#413=CARTESIAN_POINT('',(-11.5358983848634,-5.0,-38.0));
#414=DIRECTION('',(-0.866025403784439,-0.5,1.06596298147746E-16));
#415=DIRECTION('',(-0.5,0.866025403784439,6.15434014302471E-17));
#416=EDGE_CURVE('',#476,#476,#477,.T.);
#417=EDGE_CURVE('',#478,#479,#480,.T.);
#418=EDGE_CURVE('',#479,#481,#482,.T.);
#419=EDGE_CURVE('',#481,#483,#484,.T.);
#420=EDGE_CURVE('',#483,#485,#486,.T.);
#421=EDGE_CURVE('',#485,#487,#488,.T.);
#422=EDGE_CURVE('',#487,#478,#489,.T.);
#423=EDGE_CURVE('',#490,#491,#492,.T.);
#424=EDGE_CURVE('',#493,#490,#494,.T.);
#425=EDGE_CURVE('',#495,#493,#496,.T.);
#426=EDGE_CURVE('',#495,#491,#497,.T.);
#427=EDGE_CURVE('',#498,#499,#500,.T.);
#428=EDGE_CURVE('',#498,#481,#501,.T.);
#429=EDGE_CURVE('',#499,#479,#502,.T.);
#430=EDGE_CURVE('',#503,#504,#505,.T.);
#431=EDGE_CURVE('',#503,#506,#507,.T.);
#432=EDGE_CURVE('',#508,#506,#509,.T.);
#433=EDGE_CURVE('',#504,#508,#510,.T.);
#434=EDGE_CURVE('',#511,#512,#513,.T.);
#435=EDGE_CURVE('',#512,#514,#515,.T.);
#436=EDGE_CURVE('',#516,#514,#517,.T.);
#437=EDGE_CURVE('',#511,#516,#518,.T.);
#438=EDGE_CURVE('',#519,#520,#521,.T.);
#439=EDGE_CURVE('',#520,#522,#523,.T.);
#440=EDGE_CURVE('',#524,#522,#525,.T.);
#441=EDGE_CURVE('',#519,#524,#526,.T.);
#442=EDGE_CURVE('',#527,#528,#529,.T.);
#443=EDGE_CURVE('',#528,#530,#531,.T.);
#444=EDGE_CURVE('',#532,#530,#533,.T.);
#445=EDGE_CURVE('',#527,#532,#534,.T.);
#446=EDGE_CURVE('',#535,#536,#537,.T.);
#447=EDGE_CURVE('',#536,#538,#539,.T.);
#448=EDGE_CURVE('',#540,#538,#541,.T.);
#449=EDGE_CURVE('',#535,#540,#542,.T.);
#450=EDGE_CURVE('',#543,#543,#544,.F.);
#451=EDGE_CURVE('',#499,#527,#545,.T.);
#452=EDGE_CURVE('',#538,#532,#546,.T.);
#453=EDGE_CURVE('',#536,#498,#547,.T.);
#454=EDGE_CURVE('',#548,#548,#549,.F.);
#455=EDGE_CURVE('',#528,#508,#550,.T.);
#456=EDGE_CURVE('',#506,#535,#551,.T.);
#457=EDGE_CURVE('',#530,#540,#552,.T.);
#458=EDGE_CURVE('',#504,#511,#553,.T.);
#459=EDGE_CURVE('',#554,#478,#555,.T.);
#460=EDGE_CURVE('',#493,#554,#556,.T.);
#461=EDGE_CURVE('',#512,#490,#557,.T.);
#462=EDGE_CURVE('',#554,#558,#559,.T.);
#463=EDGE_CURVE('',#558,#487,#560,.T.);
#464=EDGE_CURVE('',#561,#485,#562,.T.);
#465=EDGE_CURVE('',#558,#561,#563,.T.);
#466=EDGE_CURVE('',#564,#483,#565,.T.);
#467=EDGE_CURVE('',#561,#564,#566,.T.);
#468=EDGE_CURVE('',#567,#567,#568,.T.);
#469=EDGE_CURVE('',#564,#495,#569,.T.);
#470=EDGE_CURVE('',#570,#570,#571,.F.);
#471=EDGE_CURVE('',#491,#519,#572,.T.);
#472=EDGE_CURVE('',#514,#524,#573,.T.);
#473=EDGE_CURVE('',#522,#516,#574,.T.);
#474=EDGE_CURVE('',#575,#575,#576,.F.);
#475=EDGE_CURVE('',#520,#503,#577,.T.);
#476=VERTEX_POINT('',#578);
#477=CIRCLE('',#579,1.65);
#478=VERTEX_POINT('',#580);
#479=VERTEX_POINT('',#581);
#480=LINE('',#582,#583);
#481=VERTEX_POINT('',#584);
#482=LINE('',#585,#586);
#483=VERTEX_POINT('',#587);
#484=LINE('',#588,#589);
#485=VERTEX_POINT('',#590);
#486=LINE('',#591,#592);
#487=VERTEX_POINT('',#593);
#488=LINE('',#594,#595);
#489=LINE('',#596,#597);
#490=VERTEX_POINT('',#598);
#491=VERTEX_POINT('',#599);
#492=LINE('',#600,#601);
#493=VERTEX_POINT('',#602);
#494=LINE('',#603,#604);
#495=VERTEX_POINT('',#605);
#496=LINE('',#606,#607);
#497=LINE('',#608,#609);
#498=VERTEX_POINT('',#610);
#499=VERTEX_POINT('',#611);
#500=LINE('',#612,#613);
#501=LINE('',#614,#615);
#502=LINE('',#616,#617);
#503=VERTEX_POINT('',#618);
#504=VERTEX_POINT('',#619);
#505=LINE('',#620,#621);
#506=VERTEX_POINT('',#622);
#507=LINE('',#623,#624);
#508=VERTEX_POINT('',#625);
#509=LINE('',#626,#627);
#510=LINE('',#628,#629);
#511=VERTEX_POINT('',#630);
#512=VERTEX_POINT('',#631);
#513=LINE('',#632,#633);
#514=VERTEX_POINT('',#634);
#515=LINE('',#635,#636);
#516=VERTEX_POINT('',#637);
#517=LINE('',#638,#639);
#518=LINE('',#640,#641);
#519=VERTEX_POINT('',#642);
#520=VERTEX_POINT('',#643);
#521=LINE('',#644,#645);
#522=VERTEX_POINT('',#646);
#523=LINE('',#647,#648);
#524=VERTEX_POINT('',#649);
#525=LINE('',#650,#651);
#526=LINE('',#652,#653);
#527=VERTEX_POINT('',#654);
#528=VERTEX_POINT('',#655);
#529=LINE('',#656,#657);
#530=VERTEX_POINT('',#658);
#531=LINE('',#659,#660);
#532=VERTEX_POINT('',#661);
#533=LINE('',#662,#663);
#534=LINE('',#664,#665);
#535=VERTEX_POINT('',#666);
#536=VERTEX_POINT('',#667);
#537=LINE('',#668,#669);
#538=VERTEX_POINT('',#670);
#539=LINE('',#671,#672);
#540=VERTEX_POINT('',#673);
#541=LINE('',#674,#675);
#542=LINE('',#676,#677);
#543=VERTEX_POINT('',#678);
#544=CIRCLE('',#679,1.65);
#545=LINE('',#680,#681);
#546=LINE('',#682,#683);
#547=LINE('',#684,#685);
#548=VERTEX_POINT('',#686);
#549=CIRCLE('',#687,1.65);
#550=LINE('',#688,#689);
#551=LINE('',#690,#691);
#552=LINE('',#692,#693);
#553=LINE('',#694,#695);
#554=VERTEX_POINT('',#696);
#555=LINE('',#697,#698);
#556=LINE('',#699,#700);
#557=LINE('',#701,#702);
#558=VERTEX_POINT('',#703);
#559=LINE('',#704,#705);
#560=LINE('',#706,#707);
#561=VERTEX_POINT('',#708);
#562=LINE('',#709,#710);
#563=LINE('',#711,#712);
#564=VERTEX_POINT('',#713);
#565=LINE('',#714,#715);
#566=LINE('',#716,#717);
#567=VERTEX_POINT('',#718);
#568=CIRCLE('',#719,1.65);
#569=LINE('',#720,#721);
#570=VERTEX_POINT('',#722);
#571=CIRCLE('',#723,1.65);
#572=LINE('',#724,#725);
#573=LINE('',#726,#727);
#574=LINE('',#728,#729);
#575=VERTEX_POINT('',#730);
#576=CIRCLE('',#731,1.65);
#577=LINE('',#732,#733);
#578=CARTESIAN_POINT('',(-16.6500000000011,-7.0,-65.0));
#579=AXIS2_PLACEMENT_3D('',#734,#735,#736);
#580=CARTESIAN_POINT('',(-19.6188021535181,-7.0,-65.0));
#581=CARTESIAN_POINT('',(-17.3094010767596,-3.0,-65.0));
#582=CARTESIAN_POINT('',(-18.4641016151389,-5.0,-65.0));
#583=VECTOR('',#737,1.0);
#584=CARTESIAN_POINT('',(-12.6905989232426,-3.0,-65.0));
#585=CARTESIAN_POINT('',(-15.0000000000011,-3.0,-65.0));
#586=VECTOR('',#738,1.0);
#587=CARTESIAN_POINT('',(-10.3811978464841,-7.0,-65.0));
#588=CARTESIAN_POINT('',(-11.5358983848634,-5.0,-65.0));
#589=VECTOR('',#739,1.0);
#590=CARTESIAN_POINT('',(-12.6905989232426,-11.0,-65.0));
#591=CARTESIAN_POINT('',(-11.5358983848634,-9.0,-65.0));
#592=VECTOR('',#740,1.0);
#593=CARTESIAN_POINT('',(-17.3094010767596,-11.0,-65.0));
#594=CARTESIAN_POINT('',(-15.0000000000011,-11.0,-65.0));
#595=VECTOR('',#741,1.0);
#596=CARTESIAN_POINT('',(-18.4641016151389,-9.0,-65.0));
#597=VECTOR('',#742,1.0);
#598=CARTESIAN_POINT('',(-17.3094010767596,-3.0,-45.0));
#599=CARTESIAN_POINT('',(-12.6905989232426,-3.0,-45.0));
#600=CARTESIAN_POINT('',(-15.0000000000011,-3.0,-45.0));
#601=VECTOR('',#743,1.0);
#602=CARTESIAN_POINT('',(-17.3094010767596,-3.0,-43.0));
#603=CARTESIAN_POINT('',(-17.3094010767596,-3.0,-38.0));
#604=VECTOR('',#744,1.0);
#605=CARTESIAN_POINT('',(-12.6905989232426,-3.0,-43.0));
#606=CARTESIAN_POINT('',(-15.0000000000011,-3.0,-43.0));
#607=VECTOR('',#745,1.0);
#608=CARTESIAN_POINT('',(-12.6905989232426,-3.0,-38.0));
#609=VECTOR('',#746,1.0);
#610=CARTESIAN_POINT('',(-12.6905989232426,-3.0,-63.0));
#611=CARTESIAN_POINT('',(-17.3094010767596,-3.0,-63.0));
#612=CARTESIAN_POINT('',(-15.0000000000011,-3.0,-63.0));
#613=VECTOR('',#747,1.0);
#614=CARTESIAN_POINT('',(-12.6905989232426,-3.0,-38.0));
#615=VECTOR('',#748,1.0);
#616=CARTESIAN_POINT('',(-17.3094010767596,-3.0,-38.0));
#617=VECTOR('',#749,1.0);
#618=CARTESIAN_POINT('',(-12.6905989232426,-3.0,-47.8));
#619=CARTESIAN_POINT('',(-17.3094010767596,-3.0,-47.8));
#620=CARTESIAN_POINT('',(-15.0000000000011,-3.0,-47.8));
#621=VECTOR('',#750,1.0);
#622=CARTESIAN_POINT('',(-12.6905989232426,-3.0,-60.2));
#623=CARTESIAN_POINT('',(-12.6905989232426,-3.0,-38.0));
#624=VECTOR('',#751,1.0);
#625=CARTESIAN_POINT('',(-17.3094010767596,-3.0,-60.2));
#626=CARTESIAN_POINT('',(-15.0000000000011,-3.0,-60.2));
#627=VECTOR('',#752,1.0);
#628=CARTESIAN_POINT('',(-17.3094010767596,-3.0,-38.0));
#629=VECTOR('',#753,1.0);
#630=CARTESIAN_POINT('',(-17.9400000000011,-4.0922293742525,-47.8));
#631=CARTESIAN_POINT('',(-17.9400000000011,-4.0922293742525,-45.0));
#632=CARTESIAN_POINT('',(-17.9400000000011,-4.0922293742525,-38.0));
#633=VECTOR('',#754,1.0);
#634=CARTESIAN_POINT('',(-17.9400000000011,-9.9,-45.0));
#635=CARTESIAN_POINT('',(-17.9400000000011,-3.0,-45.0));
#636=VECTOR('',#755,1.0);
#637=CARTESIAN_POINT('',(-17.9400000000011,-9.9,-47.8));
#638=CARTESIAN_POINT('',(-17.9400000000011,-9.9,-41.4));
#639=VECTOR('',#756,1.0);
#640=CARTESIAN_POINT('',(-17.9400000000011,-3.0,-47.8));
#641=VECTOR('',#757,1.0);
#642=CARTESIAN_POINT('',(-12.0600000000011,-4.09222937425252,-45.0));
#643=CARTESIAN_POINT('',(-12.0600000000011,-4.09222937425252,-47.8));
#644=CARTESIAN_POINT('',(-12.0600000000011,-4.09222937425252,-38.0));
#645=VECTOR('',#758,1.0);
#646=CARTESIAN_POINT('',(-12.0600000000011,-9.9,-47.8));
#647=CARTESIAN_POINT('',(-12.0600000000011,-3.0,-47.8));
#648=VECTOR('',#759,1.0);
#649=CARTESIAN_POINT('',(-12.0600000000011,-9.9,-45.0));
#650=CARTESIAN_POINT('',(-12.0600000000011,-9.9,-41.4));
#651=VECTOR('',#760,1.0);
#652=CARTESIAN_POINT('',(-12.0600000000011,-3.0,-45.0));
#653=VECTOR('',#761,1.0);
#654=CARTESIAN_POINT('',(-17.9400000000011,-4.0922293742525,-63.0));
#655=CARTESIAN_POINT('',(-17.9400000000011,-4.0922293742525,-60.2));
#656=CARTESIAN_POINT('',(-17.9400000000011,-4.0922293742525,-38.0));
#657=VECTOR('',#762,1.0);
#658=CARTESIAN_POINT('',(-17.9400000000011,-9.9,-60.2));
#659=CARTESIAN_POINT('',(-17.9400000000011,-3.0,-60.2));
#660=VECTOR('',#763,1.0);
#661=CARTESIAN_POINT('',(-17.9400000000011,-9.9,-63.0));
#662=CARTESIAN_POINT('',(-17.9400000000011,-9.9,-61.6));
#663=VECTOR('',#764,1.0);
#664=CARTESIAN_POINT('',(-17.9400000000011,-3.0,-63.0));
#665=VECTOR('',#765,1.0);
#666=CARTESIAN_POINT('',(-12.0600000000011,-4.09222937425252,-60.2));
#667=CARTESIAN_POINT('',(-12.0600000000011,-4.09222937425252,-63.0));
#668=CARTESIAN_POINT('',(-12.0600000000011,-4.09222937425252,-38.0));
#669=VECTOR('',#766,1.0);
#670=CARTESIAN_POINT('',(-12.0600000000011,-9.9,-63.0));
#671=CARTESIAN_POINT('',(-12.0600000000011,-3.0,-63.0));
#672=VECTOR('',#767,1.0);
#673=CARTESIAN_POINT('',(-12.0600000000011,-9.9,-60.2));
#674=CARTESIAN_POINT('',(-12.0600000000011,-9.9,-61.6));
#675=VECTOR('',#768,1.0);
#676=CARTESIAN_POINT('',(-12.0600000000011,-3.0,-60.2));
#677=VECTOR('',#769,1.0);
#678=CARTESIAN_POINT('',(-15.0000000000011,-8.65,-63.0));
#679=AXIS2_PLACEMENT_3D('',#770,#771,#772);
#680=CARTESIAN_POINT('',(-18.4641016151389,-5.0,-63.0));
#681=VECTOR('',#773,1.0);
#682=CARTESIAN_POINT('',(-15.0000000000011,-9.9,-63.0));
#683=VECTOR('',#774,1.0);
#684=CARTESIAN_POINT('',(-11.5358983848634,-5.0,-63.0));
#685=VECTOR('',#775,1.0);
#686=CARTESIAN_POINT('',(-16.6500000000011,-7.0,-60.2));
#687=AXIS2_PLACEMENT_3D('',#776,#777,#778);
#688=CARTESIAN_POINT('',(-18.4641016151389,-5.0,-60.2));
#689=VECTOR('',#779,1.0);
#690=CARTESIAN_POINT('',(-11.5358983848634,-5.0,-60.2));
#691=VECTOR('',#780,1.0);
#692=CARTESIAN_POINT('',(-15.0000000000011,-9.9,-60.2));
#693=VECTOR('',#781,1.0);
#694=CARTESIAN_POINT('',(-18.4641016151389,-5.0,-47.8));
#695=VECTOR('',#782,1.0);
#696=CARTESIAN_POINT('',(-19.6188021535181,-7.0,-43.0));
#697=CARTESIAN_POINT('',(-19.6188021535181,-7.0,-38.0));
#698=VECTOR('',#783,1.0);
#699=CARTESIAN_POINT('',(-18.4641016151389,-5.0,-43.0));
#700=VECTOR('',#784,1.0);
#701=CARTESIAN_POINT('',(-18.4641016151389,-5.0,-45.0));
#702=VECTOR('',#785,1.0);
#703=CARTESIAN_POINT('',(-17.3094010767596,-11.0,-43.0));
#704=CARTESIAN_POINT('',(-18.4641016151389,-9.0,-43.0));
#705=VECTOR('',#786,1.0);
#706=CARTESIAN_POINT('',(-17.3094010767596,-11.0,-38.0));
#707=VECTOR('',#787,1.0);
#708=CARTESIAN_POINT('',(-12.6905989232426,-11.0,-43.0));
#709=CARTESIAN_POINT('',(-12.6905989232426,-11.0,-38.0));
#710=VECTOR('',#788,1.0);
#711=CARTESIAN_POINT('',(-15.0000000000011,-11.0,-43.0));
#712=VECTOR('',#789,1.0);
#713=CARTESIAN_POINT('',(-10.3811978464841,-7.0,-43.0));
#714=CARTESIAN_POINT('',(-10.3811978464841,-7.0,-38.0));
#715=VECTOR('',#790,1.0);
#716=CARTESIAN_POINT('',(-11.5358983848634,-9.0,-43.0));
#717=VECTOR('',#791,1.0);
#718=CARTESIAN_POINT('',(-13.3500000000011,-7.0,-43.0));
#719=AXIS2_PLACEMENT_3D('',#792,#793,#794);
#720=CARTESIAN_POINT('',(-11.5358983848634,-5.0,-43.0));
#721=VECTOR('',#795,1.0);
#722=CARTESIAN_POINT('',(-16.6500000000011,-7.0,-45.0));
#723=AXIS2_PLACEMENT_3D('',#796,#797,#798);
#724=CARTESIAN_POINT('',(-11.5358983848634,-5.0,-45.0));
#725=VECTOR('',#799,1.0);
#726=CARTESIAN_POINT('',(-15.0000000000011,-9.9,-45.0));
#727=VECTOR('',#800,1.0);
#728=CARTESIAN_POINT('',(-15.0000000000011,-9.9,-47.8));
#729=VECTOR('',#801,1.0);
#730=CARTESIAN_POINT('',(-15.0000000000011,-8.65,-47.8));
#731=AXIS2_PLACEMENT_3D('',#802,#803,#804);
#732=CARTESIAN_POINT('',(-11.5358983848634,-5.0,-47.8));
#733=VECTOR('',#805,1.0);
#734=CARTESIAN_POINT('',(-15.0000000000011,-7.0,-65.0));
#735=DIRECTION('',(0.0,0.0,-1.0));
#736=DIRECTION('',(-1.0,0.0,0.0));
#737=DIRECTION('',(0.5,0.866025403784439,0.0));
#738=DIRECTION('',(1.0,1.22460635382238E-16,0.0));
#739=DIRECTION('',(0.499999999999999,-0.866025403784439,0.0));
#740=DIRECTION('',(-0.5,-0.866025403784438,0.0));
#741=DIRECTION('',(-1.0,-2.11528701825993E-16,0.0));
#742=DIRECTION('',(-0.5,0.866025403784439,0.0));
#743=DIRECTION('',(1.0,1.22460635382238E-16,-1.22460635382238E-16));
#744=DIRECTION('',(-1.23086802860452E-16,2.45039432007627E-29,-1.0));
#745=DIRECTION('',(-1.0,-1.22460635382238E-16,0.0));
#746=DIRECTION('',(-1.23086802860452E-16,2.45039432007627E-29,-1.0));
#747=DIRECTION('',(-1.0,-1.22460635382238E-16,0.0));
#748=DIRECTION('',(-1.23086802860452E-16,2.45039432007627E-29,-1.0));
#749=DIRECTION('',(-1.23086802860452E-16,2.45039432007627E-29,-1.0));
#750=DIRECTION('',(-1.0,-1.22460635382238E-16,0.0));
#751=DIRECTION('',(-1.23086802860452E-16,2.45039432007627E-29,-1.0));
#752=DIRECTION('',(1.0,1.22460635382238E-16,-1.22460635382238E-16));
#753=DIRECTION('',(-1.23086802860452E-16,2.45039432007627E-29,-1.0));
#754=DIRECTION('',(-6.12303176911189E-17,-3.19246617500144E-16,1.0));
#755=DIRECTION('',(1.22460635382238E-16,-1.0,-2.45190164888482E-29));
#756=DIRECTION('',(-6.12303176911189E-17,-2.45265147924573E-29,1.0));
#757=DIRECTION('',(1.22460635382238E-16,-1.0,-2.45190164888482E-29));
#758=DIRECTION('',(-6.12303176911189E-17,-1.07138575090891E-16,-1.0));
#759=DIRECTION('',(1.22460635382238E-16,-1.0,-2.45190164888482E-29));
#760=DIRECTION('',(-6.12303176911189E-17,2.45115181852391E-29,-1.0));
#761=DIRECTION('',(1.22460635382238E-16,-1.0,-2.45190164888482E-29));
#762=DIRECTION('',(-6.12303176911189E-17,-3.19246617500144E-16,1.0));
#763=DIRECTION('',(1.22460635382238E-16,-1.0,-2.45190164888482E-29));
#764=DIRECTION('',(-6.12303176911189E-17,-2.45265147924573E-29,1.0));
#765=DIRECTION('',(1.22460635382238E-16,-1.0,-2.45190164888482E-29));
#766=DIRECTION('',(-6.12303176911189E-17,-1.07138575090891E-16,-1.0));
#767=DIRECTION('',(1.22460635382238E-16,-1.0,-2.45190164888482E-29));
#768=DIRECTION('',(-6.12303176911189E-17,2.45115181852391E-29,-1.0));
#769=DIRECTION('',(1.22460635382238E-16,-1.0,-2.45190164888482E-29));
#770=CARTESIAN_POINT('',(-15.0000000000011,-7.0,-63.0));
#771=DIRECTION('',(3.00261433817191E-45,-2.45190164888482E-29,1.0));
#772=DIRECTION('',(0.0,-1.0,-2.45190164888482E-29));
#773=DIRECTION('',(-0.5,-0.866025403784439,-2.1234091155152E-29));
#774=DIRECTION('',(-1.0,-1.22460635382238E-16,0.0));
#775=DIRECTION('',(-0.499999999999999,0.866025403784439,2.12340911551521E-29));
#776=CARTESIAN_POINT('',(-15.0000000000011,-7.0,-60.2));
#777=DIRECTION('',(-1.22460635382238E-16,2.450401988163E-29,-1.0));
#778=DIRECTION('',(-1.0,4.83256582634407E-60,1.22460635382238E-16));
#779=DIRECTION('',(0.5,0.866025403784439,-6.12303176910976E-17));
#780=DIRECTION('',(0.499999999999999,-0.866025403784439,-6.12303176911398E-17));
#781=DIRECTION('',(1.0,1.22460635382238E-16,-1.22460635382238E-16));
#782=DIRECTION('',(-0.5,-0.866025403784439,-2.1234091155152E-29));
#783=DIRECTION('',(-1.23086802860452E-16,2.45039432007627E-29,-1.0));
#784=DIRECTION('',(-0.5,-0.866025403784439,0.0));
#785=DIRECTION('',(0.5,0.866025403784439,-6.12303176910976E-17));
#786=DIRECTION('',(0.5,-0.866025403784439,0.0));
#787=DIRECTION('',(-1.23086802860452E-16,2.45039432007627E-29,-1.0));
#788=DIRECTION('',(-1.23086802860452E-16,2.45039432007627E-29,-1.0));
#789=DIRECTION('',(1.0,2.11528701825993E-16,0.0));
#790=DIRECTION('',(-1.23086802860452E-16,2.45039432007627E-29,-1.0));
#791=DIRECTION('',(0.5,0.866025403784438,0.0));
#792=CARTESIAN_POINT('',(-15.0000000000011,-7.0,-43.0));
#793=DIRECTION('',(0.0,0.0,1.0));
#794=DIRECTION('',(1.0,0.0,0.0));
#795=DIRECTION('',(-0.5,0.866025403784439,0.0));
#796=CARTESIAN_POINT('',(-15.0000000000011,-7.0,-45.0));
#797=DIRECTION('',(-1.22460635382238E-16,2.450401988163E-29,-1.0));
#798=DIRECTION('',(-1.0,4.83256582634407E-60,1.22460635382238E-16));
#799=DIRECTION('',(0.499999999999999,-0.866025403784439,-6.12303176911398E-17));
#800=DIRECTION('',(1.0,1.22460635382238E-16,-1.22460635382238E-16));
#801=DIRECTION('',(-1.0,-1.22460635382238E-16,0.0));
#802=CARTESIAN_POINT('',(-15.0000000000011,-7.0,-47.8));
#803=DIRECTION('',(3.00261433817191E-45,-2.45190164888482E-29,1.0));
#804=DIRECTION('',(0.0,-1.0,-2.45190164888482E-29));
#805=DIRECTION('',(-0.499999999999999,0.866025403784439,2.12340911551521E-29));
ENDSEC;
END-ISO-10303-21;
