ISO-10303-21;
HEADER;
FILE_DESCRIPTION(('STEP AP203'),'1');
FILE_NAME('rio.stp','2022-08-30T22:41:35',(' '),(' '),'Spatial InterOp 3D',' ',' ');
FILE_SCHEMA(('CONFIG_CONTROL_DESIGN'));
ENDSEC;
DATA;
#1=DESIGN_CONTEXT('',#33,'design');
#2=APPLICATION_PROTOCOL_DEFINITION('INTERNATIONAL STANDARD','config_control_design',1994,#33);
#3=PRODUCT_CATEGORY_RELATIONSHIP('NONE','NONE',#34,#35);
#4=DATE_AND_TIME(#36,#37);
#5=DATE_TIME_ROLE('creation_date');
#6=DATE_TIME_ROLE('classification_date');
#7=PERSON_AND_ORGANIZATION_ROLE('creator');
#8=PERSON_AND_ORGANIZATION_ROLE('design_supplier');
#9=PERSON_AND_ORGANIZATION_ROLE('classification_officer');
#10=PERSON_AND_ORGANIZATION_ROLE('design_owner');
#11=APPROVAL_PERSON_ORGANIZATION(#38,#39,#40);
#12=APPROVAL_DATE_TIME(#4,#39);
#13=CC_DESIGN_APPROVAL(#39,(#41,#42,#43));
#14=CC_DESIGN_DATE_AND_TIME_ASSIGNMENT(#4,#5,(#43));
#15=CC_DESIGN_DATE_AND_TIME_ASSIGNMENT(#4,#6,(#41));
#16=CC_DESIGN_PERSON_AND_ORGANIZATION_ASSIGNMENT(#38,#10,(#44));
#17=CC_DESIGN_PERSON_AND_ORGANIZATION_ASSIGNMENT(#38,#7,(#43));
#18=CC_DESIGN_PERSON_AND_ORGANIZATION_ASSIGNMENT(#38,#7,(#42));
#19=CC_DESIGN_PERSON_AND_ORGANIZATION_ASSIGNMENT(#38,#8,(#42));
#20=CC_DESIGN_SECURITY_CLASSIFICATION(#41,(#42));
#21=CC_DESIGN_PERSON_AND_ORGANIZATION_ASSIGNMENT(#38,#9,(#41));
#22=SHAPE_DEFINITION_REPRESENTATION(#45,#46);
#23= (GEOMETRIC_REPRESENTATION_CONTEXT(3)GLOBAL_UNCERTAINTY_ASSIGNED_CONTEXT((#49))GLOBAL_UNIT_ASSIGNED_CONTEXT((#51,#52,#53))REPRESENTATION_CONTEXT('NONE','WORKSPACE'));
#24=PROPERTY_DEFINITION_REPRESENTATION(#55,#56);
#25=GENERAL_PROPERTY_ASSOCIATION('','',#57,#55);
#26=PROPERTY_DEFINITION_REPRESENTATION(#58,#59);
#27=GENERAL_PROPERTY_ASSOCIATION('','',#60,#58);
#28=PROPERTY_DEFINITION_REPRESENTATION(#61,#62);
#29=GENERAL_PROPERTY_ASSOCIATION('','',#63,#61);
#33=APPLICATION_CONTEXT('CONFIGURATION CONTROLLED 3D DESIGNS OF MECHANICAL PARTS AND ASSEMBLIES');
#34=PRODUCT_CATEGORY('part','NONE');
#35=PRODUCT_RELATED_PRODUCT_CATEGORY('detail',' ',(#44));
#36=CALENDAR_DATE(2022,30,7);
#37=LOCAL_TIME(19,41,35.0,#64);
#38=PERSON_AND_ORGANIZATION(#65,#66);
#39=APPROVAL(#67,'SOLID MODEL');
#40=APPROVAL_ROLE('APPROVED');
#41=SECURITY_CLASSIFICATION('','',#68);
#42=PRODUCT_DEFINITION_FORMATION_WITH_SPECIFIED_SOURCE('A','NONE',#44,.NOT_KNOWN.);
#43=PRODUCT_DEFINITION('','NONE',#42,#1);
#44=PRODUCT('Eixo do Roller (fixo)','','PART--DESC',(#69));
#45=PRODUCT_DEFINITION_SHAPE('NONE','NONE',#43);
#46=ADVANCED_BREP_SHAPE_REPRESENTATION('1',(#70,#71),#23);
#49=UNCERTAINTY_MEASURE_WITH_UNIT(LENGTH_MEASURE(0.001),#51,'','');
#51= (CONVERSION_BASED_UNIT('MILLIMETRE',#74)LENGTH_UNIT()NAMED_UNIT(#77));
#52= (NAMED_UNIT(#79)PLANE_ANGLE_UNIT()SI_UNIT($,.RADIAN.));
#53= (NAMED_UNIT(#79)SOLID_ANGLE_UNIT()SI_UNIT($,.STERADIAN.));
#55=PROPERTY_DEFINITION('PdmObjectId','',#43);
#56=REPRESENTATION('',(#85),#23);
#57=GENERAL_PROPERTY('','19_d3377a49-e31a-4249-9e22-44a8cb146317&2_80_0_97','');
#58=PROPERTY_DEFINITION('CreationDate','',#43);
#59=REPRESENTATION('',(#86),#23);
#60=GENERAL_PROPERTY('','01/07/2022 18:47:11','');
#61=PROPERTY_DEFINITION('Minor Revision','',#43);
#62=REPRESENTATION('',(#87),#23);
#63=GENERAL_PROPERTY('','15','');
#64=COORDINATED_UNIVERSAL_TIME_OFFSET(3,0,.BEHIND.);
#65=PERSON('','UNSPECIFIED',$,$,$,$);
#66=ORGANIZATION('UNSPECIFIED','UNSPECIFIED','UNSPECIFIED');
#67=APPROVAL_STATUS('approved');
#68=SECURITY_CLASSIFICATION_LEVEL('unclassified');
#69=MECHANICAL_CONTEXT('',#33,'mechanical');
#70=MANIFOLD_SOLID_BREP('1',#88);
#71=AXIS2_PLACEMENT_3D('',#89,#90,#91);
#74=LENGTH_MEASURE_WITH_UNIT(LENGTH_MEASURE(1.0),#92);
#77=DIMENSIONAL_EXPONENTS(1.0,0.0,0.0,0.0,0.0,0.0,0.0);
#79=DIMENSIONAL_EXPONENTS(0.0,0.0,0.0,0.0,0.0,0.0,0.0);
#85=VALUE_REPRESENTATION_ITEM('19_d3377a49-e31a-4249-9e22-44a8cb146317&2_80_0_97',);
#86=VALUE_REPRESENTATION_ITEM('01/07/2022 18:47:11',);
#87=VALUE_REPRESENTATION_ITEM('15',);
#88=CLOSED_SHELL('',(#93,#94,#95,#96,#97));
#89=CARTESIAN_POINT('',(0.0,0.0,0.0));
#90=DIRECTION('',(0.0,0.0,1.0));
#91=DIRECTION('',(1.0,0.0,0.0));
#92= (NAMED_UNIT(#77)LENGTH_UNIT()SI_UNIT(.MILLI.,.METRE.));
#93=ADVANCED_FACE('',(#99,#100),#101,.T.);
#94=ADVANCED_FACE('',(#102),#103,.T.);
#95=ADVANCED_FACE('',(#104,#105),#106,.F.);
#96=ADVANCED_FACE('',(#107,#108),#109,.T.);
#97=ADVANCED_FACE('',(#110),#111,.T.);
#99=FACE_OUTER_BOUND('',#112,.T.);
#100=FACE_OUTER_BOUND('',#113,.T.);
#101=CYLINDRICAL_SURFACE('',#114,1.75);
#102=FACE_OUTER_BOUND('',#115,.T.);
#103=PLANE('',#116);
#104=FACE_BOUND('',#117,.T.);
#105=FACE_OUTER_BOUND('',#118,.T.);
#106=PLANE('',#119);
#107=FACE_OUTER_BOUND('',#120,.T.);
#108=FACE_OUTER_BOUND('',#121,.T.);
#109=CYLINDRICAL_SURFACE('',#122,1.45);
#110=FACE_OUTER_BOUND('',#123,.T.);
#111=PLANE('',#124);
#112=EDGE_LOOP('',(#125));
#113=EDGE_LOOP('',(#126));
#114=AXIS2_PLACEMENT_3D('',#127,#128,#129);
#115=EDGE_LOOP('',(#130));
#116=AXIS2_PLACEMENT_3D('',#131,#132,#133);
#117=EDGE_LOOP('',(#134));
#118=EDGE_LOOP('',(#135));
#119=AXIS2_PLACEMENT_3D('',#136,#137,#138);
#120=EDGE_LOOP('',(#139));
#121=EDGE_LOOP('',(#140));
#122=AXIS2_PLACEMENT_3D('',#141,#142,#143);
#123=EDGE_LOOP('',(#144));
#124=AXIS2_PLACEMENT_3D('',#145,#146,#147);
#125=ORIENTED_EDGE('',*,*,#148,.T.);
#126=ORIENTED_EDGE('',*,*,#149,.F.);
#127=CARTESIAN_POINT('',(-34.0,64.0000000000119,-37.2981917306041));
#128=DIRECTION('',(-1.0,6.52746758015661E-16,-4.85216717025555E-18));
#129=DIRECTION('',(6.52746758015661E-16,1.0,0.0));
#130=ORIENTED_EDGE('',*,*,#149,.T.);
#131=CARTESIAN_POINT('',(-34.0,58.9999999999869,-44.7815065041352));
#132=DIRECTION('',(1.0,-6.52746758015661E-16,4.85216717025555E-18));
#133=DIRECTION('',(-6.52746758015677E-16,-1.0,3.3446381819994E-12));
#134=ORIENTED_EDGE('',*,*,#150,.T.);
#135=ORIENTED_EDGE('',*,*,#148,.F.);
#136=CARTESIAN_POINT('',(-40.0,64.0000000000119,-37.2981917306041));
#137=DIRECTION('',(1.0,-6.45577501920371E-16,2.14311683391993E-19));
#138=DIRECTION('',(1.39761476401237E-16,0.216166504219879,-0.976356514011843));
#139=ORIENTED_EDGE('',*,*,#151,.F.);
#140=ORIENTED_EDGE('',*,*,#150,.F.);
#141=CARTESIAN_POINT('',(-43.0,64.0000000000119,-37.2981917306041));
#142=DIRECTION('',(1.0,-6.50465654403735E-16,2.74515238162105E-18));
#143=DIRECTION('',(-6.50465654403735E-16,-1.0,0.0));
#144=ORIENTED_EDGE('',*,*,#151,.T.);
#145=CARTESIAN_POINT('',(-45.0,64.0000000000119,-37.2981917306041));
#146=DIRECTION('',(-1.0,6.50465654403735E-16,-2.74515238162105E-18));
#147=DIRECTION('',(-6.50465654403735E-16,-1.0,0.0));
#148=EDGE_CURVE('',#152,#152,#153,.T.);
#149=EDGE_CURVE('',#154,#154,#155,.T.);
#150=EDGE_CURVE('',#156,#156,#157,.T.);
#151=EDGE_CURVE('',#158,#158,#159,.T.);
#152=VERTEX_POINT('',#160);
#153=CIRCLE('',#161,1.75);
#154=VERTEX_POINT('',#162);
#155=CIRCLE('',#163,1.75);
#156=VERTEX_POINT('',#164);
#157=CIRCLE('',#165,1.45);
#158=VERTEX_POINT('',#166);
#159=CIRCLE('',#167,1.45);
#160=CARTESIAN_POINT('',(-40.0,65.7500000000119,-37.2981917306041));
#161=AXIS2_PLACEMENT_3D('',#168,#169,#170);
#162=CARTESIAN_POINT('',(-34.0,65.7500000000119,-37.2981917306041));
#163=AXIS2_PLACEMENT_3D('',#171,#172,#173);
#164=CARTESIAN_POINT('',(-40.0,65.4500000000119,-37.2981917306041));
#165=AXIS2_PLACEMENT_3D('',#174,#175,#176);
#166=CARTESIAN_POINT('',(-45.0,62.5500000000119,-37.2981917306041));
#167=AXIS2_PLACEMENT_3D('',#177,#178,#179);
#168=CARTESIAN_POINT('',(-40.0,64.0000000000119,-37.2981917306041));
#169=DIRECTION('',(1.0,-6.45577501920371E-16,2.14311683391993E-19));
#170=DIRECTION('',(6.45577501920371E-16,1.0,0.0));
#171=CARTESIAN_POINT('',(-34.0,64.0000000000119,-37.2981917306041));
#172=DIRECTION('',(1.0,-6.52746758015661E-16,4.85216717025555E-18));
#173=DIRECTION('',(6.52746758015661E-16,1.0,0.0));
#174=CARTESIAN_POINT('',(-40.0,64.0000000000119,-37.2981917306041));
#175=DIRECTION('',(1.0,-6.45577501920371E-16,2.14311683391993E-19));
#176=DIRECTION('',(6.45577501920371E-16,1.0,0.0));
#177=CARTESIAN_POINT('',(-45.0,64.0000000000119,-37.2981917306041));
#178=DIRECTION('',(-1.0,6.50465654403735E-16,-2.74515238162105E-18));
#179=DIRECTION('',(-6.50465654403735E-16,-1.0,0.0));
ENDSEC;
END-ISO-10303-21;
