ISO-10303-21;
HEADER;
FILE_DESCRIPTION(('STEP AP203'),'1');
FILE_NAME('Suporte do Carretel Flat.stp','2022-12-07T18:56:53',(' '),(' '),'Spatial InterOp 3D',' ',' ');
FILE_SCHEMA(('CONFIG_CONTROL_DESIGN'));
ENDSEC;
DATA;
#1=DESIGN_CONTEXT('',#33,'design');
#2=APPLICATION_PROTOCOL_DEFINITION('INTERNATIONAL STANDARD','config_control_design',1994,#33);
#3=PRODUCT_CATEGORY_RELATIONSHIP('NONE','NONE',#34,#35);
#4=DATE_AND_TIME(#36,#37);
#5=DATE_TIME_ROLE('creation_date');
#6=DATE_TIME_ROLE('classification_date');
#7=PERSON_AND_ORGANIZATION_ROLE('creator');
#8=PERSON_AND_ORGANIZATION_ROLE('design_supplier');
#9=PERSON_AND_ORGANIZATION_ROLE('classification_officer');
#10=PERSON_AND_ORGANIZATION_ROLE('design_owner');
#11=APPROVAL_PERSON_ORGANIZATION(#38,#39,#40);
#12=APPROVAL_DATE_TIME(#4,#39);
#13=CC_DESIGN_APPROVAL(#39,(#41,#42,#43));
#14=CC_DESIGN_DATE_AND_TIME_ASSIGNMENT(#4,#5,(#43));
#15=CC_DESIGN_DATE_AND_TIME_ASSIGNMENT(#4,#6,(#41));
#16=CC_DESIGN_PERSON_AND_ORGANIZATION_ASSIGNMENT(#38,#10,(#44));
#17=CC_DESIGN_PERSON_AND_ORGANIZATION_ASSIGNMENT(#38,#7,(#43));
#18=CC_DESIGN_PERSON_AND_ORGANIZATION_ASSIGNMENT(#38,#7,(#42));
#19=CC_DESIGN_PERSON_AND_ORGANIZATION_ASSIGNMENT(#38,#8,(#42));
#20=CC_DESIGN_SECURITY_CLASSIFICATION(#41,(#42));
#21=CC_DESIGN_PERSON_AND_ORGANIZATION_ASSIGNMENT(#38,#9,(#41));
#22=SHAPE_DEFINITION_REPRESENTATION(#45,#46);
#23= (GEOMETRIC_REPRESENTATION_CONTEXT(3)GLOBAL_UNCERTAINTY_ASSIGNED_CONTEXT((#49))GLOBAL_UNIT_ASSIGNED_CONTEXT((#51,#52,#53))REPRESENTATION_CONTEXT('NONE','WORKSPACE'));
#24=PROPERTY_DEFINITION_REPRESENTATION(#55,#56);
#25=GENERAL_PROPERTY_ASSOCIATION('','',#57,#55);
#26=PROPERTY_DEFINITION_REPRESENTATION(#58,#59);
#27=GENERAL_PROPERTY_ASSOCIATION('','',#60,#58);
#28=PROPERTY_DEFINITION_REPRESENTATION(#61,#62);
#29=GENERAL_PROPERTY_ASSOCIATION('','',#63,#61);
#33=APPLICATION_CONTEXT('CONFIGURATION CONTROLLED 3D DESIGNS OF MECHANICAL PARTS AND ASSEMBLIES');
#34=PRODUCT_CATEGORY('part','NONE');
#35=PRODUCT_RELATED_PRODUCT_CATEGORY('detail',' ',(#44));
#36=CALENDAR_DATE(2022,7,11);
#37=LOCAL_TIME(15,56,53.0,#64);
#38=PERSON_AND_ORGANIZATION(#65,#66);
#39=APPROVAL(#67,'SOLID MODEL');
#40=APPROVAL_ROLE('APPROVED');
#41=SECURITY_CLASSIFICATION('','',#68);
#42=PRODUCT_DEFINITION_FORMATION_WITH_SPECIFIED_SOURCE('A','NONE',#44,.NOT_KNOWN.);
#43=PRODUCT_DEFINITION('','NONE',#42,#1);
#44=PRODUCT('Suporte do Carretel Flat','','PART--DESC',(#69));
#45=PRODUCT_DEFINITION_SHAPE('NONE','NONE',#43);
#46=ADVANCED_BREP_SHAPE_REPRESENTATION('1',(#70,#71),#23);
#49=UNCERTAINTY_MEASURE_WITH_UNIT(LENGTH_MEASURE(0.001),#51,'','');
#51= (CONVERSION_BASED_UNIT('MILLIMETRE',#74)LENGTH_UNIT()NAMED_UNIT(#77));
#52= (NAMED_UNIT(#79)PLANE_ANGLE_UNIT()SI_UNIT($,.RADIAN.));
#53= (NAMED_UNIT(#79)SOLID_ANGLE_UNIT()SI_UNIT($,.STERADIAN.));
#55=PROPERTY_DEFINITION('PdmObjectId','',#43);
#56=REPRESENTATION('',(#85),#23);
#57=GENERAL_PROPERTY('','19_7683ec67-2c7c-47a4-b1d3-44d0ea5bc769&2_3_0_242','');
#58=PROPERTY_DEFINITION('CreationDate','',#43);
#59=REPRESENTATION('',(#86),#23);
#60=GENERAL_PROPERTY('','25/04/2022 17:21:27','');
#61=PROPERTY_DEFINITION('Minor Revision','',#43);
#62=REPRESENTATION('',(#87),#23);
#63=GENERAL_PROPERTY('','31','');
#64=COORDINATED_UNIVERSAL_TIME_OFFSET(3,0,.BEHIND.);
#65=PERSON('','UNSPECIFIED',$,$,$,$);
#66=ORGANIZATION('UNSPECIFIED','UNSPECIFIED','UNSPECIFIED');
#67=APPROVAL_STATUS('approved');
#68=SECURITY_CLASSIFICATION_LEVEL('unclassified');
#69=MECHANICAL_CONTEXT('',#33,'mechanical');
#70=MANIFOLD_SOLID_BREP('1',#88);
#71=AXIS2_PLACEMENT_3D('',#89,#90,#91);
#74=LENGTH_MEASURE_WITH_UNIT(LENGTH_MEASURE(1.0),#92);
#77=DIMENSIONAL_EXPONENTS(1.0,0.0,0.0,0.0,0.0,0.0,0.0);
#79=DIMENSIONAL_EXPONENTS(0.0,0.0,0.0,0.0,0.0,0.0,0.0);
#85=VALUE_REPRESENTATION_ITEM('19_7683ec67-2c7c-47a4-b1d3-44d0ea5bc769&2_3_0_242',);
#86=VALUE_REPRESENTATION_ITEM('25/04/2022 17:21:27',);
#87=VALUE_REPRESENTATION_ITEM('31',);
#88=CLOSED_SHELL('',(#93,#94,#95,#96,#97,#98,#99,#100,#101,#102,#103,#104,#105,#106,#107,#108,#109,#110,#111,#112));
#89=CARTESIAN_POINT('',(0.0,0.0,0.0));
#90=DIRECTION('',(0.0,0.0,1.0));
#91=DIRECTION('',(1.0,0.0,0.0));
#92= (NAMED_UNIT(#77)LENGTH_UNIT()SI_UNIT(.MILLI.,.METRE.));
#93=ADVANCED_FACE('',(#114,#115),#116,.T.);
#94=ADVANCED_FACE('',(#117),#118,.F.);
#95=ADVANCED_FACE('',(#119),#120,.F.);
#96=ADVANCED_FACE('',(#121),#122,.F.);
#97=ADVANCED_FACE('',(#123),#124,.F.);
#98=ADVANCED_FACE('',(#125,#126),#127,.T.);
#99=ADVANCED_FACE('',(#128),#129,.T.);
#100=ADVANCED_FACE('',(#130,#131),#132,.T.);
#101=ADVANCED_FACE('',(#133),#134,.T.);
#102=ADVANCED_FACE('',(#135),#136,.T.);
#103=ADVANCED_FACE('',(#137),#138,.T.);
#104=ADVANCED_FACE('',(#139),#140,.T.);
#105=ADVANCED_FACE('',(#141),#142,.T.);
#106=ADVANCED_FACE('',(#143,#144),#145,.F.);
#107=ADVANCED_FACE('',(#146),#147,.F.);
#108=ADVANCED_FACE('',(#148,#149),#150,.F.);
#109=ADVANCED_FACE('',(#151),#152,.F.);
#110=ADVANCED_FACE('',(#153,#154),#155,.F.);
#111=ADVANCED_FACE('',(#156,#157),#158,.F.);
#112=ADVANCED_FACE('',(#159,#160),#161,.F.);
#114=FACE_BOUND('',#162,.T.);
#115=FACE_OUTER_BOUND('',#163,.T.);
#116=PLANE('',#164);
#117=FACE_OUTER_BOUND('',#165,.T.);
#118=CYLINDRICAL_SURFACE('',#166,4.0);
#119=FACE_OUTER_BOUND('',#167,.T.);
#120=PLANE('',#168);
#121=FACE_OUTER_BOUND('',#169,.T.);
#122=CYLINDRICAL_SURFACE('',#170,4.0);
#123=FACE_OUTER_BOUND('',#171,.T.);
#124=PLANE('',#172);
#125=FACE_BOUND('',#173,.T.);
#126=FACE_OUTER_BOUND('',#174,.T.);
#127=PLANE('',#175);
#128=FACE_OUTER_BOUND('',#176,.T.);
#129=PLANE('',#177);
#130=FACE_BOUND('',#178,.T.);
#131=FACE_OUTER_BOUND('',#179,.T.);
#132=PLANE('',#180);
#133=FACE_OUTER_BOUND('',#181,.T.);
#134=PLANE('',#182);
#135=FACE_OUTER_BOUND('',#183,.T.);
#136=CYLINDRICAL_SURFACE('',#184,2.0);
#137=FACE_OUTER_BOUND('',#185,.T.);
#138=CYLINDRICAL_SURFACE('',#186,2.0);
#139=FACE_OUTER_BOUND('',#187,.T.);
#140=CYLINDRICAL_SURFACE('',#188,2.0);
#141=FACE_OUTER_BOUND('',#189,.T.);
#142=CYLINDRICAL_SURFACE('',#190,2.0);
#143=FACE_BOUND('',#191,.T.);
#144=FACE_OUTER_BOUND('',#192,.T.);
#145=PLANE('',#193);
#146=FACE_OUTER_BOUND('',#194,.T.);
#147=PLANE('',#195);
#148=FACE_BOUND('',#196,.T.);
#149=FACE_OUTER_BOUND('',#197,.T.);
#150=PLANE('',#198);
#151=FACE_OUTER_BOUND('',#199,.T.);
#152=PLANE('',#200);
#153=FACE_OUTER_BOUND('',#201,.T.);
#154=FACE_OUTER_BOUND('',#202,.T.);
#155=CYLINDRICAL_SURFACE('',#203,1.5);
#156=FACE_OUTER_BOUND('',#204,.T.);
#157=FACE_OUTER_BOUND('',#205,.T.);
#158=CYLINDRICAL_SURFACE('',#206,1.5);
#159=FACE_OUTER_BOUND('',#207,.T.);
#160=FACE_BOUND('',#208,.T.);
#161=PLANE('',#209);
#162=EDGE_LOOP('',(#210,#211,#212,#213));
#163=EDGE_LOOP('',(#214,#215,#216,#217));
#164=AXIS2_PLACEMENT_3D('',#218,#219,#220);
#165=EDGE_LOOP('',(#221,#222,#223,#224));
#166=AXIS2_PLACEMENT_3D('',#225,#226,#227);
#167=EDGE_LOOP('',(#228,#229,#230,#231));
#168=AXIS2_PLACEMENT_3D('',#232,#233,#234);
#169=EDGE_LOOP('',(#235,#236,#237,#238));
#170=AXIS2_PLACEMENT_3D('',#239,#240,#241);
#171=EDGE_LOOP('',(#242,#243,#244,#245));
#172=AXIS2_PLACEMENT_3D('',#246,#247,#248);
#173=EDGE_LOOP('',(#249));
#174=EDGE_LOOP('',(#250,#251,#252,#253,#254,#255));
#175=AXIS2_PLACEMENT_3D('',#256,#257,#258);
#176=EDGE_LOOP('',(#259,#260,#261,#262,#263,#264,#265,#266));
#177=AXIS2_PLACEMENT_3D('',#267,#268,#269);
#178=EDGE_LOOP('',(#270));
#179=EDGE_LOOP('',(#271,#272,#273,#274,#275,#276));
#180=AXIS2_PLACEMENT_3D('',#277,#278,#279);
#181=EDGE_LOOP('',(#280,#281,#282,#283,#284,#285,#286,#287));
#182=AXIS2_PLACEMENT_3D('',#288,#289,#290);
#183=EDGE_LOOP('',(#291,#292,#293,#294));
#184=AXIS2_PLACEMENT_3D('',#295,#296,#297);
#185=EDGE_LOOP('',(#298,#299,#300,#301));
#186=AXIS2_PLACEMENT_3D('',#302,#303,#304);
#187=EDGE_LOOP('',(#305,#306,#307,#308));
#188=AXIS2_PLACEMENT_3D('',#309,#310,#311);
#189=EDGE_LOOP('',(#312,#313,#314,#315));
#190=AXIS2_PLACEMENT_3D('',#316,#317,#318);
#191=EDGE_LOOP('',(#319));
#192=EDGE_LOOP('',(#320,#321,#322,#323,#324,#325));
#193=AXIS2_PLACEMENT_3D('',#326,#327,#328);
#194=EDGE_LOOP('',(#329,#330,#331,#332));
#195=AXIS2_PLACEMENT_3D('',#333,#334,#335);
#196=EDGE_LOOP('',(#336));
#197=EDGE_LOOP('',(#337,#338,#339,#340,#341,#342));
#198=AXIS2_PLACEMENT_3D('',#343,#344,#345);
#199=EDGE_LOOP('',(#346,#347,#348,#349));
#200=AXIS2_PLACEMENT_3D('',#350,#351,#352);
#201=EDGE_LOOP('',(#353));
#202=EDGE_LOOP('',(#354));
#203=AXIS2_PLACEMENT_3D('',#355,#356,#357);
#204=EDGE_LOOP('',(#358));
#205=EDGE_LOOP('',(#359));
#206=AXIS2_PLACEMENT_3D('',#360,#361,#362);
#207=EDGE_LOOP('',(#363,#364,#365,#366));
#208=EDGE_LOOP('',(#367,#368,#369,#370));
#209=AXIS2_PLACEMENT_3D('',#371,#372,#373);
#210=ORIENTED_EDGE('',*,*,#374,.F.);
#211=ORIENTED_EDGE('',*,*,#375,.F.);
#212=ORIENTED_EDGE('',*,*,#376,.F.);
#213=ORIENTED_EDGE('',*,*,#377,.F.);
#214=ORIENTED_EDGE('',*,*,#378,.T.);
#215=ORIENTED_EDGE('',*,*,#379,.T.);
#216=ORIENTED_EDGE('',*,*,#380,.T.);
#217=ORIENTED_EDGE('',*,*,#381,.T.);
#218=CARTESIAN_POINT('',(1.66701157767274E-09,61.000000000391,-2.53076430380465E-09));
#219=DIRECTION('',(2.73279602581482E-11,1.0,-4.14879590828952E-11));
#220=DIRECTION('',(-1.0,2.73279602581482E-11,0.0));
#221=ORIENTED_EDGE('',*,*,#374,.T.);
#222=ORIENTED_EDGE('',*,*,#382,.F.);
#223=ORIENTED_EDGE('',*,*,#383,.F.);
#224=ORIENTED_EDGE('',*,*,#384,.T.);
#225=CARTESIAN_POINT('',(20.0000000012573,57.9999999997594,-2.05000000198133));
#226=DIRECTION('',(2.7329013519332E-11,1.0,-4.14878169283772E-11));
#227=DIRECTION('',(-1.0,2.7329013519332E-11,-4.36975071723615E-26));
#228=ORIENTED_EDGE('',*,*,#377,.T.);
#229=ORIENTED_EDGE('',*,*,#385,.F.);
#230=ORIENTED_EDGE('',*,*,#386,.F.);
#231=ORIENTED_EDGE('',*,*,#382,.T.);
#232=CARTESIAN_POINT('',(1.22710933338829E-09,58.00000000014,-6.05000000183049));
#233=DIRECTION('',(-7.54263318583217E-12,-4.1487816928171E-11,-1.0));
#234=DIRECTION('',(-1.0,2.73290135196449E-11,7.54263318469835E-12));
#235=ORIENTED_EDGE('',*,*,#376,.T.);
#236=ORIENTED_EDGE('',*,*,#387,.F.);
#237=ORIENTED_EDGE('',*,*,#388,.F.);
#238=ORIENTED_EDGE('',*,*,#385,.T.);
#239=CARTESIAN_POINT('',(-19.9999999987427,58.0000000008525,-2.05000000167964));
#240=DIRECTION('',(2.7329013519332E-11,1.0,-4.14878169283772E-11));
#241=DIRECTION('',(-1.0,2.7329013519332E-11,-4.36975071723615E-26));
#242=ORIENTED_EDGE('',*,*,#375,.T.);
#243=ORIENTED_EDGE('',*,*,#384,.F.);
#244=ORIENTED_EDGE('',*,*,#389,.F.);
#245=ORIENTED_EDGE('',*,*,#387,.T.);
#246=CARTESIAN_POINT('',(1.28742686829815E-09,58.0000000004719,1.94999999816952));
#247=DIRECTION('',(7.54208951265277E-12,4.1487816928171E-11,1.0));
#248=DIRECTION('',(1.0,-2.73290135196449E-11,-7.54208951151895E-12));
#249=ORIENTED_EDGE('',*,*,#390,.T.);
#250=ORIENTED_EDGE('',*,*,#391,.T.);
#251=ORIENTED_EDGE('',*,*,#392,.T.);
#252=ORIENTED_EDGE('',*,*,#393,.T.);
#253=ORIENTED_EDGE('',*,*,#394,.T.);
#254=ORIENTED_EDGE('',*,*,#395,.F.);
#255=ORIENTED_EDGE('',*,*,#396,.T.);
#256=CARTESIAN_POINT('',(-26.999999998739,58.0000000010645,-1.5500000016266));
#257=DIRECTION('',(-1.0,2.73290135196449E-11,7.5408184742071E-12));
#258=DIRECTION('',(7.54081847534092E-12,4.14878169281711E-11,1.0));
#259=ORIENTED_EDGE('',*,*,#395,.T.);
#260=ORIENTED_EDGE('',*,*,#397,.T.);
#261=ORIENTED_EDGE('',*,*,#398,.T.);
#262=ORIENTED_EDGE('',*,*,#378,.F.);
#263=ORIENTED_EDGE('',*,*,#399,.T.);
#264=ORIENTED_EDGE('',*,*,#400,.T.);
#265=ORIENTED_EDGE('',*,*,#401,.F.);
#266=ORIENTED_EDGE('',*,*,#402,.T.);
#267=CARTESIAN_POINT('',(1.21201154333601E-09,58.000000000057,-8.05000000182998));
#268=DIRECTION('',(-7.54196705201739E-12,-4.1487816928171E-11,-1.0));
#269=DIRECTION('',(-1.0,2.73290135196449E-11,7.54196705088357E-12));
#270=ORIENTED_EDGE('',*,*,#403,.F.);
#271=ORIENTED_EDGE('',*,*,#404,.F.);
#272=ORIENTED_EDGE('',*,*,#405,.T.);
#273=ORIENTED_EDGE('',*,*,#406,.F.);
#274=ORIENTED_EDGE('',*,*,#407,.T.);
#275=ORIENTED_EDGE('',*,*,#401,.T.);
#276=ORIENTED_EDGE('',*,*,#408,.T.);
#277=CARTESIAN_POINT('',(27.000000001261,57.9999999995888,-1.55000000203404));
#278=DIRECTION('',(1.0,-2.73290135196448E-11,-7.54025192436186E-12));
#279=DIRECTION('',(-7.54025192549568E-12,-4.14878169281711E-11,-1.0));
#280=ORIENTED_EDGE('',*,*,#409,.T.);
#281=ORIENTED_EDGE('',*,*,#410,.T.);
#282=ORIENTED_EDGE('',*,*,#391,.F.);
#283=ORIENTED_EDGE('',*,*,#411,.T.);
#284=ORIENTED_EDGE('',*,*,#406,.T.);
#285=ORIENTED_EDGE('',*,*,#412,.T.);
#286=ORIENTED_EDGE('',*,*,#413,.T.);
#287=ORIENTED_EDGE('',*,*,#380,.F.);
#288=CARTESIAN_POINT('',(1.31003331718845E-09,58.0000000005963,4.94999999816934));
#289=DIRECTION('',(7.54875085080052E-12,4.14878169281709E-11,1.0));
#290=DIRECTION('',(1.0,-2.73290135196451E-11,-7.5487508496667E-12));
#291=ORIENTED_EDGE('',*,*,#414,.F.);
#292=ORIENTED_EDGE('',*,*,#415,.F.);
#293=ORIENTED_EDGE('',*,*,#392,.F.);
#294=ORIENTED_EDGE('',*,*,#410,.F.);
#295=CARTESIAN_POINT('',(1.29493476844573E-09,66.5500000005134,2.94999999781461));
#296=DIRECTION('',(1.0,1.22460635375415E-16,-7.54875085080053E-12));
#297=DIRECTION('',(-7.54875085080053E-12,0.0,-1.0));
#298=ORIENTED_EDGE('',*,*,#394,.F.);
#299=ORIENTED_EDGE('',*,*,#416,.F.);
#300=ORIENTED_EDGE('',*,*,#417,.F.);
#301=ORIENTED_EDGE('',*,*,#397,.F.);
#302=CARTESIAN_POINT('',(1.22709443039894E-09,66.55000000014,-6.0500000021847));
#303=DIRECTION('',(-1.0,-1.2246063565686E-16,7.5419670520174E-12));
#304=DIRECTION('',(7.5419670520174E-12,0.0,1.0));
#305=ORIENTED_EDGE('',*,*,#405,.F.);
#306=ORIENTED_EDGE('',*,*,#418,.F.);
#307=ORIENTED_EDGE('',*,*,#419,.F.);
#308=ORIENTED_EDGE('',*,*,#412,.F.);
#309=CARTESIAN_POINT('',(1.29493476844573E-09,66.5500000005134,2.94999999781461));
#310=DIRECTION('',(1.0,1.22460635375415E-16,-7.54875085080053E-12));
#311=DIRECTION('',(-7.54875085080053E-12,0.0,-1.0));
#312=ORIENTED_EDGE('',*,*,#420,.F.);
#313=ORIENTED_EDGE('',*,*,#421,.F.);
#314=ORIENTED_EDGE('',*,*,#408,.F.);
#315=ORIENTED_EDGE('',*,*,#400,.F.);
#316=CARTESIAN_POINT('',(1.22709443039894E-09,66.55000000014,-6.0500000021847));
#317=DIRECTION('',(-1.0,-1.2246063565686E-16,7.5419670520174E-12));
#318=DIRECTION('',(7.5419670520174E-12,0.0,1.0));
#319=ORIENTED_EDGE('',*,*,#422,.F.);
#320=ORIENTED_EDGE('',*,*,#423,.F.);
#321=ORIENTED_EDGE('',*,*,#414,.T.);
#322=ORIENTED_EDGE('',*,*,#409,.F.);
#323=ORIENTED_EDGE('',*,*,#379,.F.);
#324=ORIENTED_EDGE('',*,*,#398,.F.);
#325=ORIENTED_EDGE('',*,*,#417,.T.);
#326=CARTESIAN_POINT('',(-25.1999999999627,64.5250000005963,4.94999999825322));
#327=DIRECTION('',(-1.0,6.12303173520109E-17,7.54041273978296E-12));
#328=DIRECTION('',(6.12300045167476E-17,1.0,-4.14878169281711E-11));
#329=ORIENTED_EDGE('',*,*,#393,.F.);
#330=ORIENTED_EDGE('',*,*,#415,.T.);
#331=ORIENTED_EDGE('',*,*,#423,.T.);
#332=ORIENTED_EDGE('',*,*,#416,.T.);
#333=CARTESIAN_POINT('',(-26.0999999999628,68.5500000005963,4.94999999809303));
#334=DIRECTION('',(1.22460948556608E-16,-1.0,4.14878169281711E-11));
#335=DIRECTION('',(-1.0,-1.22460635721345E-16,7.54041273978296E-12));
#336=ORIENTED_EDGE('',*,*,#424,.F.);
#337=ORIENTED_EDGE('',*,*,#413,.F.);
#338=ORIENTED_EDGE('',*,*,#419,.T.);
#339=ORIENTED_EDGE('',*,*,#425,.T.);
#340=ORIENTED_EDGE('',*,*,#420,.T.);
#341=ORIENTED_EDGE('',*,*,#399,.F.);
#342=ORIENTED_EDGE('',*,*,#381,.F.);
#343=CARTESIAN_POINT('',(25.2000000000374,64.5250000005963,4.94999999787277));
#344=DIRECTION('',(1.0,6.12303180302269E-17,-7.54041273978296E-12));
#345=DIRECTION('',(6.12306308654902E-17,-1.0,4.14878169281711E-11));
#346=ORIENTED_EDGE('',*,*,#425,.F.);
#347=ORIENTED_EDGE('',*,*,#418,.T.);
#348=ORIENTED_EDGE('',*,*,#404,.T.);
#349=ORIENTED_EDGE('',*,*,#421,.T.);
#350=CARTESIAN_POINT('',(26.1000000000374,68.5500000005963,4.94999999769899));
#351=DIRECTION('',(1.22460948556608E-16,-1.0,4.14878169281711E-11));
#352=DIRECTION('',(-1.0,-1.22460635721345E-16,7.54041273978296E-12));
#353=ORIENTED_EDGE('',*,*,#390,.F.);
#354=ORIENTED_EDGE('',*,*,#422,.T.);
#355=CARTESIAN_POINT('',(27.0000000014287,64.5500000004011,-3.05000000230533));
#356=DIRECTION('',(-1.0,2.73290135196448E-11,7.54025192436186E-12));
#357=DIRECTION('',(2.73290135196448E-11,1.0,0.0));
#358=ORIENTED_EDGE('',*,*,#403,.T.);
#359=ORIENTED_EDGE('',*,*,#424,.T.);
#360=CARTESIAN_POINT('',(27.0000000014287,64.5500000004011,-3.05000000230533));
#361=DIRECTION('',(-1.0,2.73290135196448E-11,7.54025192436186E-12));
#362=DIRECTION('',(2.73290135196448E-11,1.0,0.0));
#363=ORIENTED_EDGE('',*,*,#411,.F.);
#364=ORIENTED_EDGE('',*,*,#396,.F.);
#365=ORIENTED_EDGE('',*,*,#402,.F.);
#366=ORIENTED_EDGE('',*,*,#407,.F.);
#367=ORIENTED_EDGE('',*,*,#383,.T.);
#368=ORIENTED_EDGE('',*,*,#386,.T.);
#369=ORIENTED_EDGE('',*,*,#388,.T.);
#370=ORIENTED_EDGE('',*,*,#389,.T.);
#371=CARTESIAN_POINT('',(1.58502453711475E-09,58.000000000391,-2.40630085301951E-09));
#372=DIRECTION('',(2.73279602581482E-11,1.0,-4.14879590828952E-11));
#373=DIRECTION('',(-1.0,2.73279602581482E-11,0.0));
#374=EDGE_CURVE('',#426,#427,#428,.T.);
#375=EDGE_CURVE('',#429,#426,#430,.T.);
#376=EDGE_CURVE('',#431,#429,#432,.T.);
#377=EDGE_CURVE('',#427,#431,#433,.T.);
#378=EDGE_CURVE('',#434,#435,#436,.T.);
#379=EDGE_CURVE('',#435,#437,#438,.T.);
#380=EDGE_CURVE('',#437,#439,#440,.T.);
#381=EDGE_CURVE('',#439,#434,#441,.T.);
#382=EDGE_CURVE('',#442,#427,#443,.T.);
#383=EDGE_CURVE('',#444,#442,#445,.T.);
#384=EDGE_CURVE('',#444,#426,#446,.T.);
#385=EDGE_CURVE('',#447,#431,#448,.T.);
#386=EDGE_CURVE('',#442,#447,#449,.T.);
#387=EDGE_CURVE('',#450,#429,#451,.T.);
#388=EDGE_CURVE('',#447,#450,#452,.T.);
#389=EDGE_CURVE('',#450,#444,#453,.T.);
#390=EDGE_CURVE('',#454,#454,#455,.F.);
#391=EDGE_CURVE('',#456,#457,#458,.T.);
#392=EDGE_CURVE('',#457,#459,#460,.T.);
#393=EDGE_CURVE('',#459,#461,#462,.T.);
#394=EDGE_CURVE('',#461,#463,#464,.T.);
#395=EDGE_CURVE('',#465,#463,#466,.T.);
#396=EDGE_CURVE('',#465,#456,#467,.T.);
#397=EDGE_CURVE('',#463,#468,#469,.T.);
#398=EDGE_CURVE('',#468,#435,#470,.T.);
#399=EDGE_CURVE('',#434,#471,#472,.T.);
#400=EDGE_CURVE('',#471,#473,#474,.T.);
#401=EDGE_CURVE('',#475,#473,#476,.T.);
#402=EDGE_CURVE('',#475,#465,#477,.T.);
#403=EDGE_CURVE('',#478,#478,#479,.T.);
#404=EDGE_CURVE('',#480,#481,#482,.T.);
#405=EDGE_CURVE('',#480,#483,#484,.T.);
#406=EDGE_CURVE('',#485,#483,#486,.T.);
#407=EDGE_CURVE('',#485,#475,#487,.T.);
#408=EDGE_CURVE('',#473,#481,#488,.T.);
#409=EDGE_CURVE('',#437,#489,#490,.T.);
#410=EDGE_CURVE('',#489,#457,#491,.T.);
#411=EDGE_CURVE('',#456,#485,#492,.T.);
#412=EDGE_CURVE('',#483,#493,#494,.T.);
#413=EDGE_CURVE('',#493,#439,#495,.T.);
#414=EDGE_CURVE('',#496,#489,#497,.F.);
#415=EDGE_CURVE('',#459,#496,#498,.F.);
#416=EDGE_CURVE('',#499,#461,#500,.F.);
#417=EDGE_CURVE('',#468,#499,#501,.F.);
#418=EDGE_CURVE('',#502,#480,#503,.F.);
#419=EDGE_CURVE('',#493,#502,#504,.F.);
#420=EDGE_CURVE('',#505,#471,#506,.F.);
#421=EDGE_CURVE('',#481,#505,#507,.F.);
#422=EDGE_CURVE('',#508,#508,#509,.F.);
#423=EDGE_CURVE('',#496,#499,#510,.T.);
#424=EDGE_CURVE('',#511,#511,#512,.F.);
#425=EDGE_CURVE('',#502,#505,#513,.T.);
#426=VERTEX_POINT('',#514);
#427=VERTEX_POINT('',#515);
#428=CIRCLE('',#516,4.0);
#429=VERTEX_POINT('',#517);
#430=LINE('',#518,#519);
#431=VERTEX_POINT('',#520);
#432=CIRCLE('',#521,4.0);
#433=LINE('',#522,#523);
#434=VERTEX_POINT('',#524);
#435=VERTEX_POINT('',#525);
#436=LINE('',#526,#527);
#437=VERTEX_POINT('',#528);
#438=LINE('',#529,#530);
#439=VERTEX_POINT('',#531);
#440=LINE('',#532,#533);
#441=LINE('',#534,#535);
#442=VERTEX_POINT('',#536);
#443=LINE('',#537,#538);
#444=VERTEX_POINT('',#539);
#445=CIRCLE('',#540,4.0);
#446=LINE('',#541,#542);
#447=VERTEX_POINT('',#543);
#448=LINE('',#544,#545);
#449=LINE('',#546,#547);
#450=VERTEX_POINT('',#548);
#451=LINE('',#549,#550);
#452=CIRCLE('',#551,4.0);
#453=LINE('',#552,#553);
#454=VERTEX_POINT('',#554);
#455=CIRCLE('',#555,1.5);
#456=VERTEX_POINT('',#556);
#457=VERTEX_POINT('',#557);
#458=LINE('',#558,#559);
#459=VERTEX_POINT('',#560);
#460=CIRCLE('',#561,2.0);
#461=VERTEX_POINT('',#562);
#462=LINE('',#563,#564);
#463=VERTEX_POINT('',#565);
#464=CIRCLE('',#566,2.0);
#465=VERTEX_POINT('',#567);
#466=LINE('',#568,#569);
#467=LINE('',#570,#571);
#468=VERTEX_POINT('',#572);
#469=LINE('',#573,#574);
#470=LINE('',#575,#576);
#471=VERTEX_POINT('',#577);
#472=LINE('',#578,#579);
#473=VERTEX_POINT('',#580);
#474=LINE('',#581,#582);
#475=VERTEX_POINT('',#583);
#476=LINE('',#584,#585);
#477=LINE('',#586,#587);
#478=VERTEX_POINT('',#588);
#479=CIRCLE('',#589,1.5);
#480=VERTEX_POINT('',#590);
#481=VERTEX_POINT('',#591);
#482=LINE('',#592,#593);
#483=VERTEX_POINT('',#594);
#484=CIRCLE('',#595,2.0);
#485=VERTEX_POINT('',#596);
#486=LINE('',#597,#598);
#487=LINE('',#599,#600);
#488=CIRCLE('',#601,2.0);
#489=VERTEX_POINT('',#602);
#490=LINE('',#603,#604);
#491=LINE('',#605,#606);
#492=LINE('',#607,#608);
#493=VERTEX_POINT('',#609);
#494=LINE('',#610,#611);
#495=LINE('',#612,#613);
#496=VERTEX_POINT('',#614);
#497=CIRCLE('',#615,2.0);
#498=LINE('',#616,#617);
#499=VERTEX_POINT('',#618);
#500=LINE('',#619,#620);
#501=CIRCLE('',#621,2.0);
#502=VERTEX_POINT('',#622);
#503=LINE('',#623,#624);
#504=CIRCLE('',#625,2.0);
#505=VERTEX_POINT('',#626);
#506=CIRCLE('',#627,2.0);
#507=LINE('',#628,#629);
#508=VERTEX_POINT('',#630);
#509=CIRCLE('',#631,1.5);
#510=LINE('',#632,#633);
#511=VERTEX_POINT('',#634);
#512=CIRCLE('',#635,1.5);
#513=LINE('',#636,#637);
#514=CARTESIAN_POINT('',(20.0000000013694,60.9999999999253,1.94999999789422));
#515=CARTESIAN_POINT('',(20.0000000013091,60.9999999995934,-6.0500000021058));
#516=AXIS2_PLACEMENT_3D('',#638,#639,#640);
#517=CARTESIAN_POINT('',(-19.9999999986306,61.0000000010184,1.9499999981959));
#518=CARTESIAN_POINT('',(1.36941390885614E-09,61.0000000004719,1.94999999804507));
#519=VECTOR('',#641,1.0);
#520=CARTESIAN_POINT('',(-19.9999999986909,61.0000000006865,-6.0500000018041));
#521=AXIS2_PLACEMENT_3D('',#642,#643,#644);
#522=CARTESIAN_POINT('',(1.30909637394628E-09,61.00000000014,-6.05000000195495));
#523=VECTOR('',#645,1.0);
#524=CARTESIAN_POINT('',(25.1999999999883,60.9999999993683,-8.0500000021445));
#525=CARTESIAN_POINT('',(-25.2000000000608,61.0000000010153,-8.05000000176439));
#526=CARTESIAN_POINT('',(1.29399858389401E-09,61.000000000057,-8.05000000195445));
#527=VECTOR('',#646,1.0);
#528=CARTESIAN_POINT('',(-25.2000000000118,61.000000001285,4.9499999982351));
#529=CARTESIAN_POINT('',(-25.2,61.0000000010796,-2.34074590277812E-09));
#530=VECTOR('',#647,1.0);
#531=CARTESIAN_POINT('',(25.2000000000374,60.999999999638,4.94999999801902));
#532=CARTESIAN_POINT('',(1.39202035774644E-09,61.0000000005963,4.94999999804487));
#533=VECTOR('',#648,1.0);
#534=CARTESIAN_POINT('',(25.2,60.9999999997023,-2.72078270480604E-09));
#535=VECTOR('',#649,1.0);
#536=CARTESIAN_POINT('',(20.0000000012271,57.9999999995934,-6.05000000198134));
#537=CARTESIAN_POINT('',(20.0000000012271,57.9999999995934,-6.05000000198134));
#538=VECTOR('',#650,1.0);
#539=CARTESIAN_POINT('',(20.0000000012875,57.9999999999253,1.94999999801868));
#540=AXIS2_PLACEMENT_3D('',#651,#652,#653);
#541=CARTESIAN_POINT('',(20.0000000012875,57.9999999999253,1.94999999801868));
#542=VECTOR('',#654,1.0);
#543=CARTESIAN_POINT('',(-19.9999999987729,58.0000000006865,-6.05000000167963));
#544=CARTESIAN_POINT('',(-19.9999999987729,58.0000000006865,-6.05000000167963));
#545=VECTOR('',#655,1.0);
#546=CARTESIAN_POINT('',(1.22710933338829E-09,58.00000000014,-6.05000000183049));
#547=VECTOR('',#656,1.0);
#548=CARTESIAN_POINT('',(-19.9999999987125,58.0000000010184,1.94999999832036));
#549=CARTESIAN_POINT('',(-19.9999999987125,58.0000000010184,1.94999999832036));
#550=VECTOR('',#657,1.0);
#551=AXIS2_PLACEMENT_3D('',#658,#659,#660);
#552=CARTESIAN_POINT('',(1.28742686829815E-09,58.0000000004719,1.94999999816952));
#553=VECTOR('',#661,1.0);
#554=CARTESIAN_POINT('',(-26.9999999986123,63.0500000018769,-3.05000000189816));
#555=AXIS2_PLACEMENT_3D('',#662,#663,#664);
#556=CARTESIAN_POINT('',(-26.99999999869,58.0000000013342,4.94999999837315));
#557=CARTESIAN_POINT('',(-26.9999999984563,66.5500000005963,4.94999999801843));
#558=CARTESIAN_POINT('',(-26.99999999869,58.0000000013342,4.94999999837315));
#559=VECTOR('',#665,1.0);
#560=CARTESIAN_POINT('',(-26.9999999999778,68.5500000005134,2.94999999793545));
#561=AXIS2_PLACEMENT_3D('',#666,#667,#668);
#562=CARTESIAN_POINT('',(-27.0000000000457,68.55000000014,-6.05000000206405));
#563=CARTESIAN_POINT('',(-26.9999999999627,68.5500000005963,4.94999999809982));
#564=VECTOR('',#669,1.0);
#565=CARTESIAN_POINT('',(-26.9999999985543,66.550000000057,-8.05000000198107));
#566=AXIS2_PLACEMENT_3D('',#670,#671,#672);
#567=CARTESIAN_POINT('',(-26.999999998788,58.0000000007949,-8.05000000162635));
#568=CARTESIAN_POINT('',(-26.999999998788,58.0000000007949,-8.05000000162635));
#569=VECTOR('',#673,1.0);
#570=CARTESIAN_POINT('',(-26.999999998739,58.0000000010645,-1.5500000016266));
#571=VECTOR('',#674,1.0);
#572=CARTESIAN_POINT('',(-25.2000000000608,66.550000000057,-8.05000000199465));
#573=CARTESIAN_POINT('',(-25.2000000000608,66.550000000057,-8.05000000199465));
#574=VECTOR('',#675,1.0);
#575=CARTESIAN_POINT('',(-25.2000000000608,64.525000000057,-8.05000000191063));
#576=VECTOR('',#676,1.0);
#577=CARTESIAN_POINT('',(25.1999999999393,66.550000000057,-8.05000000237476));
#578=CARTESIAN_POINT('',(25.1999999999393,64.525000000057,-8.05000000229075));
#579=VECTOR('',#677,1.0);
#580=CARTESIAN_POINT('',(27.0000000014457,66.550000000057,-8.05000000238834));
#581=CARTESIAN_POINT('',(26.9999999999394,66.550000000057,-8.05000000238834));
#582=VECTOR('',#678,1.0);
#583=CARTESIAN_POINT('',(27.000000001212,57.9999999993191,-8.05000000203361));
#584=CARTESIAN_POINT('',(27.000000001212,57.9999999993191,-8.05000000203361));
#585=VECTOR('',#679,1.0);
#586=CARTESIAN_POINT('',(1.21201154333601E-09,58.000000000057,-8.05000000182998));
#587=VECTOR('',#680,1.0);
#588=CARTESIAN_POINT('',(27.0000000014697,66.0500000004011,-3.05000000230533));
#589=AXIS2_PLACEMENT_3D('',#681,#682,#683);
#590=CARTESIAN_POINT('',(27.0000000000223,68.5500000005134,2.94999999752783));
#591=CARTESIAN_POINT('',(26.9999999999545,68.55000000014,-6.05000000247131));
#592=CARTESIAN_POINT('',(27.0000000000374,68.5500000005963,4.9499999976922));
#593=VECTOR('',#684,1.0);
#594=CARTESIAN_POINT('',(27.0000000015437,66.5500000005963,4.9499999976108));
#595=AXIS2_PLACEMENT_3D('',#685,#686,#687);
#596=CARTESIAN_POINT('',(27.00000000131,57.9999999998585,4.94999999796553));
#597=CARTESIAN_POINT('',(27.00000000131,57.9999999998585,4.94999999796553));
#598=VECTOR('',#688,1.0);
#599=CARTESIAN_POINT('',(27.000000001261,57.9999999995888,-1.55000000203404));
#600=VECTOR('',#689,1.0);
#601=AXIS2_PLACEMENT_3D('',#690,#691,#692);
#602=CARTESIAN_POINT('',(-25.1999999999627,66.5500000005963,4.94999999816921));
#603=CARTESIAN_POINT('',(-25.1999999999627,64.5250000005963,4.94999999825322));
#604=VECTOR('',#693,1.0);
#605=CARTESIAN_POINT('',(-26.9999999999627,66.5500000005963,4.94999999801843));
#606=VECTOR('',#694,1.0);
#607=CARTESIAN_POINT('',(1.31003331718845E-09,58.0000000005963,4.94999999816934));
#608=VECTOR('',#695,1.0);
#609=CARTESIAN_POINT('',(25.2000000000374,66.5500000005963,4.94999999778876));
#610=CARTESIAN_POINT('',(25.2000000000374,66.5500000005963,4.94999999762439));
#611=VECTOR('',#696,1.0);
#612=CARTESIAN_POINT('',(25.2000000000374,64.5250000005963,4.94999999787277));
#613=VECTOR('',#697,1.0);
#614=CARTESIAN_POINT('',(-25.1999999999778,68.5500000005134,2.94999999792187));
#615=AXIS2_PLACEMENT_3D('',#698,#699,#700);
#616=CARTESIAN_POINT('',(-25.1999999999778,68.5500000005134,2.94999999792187));
#617=VECTOR('',#701,1.0);
#618=CARTESIAN_POINT('',(-25.2000000000457,68.55000000014,-6.05000000207762));
#619=CARTESIAN_POINT('',(-27.0000000000457,68.55000000014,-6.05000000206405));
#620=VECTOR('',#702,1.0);
#621=AXIS2_PLACEMENT_3D('',#703,#704,#705);
#622=CARTESIAN_POINT('',(25.2000000000223,68.5500000005134,2.94999999754141));
#623=CARTESIAN_POINT('',(27.0000000000223,68.5500000005134,2.94999999752783));
#624=VECTOR('',#706,1.0);
#625=AXIS2_PLACEMENT_3D('',#707,#708,#709);
#626=CARTESIAN_POINT('',(25.1999999999544,68.55000000014,-6.05000000245773));
#627=AXIS2_PLACEMENT_3D('',#710,#711,#712);
#628=CARTESIAN_POINT('',(25.1999999999544,68.55000000014,-6.05000000245774));
#629=VECTOR('',#713,1.0);
#630=CARTESIAN_POINT('',(-25.2000000000117,64.5500000018277,-1.55000000191173));
#631=AXIS2_PLACEMENT_3D('',#714,#715,#716);
#632=CARTESIAN_POINT('',(-25.1999999999627,68.5500000005963,4.94999999808623));
#633=VECTOR('',#717,1.0);
#634=CARTESIAN_POINT('',(25.1999999999657,64.5500000004503,-4.55000000229176));
#635=AXIS2_PLACEMENT_3D('',#718,#719,#720);
#636=CARTESIAN_POINT('',(25.2000000000374,68.5500000005963,4.94999999770578));
#637=VECTOR('',#721,1.0);
#638=CARTESIAN_POINT('',(20.0000000013393,60.9999999997594,-2.05000000210579));
#639=DIRECTION('',(2.73279602581482E-11,1.0,-4.14879590828952E-11));
#640=DIRECTION('',(-1.0,2.73279602581482E-11,0.0));
#641=DIRECTION('',(1.0,-2.73279602584611E-11,-7.542089511519E-12));
#642=CARTESIAN_POINT('',(-19.9999999986607,61.0000000008525,-2.0500000018041));
#643=DIRECTION('',(2.73279602581482E-11,1.0,-4.14879590828952E-11));
#644=DIRECTION('',(-1.0,2.73279602581482E-11,0.0));
#645=DIRECTION('',(-1.0,2.73279602584611E-11,7.54263318469839E-12));
#646=DIRECTION('',(-1.0,2.73279602584611E-11,7.54196705088361E-12));
#647=DIRECTION('',(7.54041273978296E-12,4.14879590826892E-11,1.0));
#648=DIRECTION('',(1.0,-2.73279602584613E-11,-7.54875084966675E-12));
#649=DIRECTION('',(-7.54041273978296E-12,-4.14879590826892E-11,-1.0));
#650=DIRECTION('',(2.7329013519332E-11,1.0,-4.14878169283771E-11));
#651=CARTESIAN_POINT('',(20.0000000012573,57.9999999997594,-2.05000000198133));
#652=DIRECTION('',(2.73279602581482E-11,1.0,-4.14879590828952E-11));
#653=DIRECTION('',(-1.0,2.73279602581482E-11,0.0));
#654=DIRECTION('',(2.7329013519332E-11,1.0,-4.14878169283771E-11));
#655=DIRECTION('',(2.7329013519332E-11,1.0,-4.14878169283771E-11));
#656=DIRECTION('',(-1.0,2.73279602584611E-11,7.54263318469839E-12));
#657=DIRECTION('',(2.7329013519332E-11,1.0,-4.14878169283771E-11));
#658=CARTESIAN_POINT('',(-19.9999999987427,58.0000000008525,-2.05000000167964));
#659=DIRECTION('',(2.73279602581482E-11,1.0,-4.14879590828952E-11));
#660=DIRECTION('',(-1.0,2.73279602581482E-11,0.0));
#661=DIRECTION('',(1.0,-2.73279602584611E-11,-7.542089511519E-12));
#662=CARTESIAN_POINT('',(-26.9999999985713,64.5500000018769,-3.05000000189815));
#663=DIRECTION('',(-1.0,2.73290135196449E-11,7.5408184742071E-12));
#664=DIRECTION('',(-2.73290135196449E-11,-1.0,0.0));
#665=DIRECTION('',(2.7329013519332E-11,1.0,-4.14878169283771E-11));
#666=CARTESIAN_POINT('',(-26.9999999984714,66.5500000005134,2.94999999801843));
#667=DIRECTION('',(-1.0,2.73290135196449E-11,7.5408184742071E-12));
#668=DIRECTION('',(-2.73290135196449E-11,-1.0,0.0));
#669=DIRECTION('',(-7.54041273978296E-12,-4.14878169281711E-11,-1.0));
#670=CARTESIAN_POINT('',(-26.9999999985392,66.55000000014,-6.05000000198107));
#671=DIRECTION('',(-1.0,2.73290135196449E-11,7.5408184742071E-12));
#672=DIRECTION('',(-2.73290135196449E-11,-1.0,0.0));
#673=DIRECTION('',(2.7329013519332E-11,1.0,-4.14878169283771E-11));
#674=DIRECTION('',(7.54081847534092E-12,4.14879590826892E-11,1.0));
#675=DIRECTION('',(1.0,1.2246063565686E-16,-7.5419670520174E-12));
#676=DIRECTION('',(-6.12300045167475E-17,-1.0,4.1487816928171E-11));
#677=DIRECTION('',(-6.12306308654902E-17,1.0,-4.1487816928171E-11));
#678=DIRECTION('',(1.0,1.2246063565686E-16,-7.5419670520174E-12));
#679=DIRECTION('',(2.7329013519332E-11,1.0,-4.14878169283771E-11));
#680=DIRECTION('',(-1.0,2.73279602584611E-11,7.54196705088361E-12));
#681=CARTESIAN_POINT('',(27.0000000014287,64.5500000004011,-3.05000000230533));
#682=DIRECTION('',(1.0,-2.73290135196448E-11,-7.54025192436186E-12));
#683=DIRECTION('',(2.73290135196448E-11,1.0,0.0));
#684=DIRECTION('',(-7.54041273978296E-12,-4.14878169281711E-11,-1.0));
#685=CARTESIAN_POINT('',(27.0000000015286,66.5500000005134,2.9499999976108));
#686=DIRECTION('',(1.0,-2.73290135196448E-11,-7.54025192436186E-12));
#687=DIRECTION('',(2.73290135196448E-11,1.0,0.0));
#688=DIRECTION('',(2.7329013519332E-11,1.0,-4.14878169283771E-11));
#689=DIRECTION('',(-7.54025192549569E-12,-4.14879590826892E-11,-1.0));
#690=CARTESIAN_POINT('',(27.0000000014608,66.55000000014,-6.05000000238834));
#691=DIRECTION('',(1.0,-2.73290135196448E-11,-7.54025192436186E-12));
#692=DIRECTION('',(2.73290135196448E-11,1.0,0.0));
#693=DIRECTION('',(6.12300045156756E-17,1.0,-4.14879590826889E-11));
#694=DIRECTION('',(-1.0,-1.22460635375415E-16,7.54875085080053E-12));
#695=DIRECTION('',(1.0,-2.73279602584613E-11,-7.54875084966675E-12));
#696=DIRECTION('',(-1.0,-1.22460635375415E-16,7.54875085080053E-12));
#697=DIRECTION('',(6.12306308665621E-17,-1.0,4.14879590826889E-11));
#698=CARTESIAN_POINT('',(-25.1999999999778,66.5500000005134,2.94999999800485));
#699=DIRECTION('',(-1.0,6.12303173520109E-17,7.54041273978296E-12));
#700=DIRECTION('',(7.54041273978296E-12,0.0,1.0));
#701=DIRECTION('',(-1.0,-1.22460635375415E-16,7.54875085080053E-12));
#702=DIRECTION('',(1.0,1.2246063565686E-16,-7.5419670520174E-12));
#703=CARTESIAN_POINT('',(-25.2000000000457,66.55000000014,-6.05000000199465));
#704=DIRECTION('',(-1.0,6.12303173520109E-17,7.54041273978296E-12));
#705=DIRECTION('',(7.54041273978296E-12,0.0,1.0));
#706=DIRECTION('',(-1.0,-1.22460635375415E-16,7.54875085080053E-12));
#707=CARTESIAN_POINT('',(25.2000000000223,66.5500000005134,2.94999999762438));
#708=DIRECTION('',(1.0,6.12303180302269E-17,-7.54041273978296E-12));
#709=DIRECTION('',(-7.54041273978296E-12,0.0,-1.0));
#710=CARTESIAN_POINT('',(25.1999999999544,66.55000000014,-6.05000000237476));
#711=DIRECTION('',(1.0,6.12303180302269E-17,-7.54041273978296E-12));
#712=DIRECTION('',(-7.54041273978296E-12,0.0,-1.0));
#713=DIRECTION('',(1.0,1.2246063565686E-16,-7.5419670520174E-12));
#714=CARTESIAN_POINT('',(-25.2000000000231,64.5500000018277,-3.05000000191173));
#715=DIRECTION('',(-1.0,6.12303173520109E-17,7.54041273978296E-12));
#716=DIRECTION('',(7.54041273978296E-12,0.0,1.0));
#717=DIRECTION('',(-7.54041273978296E-12,-4.14878169281711E-11,-1.0));
#718=CARTESIAN_POINT('',(25.199999999977,64.5500000004503,-3.05000000229176));
#719=DIRECTION('',(1.0,6.12303180302269E-17,-7.54041273978296E-12));
#720=DIRECTION('',(-7.54041273978296E-12,0.0,-1.0));
#721=DIRECTION('',(-7.54041273978296E-12,-4.14878169281711E-11,-1.0));
ENDSEC;
END-ISO-10303-21;
