ISO-10303-21;
HEADER;
FILE_DESCRIPTION(('STEP AP203'),'1');
FILE_NAME('RBF22.P211-1 Eixo Roller.stp','2022-08-30T22:39:42',(' '),(' '),'Spatial InterOp 3D',' ',' ');
FILE_SCHEMA(('CONFIG_CONTROL_DESIGN'));
ENDSEC;
DATA;
#1=DESIGN_CONTEXT('',#33,'design');
#2=APPLICATION_PROTOCOL_DEFINITION('INTERNATIONAL STANDARD','config_control_design',1994,#33);
#3=PRODUCT_CATEGORY_RELATIONSHIP('NONE','NONE',#34,#35);
#4=DATE_AND_TIME(#36,#37);
#5=DATE_TIME_ROLE('creation_date');
#6=DATE_TIME_ROLE('classification_date');
#7=PERSON_AND_ORGANIZATION_ROLE('creator');
#8=PERSON_AND_ORGANIZATION_ROLE('design_supplier');
#9=PERSON_AND_ORGANIZATION_ROLE('classification_officer');
#10=PERSON_AND_ORGANIZATION_ROLE('design_owner');
#11=APPROVAL_PERSON_ORGANIZATION(#38,#39,#40);
#12=APPROVAL_DATE_TIME(#4,#39);
#13=CC_DESIGN_APPROVAL(#39,(#41,#42,#43));
#14=CC_DESIGN_DATE_AND_TIME_ASSIGNMENT(#4,#5,(#43));
#15=CC_DESIGN_DATE_AND_TIME_ASSIGNMENT(#4,#6,(#41));
#16=CC_DESIGN_PERSON_AND_ORGANIZATION_ASSIGNMENT(#38,#10,(#44));
#17=CC_DESIGN_PERSON_AND_ORGANIZATION_ASSIGNMENT(#38,#7,(#43));
#18=CC_DESIGN_PERSON_AND_ORGANIZATION_ASSIGNMENT(#38,#7,(#42));
#19=CC_DESIGN_PERSON_AND_ORGANIZATION_ASSIGNMENT(#38,#8,(#42));
#20=CC_DESIGN_SECURITY_CLASSIFICATION(#41,(#42));
#21=CC_DESIGN_PERSON_AND_ORGANIZATION_ASSIGNMENT(#38,#9,(#41));
#22=SHAPE_DEFINITION_REPRESENTATION(#45,#46);
#23= (GEOMETRIC_REPRESENTATION_CONTEXT(3)GLOBAL_UNCERTAINTY_ASSIGNED_CONTEXT((#49))GLOBAL_UNIT_ASSIGNED_CONTEXT((#51,#52,#53))REPRESENTATION_CONTEXT('NONE','WORKSPACE'));
#24=PROPERTY_DEFINITION_REPRESENTATION(#55,#56);
#25=GENERAL_PROPERTY_ASSOCIATION('','',#57,#55);
#26=PROPERTY_DEFINITION_REPRESENTATION(#58,#59);
#27=GENERAL_PROPERTY_ASSOCIATION('','',#60,#58);
#28=PROPERTY_DEFINITION_REPRESENTATION(#61,#62);
#29=GENERAL_PROPERTY_ASSOCIATION('','',#63,#61);
#33=APPLICATION_CONTEXT('CONFIGURATION CONTROLLED 3D DESIGNS OF MECHANICAL PARTS AND ASSEMBLIES');
#34=PRODUCT_CATEGORY('part','NONE');
#35=PRODUCT_RELATED_PRODUCT_CATEGORY('detail',' ',(#44));
#36=CALENDAR_DATE(2022,30,7);
#37=LOCAL_TIME(19,39,42.0,#64);
#38=PERSON_AND_ORGANIZATION(#65,#66);
#39=APPROVAL(#67,'SOLID MODEL');
#40=APPROVAL_ROLE('APPROVED');
#41=SECURITY_CLASSIFICATION('','',#68);
#42=PRODUCT_DEFINITION_FORMATION_WITH_SPECIFIED_SOURCE('A','NONE',#44,.NOT_KNOWN.);
#43=PRODUCT_DEFINITION('','NONE',#42,#1);
#44=PRODUCT('Eixo Roller','','1',(#69));
#45=PRODUCT_DEFINITION_SHAPE('NONE','NONE',#43);
#46=ADVANCED_BREP_SHAPE_REPRESENTATION('1',(#70,#71),#23);
#49=UNCERTAINTY_MEASURE_WITH_UNIT(LENGTH_MEASURE(0.001),#51,'','');
#51= (CONVERSION_BASED_UNIT('MILLIMETRE',#74)LENGTH_UNIT()NAMED_UNIT(#77));
#52= (NAMED_UNIT(#79)PLANE_ANGLE_UNIT()SI_UNIT($,.RADIAN.));
#53= (NAMED_UNIT(#79)SOLID_ANGLE_UNIT()SI_UNIT($,.STERADIAN.));
#55=PROPERTY_DEFINITION('PdmObjectId','',#43);
#56=REPRESENTATION('',(#85),#23);
#57=GENERAL_PROPERTY('','19_2d33aa80-3400-4df2-88c1-bd50ab977ea6&2_42_0_4','');
#58=PROPERTY_DEFINITION('CreationDate','',#43);
#59=REPRESENTATION('',(#86),#23);
#60=GENERAL_PROPERTY('','31/03/2022 19:51:08','');
#61=PROPERTY_DEFINITION('Minor Revision','',#43);
#62=REPRESENTATION('',(#87),#23);
#63=GENERAL_PROPERTY('','3','');
#64=COORDINATED_UNIVERSAL_TIME_OFFSET(3,0,.BEHIND.);
#65=PERSON('','UNSPECIFIED',$,$,$,$);
#66=ORGANIZATION('UNSPECIFIED','UNSPECIFIED','UNSPECIFIED');
#67=APPROVAL_STATUS('approved');
#68=SECURITY_CLASSIFICATION_LEVEL('unclassified');
#69=MECHANICAL_CONTEXT('',#33,'mechanical');
#70=MANIFOLD_SOLID_BREP('1',#88);
#71=AXIS2_PLACEMENT_3D('',#89,#90,#91);
#74=LENGTH_MEASURE_WITH_UNIT(LENGTH_MEASURE(1.0),#92);
#77=DIMENSIONAL_EXPONENTS(1.0,0.0,0.0,0.0,0.0,0.0,0.0);
#79=DIMENSIONAL_EXPONENTS(0.0,0.0,0.0,0.0,0.0,0.0,0.0);
#85=VALUE_REPRESENTATION_ITEM('19_2d33aa80-3400-4df2-88c1-bd50ab977ea6&2_42_0_4',);
#86=VALUE_REPRESENTATION_ITEM('31/03/2022 19:51:08',);
#87=VALUE_REPRESENTATION_ITEM('3',);
#88=CLOSED_SHELL('',(#93,#94,#95));
#89=CARTESIAN_POINT('',(0.0,0.0,0.0));
#90=DIRECTION('',(0.0,0.0,1.0));
#91=DIRECTION('',(1.0,0.0,0.0));
#92= (NAMED_UNIT(#77)LENGTH_UNIT()SI_UNIT(.MILLI.,.METRE.));
#93=ADVANCED_FACE('',(#97,#98),#99,.T.);
#94=ADVANCED_FACE('',(#100),#101,.F.);
#95=ADVANCED_FACE('',(#102),#103,.F.);
#97=FACE_OUTER_BOUND('',#104,.T.);
#98=FACE_OUTER_BOUND('',#105,.T.);
#99=CYLINDRICAL_SURFACE('',#106,2.0);
#100=FACE_OUTER_BOUND('',#107,.T.);
#101=PLANE('',#108);
#102=FACE_OUTER_BOUND('',#109,.T.);
#103=PLANE('',#110);
#104=EDGE_LOOP('',(#111));
#105=EDGE_LOOP('',(#112));
#106=AXIS2_PLACEMENT_3D('',#113,#114,#115);
#107=EDGE_LOOP('',(#116));
#108=AXIS2_PLACEMENT_3D('',#117,#118,#119);
#109=EDGE_LOOP('',(#120));
#110=AXIS2_PLACEMENT_3D('',#121,#122,#123);
#111=ORIENTED_EDGE('',*,*,#124,.T.);
#112=ORIENTED_EDGE('',*,*,#125,.F.);
#113=CARTESIAN_POINT('',(-4.87890977618477E-15,79.0,0.0));
#114=DIRECTION('',(6.12303176911189E-17,-1.0,0.0));
#115=DIRECTION('',(-1.0,-6.12303176911189E-17,0.0));
#116=ORIENTED_EDGE('',*,*,#125,.T.);
#117=CARTESIAN_POINT('',(0.95,79.0,0.0));
#118=DIRECTION('',(6.12303176911189E-17,-1.0,0.0));
#119=DIRECTION('',(0.0,0.0,-1.0));
#120=ORIENTED_EDGE('',*,*,#124,.F.);
#121=CARTESIAN_POINT('',(0.95,0.0,0.0));
#122=DIRECTION('',(-6.12303176911189E-17,1.0,0.0));
#123=DIRECTION('',(1.0,6.12303176911189E-17,0.0));
#124=EDGE_CURVE('',#126,#126,#127,.T.);
#125=EDGE_CURVE('',#128,#128,#129,.T.);
#126=VERTEX_POINT('',#130);
#127=CIRCLE('',#131,2.0);
#128=VERTEX_POINT('',#132);
#129=CIRCLE('',#133,2.0);
#130=CARTESIAN_POINT('',(-2.0,-1.22460635382238E-16,0.0));
#131=AXIS2_PLACEMENT_3D('',#134,#135,#136);
#132=CARTESIAN_POINT('',(-2.0,79.0,0.0));
#133=AXIS2_PLACEMENT_3D('',#137,#138,#139);
#134=CARTESIAN_POINT('',(-4.17146785863772E-17,0.0,0.0));
#135=DIRECTION('',(-6.12303176911189E-17,1.0,0.0));
#136=DIRECTION('',(-1.0,-6.12303176911189E-17,0.0));
#137=CARTESIAN_POINT('',(-4.87890977618477E-15,79.0,0.0));
#138=DIRECTION('',(-6.12303176911189E-17,1.0,0.0));
#139=DIRECTION('',(-1.0,-6.12303176911189E-17,0.0));
ENDSEC;
END-ISO-10303-21;
