ISO-10303-21;
HEADER;
FILE_DESCRIPTION(('STEP AP203'),'1');
FILE_NAME('RBF22.P102-1 Amortecedor inferior.stp','2022-09-05T17:07:15',(' '),(' '),'Spatial InterOp 3D',' ',' ');
FILE_SCHEMA(('CONFIG_CONTROL_DESIGN'));
ENDSEC;
DATA;
#1=DESIGN_CONTEXT('',#33,'design');
#2=APPLICATION_PROTOCOL_DEFINITION('INTERNATIONAL STANDARD','config_control_design',1994,#33);
#3=PRODUCT_CATEGORY_RELATIONSHIP('NONE','NONE',#34,#35);
#4=DATE_AND_TIME(#36,#37);
#5=DATE_TIME_ROLE('creation_date');
#6=DATE_TIME_ROLE('classification_date');
#7=PERSON_AND_ORGANIZATION_ROLE('creator');
#8=PERSON_AND_ORGANIZATION_ROLE('design_supplier');
#9=PERSON_AND_ORGANIZATION_ROLE('classification_officer');
#10=PERSON_AND_ORGANIZATION_ROLE('design_owner');
#11=APPROVAL_PERSON_ORGANIZATION(#38,#39,#40);
#12=APPROVAL_DATE_TIME(#4,#39);
#13=CC_DESIGN_APPROVAL(#39,(#41,#42,#43));
#14=CC_DESIGN_DATE_AND_TIME_ASSIGNMENT(#4,#5,(#43));
#15=CC_DESIGN_DATE_AND_TIME_ASSIGNMENT(#4,#6,(#41));
#16=CC_DESIGN_PERSON_AND_ORGANIZATION_ASSIGNMENT(#38,#10,(#44));
#17=CC_DESIGN_PERSON_AND_ORGANIZATION_ASSIGNMENT(#38,#7,(#43));
#18=CC_DESIGN_PERSON_AND_ORGANIZATION_ASSIGNMENT(#38,#7,(#42));
#19=CC_DESIGN_PERSON_AND_ORGANIZATION_ASSIGNMENT(#38,#8,(#42));
#20=CC_DESIGN_SECURITY_CLASSIFICATION(#41,(#42));
#21=CC_DESIGN_PERSON_AND_ORGANIZATION_ASSIGNMENT(#38,#9,(#41));
#22=SHAPE_DEFINITION_REPRESENTATION(#45,#46);
#23= (GEOMETRIC_REPRESENTATION_CONTEXT(3)GLOBAL_UNCERTAINTY_ASSIGNED_CONTEXT((#49))GLOBAL_UNIT_ASSIGNED_CONTEXT((#51,#52,#53))REPRESENTATION_CONTEXT('NONE','WORKSPACE'));
#24=PROPERTY_DEFINITION_REPRESENTATION(#55,#56);
#25=GENERAL_PROPERTY_ASSOCIATION('','',#57,#55);
#26=PROPERTY_DEFINITION_REPRESENTATION(#58,#59);
#27=GENERAL_PROPERTY_ASSOCIATION('','',#60,#58);
#28=PROPERTY_DEFINITION_REPRESENTATION(#61,#62);
#29=GENERAL_PROPERTY_ASSOCIATION('','',#63,#61);
#33=APPLICATION_CONTEXT('CONFIGURATION CONTROLLED 3D DESIGNS OF MECHANICAL PARTS AND ASSEMBLIES');
#34=PRODUCT_CATEGORY('part','NONE');
#35=PRODUCT_RELATED_PRODUCT_CATEGORY('detail',' ',(#44));
#36=CALENDAR_DATE(2022,5,8);
#37=LOCAL_TIME(14,7,15.0,#64);
#38=PERSON_AND_ORGANIZATION(#65,#66);
#39=APPROVAL(#67,'SOLID MODEL');
#40=APPROVAL_ROLE('APPROVED');
#41=SECURITY_CLASSIFICATION('','',#68);
#42=PRODUCT_DEFINITION_FORMATION_WITH_SPECIFIED_SOURCE('A','NONE',#44,.NOT_KNOWN.);
#43=PRODUCT_DEFINITION('','NONE',#42,#1);
#44=PRODUCT('Amortecedor inferior','','Amortecedor inferior',(#69));
#45=PRODUCT_DEFINITION_SHAPE('NONE','NONE',#43);
#46=ADVANCED_BREP_SHAPE_REPRESENTATION('1',(#70,#71),#23);
#49=UNCERTAINTY_MEASURE_WITH_UNIT(LENGTH_MEASURE(0.001),#51,'','');
#51= (CONVERSION_BASED_UNIT('MILLIMETRE',#74)LENGTH_UNIT()NAMED_UNIT(#77));
#52= (NAMED_UNIT(#79)PLANE_ANGLE_UNIT()SI_UNIT($,.RADIAN.));
#53= (NAMED_UNIT(#79)SOLID_ANGLE_UNIT()SI_UNIT($,.STERADIAN.));
#55=PROPERTY_DEFINITION('PdmObjectId','',#43);
#56=REPRESENTATION('',(#85),#23);
#57=GENERAL_PROPERTY('','19_2d33aa80-3400-4df2-88c1-bd50ab977ea6&2_36_0_7','');
#58=PROPERTY_DEFINITION('CreationDate','',#43);
#59=REPRESENTATION('',(#86),#23);
#60=GENERAL_PROPERTY('','31/03/2022 19:51:04','');
#61=PROPERTY_DEFINITION('Minor Revision','',#43);
#62=REPRESENTATION('',(#87),#23);
#63=GENERAL_PROPERTY('','6','');
#64=COORDINATED_UNIVERSAL_TIME_OFFSET(3,0,.BEHIND.);
#65=PERSON('','UNSPECIFIED',$,$,$,$);
#66=ORGANIZATION('UNSPECIFIED','UNSPECIFIED','UNSPECIFIED');
#67=APPROVAL_STATUS('approved');
#68=SECURITY_CLASSIFICATION_LEVEL('unclassified');
#69=MECHANICAL_CONTEXT('',#33,'mechanical');
#70=MANIFOLD_SOLID_BREP('1',#88);
#71=AXIS2_PLACEMENT_3D('',#89,#90,#91);
#74=LENGTH_MEASURE_WITH_UNIT(LENGTH_MEASURE(1.0),#92);
#77=DIMENSIONAL_EXPONENTS(1.0,0.0,0.0,0.0,0.0,0.0,0.0);
#79=DIMENSIONAL_EXPONENTS(0.0,0.0,0.0,0.0,0.0,0.0,0.0);
#85=VALUE_REPRESENTATION_ITEM('19_2d33aa80-3400-4df2-88c1-bd50ab977ea6&2_36_0_7',);
#86=VALUE_REPRESENTATION_ITEM('31/03/2022 19:51:04',);
#87=VALUE_REPRESENTATION_ITEM('6',);
#88=CLOSED_SHELL('',(#93,#94,#95,#96,#97,#98,#99,#100,#101,#102,#103,#104,#105,#106,#107,#108,#109,#110,#111,#112,#113,#114,#115,#116));
#89=CARTESIAN_POINT('',(0.0,0.0,0.0));
#90=DIRECTION('',(0.0,0.0,1.0));
#91=DIRECTION('',(1.0,0.0,0.0));
#92= (NAMED_UNIT(#77)LENGTH_UNIT()SI_UNIT(.MILLI.,.METRE.));
#93=ADVANCED_FACE('',(#118),#119,.F.);
#94=ADVANCED_FACE('',(#120),#121,.F.);
#95=ADVANCED_FACE('',(#122),#123,.F.);
#96=ADVANCED_FACE('',(#124),#125,.F.);
#97=ADVANCED_FACE('',(#126),#127,.F.);
#98=ADVANCED_FACE('',(#128),#129,.F.);
#99=ADVANCED_FACE('',(#130),#131,.T.);
#100=ADVANCED_FACE('',(#132),#133,.T.);
#101=ADVANCED_FACE('',(#134),#135,.T.);
#102=ADVANCED_FACE('',(#136),#137,.T.);
#103=ADVANCED_FACE('',(#138),#139,.T.);
#104=ADVANCED_FACE('',(#140),#141,.F.);
#105=ADVANCED_FACE('',(#142),#143,.F.);
#106=ADVANCED_FACE('',(#144),#145,.F.);
#107=ADVANCED_FACE('',(#146),#147,.F.);
#108=ADVANCED_FACE('',(#148),#149,.F.);
#109=ADVANCED_FACE('',(#150),#151,.F.);
#110=ADVANCED_FACE('',(#152),#153,.F.);
#111=ADVANCED_FACE('',(#154),#155,.F.);
#112=ADVANCED_FACE('',(#156),#157,.F.);
#113=ADVANCED_FACE('',(#158),#159,.F.);
#114=ADVANCED_FACE('',(#160),#161,.F.);
#115=ADVANCED_FACE('',(#162),#163,.F.);
#116=ADVANCED_FACE('',(#164),#165,.F.);
#118=FACE_OUTER_BOUND('',#166,.T.);
#119=PLANE('',#167);
#120=FACE_OUTER_BOUND('',#168,.T.);
#121=PLANE('',#169);
#122=FACE_OUTER_BOUND('',#170,.T.);
#123=PLANE('',#171);
#124=FACE_OUTER_BOUND('',#172,.T.);
#125=PLANE('',#173);
#126=FACE_OUTER_BOUND('',#174,.T.);
#127=PLANE('',#175);
#128=FACE_OUTER_BOUND('',#176,.T.);
#129=PLANE('',#177);
#130=FACE_OUTER_BOUND('',#178,.T.);
#131=PLANE('',#179);
#132=FACE_OUTER_BOUND('',#180,.T.);
#133=PLANE('',#181);
#134=FACE_OUTER_BOUND('',#182,.T.);
#135=PLANE('',#183);
#136=FACE_OUTER_BOUND('',#184,.T.);
#137=PLANE('',#185);
#138=FACE_OUTER_BOUND('',#186,.T.);
#139=PLANE('',#187);
#140=FACE_OUTER_BOUND('',#188,.T.);
#141=PLANE('',#189);
#142=FACE_OUTER_BOUND('',#190,.T.);
#143=PLANE('',#191);
#144=FACE_OUTER_BOUND('',#192,.T.);
#145=PLANE('',#193);
#146=FACE_OUTER_BOUND('',#194,.T.);
#147=PLANE('',#195);
#148=FACE_OUTER_BOUND('',#196,.T.);
#149=PLANE('',#197);
#150=FACE_OUTER_BOUND('',#198,.T.);
#151=PLANE('',#199);
#152=FACE_OUTER_BOUND('',#200,.T.);
#153=PLANE('',#201);
#154=FACE_OUTER_BOUND('',#202,.T.);
#155=PLANE('',#203);
#156=FACE_OUTER_BOUND('',#204,.T.);
#157=PLANE('',#205);
#158=FACE_OUTER_BOUND('',#206,.T.);
#159=PLANE('',#207);
#160=FACE_OUTER_BOUND('',#208,.T.);
#161=PLANE('',#209);
#162=FACE_OUTER_BOUND('',#210,.T.);
#163=PLANE('',#211);
#164=FACE_OUTER_BOUND('',#212,.T.);
#165=PLANE('',#213);
#166=EDGE_LOOP('',(#214,#215,#216,#217));
#167=AXIS2_PLACEMENT_3D('',#218,#219,#220);
#168=EDGE_LOOP('',(#221,#222,#223,#224));
#169=AXIS2_PLACEMENT_3D('',#225,#226,#227);
#170=EDGE_LOOP('',(#228,#229,#230,#231));
#171=AXIS2_PLACEMENT_3D('',#232,#233,#234);
#172=EDGE_LOOP('',(#235,#236,#237,#238));
#173=AXIS2_PLACEMENT_3D('',#239,#240,#241);
#174=EDGE_LOOP('',(#242,#243,#244,#245));
#175=AXIS2_PLACEMENT_3D('',#246,#247,#248);
#176=EDGE_LOOP('',(#249,#250,#251,#252));
#177=AXIS2_PLACEMENT_3D('',#253,#254,#255);
#178=EDGE_LOOP('',(#256,#257,#258,#259));
#179=AXIS2_PLACEMENT_3D('',#260,#261,#262);
#180=EDGE_LOOP('',(#263,#264,#265,#266));
#181=AXIS2_PLACEMENT_3D('',#267,#268,#269);
#182=EDGE_LOOP('',(#270,#271,#272,#273,#274,#275,#276,#277,#278,#279,#280,#281,#282,#283,#284,#285,#286,#287,#288,#289,#290,#291));
#183=AXIS2_PLACEMENT_3D('',#292,#293,#294);
#184=EDGE_LOOP('',(#295,#296,#297,#298));
#185=AXIS2_PLACEMENT_3D('',#299,#300,#301);
#186=EDGE_LOOP('',(#302,#303,#304,#305,#306,#307,#308,#309,#310,#311,#312,#313,#314,#315,#316,#317,#318,#319,#320,#321,#322,#323));
#187=AXIS2_PLACEMENT_3D('',#324,#325,#326);
#188=EDGE_LOOP('',(#327,#328,#329,#330));
#189=AXIS2_PLACEMENT_3D('',#331,#332,#333);
#190=EDGE_LOOP('',(#334,#335,#336,#337));
#191=AXIS2_PLACEMENT_3D('',#338,#339,#340);
#192=EDGE_LOOP('',(#341,#342,#343,#344));
#193=AXIS2_PLACEMENT_3D('',#345,#346,#347);
#194=EDGE_LOOP('',(#348,#349,#350,#351));
#195=AXIS2_PLACEMENT_3D('',#352,#353,#354);
#196=EDGE_LOOP('',(#355,#356,#357,#358));
#197=AXIS2_PLACEMENT_3D('',#359,#360,#361);
#198=EDGE_LOOP('',(#362,#363,#364,#365));
#199=AXIS2_PLACEMENT_3D('',#366,#367,#368);
#200=EDGE_LOOP('',(#369,#370,#371,#372));
#201=AXIS2_PLACEMENT_3D('',#373,#374,#375);
#202=EDGE_LOOP('',(#376,#377,#378,#379));
#203=AXIS2_PLACEMENT_3D('',#380,#381,#382);
#204=EDGE_LOOP('',(#383,#384,#385,#386));
#205=AXIS2_PLACEMENT_3D('',#387,#388,#389);
#206=EDGE_LOOP('',(#390,#391,#392,#393));
#207=AXIS2_PLACEMENT_3D('',#394,#395,#396);
#208=EDGE_LOOP('',(#397,#398,#399,#400));
#209=AXIS2_PLACEMENT_3D('',#401,#402,#403);
#210=EDGE_LOOP('',(#404,#405,#406,#407));
#211=AXIS2_PLACEMENT_3D('',#408,#409,#410);
#212=EDGE_LOOP('',(#411,#412,#413,#414));
#213=AXIS2_PLACEMENT_3D('',#415,#416,#417);
#214=ORIENTED_EDGE('',*,*,#418,.F.);
#215=ORIENTED_EDGE('',*,*,#419,.F.);
#216=ORIENTED_EDGE('',*,*,#420,.F.);
#217=ORIENTED_EDGE('',*,*,#421,.T.);
#218=CARTESIAN_POINT('',(13.3556624327026,5.0,-0.25));
#219=DIRECTION('',(-0.866025403784439,-1.06054021204601E-16,0.5));
#220=DIRECTION('',(-0.5,-6.12303176911188E-17,-0.866025403784439));
#221=ORIENTED_EDGE('',*,*,#422,.F.);
#222=ORIENTED_EDGE('',*,*,#423,.F.);
#223=ORIENTED_EDGE('',*,*,#424,.F.);
#224=ORIENTED_EDGE('',*,*,#425,.T.);
#225=CARTESIAN_POINT('',(11.3556624327026,5.0,-0.25));
#226=DIRECTION('',(0.866025403784438,1.06054021204601E-16,-0.5));
#227=DIRECTION('',(0.5,6.12303176911189E-17,0.866025403784438));
#228=ORIENTED_EDGE('',*,*,#426,.F.);
#229=ORIENTED_EDGE('',*,*,#427,.F.);
#230=ORIENTED_EDGE('',*,*,#428,.F.);
#231=ORIENTED_EDGE('',*,*,#429,.T.);
#232=CARTESIAN_POINT('',(22.8556624327026,5.0,-0.25));
#233=DIRECTION('',(0.866025403784438,1.06054021204601E-16,-0.5));
#234=DIRECTION('',(0.5,6.12303176911189E-17,0.866025403784438));
#235=ORIENTED_EDGE('',*,*,#430,.F.);
#236=ORIENTED_EDGE('',*,*,#431,.F.);
#237=ORIENTED_EDGE('',*,*,#432,.F.);
#238=ORIENTED_EDGE('',*,*,#433,.T.);
#239=CARTESIAN_POINT('',(6.46132486540519,5.0,-0.5));
#240=DIRECTION('',(0.0,0.0,1.0));
#241=DIRECTION('',(-1.0,-1.22460635382238E-16,0.0));
#242=ORIENTED_EDGE('',*,*,#434,.F.);
#243=ORIENTED_EDGE('',*,*,#435,.F.);
#244=ORIENTED_EDGE('',*,*,#436,.F.);
#245=ORIENTED_EDGE('',*,*,#437,.T.);
#246=CARTESIAN_POINT('',(0.711324865405188,5.0,-0.5));
#247=DIRECTION('',(0.0,0.0,1.0));
#248=DIRECTION('',(-1.0,-1.22460635382238E-16,0.0));
#249=ORIENTED_EDGE('',*,*,#438,.F.);
#250=ORIENTED_EDGE('',*,*,#439,.F.);
#251=ORIENTED_EDGE('',*,*,#440,.F.);
#252=ORIENTED_EDGE('',*,*,#431,.T.);
#253=CARTESIAN_POINT('',(5.60566243270259,5.0,-0.25));
#254=DIRECTION('',(0.866025403784438,1.06054021204601E-16,-0.5));
#255=DIRECTION('',(0.5,6.12303176911189E-17,0.866025403784438));
#256=ORIENTED_EDGE('',*,*,#441,.T.);
#257=ORIENTED_EDGE('',*,*,#442,.F.);
#258=ORIENTED_EDGE('',*,*,#443,.T.);
#259=ORIENTED_EDGE('',*,*,#444,.F.);
#260=CARTESIAN_POINT('',(0.0,2.5,0.0));
#261=DIRECTION('',(-1.0,-6.12303176911189E-17,0.0));
#262=DIRECTION('',(6.12303176911189E-17,-1.0,0.0));
#263=ORIENTED_EDGE('',*,*,#445,.F.);
#264=ORIENTED_EDGE('',*,*,#446,.T.);
#265=ORIENTED_EDGE('',*,*,#447,.T.);
#266=ORIENTED_EDGE('',*,*,#448,.F.);
#267=CARTESIAN_POINT('',(25.0,2.5,0.0));
#268=DIRECTION('',(1.0,-6.12303176911189E-17,0.0));
#269=DIRECTION('',(6.12303176911189E-17,1.0,0.0));
#270=ORIENTED_EDGE('',*,*,#444,.T.);
#271=ORIENTED_EDGE('',*,*,#449,.T.);
#272=ORIENTED_EDGE('',*,*,#447,.F.);
#273=ORIENTED_EDGE('',*,*,#450,.T.);
#274=ORIENTED_EDGE('',*,*,#451,.T.);
#275=ORIENTED_EDGE('',*,*,#428,.T.);
#276=ORIENTED_EDGE('',*,*,#452,.T.);
#277=ORIENTED_EDGE('',*,*,#453,.T.);
#278=ORIENTED_EDGE('',*,*,#454,.T.);
#279=ORIENTED_EDGE('',*,*,#455,.T.);
#280=ORIENTED_EDGE('',*,*,#456,.T.);
#281=ORIENTED_EDGE('',*,*,#420,.T.);
#282=ORIENTED_EDGE('',*,*,#457,.T.);
#283=ORIENTED_EDGE('',*,*,#424,.T.);
#284=ORIENTED_EDGE('',*,*,#458,.T.);
#285=ORIENTED_EDGE('',*,*,#459,.T.);
#286=ORIENTED_EDGE('',*,*,#432,.T.);
#287=ORIENTED_EDGE('',*,*,#440,.T.);
#288=ORIENTED_EDGE('',*,*,#460,.T.);
#289=ORIENTED_EDGE('',*,*,#461,.T.);
#290=ORIENTED_EDGE('',*,*,#436,.T.);
#291=ORIENTED_EDGE('',*,*,#462,.T.);
#292=CARTESIAN_POINT('',(12.5,5.0,0.0));
#293=DIRECTION('',(-1.22460635382238E-16,1.0,0.0));
#294=DIRECTION('',(-1.0,-1.22460635382238E-16,0.0));
#295=ORIENTED_EDGE('',*,*,#463,.F.);
#296=ORIENTED_EDGE('',*,*,#448,.T.);
#297=ORIENTED_EDGE('',*,*,#449,.F.);
#298=ORIENTED_EDGE('',*,*,#443,.F.);
#299=CARTESIAN_POINT('',(12.5,0.0,1.0));
#300=DIRECTION('',(0.0,0.0,1.0));
#301=DIRECTION('',(1.0,0.0,0.0));
#302=ORIENTED_EDGE('',*,*,#438,.T.);
#303=ORIENTED_EDGE('',*,*,#430,.T.);
#304=ORIENTED_EDGE('',*,*,#464,.T.);
#305=ORIENTED_EDGE('',*,*,#465,.T.);
#306=ORIENTED_EDGE('',*,*,#422,.T.);
#307=ORIENTED_EDGE('',*,*,#466,.T.);
#308=ORIENTED_EDGE('',*,*,#418,.T.);
#309=ORIENTED_EDGE('',*,*,#467,.T.);
#310=ORIENTED_EDGE('',*,*,#468,.T.);
#311=ORIENTED_EDGE('',*,*,#469,.T.);
#312=ORIENTED_EDGE('',*,*,#470,.T.);
#313=ORIENTED_EDGE('',*,*,#471,.T.);
#314=ORIENTED_EDGE('',*,*,#426,.T.);
#315=ORIENTED_EDGE('',*,*,#472,.T.);
#316=ORIENTED_EDGE('',*,*,#473,.T.);
#317=ORIENTED_EDGE('',*,*,#445,.T.);
#318=ORIENTED_EDGE('',*,*,#463,.T.);
#319=ORIENTED_EDGE('',*,*,#442,.T.);
#320=ORIENTED_EDGE('',*,*,#474,.F.);
#321=ORIENTED_EDGE('',*,*,#434,.T.);
#322=ORIENTED_EDGE('',*,*,#475,.T.);
#323=ORIENTED_EDGE('',*,*,#476,.T.);
#324=CARTESIAN_POINT('',(12.3556624327026,0.5,-0.5));
#325=DIRECTION('',(-1.22460635382238E-16,-1.0,0.0));
#326=DIRECTION('',(1.0,-1.22460635382238E-16,0.0));
#327=ORIENTED_EDGE('',*,*,#473,.F.);
#328=ORIENTED_EDGE('',*,*,#477,.F.);
#329=ORIENTED_EDGE('',*,*,#450,.F.);
#330=ORIENTED_EDGE('',*,*,#446,.F.);
#331=CARTESIAN_POINT('',(24.8556624327026,5.0,-0.25));
#332=DIRECTION('',(-0.866025403784439,-1.06054021204601E-16,0.5));
#333=DIRECTION('',(-0.5,-6.12303176911188E-17,-0.866025403784439));
#334=ORIENTED_EDGE('',*,*,#472,.F.);
#335=ORIENTED_EDGE('',*,*,#429,.F.);
#336=ORIENTED_EDGE('',*,*,#451,.F.);
#337=ORIENTED_EDGE('',*,*,#477,.T.);
#338=CARTESIAN_POINT('',(23.7113248654052,5.0,-0.5));
#339=DIRECTION('',(0.0,0.0,1.0));
#340=DIRECTION('',(-1.0,-1.22460635382238E-16,0.0));
#341=ORIENTED_EDGE('',*,*,#470,.F.);
#342=ORIENTED_EDGE('',*,*,#478,.F.);
#343=ORIENTED_EDGE('',*,*,#453,.F.);
#344=ORIENTED_EDGE('',*,*,#479,.T.);
#345=CARTESIAN_POINT('',(19.1056624327026,5.0,-0.25));
#346=DIRECTION('',(-0.866025403784439,-1.06054021204601E-16,0.5));
#347=DIRECTION('',(-0.5,-6.12303176911188E-17,-0.866025403784439));
#348=ORIENTED_EDGE('',*,*,#469,.F.);
#349=ORIENTED_EDGE('',*,*,#480,.F.);
#350=ORIENTED_EDGE('',*,*,#454,.F.);
#351=ORIENTED_EDGE('',*,*,#478,.T.);
#352=CARTESIAN_POINT('',(17.9613248654052,5.0,-0.5));
#353=DIRECTION('',(0.0,0.0,1.0));
#354=DIRECTION('',(-1.0,-1.22460635382238E-16,0.0));
#355=ORIENTED_EDGE('',*,*,#468,.F.);
#356=ORIENTED_EDGE('',*,*,#481,.F.);
#357=ORIENTED_EDGE('',*,*,#455,.F.);
#358=ORIENTED_EDGE('',*,*,#480,.T.);
#359=CARTESIAN_POINT('',(17.1056624327026,5.0,-0.25));
#360=DIRECTION('',(0.866025403784438,1.06054021204601E-16,-0.5));
#361=DIRECTION('',(0.5,6.12303176911189E-17,0.866025403784438));
#362=ORIENTED_EDGE('',*,*,#475,.F.);
#363=ORIENTED_EDGE('',*,*,#437,.F.);
#364=ORIENTED_EDGE('',*,*,#461,.F.);
#365=ORIENTED_EDGE('',*,*,#482,.T.);
#366=CARTESIAN_POINT('',(1.8556624327026,5.0,-0.25));
#367=DIRECTION('',(-0.866025403784439,-1.06054021204601E-16,0.5));
#368=DIRECTION('',(-0.5,-6.12303176911188E-17,-0.866025403784439));
#369=ORIENTED_EDGE('',*,*,#474,.T.);
#370=ORIENTED_EDGE('',*,*,#441,.F.);
#371=ORIENTED_EDGE('',*,*,#462,.F.);
#372=ORIENTED_EDGE('',*,*,#435,.T.);
#373=CARTESIAN_POINT('',(-0.144337567297405,5.0,-0.25));
#374=DIRECTION('',(0.866025403784438,1.06054021204601E-16,-0.5));
#375=DIRECTION('',(0.5,6.12303176911189E-17,0.866025403784438));
#376=ORIENTED_EDGE('',*,*,#464,.F.);
#377=ORIENTED_EDGE('',*,*,#433,.F.);
#378=ORIENTED_EDGE('',*,*,#459,.F.);
#379=ORIENTED_EDGE('',*,*,#483,.T.);
#380=CARTESIAN_POINT('',(7.6056624327026,5.0,-0.25));
#381=DIRECTION('',(-0.866025403784439,-1.06054021204601E-16,0.5));
#382=DIRECTION('',(-0.5,-6.12303176911188E-17,-0.866025403784439));
#383=ORIENTED_EDGE('',*,*,#465,.F.);
#384=ORIENTED_EDGE('',*,*,#483,.F.);
#385=ORIENTED_EDGE('',*,*,#458,.F.);
#386=ORIENTED_EDGE('',*,*,#423,.T.);
#387=CARTESIAN_POINT('',(0.0,0.0,0.0));
#388=DIRECTION('',(0.0,0.0,1.0));
#389=DIRECTION('',(1.0,0.0,0.0));
#390=ORIENTED_EDGE('',*,*,#476,.F.);
#391=ORIENTED_EDGE('',*,*,#482,.F.);
#392=ORIENTED_EDGE('',*,*,#460,.F.);
#393=ORIENTED_EDGE('',*,*,#439,.T.);
#394=CARTESIAN_POINT('',(0.0,0.0,0.0));
#395=DIRECTION('',(0.0,0.0,1.0));
#396=DIRECTION('',(1.0,0.0,0.0));
#397=ORIENTED_EDGE('',*,*,#471,.F.);
#398=ORIENTED_EDGE('',*,*,#479,.F.);
#399=ORIENTED_EDGE('',*,*,#452,.F.);
#400=ORIENTED_EDGE('',*,*,#427,.T.);
#401=CARTESIAN_POINT('',(0.0,0.0,0.0));
#402=DIRECTION('',(0.0,0.0,1.0));
#403=DIRECTION('',(1.0,0.0,0.0));
#404=ORIENTED_EDGE('',*,*,#467,.F.);
#405=ORIENTED_EDGE('',*,*,#421,.F.);
#406=ORIENTED_EDGE('',*,*,#456,.F.);
#407=ORIENTED_EDGE('',*,*,#481,.T.);
#408=CARTESIAN_POINT('',(0.0,0.0,0.0));
#409=DIRECTION('',(0.0,0.0,1.0));
#410=DIRECTION('',(1.0,0.0,0.0));
#411=ORIENTED_EDGE('',*,*,#466,.F.);
#412=ORIENTED_EDGE('',*,*,#425,.F.);
#413=ORIENTED_EDGE('',*,*,#457,.F.);
#414=ORIENTED_EDGE('',*,*,#419,.T.);
#415=CARTESIAN_POINT('',(12.2113248654052,5.0,-0.5));
#416=DIRECTION('',(0.0,0.0,1.0));
#417=DIRECTION('',(-1.0,-1.22460635382238E-16,0.0));
#418=EDGE_CURVE('',#484,#485,#486,.T.);
#419=EDGE_CURVE('',#487,#484,#488,.T.);
#420=EDGE_CURVE('',#489,#487,#490,.T.);
#421=EDGE_CURVE('',#489,#485,#491,.T.);
#422=EDGE_CURVE('',#492,#493,#494,.T.);
#423=EDGE_CURVE('',#495,#492,#496,.T.);
#424=EDGE_CURVE('',#497,#495,#498,.T.);
#425=EDGE_CURVE('',#497,#493,#499,.T.);
#426=EDGE_CURVE('',#500,#501,#502,.T.);
#427=EDGE_CURVE('',#503,#500,#504,.T.);
#428=EDGE_CURVE('',#505,#503,#506,.T.);
#429=EDGE_CURVE('',#505,#501,#507,.T.);
#430=EDGE_CURVE('',#508,#509,#510,.T.);
#431=EDGE_CURVE('',#511,#508,#512,.T.);
#432=EDGE_CURVE('',#513,#511,#514,.T.);
#433=EDGE_CURVE('',#513,#509,#515,.T.);
#434=EDGE_CURVE('',#516,#517,#518,.T.);
#435=EDGE_CURVE('',#519,#516,#520,.T.);
#436=EDGE_CURVE('',#521,#519,#522,.T.);
#437=EDGE_CURVE('',#521,#517,#523,.T.);
#438=EDGE_CURVE('',#524,#508,#525,.T.);
#439=EDGE_CURVE('',#526,#524,#527,.T.);
#440=EDGE_CURVE('',#511,#526,#528,.T.);
#441=EDGE_CURVE('',#529,#530,#531,.T.);
#442=EDGE_CURVE('',#532,#530,#533,.T.);
#443=EDGE_CURVE('',#532,#534,#535,.T.);
#444=EDGE_CURVE('',#529,#534,#536,.T.);
#445=EDGE_CURVE('',#537,#538,#539,.T.);
#446=EDGE_CURVE('',#537,#540,#541,.T.);
#447=EDGE_CURVE('',#540,#542,#543,.T.);
#448=EDGE_CURVE('',#538,#542,#544,.T.);
#449=EDGE_CURVE('',#534,#542,#545,.T.);
#450=EDGE_CURVE('',#540,#546,#547,.T.);
#451=EDGE_CURVE('',#546,#505,#548,.T.);
#452=EDGE_CURVE('',#503,#549,#550,.T.);
#453=EDGE_CURVE('',#549,#551,#552,.T.);
#454=EDGE_CURVE('',#551,#553,#554,.T.);
#455=EDGE_CURVE('',#553,#555,#556,.T.);
#456=EDGE_CURVE('',#555,#489,#557,.T.);
#457=EDGE_CURVE('',#487,#497,#558,.T.);
#458=EDGE_CURVE('',#495,#559,#560,.T.);
#459=EDGE_CURVE('',#559,#513,#561,.T.);
#460=EDGE_CURVE('',#526,#562,#563,.T.);
#461=EDGE_CURVE('',#562,#521,#564,.T.);
#462=EDGE_CURVE('',#519,#529,#565,.T.);
#463=EDGE_CURVE('',#538,#532,#566,.T.);
#464=EDGE_CURVE('',#509,#567,#568,.T.);
#465=EDGE_CURVE('',#567,#492,#569,.T.);
#466=EDGE_CURVE('',#493,#484,#570,.T.);
#467=EDGE_CURVE('',#485,#571,#572,.T.);
#468=EDGE_CURVE('',#571,#573,#574,.T.);
#469=EDGE_CURVE('',#573,#575,#576,.T.);
#470=EDGE_CURVE('',#575,#577,#578,.T.);
#471=EDGE_CURVE('',#577,#500,#579,.T.);
#472=EDGE_CURVE('',#501,#580,#581,.T.);
#473=EDGE_CURVE('',#580,#537,#582,.T.);
#474=EDGE_CURVE('',#516,#530,#583,.T.);
#475=EDGE_CURVE('',#517,#584,#585,.T.);
#476=EDGE_CURVE('',#584,#524,#586,.T.);
#477=EDGE_CURVE('',#546,#580,#587,.T.);
#478=EDGE_CURVE('',#551,#575,#588,.T.);
#479=EDGE_CURVE('',#549,#577,#589,.T.);
#480=EDGE_CURVE('',#553,#573,#590,.T.);
#481=EDGE_CURVE('',#555,#571,#591,.T.);
#482=EDGE_CURVE('',#562,#584,#592,.T.);
#483=EDGE_CURVE('',#559,#567,#593,.T.);
#484=VERTEX_POINT('',#594);
#485=VERTEX_POINT('',#595);
#486=LINE('',#596,#597);
#487=VERTEX_POINT('',#598);
#488=LINE('',#599,#600);
#489=VERTEX_POINT('',#601);
#490=LINE('',#602,#603);
#491=LINE('',#604,#605);
#492=VERTEX_POINT('',#606);
#493=VERTEX_POINT('',#607);
#494=LINE('',#608,#609);
#495=VERTEX_POINT('',#610);
#496=LINE('',#611,#612);
#497=VERTEX_POINT('',#613);
#498=LINE('',#614,#615);
#499=LINE('',#616,#617);
#500=VERTEX_POINT('',#618);
#501=VERTEX_POINT('',#619);
#502=LINE('',#620,#621);
#503=VERTEX_POINT('',#622);
#504=LINE('',#623,#624);
#505=VERTEX_POINT('',#625);
#506=LINE('',#626,#627);
#507=LINE('',#628,#629);
#508=VERTEX_POINT('',#630);
#509=VERTEX_POINT('',#631);
#510=LINE('',#632,#633);
#511=VERTEX_POINT('',#634);
#512=LINE('',#635,#636);
#513=VERTEX_POINT('',#637);
#514=LINE('',#638,#639);
#515=LINE('',#640,#641);
#516=VERTEX_POINT('',#642);
#517=VERTEX_POINT('',#643);
#518=LINE('',#644,#645);
#519=VERTEX_POINT('',#646);
#520=LINE('',#647,#648);
#521=VERTEX_POINT('',#649);
#522=LINE('',#650,#651);
#523=LINE('',#652,#653);
#524=VERTEX_POINT('',#654);
#525=LINE('',#655,#656);
#526=VERTEX_POINT('',#657);
#527=LINE('',#658,#659);
#528=LINE('',#660,#661);
#529=VERTEX_POINT('',#662);
#530=VERTEX_POINT('',#663);
#531=LINE('',#664,#665);
#532=VERTEX_POINT('',#666);
#533=LINE('',#667,#668);
#534=VERTEX_POINT('',#669);
#535=LINE('',#670,#671);
#536=LINE('',#672,#673);
#537=VERTEX_POINT('',#674);
#538=VERTEX_POINT('',#675);
#539=LINE('',#676,#677);
#540=VERTEX_POINT('',#678);
#541=LINE('',#679,#680);
#542=VERTEX_POINT('',#681);
#543=LINE('',#682,#683);
#544=LINE('',#684,#685);
#545=LINE('',#686,#687);
#546=VERTEX_POINT('',#688);
#547=LINE('',#689,#690);
#548=LINE('',#691,#692);
#549=VERTEX_POINT('',#693);
#550=LINE('',#694,#695);
#551=VERTEX_POINT('',#696);
#552=LINE('',#697,#698);
#553=VERTEX_POINT('',#699);
#554=LINE('',#700,#701);
#555=VERTEX_POINT('',#702);
#556=LINE('',#703,#704);
#557=LINE('',#705,#706);
#558=LINE('',#707,#708);
#559=VERTEX_POINT('',#709);
#560=LINE('',#710,#711);
#561=LINE('',#712,#713);
#562=VERTEX_POINT('',#714);
#563=LINE('',#715,#716);
#564=LINE('',#717,#718);
#565=LINE('',#719,#720);
#566=LINE('',#721,#722);
#567=VERTEX_POINT('',#723);
#568=LINE('',#724,#725);
#569=LINE('',#726,#727);
#570=LINE('',#728,#729);
#571=VERTEX_POINT('',#730);
#572=LINE('',#731,#732);
#573=VERTEX_POINT('',#733);
#574=LINE('',#734,#735);
#575=VERTEX_POINT('',#736);
#576=LINE('',#737,#738);
#577=VERTEX_POINT('',#739);
#578=LINE('',#740,#741);
#579=LINE('',#742,#743);
#580=VERTEX_POINT('',#744);
#581=LINE('',#745,#746);
#582=LINE('',#747,#748);
#583=LINE('',#749,#750);
#584=VERTEX_POINT('',#751);
#585=LINE('',#752,#753);
#586=LINE('',#754,#755);
#587=LINE('',#756,#757);
#588=LINE('',#758,#759);
#589=LINE('',#760,#761);
#590=LINE('',#762,#763);
#591=LINE('',#764,#765);
#592=LINE('',#766,#767);
#593=LINE('',#768,#769);
#594=CARTESIAN_POINT('',(13.2113248654052,0.5,-0.5));
#595=CARTESIAN_POINT('',(13.5,0.5,-7.58941520739853E-16));
#596=CARTESIAN_POINT('',(13.3556624327026,0.5,-0.25));
#597=VECTOR('',#770,1.0);
#598=CARTESIAN_POINT('',(13.2113248654052,5.0,-0.5));
#599=CARTESIAN_POINT('',(13.2113248654052,5.0,-0.5));
#600=VECTOR('',#771,1.0);
#601=CARTESIAN_POINT('',(13.5,5.0,-7.04731412115578E-16));
#602=CARTESIAN_POINT('',(13.3556624327026,5.0,-0.25));
#603=VECTOR('',#772,1.0);
#604=CARTESIAN_POINT('',(13.5,5.0,-7.04731412115578E-16));
#605=VECTOR('',#773,1.0);
#606=CARTESIAN_POINT('',(11.5,0.5,-8.67361737988404E-16));
#607=CARTESIAN_POINT('',(11.2113248654052,0.5,-0.5));
#608=CARTESIAN_POINT('',(11.3556624327026,0.5,-0.25));
#609=VECTOR('',#774,1.0);
#610=CARTESIAN_POINT('',(11.5,5.0,-8.67361737988404E-16));
#611=CARTESIAN_POINT('',(11.5,5.0,-8.67361737988404E-16));
#612=VECTOR('',#775,1.0);
#613=CARTESIAN_POINT('',(11.2113248654052,5.0,-0.5));
#614=CARTESIAN_POINT('',(11.3556624327026,5.0,-0.25));
#615=VECTOR('',#776,1.0);
#616=CARTESIAN_POINT('',(11.2113248654052,5.0,-0.5));
#617=VECTOR('',#777,1.0);
#618=CARTESIAN_POINT('',(23.0,0.5,-9.21571846612679E-16));
#619=CARTESIAN_POINT('',(22.7113248654052,0.5,-0.5));
#620=CARTESIAN_POINT('',(22.8556624327026,0.5,-0.25));
#621=VECTOR('',#778,1.0);
#622=CARTESIAN_POINT('',(23.0,5.0,-8.67361737988404E-16));
#623=CARTESIAN_POINT('',(23.0,5.0,-8.67361737988404E-16));
#624=VECTOR('',#779,1.0);
#625=CARTESIAN_POINT('',(22.7113248654052,5.0,-0.5));
#626=CARTESIAN_POINT('',(22.8556624327026,5.0,-0.25));
#627=VECTOR('',#780,1.0);
#628=CARTESIAN_POINT('',(22.7113248654052,5.0,-0.5));
#629=VECTOR('',#781,1.0);
#630=CARTESIAN_POINT('',(5.46132486540519,0.5,-0.5));
#631=CARTESIAN_POINT('',(7.46132486540519,0.5,-0.5));
#632=CARTESIAN_POINT('',(12.3556624327026,0.5,-0.5));
#633=VECTOR('',#782,1.0);
#634=CARTESIAN_POINT('',(5.46132486540519,5.0,-0.5));
#635=CARTESIAN_POINT('',(5.46132486540519,5.0,-0.5));
#636=VECTOR('',#783,1.0);
#637=CARTESIAN_POINT('',(7.46132486540519,5.0,-0.5));
#638=CARTESIAN_POINT('',(6.46132486540519,5.0,-0.5));
#639=VECTOR('',#784,1.0);
#640=CARTESIAN_POINT('',(7.46132486540519,5.0,-0.5));
#641=VECTOR('',#785,1.0);
#642=CARTESIAN_POINT('',(-0.288675134594809,0.5,-0.5));
#643=CARTESIAN_POINT('',(1.71132486540519,0.5,-0.5));
#644=CARTESIAN_POINT('',(12.3556624327026,0.5,-0.5));
#645=VECTOR('',#786,1.0);
#646=CARTESIAN_POINT('',(-0.28867513459481,5.0,-0.5));
#647=CARTESIAN_POINT('',(-0.28867513459481,5.0,-0.5));
#648=VECTOR('',#787,1.0);
#649=CARTESIAN_POINT('',(1.71132486540519,5.0,-0.5));
#650=CARTESIAN_POINT('',(0.711324865405188,5.0,-0.5));
#651=VECTOR('',#788,1.0);
#652=CARTESIAN_POINT('',(1.71132486540519,5.0,-0.5));
#653=VECTOR('',#789,1.0);
#654=CARTESIAN_POINT('',(5.75,0.5,0.0));
#655=CARTESIAN_POINT('',(5.60566243270259,0.5,-0.25));
#656=VECTOR('',#790,1.0);
#657=CARTESIAN_POINT('',(5.75,5.0,-8.67361737988404E-16));
#658=CARTESIAN_POINT('',(5.75,5.0,-8.67361737988404E-16));
#659=VECTOR('',#791,1.0);
#660=CARTESIAN_POINT('',(5.60566243270259,5.0,-0.25));
#661=VECTOR('',#792,1.0);
#662=CARTESIAN_POINT('',(0.0,5.0,0.0));
#663=CARTESIAN_POINT('',(0.0,0.5,0.0));
#664=CARTESIAN_POINT('',(0.0,2.5,0.0));
#665=VECTOR('',#793,1.0);
#666=CARTESIAN_POINT('',(0.0,0.5,1.0));
#667=CARTESIAN_POINT('',(0.0,0.5,-0.5));
#668=VECTOR('',#794,1.0);
#669=CARTESIAN_POINT('',(0.0,5.0,1.0));
#670=CARTESIAN_POINT('',(0.0,0.0,1.0));
#671=VECTOR('',#795,1.0);
#672=CARTESIAN_POINT('',(0.0,5.0,0.0));
#673=VECTOR('',#796,1.0);
#674=CARTESIAN_POINT('',(25.0,0.5,-3.41523684332934E-15));
#675=CARTESIAN_POINT('',(25.0,0.5,1.0));
#676=CARTESIAN_POINT('',(25.0,0.5,-0.5));
#677=VECTOR('',#797,1.0);
#678=CARTESIAN_POINT('',(25.0,5.0,-7.04731412115578E-16));
#679=CARTESIAN_POINT('',(25.0,2.5,0.0));
#680=VECTOR('',#798,1.0);
#681=CARTESIAN_POINT('',(25.0,5.0,1.0));
#682=CARTESIAN_POINT('',(25.0,5.0,0.0));
#683=VECTOR('',#799,1.0);
#684=CARTESIAN_POINT('',(25.0,0.0,1.0));
#685=VECTOR('',#800,1.0);
#686=CARTESIAN_POINT('',(12.5,5.0,1.0));
#687=VECTOR('',#801,1.0);
#688=CARTESIAN_POINT('',(24.7113248654052,5.0,-0.5));
#689=CARTESIAN_POINT('',(24.8556624327026,5.0,-0.25));
#690=VECTOR('',#802,1.0);
#691=CARTESIAN_POINT('',(23.7113248654052,5.0,-0.5));
#692=VECTOR('',#803,1.0);
#693=CARTESIAN_POINT('',(19.25,5.0,-7.04731412115578E-16));
#694=CARTESIAN_POINT('',(12.5,5.0,0.0));
#695=VECTOR('',#804,1.0);
#696=CARTESIAN_POINT('',(18.9613248654052,5.0,-0.5));
#697=CARTESIAN_POINT('',(19.1056624327026,5.0,-0.25));
#698=VECTOR('',#805,1.0);
#699=CARTESIAN_POINT('',(16.9613248654052,5.0,-0.5));
#700=CARTESIAN_POINT('',(17.9613248654052,5.0,-0.5));
#701=VECTOR('',#806,1.0);
#702=CARTESIAN_POINT('',(17.25,5.0,-8.67361737988404E-16));
#703=CARTESIAN_POINT('',(17.1056624327026,5.0,-0.25));
#704=VECTOR('',#807,1.0);
#705=CARTESIAN_POINT('',(12.5,5.0,0.0));
#706=VECTOR('',#808,1.0);
#707=CARTESIAN_POINT('',(12.2113248654052,5.0,-0.5));
#708=VECTOR('',#809,1.0);
#709=CARTESIAN_POINT('',(7.75,5.0,-7.04731412115578E-16));
#710=CARTESIAN_POINT('',(12.5,5.0,0.0));
#711=VECTOR('',#810,1.0);
#712=CARTESIAN_POINT('',(7.6056624327026,5.0,-0.25));
#713=VECTOR('',#811,1.0);
#714=CARTESIAN_POINT('',(2.0,5.0,0.0));
#715=CARTESIAN_POINT('',(12.5,5.0,0.0));
#716=VECTOR('',#812,1.0);
#717=CARTESIAN_POINT('',(1.8556624327026,5.0,-0.25));
#718=VECTOR('',#813,1.0);
#719=CARTESIAN_POINT('',(-0.144337567297405,5.0,-0.25));
#720=VECTOR('',#814,1.0);
#721=CARTESIAN_POINT('',(12.3556624327026,0.5,1.0));
#722=VECTOR('',#815,1.0);
#723=CARTESIAN_POINT('',(7.75,0.5,0.0));
#724=CARTESIAN_POINT('',(7.6056624327026,0.5,-0.25));
#725=VECTOR('',#816,1.0);
#726=CARTESIAN_POINT('',(6.12303176911191E-17,0.5,0.0));
#727=VECTOR('',#817,1.0);
#728=CARTESIAN_POINT('',(12.3556624327026,0.5,-0.5));
#729=VECTOR('',#818,1.0);
#730=CARTESIAN_POINT('',(17.25,0.5,0.0));
#731=CARTESIAN_POINT('',(6.12303176911191E-17,0.5,0.0));
#732=VECTOR('',#819,1.0);
#733=CARTESIAN_POINT('',(16.9613248654052,0.5,-0.5));
#734=CARTESIAN_POINT('',(17.1056624327026,0.5,-0.25));
#735=VECTOR('',#820,1.0);
#736=CARTESIAN_POINT('',(18.9613248654052,0.5,-0.5));
#737=CARTESIAN_POINT('',(12.3556624327026,0.5,-0.5));
#738=VECTOR('',#821,1.0);
#739=CARTESIAN_POINT('',(19.25,0.5,0.0));
#740=CARTESIAN_POINT('',(19.1056624327026,0.5,-0.25));
#741=VECTOR('',#822,1.0);
#742=CARTESIAN_POINT('',(6.12303176911191E-17,0.5,0.0));
#743=VECTOR('',#823,1.0);
#744=CARTESIAN_POINT('',(24.7113248654052,0.5,-0.5));
#745=CARTESIAN_POINT('',(12.3556624327026,0.5,-0.5));
#746=VECTOR('',#824,1.0);
#747=CARTESIAN_POINT('',(24.8556624327026,0.5,-0.25));
#748=VECTOR('',#825,1.0);
#749=CARTESIAN_POINT('',(2.87240925722954,0.5,4.97515877365275));
#750=VECTOR('',#826,1.0);
#751=CARTESIAN_POINT('',(2.0,0.5,-7.58941520739853E-16));
#752=CARTESIAN_POINT('',(1.8556624327026,0.5,-0.25));
#753=VECTOR('',#827,1.0);
#754=CARTESIAN_POINT('',(6.12303176911191E-17,0.5,0.0));
#755=VECTOR('',#828,1.0);
#756=CARTESIAN_POINT('',(24.7113248654052,5.0,-0.5));
#757=VECTOR('',#829,1.0);
#758=CARTESIAN_POINT('',(18.9613248654052,5.0,-0.5));
#759=VECTOR('',#830,1.0);
#760=CARTESIAN_POINT('',(19.25,5.0,-7.04731412115578E-16));
#761=VECTOR('',#831,1.0);
#762=CARTESIAN_POINT('',(16.9613248654052,5.0,-0.5));
#763=VECTOR('',#832,1.0);
#764=CARTESIAN_POINT('',(17.25,5.0,-8.67361737988404E-16));
#765=VECTOR('',#833,1.0);
#766=CARTESIAN_POINT('',(2.0,5.0,-7.04731412115578E-16));
#767=VECTOR('',#834,1.0);
#768=CARTESIAN_POINT('',(7.75,5.0,-7.04731412115578E-16));
#769=VECTOR('',#835,1.0);
#770=DIRECTION('',(0.5,-6.12303176911188E-17,0.866025403784439));
#771=DIRECTION('',(1.22460635382238E-16,-1.0,0.0));
#772=DIRECTION('',(-0.5,-6.12303176911188E-17,-0.866025403784439));
#773=DIRECTION('',(1.22460635382238E-16,-1.0,0.0));
#774=DIRECTION('',(-0.5,6.12303176911189E-17,-0.866025403784439));
#775=DIRECTION('',(1.22460635382238E-16,-1.0,0.0));
#776=DIRECTION('',(0.5,6.12303176911189E-17,0.866025403784438));
#777=DIRECTION('',(1.22460635382238E-16,-1.0,0.0));
#778=DIRECTION('',(-0.5,6.12303176911189E-17,-0.866025403784439));
#779=DIRECTION('',(1.22460635382238E-16,-1.0,0.0));
#780=DIRECTION('',(0.5,6.12303176911189E-17,0.866025403784438));
#781=DIRECTION('',(1.22460635382238E-16,-1.0,0.0));
#782=DIRECTION('',(1.0,-1.22460635382238E-16,0.0));
#783=DIRECTION('',(1.22460635382238E-16,-1.0,0.0));
#784=DIRECTION('',(-1.0,-1.22460635382238E-16,0.0));
#785=DIRECTION('',(1.22460635382238E-16,-1.0,0.0));
#786=DIRECTION('',(1.0,-1.22460635382238E-16,0.0));
#787=DIRECTION('',(1.22460635382238E-16,-1.0,0.0));
#788=DIRECTION('',(-1.0,-1.22460635382238E-16,0.0));
#789=DIRECTION('',(1.22460635382238E-16,-1.0,0.0));
#790=DIRECTION('',(-0.5,6.12303176911189E-17,-0.866025403784439));
#791=DIRECTION('',(1.22460635382238E-16,-1.0,0.0));
#792=DIRECTION('',(0.5,6.12303176911189E-17,0.866025403784438));
#793=DIRECTION('',(6.12303176911189E-17,-1.0,0.0));
#794=DIRECTION('',(0.0,0.0,-1.0));
#795=DIRECTION('',(0.0,1.0,0.0));
#796=DIRECTION('',(0.0,0.0,1.0));
#797=DIRECTION('',(0.0,0.0,1.0));
#798=DIRECTION('',(6.12303176911189E-17,1.0,0.0));
#799=DIRECTION('',(0.0,0.0,1.0));
#800=DIRECTION('',(0.0,1.0,0.0));
#801=DIRECTION('',(1.0,0.0,0.0));
#802=DIRECTION('',(-0.5,-6.12303176911188E-17,-0.866025403784439));
#803=DIRECTION('',(-1.0,-1.22460635382238E-16,0.0));
#804=DIRECTION('',(-1.0,-1.22460635382238E-16,0.0));
#805=DIRECTION('',(-0.5,-6.12303176911188E-17,-0.866025403784439));
#806=DIRECTION('',(-1.0,-1.22460635382238E-16,0.0));
#807=DIRECTION('',(0.5,6.12303176911189E-17,0.866025403784438));
#808=DIRECTION('',(-1.0,-1.22460635382238E-16,0.0));
#809=DIRECTION('',(-1.0,-1.22460635382238E-16,0.0));
#810=DIRECTION('',(-1.0,-1.22460635382238E-16,0.0));
#811=DIRECTION('',(-0.5,-6.12303176911188E-17,-0.866025403784439));
#812=DIRECTION('',(-1.0,-1.22460635382238E-16,0.0));
#813=DIRECTION('',(-0.5,-6.12303176911188E-17,-0.866025403784439));
#814=DIRECTION('',(0.5,6.12303176911189E-17,0.866025403784438));
#815=DIRECTION('',(-1.0,1.22460635382238E-16,0.0));
#816=DIRECTION('',(0.5,-6.12303176911188E-17,0.866025403784439));
#817=DIRECTION('',(1.0,-1.22460635382238E-16,0.0));
#818=DIRECTION('',(1.0,-1.22460635382238E-16,0.0));
#819=DIRECTION('',(1.0,-1.22460635382238E-16,0.0));
#820=DIRECTION('',(-0.5,6.12303176911189E-17,-0.866025403784439));
#821=DIRECTION('',(1.0,-1.22460635382238E-16,0.0));
#822=DIRECTION('',(0.5,-6.12303176911188E-17,0.866025403784439));
#823=DIRECTION('',(1.0,-1.22460635382238E-16,0.0));
#824=DIRECTION('',(1.0,-1.22460635382238E-16,0.0));
#825=DIRECTION('',(0.5,-6.12303176911188E-17,0.866025403784439));
#826=DIRECTION('',(0.5,-6.12303176911189E-17,0.866025403784439));
#827=DIRECTION('',(0.5,-6.12303176911188E-17,0.866025403784439));
#828=DIRECTION('',(1.0,-1.22460635382238E-16,0.0));
#829=DIRECTION('',(1.22460635382238E-16,-1.0,0.0));
#830=DIRECTION('',(1.22460635382238E-16,-1.0,0.0));
#831=DIRECTION('',(1.22460635382238E-16,-1.0,0.0));
#832=DIRECTION('',(1.22460635382238E-16,-1.0,0.0));
#833=DIRECTION('',(1.22460635382238E-16,-1.0,0.0));
#834=DIRECTION('',(1.22460635382238E-16,-1.0,0.0));
#835=DIRECTION('',(1.22460635382238E-16,-1.0,0.0));
ENDSEC;
END-ISO-10303-21;
