ISO-10303-21;
HEADER;
FILE_DESCRIPTION(('STEP AP203'),'1');
FILE_NAME('RBF22.P403-1 Rolete.stp','2022-08-30T19:18:12',(' '),(' '),'Spatial InterOp 3D',' ',' ');
FILE_SCHEMA(('CONFIG_CONTROL_DESIGN'));
ENDSEC;
DATA;
#1=DESIGN_CONTEXT('',#33,'design');
#2=APPLICATION_PROTOCOL_DEFINITION('INTERNATIONAL STANDARD','config_control_design',1994,#33);
#3=PRODUCT_CATEGORY_RELATIONSHIP('NONE','NONE',#34,#35);
#4=DATE_AND_TIME(#36,#37);
#5=DATE_TIME_ROLE('creation_date');
#6=DATE_TIME_ROLE('classification_date');
#7=PERSON_AND_ORGANIZATION_ROLE('creator');
#8=PERSON_AND_ORGANIZATION_ROLE('design_supplier');
#9=PERSON_AND_ORGANIZATION_ROLE('classification_officer');
#10=PERSON_AND_ORGANIZATION_ROLE('design_owner');
#11=APPROVAL_PERSON_ORGANIZATION(#38,#39,#40);
#12=APPROVAL_DATE_TIME(#4,#39);
#13=CC_DESIGN_APPROVAL(#39,(#41,#42,#43));
#14=CC_DESIGN_DATE_AND_TIME_ASSIGNMENT(#4,#5,(#43));
#15=CC_DESIGN_DATE_AND_TIME_ASSIGNMENT(#4,#6,(#41));
#16=CC_DESIGN_PERSON_AND_ORGANIZATION_ASSIGNMENT(#38,#10,(#44));
#17=CC_DESIGN_PERSON_AND_ORGANIZATION_ASSIGNMENT(#38,#7,(#43));
#18=CC_DESIGN_PERSON_AND_ORGANIZATION_ASSIGNMENT(#38,#7,(#42));
#19=CC_DESIGN_PERSON_AND_ORGANIZATION_ASSIGNMENT(#38,#8,(#42));
#20=CC_DESIGN_SECURITY_CLASSIFICATION(#41,(#42));
#21=CC_DESIGN_PERSON_AND_ORGANIZATION_ASSIGNMENT(#38,#9,(#41));
#22=SHAPE_DEFINITION_REPRESENTATION(#45,#46);
#23= (GEOMETRIC_REPRESENTATION_CONTEXT(3)GLOBAL_UNCERTAINTY_ASSIGNED_CONTEXT((#49))GLOBAL_UNIT_ASSIGNED_CONTEXT((#51,#52,#53))REPRESENTATION_CONTEXT('NONE','WORKSPACE'));
#24=PROPERTY_DEFINITION_REPRESENTATION(#55,#56);
#25=GENERAL_PROPERTY_ASSOCIATION('','',#57,#55);
#26=PROPERTY_DEFINITION_REPRESENTATION(#58,#59);
#27=GENERAL_PROPERTY_ASSOCIATION('','',#60,#58);
#28=PROPERTY_DEFINITION_REPRESENTATION(#61,#62);
#29=GENERAL_PROPERTY_ASSOCIATION('','',#63,#61);
#33=APPLICATION_CONTEXT('CONFIGURATION CONTROLLED 3D DESIGNS OF MECHANICAL PARTS AND ASSEMBLIES');
#34=PRODUCT_CATEGORY('part','NONE');
#35=PRODUCT_RELATED_PRODUCT_CATEGORY('detail',' ',(#44));
#36=CALENDAR_DATE(2022,30,7);
#37=LOCAL_TIME(16,18,12.0,#64);
#38=PERSON_AND_ORGANIZATION(#65,#66);
#39=APPROVAL(#67,'SOLID MODEL');
#40=APPROVAL_ROLE('APPROVED');
#41=SECURITY_CLASSIFICATION('','',#68);
#42=PRODUCT_DEFINITION_FORMATION_WITH_SPECIFIED_SOURCE('A','NONE',#44,.NOT_KNOWN.);
#43=PRODUCT_DEFINITION('','NONE',#42,#1);
#44=PRODUCT('Rolete2mm','','Rolete2mm',(#69));
#45=PRODUCT_DEFINITION_SHAPE('NONE','NONE',#43);
#46=ADVANCED_BREP_SHAPE_REPRESENTATION('1',(#70,#71),#23);
#49=UNCERTAINTY_MEASURE_WITH_UNIT(LENGTH_MEASURE(0.001),#51,'','');
#51= (CONVERSION_BASED_UNIT('MILLIMETRE',#74)LENGTH_UNIT()NAMED_UNIT(#77));
#52= (NAMED_UNIT(#79)PLANE_ANGLE_UNIT()SI_UNIT($,.RADIAN.));
#53= (NAMED_UNIT(#79)SOLID_ANGLE_UNIT()SI_UNIT($,.STERADIAN.));
#55=PROPERTY_DEFINITION('PdmObjectId','',#43);
#56=REPRESENTATION('',(#85),#23);
#57=GENERAL_PROPERTY('','19_5650811b-43a8-4978-9781-83654e6a100d&2_2_0_0','');
#58=PROPERTY_DEFINITION('CreationDate','',#43);
#59=REPRESENTATION('',(#86),#23);
#60=GENERAL_PROPERTY('','30/08/2022 18:34:37','');
#61=PROPERTY_DEFINITION('Minor Revision','',#43);
#62=REPRESENTATION('',(#87),#23);
#63=GENERAL_PROPERTY('','0','');
#64=COORDINATED_UNIVERSAL_TIME_OFFSET(3,0,.BEHIND.);
#65=PERSON('','UNSPECIFIED',$,$,$,$);
#66=ORGANIZATION('UNSPECIFIED','UNSPECIFIED','UNSPECIFIED');
#67=APPROVAL_STATUS('approved');
#68=SECURITY_CLASSIFICATION_LEVEL('unclassified');
#69=MECHANICAL_CONTEXT('',#33,'mechanical');
#70=MANIFOLD_SOLID_BREP('1',#88);
#71=AXIS2_PLACEMENT_3D('',#89,#90,#91);
#74=LENGTH_MEASURE_WITH_UNIT(LENGTH_MEASURE(1.0),#92);
#77=DIMENSIONAL_EXPONENTS(1.0,0.0,0.0,0.0,0.0,0.0,0.0);
#79=DIMENSIONAL_EXPONENTS(0.0,0.0,0.0,0.0,0.0,0.0,0.0);
#85=VALUE_REPRESENTATION_ITEM('19_5650811b-43a8-4978-9781-83654e6a100d&2_2_0_0',);
#86=VALUE_REPRESENTATION_ITEM('30/08/2022 18:34:37',);
#87=VALUE_REPRESENTATION_ITEM('0',);
#88=CLOSED_SHELL('',(#93,#94,#95,#96,#97,#98,#99,#100,#101,#102,#103,#104,#105,#106,#107));
#89=CARTESIAN_POINT('',(0.0,0.0,0.0));
#90=DIRECTION('',(0.0,0.0,1.0));
#91=DIRECTION('',(1.0,0.0,0.0));
#92= (NAMED_UNIT(#77)LENGTH_UNIT()SI_UNIT(.MILLI.,.METRE.));
#93=ADVANCED_FACE('',(#109,#110),#111,.T.);
#94=ADVANCED_FACE('',(#112,#113),#114,.T.);
#95=ADVANCED_FACE('',(#115,#116),#117,.T.);
#96=ADVANCED_FACE('',(#118,#119),#120,.T.);
#97=ADVANCED_FACE('',(#121,#122),#123,.T.);
#98=ADVANCED_FACE('',(#124,#125),#126,.T.);
#99=ADVANCED_FACE('',(#127,#128),#129,.F.);
#100=ADVANCED_FACE('',(#130,#131),#132,.F.);
#101=ADVANCED_FACE('',(#133,#134),#135,.T.);
#102=ADVANCED_FACE('',(#136,#137),#138,.T.);
#103=ADVANCED_FACE('',(#139),#140,.T.);
#104=ADVANCED_FACE('',(#141),#142,.T.);
#105=ADVANCED_FACE('',(#143,#144),#145,.T.);
#106=ADVANCED_FACE('',(#146,#147),#148,.T.);
#107=ADVANCED_FACE('',(#149,#150),#151,.T.);
#109=FACE_BOUND('',#152,.T.);
#110=FACE_OUTER_BOUND('',#153,.T.);
#111=PLANE('',#154);
#112=FACE_OUTER_BOUND('',#155,.T.);
#113=FACE_OUTER_BOUND('',#156,.T.);
#114=CYLINDRICAL_SURFACE('',#157,4.5);
#115=FACE_BOUND('',#158,.T.);
#116=FACE_OUTER_BOUND('',#159,.T.);
#117=PLANE('',#160);
#118=FACE_OUTER_BOUND('',#161,.T.);
#119=FACE_OUTER_BOUND('',#162,.T.);
#120=CYLINDRICAL_SURFACE('',#163,4.5);
#121=FACE_BOUND('',#164,.T.);
#122=FACE_OUTER_BOUND('',#165,.T.);
#123=PLANE('',#166);
#124=FACE_BOUND('',#167,.T.);
#125=FACE_OUTER_BOUND('',#168,.T.);
#126=PLANE('',#169);
#127=FACE_OUTER_BOUND('',#170,.T.);
#128=FACE_OUTER_BOUND('',#171,.T.);
#129=TOROIDAL_SURFACE('',#172,1.4,0.4);
#130=FACE_OUTER_BOUND('',#173,.T.);
#131=FACE_OUTER_BOUND('',#174,.T.);
#132=TOROIDAL_SURFACE('',#175,1.4,0.4);
#133=FACE_BOUND('',#176,.T.);
#134=FACE_OUTER_BOUND('',#177,.T.);
#135=CONICAL_SURFACE('',#178,0.8,0.785398163397448);
#136=FACE_OUTER_BOUND('',#179,.T.);
#137=FACE_BOUND('',#180,.T.);
#138=CONICAL_SURFACE('',#181,0.8,0.785398163397449);
#139=FACE_OUTER_BOUND('',#182,.T.);
#140=PLANE('',#183);
#141=FACE_OUTER_BOUND('',#184,.T.);
#142=PLANE('',#185);
#143=FACE_OUTER_BOUND('',#186,.T.);
#144=FACE_OUTER_BOUND('',#187,.T.);
#145=CYLINDRICAL_SURFACE('',#188,1.0);
#146=FACE_OUTER_BOUND('',#189,.T.);
#147=FACE_OUTER_BOUND('',#190,.T.);
#148=CYLINDRICAL_SURFACE('',#191,3.0);
#149=FACE_OUTER_BOUND('',#192,.T.);
#150=FACE_OUTER_BOUND('',#193,.T.);
#151=CYLINDRICAL_SURFACE('',#194,1.0);
#152=EDGE_LOOP('',(#195));
#153=EDGE_LOOP('',(#196));
#154=AXIS2_PLACEMENT_3D('',#197,#198,#199);
#155=EDGE_LOOP('',(#200));
#156=EDGE_LOOP('',(#201));
#157=AXIS2_PLACEMENT_3D('',#202,#203,#204);
#158=EDGE_LOOP('',(#205));
#159=EDGE_LOOP('',(#206));
#160=AXIS2_PLACEMENT_3D('',#207,#208,#209);
#161=EDGE_LOOP('',(#210));
#162=EDGE_LOOP('',(#211));
#163=AXIS2_PLACEMENT_3D('',#212,#213,#214);
#164=EDGE_LOOP('',(#215));
#165=EDGE_LOOP('',(#216));
#166=AXIS2_PLACEMENT_3D('',#217,#218,#219);
#167=EDGE_LOOP('',(#220));
#168=EDGE_LOOP('',(#221));
#169=AXIS2_PLACEMENT_3D('',#222,#223,#224);
#170=EDGE_LOOP('',(#225));
#171=EDGE_LOOP('',(#226));
#172=AXIS2_PLACEMENT_3D('',#227,#228,#229);
#173=EDGE_LOOP('',(#230));
#174=EDGE_LOOP('',(#231));
#175=AXIS2_PLACEMENT_3D('',#232,#233,#234);
#176=EDGE_LOOP('',(#235));
#177=EDGE_LOOP('',(#236));
#178=AXIS2_PLACEMENT_3D('',#237,#238,#239);
#179=EDGE_LOOP('',(#240));
#180=EDGE_LOOP('',(#241));
#181=AXIS2_PLACEMENT_3D('',#242,#243,#244);
#182=EDGE_LOOP('',(#245));
#183=AXIS2_PLACEMENT_3D('',#246,#247,#248);
#184=EDGE_LOOP('',(#249));
#185=AXIS2_PLACEMENT_3D('',#250,#251,#252);
#186=EDGE_LOOP('',(#253));
#187=EDGE_LOOP('',(#254));
#188=AXIS2_PLACEMENT_3D('',#255,#256,#257);
#189=EDGE_LOOP('',(#258));
#190=EDGE_LOOP('',(#259));
#191=AXIS2_PLACEMENT_3D('',#260,#261,#262);
#192=EDGE_LOOP('',(#263));
#193=EDGE_LOOP('',(#264));
#194=AXIS2_PLACEMENT_3D('',#265,#266,#267);
#195=ORIENTED_EDGE('',*,*,#268,.F.);
#196=ORIENTED_EDGE('',*,*,#269,.T.);
#197=CARTESIAN_POINT('',(3.0,4.7,0.0));
#198=DIRECTION('',(0.0,-1.0,0.0));
#199=DIRECTION('',(0.0,0.0,-1.0));
#200=ORIENTED_EDGE('',*,*,#270,.T.);
#201=ORIENTED_EDGE('',*,*,#269,.F.);
#202=CARTESIAN_POINT('',(0.0,4.95,0.0));
#203=DIRECTION('',(0.0,-1.0,0.0));
#204=DIRECTION('',(1.0,0.0,0.0));
#205=ORIENTED_EDGE('',*,*,#271,.F.);
#206=ORIENTED_EDGE('',*,*,#270,.F.);
#207=CARTESIAN_POINT('',(4.5,5.2,0.0));
#208=DIRECTION('',(-0.0,1.0,0.0));
#209=DIRECTION('',(1.0,0.0,0.0));
#210=ORIENTED_EDGE('',*,*,#272,.T.);
#211=ORIENTED_EDGE('',*,*,#273,.F.);
#212=CARTESIAN_POINT('',(0.0,2.05,0.0));
#213=DIRECTION('',(0.0,-1.0,0.0));
#214=DIRECTION('',(1.0,0.0,0.0));
#215=ORIENTED_EDGE('',*,*,#274,.T.);
#216=ORIENTED_EDGE('',*,*,#272,.F.);
#217=CARTESIAN_POINT('',(4.5,2.3,0.0));
#218=DIRECTION('',(-0.0,1.0,0.0));
#219=DIRECTION('',(1.0,0.0,0.0));
#220=ORIENTED_EDGE('',*,*,#275,.F.);
#221=ORIENTED_EDGE('',*,*,#273,.T.);
#222=CARTESIAN_POINT('',(1.0,1.8,0.0));
#223=DIRECTION('',(0.0,-1.0,0.0));
#224=DIRECTION('',(0.0,0.0,-1.0));
#225=ORIENTED_EDGE('',*,*,#276,.T.);
#226=ORIENTED_EDGE('',*,*,#275,.T.);
#227=CARTESIAN_POINT('',(0.0,1.4,0.0));
#228=DIRECTION('',(0.0,-1.0,0.0));
#229=DIRECTION('',(0.0,0.0,-1.0));
#230=ORIENTED_EDGE('',*,*,#271,.T.);
#231=ORIENTED_EDGE('',*,*,#277,.T.);
#232=CARTESIAN_POINT('',(0.0,5.6,0.0));
#233=DIRECTION('',(0.0,-1.0,0.0));
#234=DIRECTION('',(0.0,0.0,-1.0));
#235=ORIENTED_EDGE('',*,*,#278,.T.);
#236=ORIENTED_EDGE('',*,*,#279,.T.);
#237=CARTESIAN_POINT('',(0.0,6.8,0.0));
#238=DIRECTION('',(-0.0,-1.0,0.0));
#239=DIRECTION('',(-1.0,0.0,0.0));
#240=ORIENTED_EDGE('',*,*,#280,.T.);
#241=ORIENTED_EDGE('',*,*,#281,.T.);
#242=CARTESIAN_POINT('',(0.0,0.2,0.0));
#243=DIRECTION('',(0.0,1.0,-0.0));
#244=DIRECTION('',(-1.0,0.0,0.0));
#245=ORIENTED_EDGE('',*,*,#278,.F.);
#246=CARTESIAN_POINT('',(1.0,7.0,0.0));
#247=DIRECTION('',(-0.0,1.0,0.0));
#248=DIRECTION('',(1.0,0.0,0.0));
#249=ORIENTED_EDGE('',*,*,#281,.F.);
#250=CARTESIAN_POINT('',(0.0,0.0,0.0));
#251=DIRECTION('',(0.0,-1.0,0.0));
#252=DIRECTION('',(0.0,0.0,-1.0));
#253=ORIENTED_EDGE('',*,*,#276,.F.);
#254=ORIENTED_EDGE('',*,*,#280,.F.);
#255=CARTESIAN_POINT('',(0.0,0.9,0.0));
#256=DIRECTION('',(0.0,-1.0,0.0));
#257=DIRECTION('',(1.0,0.0,0.0));
#258=ORIENTED_EDGE('',*,*,#268,.T.);
#259=ORIENTED_EDGE('',*,*,#274,.F.);
#260=CARTESIAN_POINT('',(0.0,3.5,0.0));
#261=DIRECTION('',(0.0,-1.0,0.0));
#262=DIRECTION('',(1.0,0.0,0.0));
#263=ORIENTED_EDGE('',*,*,#279,.F.);
#264=ORIENTED_EDGE('',*,*,#277,.F.);
#265=CARTESIAN_POINT('',(0.0,6.1,0.0));
#266=DIRECTION('',(0.0,-1.0,0.0));
#267=DIRECTION('',(1.0,0.0,0.0));
#268=EDGE_CURVE('',#282,#282,#283,.T.);
#269=EDGE_CURVE('',#284,#284,#285,.T.);
#270=EDGE_CURVE('',#286,#286,#287,.T.);
#271=EDGE_CURVE('',#288,#288,#289,.T.);
#272=EDGE_CURVE('',#290,#290,#291,.T.);
#273=EDGE_CURVE('',#292,#292,#293,.T.);
#274=EDGE_CURVE('',#294,#294,#295,.T.);
#275=EDGE_CURVE('',#296,#296,#297,.T.);
#276=EDGE_CURVE('',#298,#298,#299,.T.);
#277=EDGE_CURVE('',#300,#300,#301,.T.);
#278=EDGE_CURVE('',#302,#302,#303,.T.);
#279=EDGE_CURVE('',#304,#304,#305,.T.);
#280=EDGE_CURVE('',#306,#306,#307,.T.);
#281=EDGE_CURVE('',#308,#308,#309,.T.);
#282=VERTEX_POINT('',#310);
#283=CIRCLE('',#311,3.0);
#284=VERTEX_POINT('',#312);
#285=CIRCLE('',#313,4.5);
#286=VERTEX_POINT('',#314);
#287=CIRCLE('',#315,4.5);
#288=VERTEX_POINT('',#316);
#289=CIRCLE('',#317,1.4);
#290=VERTEX_POINT('',#318);
#291=CIRCLE('',#319,4.5);
#292=VERTEX_POINT('',#320);
#293=CIRCLE('',#321,4.5);
#294=VERTEX_POINT('',#322);
#295=CIRCLE('',#323,3.0);
#296=VERTEX_POINT('',#324);
#297=CIRCLE('',#325,1.4);
#298=VERTEX_POINT('',#326);
#299=CIRCLE('',#327,1.0);
#300=VERTEX_POINT('',#328);
#301=CIRCLE('',#329,1.0);
#302=VERTEX_POINT('',#330);
#303=CIRCLE('',#331,0.6);
#304=VERTEX_POINT('',#332);
#305=CIRCLE('',#333,1.0);
#306=VERTEX_POINT('',#334);
#307=CIRCLE('',#335,1.0);
#308=VERTEX_POINT('',#336);
#309=CIRCLE('',#337,0.6);
#310=CARTESIAN_POINT('',(3.0,4.7,0.0));
#311=AXIS2_PLACEMENT_3D('',#338,#339,#340);
#312=CARTESIAN_POINT('',(4.5,4.7,0.0));
#313=AXIS2_PLACEMENT_3D('',#341,#342,#343);
#314=CARTESIAN_POINT('',(4.5,5.2,0.0));
#315=AXIS2_PLACEMENT_3D('',#344,#345,#346);
#316=CARTESIAN_POINT('',(-1.4,5.2,1.71450551880629E-16));
#317=AXIS2_PLACEMENT_3D('',#347,#348,#349);
#318=CARTESIAN_POINT('',(4.5,2.3,0.0));
#319=AXIS2_PLACEMENT_3D('',#350,#351,#352);
#320=CARTESIAN_POINT('',(4.5,1.8,0.0));
#321=AXIS2_PLACEMENT_3D('',#353,#354,#355);
#322=CARTESIAN_POINT('',(3.0,2.3,0.0));
#323=AXIS2_PLACEMENT_3D('',#356,#357,#358);
#324=CARTESIAN_POINT('',(-1.4,1.8,1.71450551880629E-16));
#325=AXIS2_PLACEMENT_3D('',#359,#360,#361);
#326=CARTESIAN_POINT('',(-1.0,1.4,1.22464679914735E-16));
#327=AXIS2_PLACEMENT_3D('',#362,#363,#364);
#328=CARTESIAN_POINT('',(-1.0,5.6,1.22464679914735E-16));
#329=AXIS2_PLACEMENT_3D('',#365,#366,#367);
#330=CARTESIAN_POINT('',(-0.6,7.0,0.0));
#331=AXIS2_PLACEMENT_3D('',#368,#369,#370);
#332=CARTESIAN_POINT('',(-1.0,6.6,0.0));
#333=AXIS2_PLACEMENT_3D('',#371,#372,#373);
#334=CARTESIAN_POINT('',(-1.0,0.4,0.0));
#335=AXIS2_PLACEMENT_3D('',#374,#375,#376);
#336=CARTESIAN_POINT('',(-0.6,0.0,0.0));
#337=AXIS2_PLACEMENT_3D('',#377,#378,#379);
#338=CARTESIAN_POINT('',(0.0,4.7,0.0));
#339=DIRECTION('',(0.0,-1.0,0.0));
#340=DIRECTION('',(1.0,0.0,0.0));
#341=CARTESIAN_POINT('',(0.0,4.7,0.0));
#342=DIRECTION('',(0.0,-1.0,0.0));
#343=DIRECTION('',(1.0,0.0,0.0));
#344=CARTESIAN_POINT('',(0.0,5.2,0.0));
#345=DIRECTION('',(0.0,-1.0,0.0));
#346=DIRECTION('',(1.0,0.0,0.0));
#347=CARTESIAN_POINT('',(0.0,5.2,0.0));
#348=DIRECTION('',(0.0,1.0,0.0));
#349=DIRECTION('',(-1.0,0.0,1.22464679914735E-16));
#350=CARTESIAN_POINT('',(0.0,2.3,0.0));
#351=DIRECTION('',(0.0,-1.0,0.0));
#352=DIRECTION('',(1.0,0.0,0.0));
#353=CARTESIAN_POINT('',(0.0,1.8,0.0));
#354=DIRECTION('',(0.0,-1.0,0.0));
#355=DIRECTION('',(1.0,0.0,0.0));
#356=CARTESIAN_POINT('',(0.0,2.3,0.0));
#357=DIRECTION('',(0.0,-1.0,0.0));
#358=DIRECTION('',(1.0,0.0,0.0));
#359=CARTESIAN_POINT('',(0.0,1.8,0.0));
#360=DIRECTION('',(0.0,-1.0,0.0));
#361=DIRECTION('',(-1.0,0.0,1.22464679914735E-16));
#362=CARTESIAN_POINT('',(0.0,1.4,0.0));
#363=DIRECTION('',(0.0,1.0,0.0));
#364=DIRECTION('',(-1.0,0.0,1.22464679914735E-16));
#365=CARTESIAN_POINT('',(0.0,5.6,0.0));
#366=DIRECTION('',(0.0,-1.0,0.0));
#367=DIRECTION('',(-1.0,0.0,1.22464679914735E-16));
#368=CARTESIAN_POINT('',(0.0,7.0,0.0));
#369=DIRECTION('',(0.0,-1.0,0.0));
#370=DIRECTION('',(-1.0,0.0,0.0));
#371=CARTESIAN_POINT('',(0.0,6.6,0.0));
#372=DIRECTION('',(0.0,1.0,0.0));
#373=DIRECTION('',(-1.0,0.0,0.0));
#374=CARTESIAN_POINT('',(0.0,0.4,0.0));
#375=DIRECTION('',(0.0,-1.0,0.0));
#376=DIRECTION('',(-1.0,0.0,0.0));
#377=CARTESIAN_POINT('',(0.0,0.0,0.0));
#378=DIRECTION('',(0.0,1.0,0.0));
#379=DIRECTION('',(-1.0,0.0,0.0));
ENDSEC;
END-ISO-10303-21;
