ISO-10303-21;
HEADER;
FILE_DESCRIPTION(('STEP AP203'),'1');
FILE_NAME('Eixo Par.stp','2022-12-07T18:07:59',(' '),(' '),'Spatial InterOp 3D',' ',' ');
FILE_SCHEMA(('CONFIG_CONTROL_DESIGN'));
ENDSEC;
DATA;
#1=DESIGN_CONTEXT('',#33,'design');
#2=APPLICATION_PROTOCOL_DEFINITION('INTERNATIONAL STANDARD','config_control_design',1994,#33);
#3=PRODUCT_CATEGORY_RELATIONSHIP('NONE','NONE',#34,#35);
#4=DATE_AND_TIME(#36,#37);
#5=DATE_TIME_ROLE('creation_date');
#6=DATE_TIME_ROLE('classification_date');
#7=PERSON_AND_ORGANIZATION_ROLE('creator');
#8=PERSON_AND_ORGANIZATION_ROLE('design_supplier');
#9=PERSON_AND_ORGANIZATION_ROLE('classification_officer');
#10=PERSON_AND_ORGANIZATION_ROLE('design_owner');
#11=APPROVAL_PERSON_ORGANIZATION(#38,#39,#40);
#12=APPROVAL_DATE_TIME(#4,#39);
#13=CC_DESIGN_APPROVAL(#39,(#41,#42,#43));
#14=CC_DESIGN_DATE_AND_TIME_ASSIGNMENT(#4,#5,(#43));
#15=CC_DESIGN_DATE_AND_TIME_ASSIGNMENT(#4,#6,(#41));
#16=CC_DESIGN_PERSON_AND_ORGANIZATION_ASSIGNMENT(#38,#10,(#44));
#17=CC_DESIGN_PERSON_AND_ORGANIZATION_ASSIGNMENT(#38,#7,(#43));
#18=CC_DESIGN_PERSON_AND_ORGANIZATION_ASSIGNMENT(#38,#7,(#42));
#19=CC_DESIGN_PERSON_AND_ORGANIZATION_ASSIGNMENT(#38,#8,(#42));
#20=CC_DESIGN_SECURITY_CLASSIFICATION(#41,(#42));
#21=CC_DESIGN_PERSON_AND_ORGANIZATION_ASSIGNMENT(#38,#9,(#41));
#22=SHAPE_DEFINITION_REPRESENTATION(#45,#46);
#23= (GEOMETRIC_REPRESENTATION_CONTEXT(3)GLOBAL_UNCERTAINTY_ASSIGNED_CONTEXT((#49))GLOBAL_UNIT_ASSIGNED_CONTEXT((#51,#52,#53))REPRESENTATION_CONTEXT('NONE','WORKSPACE'));
#24=PROPERTY_DEFINITION_REPRESENTATION(#55,#56);
#25=GENERAL_PROPERTY_ASSOCIATION('','',#57,#55);
#26=PROPERTY_DEFINITION_REPRESENTATION(#58,#59);
#27=GENERAL_PROPERTY_ASSOCIATION('','',#60,#58);
#28=PROPERTY_DEFINITION_REPRESENTATION(#61,#62);
#29=GENERAL_PROPERTY_ASSOCIATION('','',#63,#61);
#33=APPLICATION_CONTEXT('CONFIGURATION CONTROLLED 3D DESIGNS OF MECHANICAL PARTS AND ASSEMBLIES');
#34=PRODUCT_CATEGORY('part','NONE');
#35=PRODUCT_RELATED_PRODUCT_CATEGORY('detail',' ',(#44));
#36=CALENDAR_DATE(2022,7,11);
#37=LOCAL_TIME(15,7,59.0,#64);
#38=PERSON_AND_ORGANIZATION(#65,#66);
#39=APPROVAL(#67,'SOLID MODEL');
#40=APPROVAL_ROLE('APPROVED');
#41=SECURITY_CLASSIFICATION('','',#68);
#42=PRODUCT_DEFINITION_FORMATION_WITH_SPECIFIED_SOURCE('A','NONE',#44,.NOT_KNOWN.);
#43=PRODUCT_DEFINITION('','NONE',#42,#1);
#44=PRODUCT('Eixo Par','','Eixo Par',(#69));
#45=PRODUCT_DEFINITION_SHAPE('NONE','NONE',#43);
#46=ADVANCED_BREP_SHAPE_REPRESENTATION('1',(#70,#71),#23);
#49=UNCERTAINTY_MEASURE_WITH_UNIT(LENGTH_MEASURE(0.001),#51,'','');
#51= (CONVERSION_BASED_UNIT('MILLIMETRE',#74)LENGTH_UNIT()NAMED_UNIT(#77));
#52= (NAMED_UNIT(#79)PLANE_ANGLE_UNIT()SI_UNIT($,.RADIAN.));
#53= (NAMED_UNIT(#79)SOLID_ANGLE_UNIT()SI_UNIT($,.STERADIAN.));
#55=PROPERTY_DEFINITION('PdmObjectId','',#43);
#56=REPRESENTATION('',(#85),#23);
#57=GENERAL_PROPERTY('','19_e53f71a6-0579-4bee-980f-c92e8fc169a4&2_27_0_0','');
#58=PROPERTY_DEFINITION('CreationDate','',#43);
#59=REPRESENTATION('',(#86),#23);
#60=GENERAL_PROPERTY('','18/10/2022 19:23:56','');
#61=PROPERTY_DEFINITION('Minor Revision','',#43);
#62=REPRESENTATION('',(#87),#23);
#63=GENERAL_PROPERTY('','0','');
#64=COORDINATED_UNIVERSAL_TIME_OFFSET(3,0,.BEHIND.);
#65=PERSON('','UNSPECIFIED',$,$,$,$);
#66=ORGANIZATION('UNSPECIFIED','UNSPECIFIED','UNSPECIFIED');
#67=APPROVAL_STATUS('approved');
#68=SECURITY_CLASSIFICATION_LEVEL('unclassified');
#69=MECHANICAL_CONTEXT('',#33,'mechanical');
#70=MANIFOLD_SOLID_BREP('1',#88);
#71=AXIS2_PLACEMENT_3D('',#89,#90,#91);
#74=LENGTH_MEASURE_WITH_UNIT(LENGTH_MEASURE(1.0),#92);
#77=DIMENSIONAL_EXPONENTS(1.0,0.0,0.0,0.0,0.0,0.0,0.0);
#79=DIMENSIONAL_EXPONENTS(0.0,0.0,0.0,0.0,0.0,0.0,0.0);
#85=VALUE_REPRESENTATION_ITEM('19_e53f71a6-0579-4bee-980f-c92e8fc169a4&2_27_0_0',);
#86=VALUE_REPRESENTATION_ITEM('18/10/2022 19:23:56',);
#87=VALUE_REPRESENTATION_ITEM('0',);
#88=CLOSED_SHELL('',(#93,#94,#95,#96,#97,#98,#99,#100,#101,#102,#103,#104,#105,#106,#107,#108,#109,#110));
#89=CARTESIAN_POINT('',(0.0,0.0,0.0));
#90=DIRECTION('',(0.0,0.0,1.0));
#91=DIRECTION('',(1.0,0.0,0.0));
#92= (NAMED_UNIT(#77)LENGTH_UNIT()SI_UNIT(.MILLI.,.METRE.));
#93=ADVANCED_FACE('',(#112,#113,#114,#115,#116),#117,.F.);
#94=ADVANCED_FACE('',(#118),#119,.F.);
#95=ADVANCED_FACE('',(#120,#121),#122,.T.);
#96=ADVANCED_FACE('',(#123),#124,.T.);
#97=ADVANCED_FACE('',(#125),#126,.F.);
#98=ADVANCED_FACE('',(#127),#128,.T.);
#99=ADVANCED_FACE('',(#129),#130,.F.);
#100=ADVANCED_FACE('',(#131),#132,.T.);
#101=ADVANCED_FACE('',(#133,#134),#135,.T.);
#102=ADVANCED_FACE('',(#136),#137,.T.);
#103=ADVANCED_FACE('',(#138),#139,.T.);
#104=ADVANCED_FACE('',(#140),#141,.F.);
#105=ADVANCED_FACE('',(#142),#143,.F.);
#106=ADVANCED_FACE('',(#144),#145,.F.);
#107=ADVANCED_FACE('',(#146),#147,.F.);
#108=ADVANCED_FACE('',(#148),#149,.F.);
#109=ADVANCED_FACE('',(#150),#151,.F.);
#110=ADVANCED_FACE('',(#152,#153,#154,#155,#156),#157,.T.);
#112=FACE_BOUND('',#158,.T.);
#113=FACE_BOUND('',#159,.T.);
#114=FACE_BOUND('',#160,.T.);
#115=FACE_BOUND('',#161,.T.);
#116=FACE_OUTER_BOUND('',#162,.T.);
#117=PLANE('',#163);
#118=FACE_OUTER_BOUND('',#164,.T.);
#119=CYLINDRICAL_SURFACE('',#165,6.0);
#120=FACE_BOUND('',#166,.T.);
#121=FACE_OUTER_BOUND('',#167,.T.);
#122=PLANE('',#168);
#123=FACE_OUTER_BOUND('',#169,.T.);
#124=CYLINDRICAL_SURFACE('',#170,10.5);
#125=FACE_OUTER_BOUND('',#171,.T.);
#126=CYLINDRICAL_SURFACE('',#172,1.5);
#127=FACE_OUTER_BOUND('',#173,.T.);
#128=PLANE('',#174);
#129=FACE_OUTER_BOUND('',#175,.T.);
#130=CONICAL_SURFACE('',#176,2.25,0.785398163397448);
#131=FACE_OUTER_BOUND('',#177,.T.);
#132=CYLINDRICAL_SURFACE('',#178,2.5);
#133=FACE_BOUND('',#179,.T.);
#134=FACE_OUTER_BOUND('',#180,.T.);
#135=PLANE('',#181);
#136=FACE_OUTER_BOUND('',#182,.T.);
#137=CYLINDRICAL_SURFACE('',#183,3.5);
#138=FACE_OUTER_BOUND('',#184,.T.);
#139=CYLINDRICAL_SURFACE('',#185,2.5);
#140=FACE_OUTER_BOUND('',#186,.T.);
#141=CYLINDRICAL_SURFACE('',#187,1.2295);
#142=FACE_OUTER_BOUND('',#188,.T.);
#143=CONICAL_SURFACE('',#189,0.61475,1.02974425867665);
#144=FACE_OUTER_BOUND('',#190,.T.);
#145=CYLINDRICAL_SURFACE('',#191,1.5);
#146=FACE_OUTER_BOUND('',#192,.T.);
#147=CONICAL_SURFACE('',#193,2.25,0.785398163397448);
#148=FACE_OUTER_BOUND('',#194,.T.);
#149=CYLINDRICAL_SURFACE('',#195,1.5);
#150=FACE_OUTER_BOUND('',#196,.T.);
#151=CONICAL_SURFACE('',#197,2.25,0.785398163397448);
#152=FACE_BOUND('',#198,.T.);
#153=FACE_BOUND('',#199,.T.);
#154=FACE_BOUND('',#200,.T.);
#155=FACE_BOUND('',#201,.T.);
#156=FACE_OUTER_BOUND('',#202,.T.);
#157=PLANE('',#203);
#158=EDGE_LOOP('',(#204,#205));
#159=EDGE_LOOP('',(#206,#207));
#160=EDGE_LOOP('',(#208,#209));
#161=EDGE_LOOP('',(#210,#211));
#162=EDGE_LOOP('',(#212,#213));
#163=AXIS2_PLACEMENT_3D('',#214,#215,#216);
#164=EDGE_LOOP('',(#217,#218,#219,#220));
#165=AXIS2_PLACEMENT_3D('',#221,#222,#223);
#166=EDGE_LOOP('',(#224,#225));
#167=EDGE_LOOP('',(#226,#227));
#168=AXIS2_PLACEMENT_3D('',#228,#229,#230);
#169=EDGE_LOOP('',(#231,#232,#233,#234));
#170=AXIS2_PLACEMENT_3D('',#235,#236,#237);
#171=EDGE_LOOP('',(#238,#239,#240,#241,#242));
#172=AXIS2_PLACEMENT_3D('',#243,#244,#245);
#173=EDGE_LOOP('',(#246,#247));
#174=AXIS2_PLACEMENT_3D('',#248,#249,#250);
#175=EDGE_LOOP('',(#251,#252,#253,#254,#255,#256));
#176=AXIS2_PLACEMENT_3D('',#257,#258,#259);
#177=EDGE_LOOP('',(#260,#261,#262,#263,#264,#265));
#178=AXIS2_PLACEMENT_3D('',#266,#267,#268);
#179=EDGE_LOOP('',(#269,#270));
#180=EDGE_LOOP('',(#271,#272));
#181=AXIS2_PLACEMENT_3D('',#273,#274,#275);
#182=EDGE_LOOP('',(#276,#277,#278,#279,#280,#281));
#183=AXIS2_PLACEMENT_3D('',#282,#283,#284);
#184=EDGE_LOOP('',(#285,#286,#287,#288,#289,#290));
#185=AXIS2_PLACEMENT_3D('',#291,#292,#293);
#186=EDGE_LOOP('',(#294,#295,#296,#297,#298,#299));
#187=AXIS2_PLACEMENT_3D('',#300,#301,#302);
#188=EDGE_LOOP('',(#303,#304,#305,#306));
#189=AXIS2_PLACEMENT_3D('',#307,#308,#309);
#190=EDGE_LOOP('',(#310,#311,#312,#313,#314));
#191=AXIS2_PLACEMENT_3D('',#315,#316,#317);
#192=EDGE_LOOP('',(#318,#319,#320,#321,#322,#323));
#193=AXIS2_PLACEMENT_3D('',#324,#325,#326);
#194=EDGE_LOOP('',(#327,#328,#329,#330,#331));
#195=AXIS2_PLACEMENT_3D('',#332,#333,#334);
#196=EDGE_LOOP('',(#335,#336,#337,#338,#339,#340));
#197=AXIS2_PLACEMENT_3D('',#341,#342,#343);
#198=EDGE_LOOP('',(#344));
#199=EDGE_LOOP('',(#345));
#200=EDGE_LOOP('',(#346));
#201=EDGE_LOOP('',(#347,#348));
#202=EDGE_LOOP('',(#349,#350));
#203=AXIS2_PLACEMENT_3D('',#351,#352,#353);
#204=ORIENTED_EDGE('',*,*,#354,.T.);
#205=ORIENTED_EDGE('',*,*,#355,.T.);
#206=ORIENTED_EDGE('',*,*,#356,.T.);
#207=ORIENTED_EDGE('',*,*,#357,.T.);
#208=ORIENTED_EDGE('',*,*,#358,.T.);
#209=ORIENTED_EDGE('',*,*,#359,.T.);
#210=ORIENTED_EDGE('',*,*,#360,.T.);
#211=ORIENTED_EDGE('',*,*,#361,.T.);
#212=ORIENTED_EDGE('',*,*,#362,.F.);
#213=ORIENTED_EDGE('',*,*,#363,.F.);
#214=CARTESIAN_POINT('',(0.0,0.0,0.0));
#215=DIRECTION('',(0.0,0.0,1.0));
#216=DIRECTION('',(1.0,0.0,0.0));
#217=ORIENTED_EDGE('',*,*,#363,.T.);
#218=ORIENTED_EDGE('',*,*,#364,.T.);
#219=ORIENTED_EDGE('',*,*,#365,.F.);
#220=ORIENTED_EDGE('',*,*,#366,.F.);
#221=CARTESIAN_POINT('',(-8.0,6.0,0.0));
#222=DIRECTION('',(0.0,-0.0,1.0));
#223=DIRECTION('',(0.414356743701895,0.910114547158083,0.0));
#224=ORIENTED_EDGE('',*,*,#367,.T.);
#225=ORIENTED_EDGE('',*,*,#368,.T.);
#226=ORIENTED_EDGE('',*,*,#369,.T.);
#227=ORIENTED_EDGE('',*,*,#370,.T.);
#228=CARTESIAN_POINT('',(0.0,0.0,-6.0));
#229=DIRECTION('',(0.0,0.0,-1.0));
#230=DIRECTION('',(0.0,-1.0,0.0));
#231=ORIENTED_EDGE('',*,*,#362,.T.);
#232=ORIENTED_EDGE('',*,*,#366,.T.);
#233=ORIENTED_EDGE('',*,*,#371,.F.);
#234=ORIENTED_EDGE('',*,*,#364,.F.);
#235=CARTESIAN_POINT('',(0.0,0.0,0.0));
#236=DIRECTION('',(0.0,0.0,1.0));
#237=DIRECTION('',(0.8,-0.6,0.0));
#238=ORIENTED_EDGE('',*,*,#372,.T.);
#239=ORIENTED_EDGE('',*,*,#373,.T.);
#240=ORIENTED_EDGE('',*,*,#374,.F.);
#241=ORIENTED_EDGE('',*,*,#373,.F.);
#242=ORIENTED_EDGE('',*,*,#375,.T.);
#243=CARTESIAN_POINT('',(6.0,-3.0,35.2562051276084));
#244=DIRECTION('',(0.0,0.0,-1.0));
#245=DIRECTION('',(-1.0,0.0,0.0));
#246=ORIENTED_EDGE('',*,*,#376,.T.);
#247=ORIENTED_EDGE('',*,*,#377,.T.);
#248=CARTESIAN_POINT('',(0.0,0.0,5.0));
#249=DIRECTION('',(0.0,0.0,1.0));
#250=DIRECTION('',(1.0,0.0,0.0));
#251=ORIENTED_EDGE('',*,*,#358,.F.);
#252=ORIENTED_EDGE('',*,*,#359,.F.);
#253=ORIENTED_EDGE('',*,*,#378,.T.);
#254=ORIENTED_EDGE('',*,*,#379,.F.);
#255=ORIENTED_EDGE('',*,*,#380,.F.);
#256=ORIENTED_EDGE('',*,*,#378,.F.);
#257=CARTESIAN_POINT('',(3.0,6.0,0.75));
#258=DIRECTION('',(-0.0,0.0,-1.0));
#259=DIRECTION('',(-1.0,0.0,0.0));
#260=ORIENTED_EDGE('',*,*,#376,.F.);
#261=ORIENTED_EDGE('',*,*,#377,.F.);
#262=ORIENTED_EDGE('',*,*,#381,.T.);
#263=ORIENTED_EDGE('',*,*,#382,.F.);
#264=ORIENTED_EDGE('',*,*,#383,.F.);
#265=ORIENTED_EDGE('',*,*,#381,.F.);
#266=CARTESIAN_POINT('',(0.0,0.0,3.0));
#267=DIRECTION('',(0.0,0.0,1.0));
#268=DIRECTION('',(1.0,0.0,0.0));
#269=ORIENTED_EDGE('',*,*,#384,.T.);
#270=ORIENTED_EDGE('',*,*,#385,.T.);
#271=ORIENTED_EDGE('',*,*,#386,.T.);
#272=ORIENTED_EDGE('',*,*,#387,.T.);
#273=CARTESIAN_POINT('',(0.0,0.0,-16.0));
#274=DIRECTION('',(0.0,0.0,-1.0));
#275=DIRECTION('',(0.0,-1.0,0.0));
#276=ORIENTED_EDGE('',*,*,#369,.F.);
#277=ORIENTED_EDGE('',*,*,#370,.F.);
#278=ORIENTED_EDGE('',*,*,#388,.T.);
#279=ORIENTED_EDGE('',*,*,#354,.F.);
#280=ORIENTED_EDGE('',*,*,#355,.F.);
#281=ORIENTED_EDGE('',*,*,#388,.F.);
#282=CARTESIAN_POINT('',(0.0,0.0,0.0));
#283=DIRECTION('',(0.0,0.0,-1.0));
#284=DIRECTION('',(-1.0,0.0,0.0));
#285=ORIENTED_EDGE('',*,*,#386,.F.);
#286=ORIENTED_EDGE('',*,*,#387,.F.);
#287=ORIENTED_EDGE('',*,*,#389,.T.);
#288=ORIENTED_EDGE('',*,*,#367,.F.);
#289=ORIENTED_EDGE('',*,*,#368,.F.);
#290=ORIENTED_EDGE('',*,*,#389,.F.);
#291=CARTESIAN_POINT('',(0.0,0.0,-6.0));
#292=DIRECTION('',(0.0,0.0,-1.0));
#293=DIRECTION('',(-1.0,0.0,0.0));
#294=ORIENTED_EDGE('',*,*,#384,.F.);
#295=ORIENTED_EDGE('',*,*,#385,.F.);
#296=ORIENTED_EDGE('',*,*,#390,.T.);
#297=ORIENTED_EDGE('',*,*,#391,.F.);
#298=ORIENTED_EDGE('',*,*,#392,.F.);
#299=ORIENTED_EDGE('',*,*,#390,.F.);
#300=CARTESIAN_POINT('',(0.0,0.0,-12.0));
#301=DIRECTION('',(0.0,0.0,-1.0));
#302=DIRECTION('',(-1.0,0.0,0.0));
#303=ORIENTED_EDGE('',*,*,#391,.T.);
#304=ORIENTED_EDGE('',*,*,#393,.T.);
#305=ORIENTED_EDGE('',*,*,#393,.F.);
#306=ORIENTED_EDGE('',*,*,#392,.T.);
#307=CARTESIAN_POINT('',(0.0,0.0,-7.63062093445281));
#308=DIRECTION('',(-0.0,0.0,-1.0));
#309=DIRECTION('',(-1.0,0.0,0.0));
#310=ORIENTED_EDGE('',*,*,#394,.T.);
#311=ORIENTED_EDGE('',*,*,#395,.T.);
#312=ORIENTED_EDGE('',*,*,#396,.F.);
#313=ORIENTED_EDGE('',*,*,#395,.F.);
#314=ORIENTED_EDGE('',*,*,#397,.T.);
#315=CARTESIAN_POINT('',(-3.0,-6.0,35.2562051276084));
#316=DIRECTION('',(0.0,0.0,-1.0));
#317=DIRECTION('',(-1.0,0.0,0.0));
#318=ORIENTED_EDGE('',*,*,#356,.F.);
#319=ORIENTED_EDGE('',*,*,#357,.F.);
#320=ORIENTED_EDGE('',*,*,#398,.T.);
#321=ORIENTED_EDGE('',*,*,#394,.F.);
#322=ORIENTED_EDGE('',*,*,#397,.F.);
#323=ORIENTED_EDGE('',*,*,#398,.F.);
#324=CARTESIAN_POINT('',(-3.0,-6.0,0.75));
#325=DIRECTION('',(-0.0,0.0,-1.0));
#326=DIRECTION('',(-1.0,0.0,0.0));
#327=ORIENTED_EDGE('',*,*,#379,.T.);
#328=ORIENTED_EDGE('',*,*,#399,.T.);
#329=ORIENTED_EDGE('',*,*,#400,.F.);
#330=ORIENTED_EDGE('',*,*,#399,.F.);
#331=ORIENTED_EDGE('',*,*,#380,.T.);
#332=CARTESIAN_POINT('',(3.0,6.0,35.2562051276084));
#333=DIRECTION('',(0.0,0.0,-1.0));
#334=DIRECTION('',(-1.0,0.0,0.0));
#335=ORIENTED_EDGE('',*,*,#360,.F.);
#336=ORIENTED_EDGE('',*,*,#361,.F.);
#337=ORIENTED_EDGE('',*,*,#401,.T.);
#338=ORIENTED_EDGE('',*,*,#372,.F.);
#339=ORIENTED_EDGE('',*,*,#375,.F.);
#340=ORIENTED_EDGE('',*,*,#401,.F.);
#341=CARTESIAN_POINT('',(6.0,-3.0,0.75));
#342=DIRECTION('',(-0.0,0.0,-1.0));
#343=DIRECTION('',(-1.0,0.0,0.0));
#344=ORIENTED_EDGE('',*,*,#396,.T.);
#345=ORIENTED_EDGE('',*,*,#400,.T.);
#346=ORIENTED_EDGE('',*,*,#374,.T.);
#347=ORIENTED_EDGE('',*,*,#382,.T.);
#348=ORIENTED_EDGE('',*,*,#383,.T.);
#349=ORIENTED_EDGE('',*,*,#371,.T.);
#350=ORIENTED_EDGE('',*,*,#365,.T.);
#351=CARTESIAN_POINT('',(0.0,0.0,3.0));
#352=DIRECTION('',(0.0,0.0,1.0));
#353=DIRECTION('',(1.0,0.0,0.0));
#354=EDGE_CURVE('',#402,#403,#404,.T.);
#355=EDGE_CURVE('',#403,#402,#405,.T.);
#356=EDGE_CURVE('',#406,#407,#408,.T.);
#357=EDGE_CURVE('',#407,#406,#409,.T.);
#358=EDGE_CURVE('',#410,#411,#412,.T.);
#359=EDGE_CURVE('',#411,#410,#413,.T.);
#360=EDGE_CURVE('',#414,#415,#416,.T.);
#361=EDGE_CURVE('',#415,#414,#417,.T.);
#362=EDGE_CURVE('',#418,#419,#420,.T.);
#363=EDGE_CURVE('',#419,#418,#421,.T.);
#364=EDGE_CURVE('',#418,#422,#423,.T.);
#365=EDGE_CURVE('',#424,#422,#425,.T.);
#366=EDGE_CURVE('',#419,#424,#426,.T.);
#367=EDGE_CURVE('',#427,#428,#429,.T.);
#368=EDGE_CURVE('',#428,#427,#430,.T.);
#369=EDGE_CURVE('',#431,#432,#433,.T.);
#370=EDGE_CURVE('',#432,#431,#434,.T.);
#371=EDGE_CURVE('',#422,#424,#435,.T.);
#372=EDGE_CURVE('',#436,#437,#438,.T.);
#373=EDGE_CURVE('',#437,#439,#440,.T.);
#374=EDGE_CURVE('',#439,#439,#441,.T.);
#375=EDGE_CURVE('',#437,#436,#442,.T.);
#376=EDGE_CURVE('',#443,#444,#445,.T.);
#377=EDGE_CURVE('',#444,#443,#446,.T.);
#378=EDGE_CURVE('',#411,#447,#448,.T.);
#379=EDGE_CURVE('',#449,#447,#450,.T.);
#380=EDGE_CURVE('',#447,#449,#451,.T.);
#381=EDGE_CURVE('',#444,#452,#453,.T.);
#382=EDGE_CURVE('',#454,#452,#455,.T.);
#383=EDGE_CURVE('',#452,#454,#456,.T.);
#384=EDGE_CURVE('',#457,#458,#459,.T.);
#385=EDGE_CURVE('',#458,#457,#460,.T.);
#386=EDGE_CURVE('',#461,#462,#463,.T.);
#387=EDGE_CURVE('',#462,#461,#464,.T.);
#388=EDGE_CURVE('',#432,#403,#465,.T.);
#389=EDGE_CURVE('',#462,#428,#466,.T.);
#390=EDGE_CURVE('',#458,#467,#468,.T.);
#391=EDGE_CURVE('',#469,#467,#470,.T.);
#392=EDGE_CURVE('',#467,#469,#471,.T.);
#393=EDGE_CURVE('',#467,#472,#473,.T.);
#394=EDGE_CURVE('',#474,#475,#476,.T.);
#395=EDGE_CURVE('',#475,#477,#478,.T.);
#396=EDGE_CURVE('',#477,#477,#479,.T.);
#397=EDGE_CURVE('',#475,#474,#480,.T.);
#398=EDGE_CURVE('',#407,#475,#481,.T.);
#399=EDGE_CURVE('',#447,#482,#483,.T.);
#400=EDGE_CURVE('',#482,#482,#484,.T.);
#401=EDGE_CURVE('',#415,#437,#485,.T.);
#402=VERTEX_POINT('',#486);
#403=VERTEX_POINT('',#487);
#404=CIRCLE('',#488,3.5);
#405=CIRCLE('',#489,3.5);
#406=VERTEX_POINT('',#490);
#407=VERTEX_POINT('',#491);
#408=CIRCLE('',#492,3.0);
#409=CIRCLE('',#493,3.0);
#410=VERTEX_POINT('',#494);
#411=VERTEX_POINT('',#495);
#412=CIRCLE('',#496,3.0);
#413=CIRCLE('',#497,3.0);
#414=VERTEX_POINT('',#498);
#415=VERTEX_POINT('',#499);
#416=CIRCLE('',#500,3.0);
#417=CIRCLE('',#501,3.0);
#418=VERTEX_POINT('',#502);
#419=VERTEX_POINT('',#503);
#420=CIRCLE('',#504,10.5);
#421=CIRCLE('',#505,6.0);
#422=VERTEX_POINT('',#506);
#423=LINE('',#507,#508);
#424=VERTEX_POINT('',#509);
#425=CIRCLE('',#510,6.0);
#426=LINE('',#511,#512);
#427=VERTEX_POINT('',#513);
#428=VERTEX_POINT('',#514);
#429=CIRCLE('',#515,2.5);
#430=CIRCLE('',#516,2.5);
#431=VERTEX_POINT('',#517);
#432=VERTEX_POINT('',#518);
#433=CIRCLE('',#519,3.5);
#434=CIRCLE('',#520,3.5);
#435=CIRCLE('',#521,10.5);
#436=VERTEX_POINT('',#522);
#437=VERTEX_POINT('',#523);
#438=CIRCLE('',#524,1.5);
#439=VERTEX_POINT('',#525);
#440=LINE('',#526,#527);
#441=CIRCLE('',#528,1.5);
#442=CIRCLE('',#529,1.5);
#443=VERTEX_POINT('',#530);
#444=VERTEX_POINT('',#531);
#445=CIRCLE('',#532,2.5);
#446=CIRCLE('',#533,2.5);
#447=VERTEX_POINT('',#534);
#448=LINE('',#535,#536);
#449=VERTEX_POINT('',#537);
#450=CIRCLE('',#538,1.5);
#451=CIRCLE('',#539,1.5);
#452=VERTEX_POINT('',#540);
#453=LINE('',#541,#542);
#454=VERTEX_POINT('',#543);
#455=CIRCLE('',#544,2.5);
#456=CIRCLE('',#545,2.5);
#457=VERTEX_POINT('',#546);
#458=VERTEX_POINT('',#547);
#459=CIRCLE('',#548,1.2295);
#460=CIRCLE('',#549,1.2295);
#461=VERTEX_POINT('',#550);
#462=VERTEX_POINT('',#551);
#463=CIRCLE('',#552,2.5);
#464=CIRCLE('',#553,2.5);
#465=LINE('',#554,#555);
#466=LINE('',#556,#557);
#467=VERTEX_POINT('',#558);
#468=LINE('',#559,#560);
#469=VERTEX_POINT('',#561);
#470=CIRCLE('',#562,1.2295);
#471=CIRCLE('',#563,1.2295);
#472=VERTEX_POINT('',#564);
#473=LINE('',#565,#566);
#474=VERTEX_POINT('',#567);
#475=VERTEX_POINT('',#568);
#476=CIRCLE('',#569,1.5);
#477=VERTEX_POINT('',#570);
#478=LINE('',#571,#572);
#479=CIRCLE('',#573,1.5);
#480=CIRCLE('',#574,1.5);
#481=LINE('',#575,#576);
#482=VERTEX_POINT('',#577);
#483=LINE('',#578,#579);
#484=CIRCLE('',#580,1.5);
#485=LINE('',#581,#582);
#486=CARTESIAN_POINT('',(-3.5,0.0,0.0));
#487=CARTESIAN_POINT('',(3.5,-4.28626379701574E-16,0.0));
#488=AXIS2_PLACEMENT_3D('',#583,#584,#585);
#489=AXIS2_PLACEMENT_3D('',#586,#587,#588);
#490=CARTESIAN_POINT('',(-6.0,-6.0,0.0));
#491=CARTESIAN_POINT('',(4.16333634234434E-16,-6.0,-5.55111512312578E-16));
#492=AXIS2_PLACEMENT_3D('',#589,#590,#591);
#493=AXIS2_PLACEMENT_3D('',#592,#593,#594);
#494=CARTESIAN_POINT('',(0.0,6.0,0.0));
#495=CARTESIAN_POINT('',(6.0,6.0,-5.55111512312578E-16));
#496=AXIS2_PLACEMENT_3D('',#595,#596,#597);
#497=AXIS2_PLACEMENT_3D('',#598,#599,#600);
#498=CARTESIAN_POINT('',(3.0,-3.0,0.0));
#499=CARTESIAN_POINT('',(9.0,-3.0,-5.55111512312578E-16));
#500=AXIS2_PLACEMENT_3D('',#601,#602,#603);
#501=AXIS2_PLACEMENT_3D('',#604,#605,#606);
#502=CARTESIAN_POINT('',(-10.4861404622114,0.539312717051503,0.0));
#503=CARTESIAN_POINT('',(-3.45385953778863,9.9156872829485,0.0));
#504=AXIS2_PLACEMENT_3D('',#607,#608,#609);
#505=AXIS2_PLACEMENT_3D('',#610,#611,#612);
#506=CARTESIAN_POINT('',(-10.4861404622114,0.539312717051503,3.0));
#507=CARTESIAN_POINT('',(-10.4861404622114,0.539312717051503,0.0));
#508=VECTOR('',#613,1.0);
#509=CARTESIAN_POINT('',(-3.45385953778863,9.9156872829485,3.0));
#510=AXIS2_PLACEMENT_3D('',#614,#615,#616);
#511=CARTESIAN_POINT('',(-3.45385953778863,9.9156872829485,0.0));
#512=VECTOR('',#617,1.0);
#513=CARTESIAN_POINT('',(-2.5,0.0,-6.0));
#514=CARTESIAN_POINT('',(2.5,-3.06161699786838E-16,-6.0));
#515=AXIS2_PLACEMENT_3D('',#618,#619,#620);
#516=AXIS2_PLACEMENT_3D('',#621,#622,#623);
#517=CARTESIAN_POINT('',(-3.5,0.0,-6.0));
#518=CARTESIAN_POINT('',(3.5,-4.28626379701574E-16,-6.0));
#519=AXIS2_PLACEMENT_3D('',#624,#625,#626);
#520=AXIS2_PLACEMENT_3D('',#627,#628,#629);
#521=AXIS2_PLACEMENT_3D('',#630,#631,#632);
#522=CARTESIAN_POINT('',(4.5,-3.0,1.5));
#523=CARTESIAN_POINT('',(7.5,-3.0,1.5));
#524=AXIS2_PLACEMENT_3D('',#633,#634,#635);
#525=CARTESIAN_POINT('',(7.5,-3.0,3.0));
#526=CARTESIAN_POINT('',(7.5,-3.0,35.2562051276084));
#527=VECTOR('',#636,1.0);
#528=AXIS2_PLACEMENT_3D('',#637,#638,#639);
#529=AXIS2_PLACEMENT_3D('',#640,#641,#642);
#530=CARTESIAN_POINT('',(2.5,0.0,5.0));
#531=CARTESIAN_POINT('',(-2.5,-3.06161699786838E-16,5.0));
#532=AXIS2_PLACEMENT_3D('',#643,#644,#645);
#533=AXIS2_PLACEMENT_3D('',#646,#647,#648);
#534=CARTESIAN_POINT('',(4.5,6.0,1.5));
#535=CARTESIAN_POINT('',(5.25,6.0,0.75));
#536=VECTOR('',#649,1.0);
#537=CARTESIAN_POINT('',(1.5,6.0,1.5));
#538=AXIS2_PLACEMENT_3D('',#650,#651,#652);
#539=AXIS2_PLACEMENT_3D('',#653,#654,#655);
#540=CARTESIAN_POINT('',(-2.5,-3.06161699786838E-16,3.0));
#541=CARTESIAN_POINT('',(-2.5,-3.06161699786838E-16,3.0));
#542=VECTOR('',#656,1.0);
#543=CARTESIAN_POINT('',(2.5,0.0,3.0));
#544=AXIS2_PLACEMENT_3D('',#657,#658,#659);
#545=AXIS2_PLACEMENT_3D('',#660,#661,#662);
#546=CARTESIAN_POINT('',(-1.2295,0.0,-16.0));
#547=CARTESIAN_POINT('',(1.2295,-1.50570323955167E-16,-16.0));
#548=AXIS2_PLACEMENT_3D('',#663,#664,#665);
#549=AXIS2_PLACEMENT_3D('',#666,#667,#668);
#550=CARTESIAN_POINT('',(-2.5,0.0,-16.0));
#551=CARTESIAN_POINT('',(2.5,-3.06161699786838E-16,-16.0));
#552=AXIS2_PLACEMENT_3D('',#669,#670,#671);
#553=AXIS2_PLACEMENT_3D('',#672,#673,#674);
#554=CARTESIAN_POINT('',(3.5,-4.28626379701574E-16,0.0));
#555=VECTOR('',#675,1.0);
#556=CARTESIAN_POINT('',(2.5,-3.06161699786838E-16,-6.0));
#557=VECTOR('',#676,1.0);
#558=CARTESIAN_POINT('',(1.2295,-1.50570323955167E-16,-8.0));
#559=CARTESIAN_POINT('',(1.2295,-1.50570323955167E-16,-12.0));
#560=VECTOR('',#677,1.0);
#561=CARTESIAN_POINT('',(-1.2295,0.0,-8.0));
#562=AXIS2_PLACEMENT_3D('',#678,#679,#680);
#563=AXIS2_PLACEMENT_3D('',#681,#682,#683);
#564=CARTESIAN_POINT('',(0.0,0.0,-7.26124186890561));
#565=CARTESIAN_POINT('',(0.61475,-7.52851619775835E-17,-7.63062093445281));
#566=VECTOR('',#684,1.0);
#567=CARTESIAN_POINT('',(-4.5,-6.0,1.5));
#568=CARTESIAN_POINT('',(-1.5,-6.0,1.5));
#569=AXIS2_PLACEMENT_3D('',#685,#686,#687);
#570=CARTESIAN_POINT('',(-1.5,-6.0,3.0));
#571=CARTESIAN_POINT('',(-1.5,-6.0,35.2562051276084));
#572=VECTOR('',#688,1.0);
#573=AXIS2_PLACEMENT_3D('',#689,#690,#691);
#574=AXIS2_PLACEMENT_3D('',#692,#693,#694);
#575=CARTESIAN_POINT('',(-0.75,-6.0,0.75));
#576=VECTOR('',#695,1.0);
#577=CARTESIAN_POINT('',(4.5,6.0,3.0));
#578=CARTESIAN_POINT('',(4.5,6.0,35.2562051276084));
#579=VECTOR('',#696,1.0);
#580=AXIS2_PLACEMENT_3D('',#697,#698,#699);
#581=CARTESIAN_POINT('',(8.25,-3.0,0.75));
#582=VECTOR('',#700,1.0);
#583=CARTESIAN_POINT('',(0.0,0.0,0.0));
#584=DIRECTION('',(0.0,0.0,1.0));
#585=DIRECTION('',(-1.0,0.0,0.0));
#586=CARTESIAN_POINT('',(0.0,0.0,0.0));
#587=DIRECTION('',(0.0,0.0,1.0));
#588=DIRECTION('',(-1.0,0.0,0.0));
#589=CARTESIAN_POINT('',(-3.0,-6.0,0.0));
#590=DIRECTION('',(0.0,0.0,1.0));
#591=DIRECTION('',(-1.0,0.0,0.0));
#592=CARTESIAN_POINT('',(-3.0,-6.0,0.0));
#593=DIRECTION('',(0.0,0.0,1.0));
#594=DIRECTION('',(-1.0,0.0,0.0));
#595=CARTESIAN_POINT('',(3.0,6.0,0.0));
#596=DIRECTION('',(0.0,0.0,1.0));
#597=DIRECTION('',(-1.0,0.0,0.0));
#598=CARTESIAN_POINT('',(3.0,6.0,0.0));
#599=DIRECTION('',(0.0,0.0,1.0));
#600=DIRECTION('',(-1.0,0.0,0.0));
#601=CARTESIAN_POINT('',(6.0,-3.0,0.0));
#602=DIRECTION('',(0.0,0.0,1.0));
#603=DIRECTION('',(-1.0,0.0,0.0));
#604=CARTESIAN_POINT('',(6.0,-3.0,0.0));
#605=DIRECTION('',(0.0,0.0,1.0));
#606=DIRECTION('',(-1.0,0.0,0.0));
#607=CARTESIAN_POINT('',(0.0,0.0,0.0));
#608=DIRECTION('',(0.0,0.0,1.0));
#609=DIRECTION('',(-0.998680044020131,0.0513631159096669,0.0));
#610=CARTESIAN_POINT('',(-8.0,6.0,0.0));
#611=DIRECTION('',(0.0,0.0,-1.0));
#612=DIRECTION('',(0.414356743701895,0.910114547158083,0.0));
#613=DIRECTION('',(0.0,0.0,1.0));
#614=CARTESIAN_POINT('',(-8.0,6.0,3.0));
#615=DIRECTION('',(0.0,0.0,-1.0));
#616=DIRECTION('',(0.414356743701895,0.910114547158083,0.0));
#617=DIRECTION('',(0.0,0.0,1.0));
#618=CARTESIAN_POINT('',(0.0,0.0,-6.0));
#619=DIRECTION('',(0.0,0.0,1.0));
#620=DIRECTION('',(-1.0,0.0,0.0));
#621=CARTESIAN_POINT('',(0.0,0.0,-6.0));
#622=DIRECTION('',(0.0,0.0,1.0));
#623=DIRECTION('',(-1.0,0.0,0.0));
#624=CARTESIAN_POINT('',(0.0,0.0,-6.0));
#625=DIRECTION('',(0.0,0.0,-1.0));
#626=DIRECTION('',(-1.0,0.0,0.0));
#627=CARTESIAN_POINT('',(0.0,0.0,-6.0));
#628=DIRECTION('',(0.0,0.0,-1.0));
#629=DIRECTION('',(-1.0,0.0,0.0));
#630=CARTESIAN_POINT('',(0.0,0.0,3.0));
#631=DIRECTION('',(0.0,0.0,1.0));
#632=DIRECTION('',(-0.998680044020131,0.0513631159096669,0.0));
#633=CARTESIAN_POINT('',(6.0,-3.0,1.5));
#634=DIRECTION('',(0.0,0.0,-1.0));
#635=DIRECTION('',(-1.0,0.0,0.0));
#636=DIRECTION('',(0.0,0.0,1.0));
#637=CARTESIAN_POINT('',(6.0,-3.0,3.0));
#638=DIRECTION('',(0.0,0.0,-1.0));
#639=DIRECTION('',(-1.0,0.0,0.0));
#640=CARTESIAN_POINT('',(6.0,-3.0,1.5));
#641=DIRECTION('',(0.0,0.0,-1.0));
#642=DIRECTION('',(-1.0,0.0,0.0));
#643=CARTESIAN_POINT('',(0.0,0.0,5.0));
#644=DIRECTION('',(0.0,0.0,1.0));
#645=DIRECTION('',(1.0,0.0,0.0));
#646=CARTESIAN_POINT('',(0.0,0.0,5.0));
#647=DIRECTION('',(0.0,0.0,1.0));
#648=DIRECTION('',(1.0,0.0,0.0));
#649=DIRECTION('',(-0.707106781186547,8.65956056235493E-17,0.707106781186548));
#650=CARTESIAN_POINT('',(3.0,6.0,1.5));
#651=DIRECTION('',(0.0,0.0,-1.0));
#652=DIRECTION('',(-1.0,0.0,0.0));
#653=CARTESIAN_POINT('',(3.0,6.0,1.5));
#654=DIRECTION('',(0.0,0.0,-1.0));
#655=DIRECTION('',(-1.0,0.0,0.0));
#656=DIRECTION('',(0.0,0.0,-1.0));
#657=CARTESIAN_POINT('',(0.0,0.0,3.0));
#658=DIRECTION('',(0.0,0.0,-1.0));
#659=DIRECTION('',(1.0,0.0,0.0));
#660=CARTESIAN_POINT('',(0.0,0.0,3.0));
#661=DIRECTION('',(0.0,0.0,-1.0));
#662=DIRECTION('',(1.0,0.0,0.0));
#663=CARTESIAN_POINT('',(0.0,0.0,-16.0));
#664=DIRECTION('',(0.0,0.0,1.0));
#665=DIRECTION('',(-1.0,0.0,0.0));
#666=CARTESIAN_POINT('',(0.0,0.0,-16.0));
#667=DIRECTION('',(0.0,0.0,1.0));
#668=DIRECTION('',(-1.0,0.0,0.0));
#669=CARTESIAN_POINT('',(0.0,0.0,-16.0));
#670=DIRECTION('',(0.0,0.0,-1.0));
#671=DIRECTION('',(-1.0,0.0,0.0));
#672=CARTESIAN_POINT('',(0.0,0.0,-16.0));
#673=DIRECTION('',(0.0,0.0,-1.0));
#674=DIRECTION('',(-1.0,0.0,0.0));
#675=DIRECTION('',(0.0,0.0,1.0));
#676=DIRECTION('',(0.0,0.0,1.0));
#677=DIRECTION('',(0.0,0.0,1.0));
#678=CARTESIAN_POINT('',(0.0,0.0,-8.0));
#679=DIRECTION('',(0.0,0.0,-1.0));
#680=DIRECTION('',(-1.0,0.0,0.0));
#681=CARTESIAN_POINT('',(0.0,0.0,-8.0));
#682=DIRECTION('',(0.0,0.0,-1.0));
#683=DIRECTION('',(-1.0,0.0,0.0));
#684=DIRECTION('',(-0.857167300702112,1.04972719113862E-16,0.515038074910054));
#685=CARTESIAN_POINT('',(-3.0,-6.0,1.5));
#686=DIRECTION('',(0.0,0.0,-1.0));
#687=DIRECTION('',(-1.0,0.0,0.0));
#688=DIRECTION('',(0.0,0.0,1.0));
#689=CARTESIAN_POINT('',(-3.0,-6.0,3.0));
#690=DIRECTION('',(0.0,0.0,-1.0));
#691=DIRECTION('',(-1.0,0.0,0.0));
#692=CARTESIAN_POINT('',(-3.0,-6.0,1.5));
#693=DIRECTION('',(0.0,0.0,-1.0));
#694=DIRECTION('',(-1.0,0.0,0.0));
#695=DIRECTION('',(-0.707106781186547,8.65956056235493E-17,0.707106781186548));
#696=DIRECTION('',(0.0,0.0,1.0));
#697=CARTESIAN_POINT('',(3.0,6.0,3.0));
#698=DIRECTION('',(0.0,0.0,-1.0));
#699=DIRECTION('',(-1.0,0.0,0.0));
#700=DIRECTION('',(-0.707106781186547,8.65956056235493E-17,0.707106781186548));
ENDSEC;
END-ISO-10303-21;
