ISO-10303-21;
HEADER;
FILE_DESCRIPTION(('STEP AP203'),'1');
FILE_NAME('RBF22.P501-1 Suporte Inferior dos Capacitores.stp','2022-08-30T19:31:19',(' '),(' '),'Spatial InterOp 3D',' ',' ');
FILE_SCHEMA(('CONFIG_CONTROL_DESIGN'));
ENDSEC;
DATA;
#1=DESIGN_CONTEXT('',#33,'design');
#2=APPLICATION_PROTOCOL_DEFINITION('INTERNATIONAL STANDARD','config_control_design',1994,#33);
#3=PRODUCT_CATEGORY_RELATIONSHIP('NONE','NONE',#34,#35);
#4=DATE_AND_TIME(#36,#37);
#5=DATE_TIME_ROLE('creation_date');
#6=DATE_TIME_ROLE('classification_date');
#7=PERSON_AND_ORGANIZATION_ROLE('creator');
#8=PERSON_AND_ORGANIZATION_ROLE('design_supplier');
#9=PERSON_AND_ORGANIZATION_ROLE('classification_officer');
#10=PERSON_AND_ORGANIZATION_ROLE('design_owner');
#11=APPROVAL_PERSON_ORGANIZATION(#38,#39,#40);
#12=APPROVAL_DATE_TIME(#4,#39);
#13=CC_DESIGN_APPROVAL(#39,(#41,#42,#43));
#14=CC_DESIGN_DATE_AND_TIME_ASSIGNMENT(#4,#5,(#43));
#15=CC_DESIGN_DATE_AND_TIME_ASSIGNMENT(#4,#6,(#41));
#16=CC_DESIGN_PERSON_AND_ORGANIZATION_ASSIGNMENT(#38,#10,(#44));
#17=CC_DESIGN_PERSON_AND_ORGANIZATION_ASSIGNMENT(#38,#7,(#43));
#18=CC_DESIGN_PERSON_AND_ORGANIZATION_ASSIGNMENT(#38,#7,(#42));
#19=CC_DESIGN_PERSON_AND_ORGANIZATION_ASSIGNMENT(#38,#8,(#42));
#20=CC_DESIGN_SECURITY_CLASSIFICATION(#41,(#42));
#21=CC_DESIGN_PERSON_AND_ORGANIZATION_ASSIGNMENT(#38,#9,(#41));
#22=SHAPE_DEFINITION_REPRESENTATION(#45,#46);
#23= (GEOMETRIC_REPRESENTATION_CONTEXT(3)GLOBAL_UNCERTAINTY_ASSIGNED_CONTEXT((#49))GLOBAL_UNIT_ASSIGNED_CONTEXT((#51,#52,#53))REPRESENTATION_CONTEXT('NONE','WORKSPACE'));
#24=PROPERTY_DEFINITION_REPRESENTATION(#55,#56);
#25=GENERAL_PROPERTY_ASSOCIATION('','',#57,#55);
#26=PROPERTY_DEFINITION_REPRESENTATION(#58,#59);
#27=GENERAL_PROPERTY_ASSOCIATION('','',#60,#58);
#28=PROPERTY_DEFINITION_REPRESENTATION(#61,#62);
#29=GENERAL_PROPERTY_ASSOCIATION('','',#63,#61);
#33=APPLICATION_CONTEXT('CONFIGURATION CONTROLLED 3D DESIGNS OF MECHANICAL PARTS AND ASSEMBLIES');
#34=PRODUCT_CATEGORY('part','NONE');
#35=PRODUCT_RELATED_PRODUCT_CATEGORY('detail',' ',(#44));
#36=CALENDAR_DATE(2022,30,7);
#37=LOCAL_TIME(16,31,19.0,#64);
#38=PERSON_AND_ORGANIZATION(#65,#66);
#39=APPROVAL(#67,'SOLID MODEL');
#40=APPROVAL_ROLE('APPROVED');
#41=SECURITY_CLASSIFICATION('','',#68);
#42=PRODUCT_DEFINITION_FORMATION_WITH_SPECIFIED_SOURCE('A','NONE',#44,.NOT_KNOWN.);
#43=PRODUCT_DEFINITION('','NONE',#42,#1);
#44=PRODUCT('Suporte dos Capacitores','','PART--DESC',(#69));
#45=PRODUCT_DEFINITION_SHAPE('NONE','NONE',#43);
#46=ADVANCED_BREP_SHAPE_REPRESENTATION('1',(#70,#71),#23);
#49=UNCERTAINTY_MEASURE_WITH_UNIT(LENGTH_MEASURE(0.001),#51,'','');
#51= (CONVERSION_BASED_UNIT('MILLIMETRE',#74)LENGTH_UNIT()NAMED_UNIT(#77));
#52= (NAMED_UNIT(#79)PLANE_ANGLE_UNIT()SI_UNIT($,.RADIAN.));
#53= (NAMED_UNIT(#79)SOLID_ANGLE_UNIT()SI_UNIT($,.STERADIAN.));
#55=PROPERTY_DEFINITION('PdmObjectId','',#43);
#56=REPRESENTATION('',(#85),#23);
#57=GENERAL_PROPERTY('','19_7683ec67-2c7c-47a4-b1d3-44d0ea5bc769&2_30_0_155','');
#58=PROPERTY_DEFINITION('CreationDate','',#43);
#59=REPRESENTATION('',(#86),#23);
#60=GENERAL_PROPERTY('','25/04/2022 18:25:06','');
#61=PROPERTY_DEFINITION('Minor Revision','',#43);
#62=REPRESENTATION('',(#87),#23);
#63=GENERAL_PROPERTY('','25','');
#64=COORDINATED_UNIVERSAL_TIME_OFFSET(3,0,.BEHIND.);
#65=PERSON('','UNSPECIFIED',$,$,$,$);
#66=ORGANIZATION('UNSPECIFIED','UNSPECIFIED','UNSPECIFIED');
#67=APPROVAL_STATUS('approved');
#68=SECURITY_CLASSIFICATION_LEVEL('unclassified');
#69=MECHANICAL_CONTEXT('',#33,'mechanical');
#70=MANIFOLD_SOLID_BREP('1',#88);
#71=AXIS2_PLACEMENT_3D('',#89,#90,#91);
#74=LENGTH_MEASURE_WITH_UNIT(LENGTH_MEASURE(1.0),#92);
#77=DIMENSIONAL_EXPONENTS(1.0,0.0,0.0,0.0,0.0,0.0,0.0);
#79=DIMENSIONAL_EXPONENTS(0.0,0.0,0.0,0.0,0.0,0.0,0.0);
#85=VALUE_REPRESENTATION_ITEM('19_7683ec67-2c7c-47a4-b1d3-44d0ea5bc769&2_30_0_155',);
#86=VALUE_REPRESENTATION_ITEM('25/04/2022 18:25:06',);
#87=VALUE_REPRESENTATION_ITEM('25',);
#88=CLOSED_SHELL('',(#93,#94,#95,#96,#97,#98,#99,#100,#101,#102,#103,#104,#105,#106,#107,#108,#109,#110,#111,#112,#113,#114,#115,#116,#117,#118,#119,#120));
#89=CARTESIAN_POINT('',(0.0,0.0,0.0));
#90=DIRECTION('',(0.0,0.0,1.0));
#91=DIRECTION('',(1.0,0.0,0.0));
#92= (NAMED_UNIT(#77)LENGTH_UNIT()SI_UNIT(.MILLI.,.METRE.));
#93=ADVANCED_FACE('',(#122),#123,.T.);
#94=ADVANCED_FACE('',(#124,#125,#126,#127),#128,.F.);
#95=ADVANCED_FACE('',(#129),#130,.T.);
#96=ADVANCED_FACE('',(#131),#132,.T.);
#97=ADVANCED_FACE('',(#133),#134,.T.);
#98=ADVANCED_FACE('',(#135),#136,.T.);
#99=ADVANCED_FACE('',(#137),#138,.T.);
#100=ADVANCED_FACE('',(#139),#140,.T.);
#101=ADVANCED_FACE('',(#141),#142,.T.);
#102=ADVANCED_FACE('',(#143),#144,.T.);
#103=ADVANCED_FACE('',(#145),#146,.T.);
#104=ADVANCED_FACE('',(#147),#148,.T.);
#105=ADVANCED_FACE('',(#149),#150,.T.);
#106=ADVANCED_FACE('',(#151,#152,#153,#154,#155,#156,#157,#158),#159,.T.);
#107=ADVANCED_FACE('',(#160,#161),#162,.F.);
#108=ADVANCED_FACE('',(#163),#164,.T.);
#109=ADVANCED_FACE('',(#165,#166),#167,.F.);
#110=ADVANCED_FACE('',(#168),#169,.T.);
#111=ADVANCED_FACE('',(#170,#171),#172,.F.);
#112=ADVANCED_FACE('',(#173),#174,.T.);
#113=ADVANCED_FACE('',(#175,#176),#177,.F.);
#114=ADVANCED_FACE('',(#178),#179,.T.);
#115=ADVANCED_FACE('',(#180,#181),#182,.F.);
#116=ADVANCED_FACE('',(#183,#184),#185,.F.);
#117=ADVANCED_FACE('',(#186,#187),#188,.F.);
#118=ADVANCED_FACE('',(#189,#190),#191,.F.);
#119=ADVANCED_FACE('',(#192,#193),#194,.F.);
#120=ADVANCED_FACE('',(#195,#196),#197,.F.);
#122=FACE_OUTER_BOUND('',#198,.T.);
#123=CYLINDRICAL_SURFACE('',#199,4.0);
#124=FACE_BOUND('',#200,.T.);
#125=FACE_BOUND('',#201,.T.);
#126=FACE_BOUND('',#202,.T.);
#127=FACE_OUTER_BOUND('',#203,.T.);
#128=PLANE('',#204);
#129=FACE_OUTER_BOUND('',#205,.T.);
#130=PLANE('',#206);
#131=FACE_OUTER_BOUND('',#207,.T.);
#132=PLANE('',#208);
#133=FACE_OUTER_BOUND('',#209,.T.);
#134=CYLINDRICAL_SURFACE('',#210,17.5);
#135=FACE_OUTER_BOUND('',#211,.T.);
#136=PLANE('',#212);
#137=FACE_OUTER_BOUND('',#213,.T.);
#138=CYLINDRICAL_SURFACE('',#214,4.0);
#139=FACE_OUTER_BOUND('',#215,.T.);
#140=PLANE('',#216);
#141=FACE_OUTER_BOUND('',#217,.T.);
#142=CYLINDRICAL_SURFACE('',#218,4.0);
#143=FACE_OUTER_BOUND('',#219,.T.);
#144=PLANE('',#220);
#145=FACE_OUTER_BOUND('',#221,.T.);
#146=CYLINDRICAL_SURFACE('',#222,17.5);
#147=FACE_OUTER_BOUND('',#223,.T.);
#148=PLANE('',#224);
#149=FACE_OUTER_BOUND('',#225,.T.);
#150=CYLINDRICAL_SURFACE('',#226,4.0);
#151=FACE_BOUND('',#227,.T.);
#152=FACE_BOUND('',#228,.T.);
#153=FACE_BOUND('',#229,.T.);
#154=FACE_BOUND('',#230,.T.);
#155=FACE_BOUND('',#231,.T.);
#156=FACE_BOUND('',#232,.T.);
#157=FACE_BOUND('',#233,.T.);
#158=FACE_OUTER_BOUND('',#234,.T.);
#159=PLANE('',#235);
#160=FACE_OUTER_BOUND('',#236,.T.);
#161=FACE_OUTER_BOUND('',#237,.T.);
#162=CYLINDRICAL_SURFACE('',#238,17.7);
#163=FACE_OUTER_BOUND('',#239,.T.);
#164=PLANE('',#240);
#165=FACE_OUTER_BOUND('',#241,.T.);
#166=FACE_OUTER_BOUND('',#242,.T.);
#167=CYLINDRICAL_SURFACE('',#243,17.7);
#168=FACE_OUTER_BOUND('',#244,.T.);
#169=PLANE('',#245);
#170=FACE_OUTER_BOUND('',#246,.T.);
#171=FACE_OUTER_BOUND('',#247,.T.);
#172=CYLINDRICAL_SURFACE('',#248,17.7);
#173=FACE_OUTER_BOUND('',#249,.T.);
#174=PLANE('',#250);
#175=FACE_OUTER_BOUND('',#251,.T.);
#176=FACE_OUTER_BOUND('',#252,.T.);
#177=CYLINDRICAL_SURFACE('',#253,17.7);
#178=FACE_OUTER_BOUND('',#254,.T.);
#179=PLANE('',#255);
#180=FACE_BOUND('',#256,.T.);
#181=FACE_OUTER_BOUND('',#257,.T.);
#182=CONICAL_SURFACE('',#258,1.7,0.785398163397448);
#183=FACE_OUTER_BOUND('',#259,.T.);
#184=FACE_OUTER_BOUND('',#260,.T.);
#185=CYLINDRICAL_SURFACE('',#261,1.7);
#186=FACE_BOUND('',#262,.T.);
#187=FACE_OUTER_BOUND('',#263,.T.);
#188=CONICAL_SURFACE('',#264,1.7,0.785398163397448);
#189=FACE_OUTER_BOUND('',#265,.T.);
#190=FACE_OUTER_BOUND('',#266,.T.);
#191=CYLINDRICAL_SURFACE('',#267,1.7);
#192=FACE_BOUND('',#268,.T.);
#193=FACE_OUTER_BOUND('',#269,.T.);
#194=CONICAL_SURFACE('',#270,1.7,0.785398163397448);
#195=FACE_OUTER_BOUND('',#271,.T.);
#196=FACE_OUTER_BOUND('',#272,.T.);
#197=CYLINDRICAL_SURFACE('',#273,1.7);
#198=EDGE_LOOP('',(#274,#275,#276,#277));
#199=AXIS2_PLACEMENT_3D('',#278,#279,#280);
#200=EDGE_LOOP('',(#281));
#201=EDGE_LOOP('',(#282));
#202=EDGE_LOOP('',(#283));
#203=EDGE_LOOP('',(#284,#285,#286,#287,#288,#289,#290,#291,#292,#293,#294,#295));
#204=AXIS2_PLACEMENT_3D('',#296,#297,#298);
#205=EDGE_LOOP('',(#299,#300,#301,#302));
#206=AXIS2_PLACEMENT_3D('',#303,#304,#305);
#207=EDGE_LOOP('',(#306,#307,#308,#309));
#208=AXIS2_PLACEMENT_3D('',#310,#311,#312);
#209=EDGE_LOOP('',(#313,#314,#315,#316));
#210=AXIS2_PLACEMENT_3D('',#317,#318,#319);
#211=EDGE_LOOP('',(#320,#321,#322,#323));
#212=AXIS2_PLACEMENT_3D('',#324,#325,#326);
#213=EDGE_LOOP('',(#327,#328,#329,#330));
#214=AXIS2_PLACEMENT_3D('',#331,#332,#333);
#215=EDGE_LOOP('',(#334,#335,#336,#337));
#216=AXIS2_PLACEMENT_3D('',#338,#339,#340);
#217=EDGE_LOOP('',(#341,#342,#343,#344));
#218=AXIS2_PLACEMENT_3D('',#345,#346,#347);
#219=EDGE_LOOP('',(#348,#349,#350,#351));
#220=AXIS2_PLACEMENT_3D('',#352,#353,#354);
#221=EDGE_LOOP('',(#355,#356,#357,#358));
#222=AXIS2_PLACEMENT_3D('',#359,#360,#361);
#223=EDGE_LOOP('',(#362,#363,#364,#365));
#224=AXIS2_PLACEMENT_3D('',#366,#367,#368);
#225=EDGE_LOOP('',(#369,#370,#371,#372));
#226=AXIS2_PLACEMENT_3D('',#373,#374,#375);
#227=EDGE_LOOP('',(#376));
#228=EDGE_LOOP('',(#377));
#229=EDGE_LOOP('',(#378));
#230=EDGE_LOOP('',(#379));
#231=EDGE_LOOP('',(#380));
#232=EDGE_LOOP('',(#381));
#233=EDGE_LOOP('',(#382));
#234=EDGE_LOOP('',(#383,#384,#385,#386,#387,#388,#389,#390,#391,#392,#393,#394));
#235=AXIS2_PLACEMENT_3D('',#395,#396,#397);
#236=EDGE_LOOP('',(#398));
#237=EDGE_LOOP('',(#399));
#238=AXIS2_PLACEMENT_3D('',#400,#401,#402);
#239=EDGE_LOOP('',(#403));
#240=AXIS2_PLACEMENT_3D('',#404,#405,#406);
#241=EDGE_LOOP('',(#407));
#242=EDGE_LOOP('',(#408));
#243=AXIS2_PLACEMENT_3D('',#409,#410,#411);
#244=EDGE_LOOP('',(#412));
#245=AXIS2_PLACEMENT_3D('',#413,#414,#415);
#246=EDGE_LOOP('',(#416));
#247=EDGE_LOOP('',(#417));
#248=AXIS2_PLACEMENT_3D('',#418,#419,#420);
#249=EDGE_LOOP('',(#421));
#250=AXIS2_PLACEMENT_3D('',#422,#423,#424);
#251=EDGE_LOOP('',(#425));
#252=EDGE_LOOP('',(#426));
#253=AXIS2_PLACEMENT_3D('',#427,#428,#429);
#254=EDGE_LOOP('',(#430));
#255=AXIS2_PLACEMENT_3D('',#431,#432,#433);
#256=EDGE_LOOP('',(#434));
#257=EDGE_LOOP('',(#435));
#258=AXIS2_PLACEMENT_3D('',#436,#437,#438);
#259=EDGE_LOOP('',(#439));
#260=EDGE_LOOP('',(#440));
#261=AXIS2_PLACEMENT_3D('',#441,#442,#443);
#262=EDGE_LOOP('',(#444));
#263=EDGE_LOOP('',(#445));
#264=AXIS2_PLACEMENT_3D('',#446,#447,#448);
#265=EDGE_LOOP('',(#449));
#266=EDGE_LOOP('',(#450));
#267=AXIS2_PLACEMENT_3D('',#451,#452,#453);
#268=EDGE_LOOP('',(#454));
#269=EDGE_LOOP('',(#455));
#270=AXIS2_PLACEMENT_3D('',#456,#457,#458);
#271=EDGE_LOOP('',(#459));
#272=EDGE_LOOP('',(#460));
#273=AXIS2_PLACEMENT_3D('',#461,#462,#463);
#274=ORIENTED_EDGE('',*,*,#464,.F.);
#275=ORIENTED_EDGE('',*,*,#465,.F.);
#276=ORIENTED_EDGE('',*,*,#466,.T.);
#277=ORIENTED_EDGE('',*,*,#467,.T.);
#278=CARTESIAN_POINT('',(-32.5,-70.5,-31.0));
#279=DIRECTION('',(-1.23086802860452E-16,2.45039432007627E-29,-1.0));
#280=DIRECTION('',(-1.0,-6.04068837963686E-61,1.23086802860452E-16));
#281=ORIENTED_EDGE('',*,*,#468,.T.);
#282=ORIENTED_EDGE('',*,*,#469,.T.);
#283=ORIENTED_EDGE('',*,*,#470,.T.);
#284=ORIENTED_EDGE('',*,*,#471,.F.);
#285=ORIENTED_EDGE('',*,*,#466,.F.);
#286=ORIENTED_EDGE('',*,*,#472,.F.);
#287=ORIENTED_EDGE('',*,*,#473,.F.);
#288=ORIENTED_EDGE('',*,*,#474,.F.);
#289=ORIENTED_EDGE('',*,*,#475,.F.);
#290=ORIENTED_EDGE('',*,*,#476,.F.);
#291=ORIENTED_EDGE('',*,*,#477,.F.);
#292=ORIENTED_EDGE('',*,*,#478,.F.);
#293=ORIENTED_EDGE('',*,*,#479,.F.);
#294=ORIENTED_EDGE('',*,*,#480,.F.);
#295=ORIENTED_EDGE('',*,*,#481,.F.);
#296=CARTESIAN_POINT('',(-19.0,-54.9714052096562,-31.0));
#297=DIRECTION('',(-1.23086802860452E-16,2.45039432007627E-29,-1.0));
#298=DIRECTION('',(-1.0,0.0,1.23086802860452E-16));
#299=ORIENTED_EDGE('',*,*,#482,.F.);
#300=ORIENTED_EDGE('',*,*,#483,.F.);
#301=ORIENTED_EDGE('',*,*,#472,.T.);
#302=ORIENTED_EDGE('',*,*,#465,.T.);
#303=CARTESIAN_POINT('',(7.50565140612555E-17,-74.5,-31.0));
#304=DIRECTION('',(-3.016112026056E-45,-1.0,-2.45039432007627E-29));
#305=DIRECTION('',(-1.0,-1.85231939130086E-60,1.23086802860452E-16));
#306=ORIENTED_EDGE('',*,*,#484,.F.);
#307=ORIENTED_EDGE('',*,*,#467,.F.);
#308=ORIENTED_EDGE('',*,*,#471,.T.);
#309=ORIENTED_EDGE('',*,*,#485,.T.);
#310=CARTESIAN_POINT('',(-36.5,-64.7357026048281,-31.0));
#311=DIRECTION('',(-1.0,-6.12303176911189E-17,1.23086802860452E-16));
#312=DIRECTION('',(-6.12303176911189E-17,1.0,2.45114798448055E-29));
#313=ORIENTED_EDGE('',*,*,#486,.F.);
#314=ORIENTED_EDGE('',*,*,#485,.F.);
#315=ORIENTED_EDGE('',*,*,#481,.T.);
#316=ORIENTED_EDGE('',*,*,#487,.T.);
#317=CARTESIAN_POINT('',(-19.0,-54.9714052096562,-31.0));
#318=DIRECTION('',(-1.23086802860452E-16,2.45039432007627E-29,-1.0));
#319=DIRECTION('',(-1.0,-6.04068837963686E-61,1.23086802860452E-16));
#320=ORIENTED_EDGE('',*,*,#488,.F.);
#321=ORIENTED_EDGE('',*,*,#487,.F.);
#322=ORIENTED_EDGE('',*,*,#480,.T.);
#323=ORIENTED_EDGE('',*,*,#489,.T.);
#324=CARTESIAN_POINT('',(-20.0,-4.0,-31.0));
#325=DIRECTION('',(-1.0,-6.12303176911189E-17,1.23086802860452E-16));
#326=DIRECTION('',(-6.12303176911189E-17,1.0,2.45114798448055E-29));
#327=ORIENTED_EDGE('',*,*,#490,.F.);
#328=ORIENTED_EDGE('',*,*,#489,.F.);
#329=ORIENTED_EDGE('',*,*,#479,.T.);
#330=ORIENTED_EDGE('',*,*,#491,.T.);
#331=CARTESIAN_POINT('',(-16.0,25.5,-31.0));
#332=DIRECTION('',(-1.23086802860452E-16,2.45039432007627E-29,-1.0));
#333=DIRECTION('',(-1.0,-6.04068837963686E-61,1.23086802860452E-16));
#334=ORIENTED_EDGE('',*,*,#492,.F.);
#335=ORIENTED_EDGE('',*,*,#491,.F.);
#336=ORIENTED_EDGE('',*,*,#478,.T.);
#337=ORIENTED_EDGE('',*,*,#493,.T.);
#338=CARTESIAN_POINT('',(-3.32005560982428E-15,29.5,-31.0));
#339=DIRECTION('',(1.22460635382238E-16,1.0,2.44888699126773E-29));
#340=DIRECTION('',(1.0,-1.22460635382238E-16,-1.23086802860452E-16));
#341=ORIENTED_EDGE('',*,*,#494,.F.);
#342=ORIENTED_EDGE('',*,*,#493,.F.);
#343=ORIENTED_EDGE('',*,*,#477,.T.);
#344=ORIENTED_EDGE('',*,*,#495,.T.);
#345=CARTESIAN_POINT('',(16.0,25.5,-31.0));
#346=DIRECTION('',(-1.23086802860452E-16,2.45039432007627E-29,-1.0));
#347=DIRECTION('',(-1.0,-6.04068837963686E-61,1.23086802860452E-16));
#348=ORIENTED_EDGE('',*,*,#496,.F.);
#349=ORIENTED_EDGE('',*,*,#495,.F.);
#350=ORIENTED_EDGE('',*,*,#476,.T.);
#351=ORIENTED_EDGE('',*,*,#497,.T.);
#352=CARTESIAN_POINT('',(20.0,-4.0,-31.0));
#353=DIRECTION('',(1.0,-6.12303176911189E-17,-1.23086802860452E-16));
#354=DIRECTION('',(-6.12303176911189E-17,-1.0,-2.449640655672E-29));
#355=ORIENTED_EDGE('',*,*,#498,.F.);
#356=ORIENTED_EDGE('',*,*,#497,.F.);
#357=ORIENTED_EDGE('',*,*,#475,.T.);
#358=ORIENTED_EDGE('',*,*,#499,.T.);
#359=CARTESIAN_POINT('',(19.0,-54.9714052096562,-31.0));
#360=DIRECTION('',(-1.23086802860452E-16,2.45039432007627E-29,-1.0));
#361=DIRECTION('',(-1.0,-6.04068837963686E-61,1.23086802860452E-16));
#362=ORIENTED_EDGE('',*,*,#500,.F.);
#363=ORIENTED_EDGE('',*,*,#499,.F.);
#364=ORIENTED_EDGE('',*,*,#474,.T.);
#365=ORIENTED_EDGE('',*,*,#501,.T.);
#366=CARTESIAN_POINT('',(36.5,-64.7357026048281,-31.0));
#367=DIRECTION('',(1.0,-6.12303176911189E-17,-1.23086802860452E-16));
#368=DIRECTION('',(-6.12303176911189E-17,-1.0,-2.449640655672E-29));
#369=ORIENTED_EDGE('',*,*,#502,.F.);
#370=ORIENTED_EDGE('',*,*,#501,.F.);
#371=ORIENTED_EDGE('',*,*,#473,.T.);
#372=ORIENTED_EDGE('',*,*,#483,.T.);
#373=CARTESIAN_POINT('',(32.5,-70.5,-31.0));
#374=DIRECTION('',(-1.23086802860452E-16,2.45039432007627E-29,-1.0));
#375=DIRECTION('',(-1.0,-6.04068837963686E-61,1.23086802860452E-16));
#376=ORIENTED_EDGE('',*,*,#503,.T.);
#377=ORIENTED_EDGE('',*,*,#504,.T.);
#378=ORIENTED_EDGE('',*,*,#505,.T.);
#379=ORIENTED_EDGE('',*,*,#506,.F.);
#380=ORIENTED_EDGE('',*,*,#507,.F.);
#381=ORIENTED_EDGE('',*,*,#508,.F.);
#382=ORIENTED_EDGE('',*,*,#509,.F.);
#383=ORIENTED_EDGE('',*,*,#484,.T.);
#384=ORIENTED_EDGE('',*,*,#486,.T.);
#385=ORIENTED_EDGE('',*,*,#488,.T.);
#386=ORIENTED_EDGE('',*,*,#490,.T.);
#387=ORIENTED_EDGE('',*,*,#492,.T.);
#388=ORIENTED_EDGE('',*,*,#494,.T.);
#389=ORIENTED_EDGE('',*,*,#496,.T.);
#390=ORIENTED_EDGE('',*,*,#498,.T.);
#391=ORIENTED_EDGE('',*,*,#500,.T.);
#392=ORIENTED_EDGE('',*,*,#502,.T.);
#393=ORIENTED_EDGE('',*,*,#482,.T.);
#394=ORIENTED_EDGE('',*,*,#464,.T.);
#395=CARTESIAN_POINT('',(-19.0,-54.9714052096562,-35.0));
#396=DIRECTION('',(-1.23086802860452E-16,2.45039432007627E-29,-1.0));
#397=DIRECTION('',(-1.0,0.0,1.23086802860452E-16));
#398=ORIENTED_EDGE('',*,*,#509,.T.);
#399=ORIENTED_EDGE('',*,*,#510,.F.);
#400=CARTESIAN_POINT('',(18.0,-56.0,-35.0));
#401=DIRECTION('',(1.23086802860452E-16,-2.45039432007627E-29,1.0));
#402=DIRECTION('',(-1.0,-6.04068837963686E-61,1.23086802860452E-16));
#403=ORIENTED_EDGE('',*,*,#510,.T.);
#404=CARTESIAN_POINT('',(18.0,-56.0,-34.0));
#405=DIRECTION('',(-1.23086802860452E-16,2.45039432007627E-29,-1.0));
#406=DIRECTION('',(-1.0,0.0,1.23086802860452E-16));
#407=ORIENTED_EDGE('',*,*,#506,.T.);
#408=ORIENTED_EDGE('',*,*,#511,.F.);
#409=CARTESIAN_POINT('',(-3.46944695195361E-15,-25.0,-35.0));
#410=DIRECTION('',(1.23086802860452E-16,-2.45039432007627E-29,1.0));
#411=DIRECTION('',(-1.0,-6.04068837963686E-61,1.23086802860452E-16));
#412=ORIENTED_EDGE('',*,*,#511,.T.);
#413=CARTESIAN_POINT('',(-3.34636014909316E-15,-25.0,-34.0));
#414=DIRECTION('',(-1.23086802860452E-16,2.45039432007627E-29,-1.0));
#415=DIRECTION('',(-1.0,0.0,1.23086802860452E-16));
#416=ORIENTED_EDGE('',*,*,#508,.T.);
#417=ORIENTED_EDGE('',*,*,#512,.F.);
#418=CARTESIAN_POINT('',(-18.0,-56.0,-35.0));
#419=DIRECTION('',(1.23086802860452E-16,-2.45039432007627E-29,1.0));
#420=DIRECTION('',(-1.0,-6.04068837963686E-61,1.23086802860452E-16));
#421=ORIENTED_EDGE('',*,*,#512,.T.);
#422=CARTESIAN_POINT('',(-18.0,-56.0,-34.0));
#423=DIRECTION('',(-1.23086802860452E-16,2.45039432007627E-29,-1.0));
#424=DIRECTION('',(-1.0,0.0,1.23086802860452E-16));
#425=ORIENTED_EDGE('',*,*,#507,.T.);
#426=ORIENTED_EDGE('',*,*,#513,.F.);
#427=CARTESIAN_POINT('',(-3.46944695195361E-15,11.0,-35.0));
#428=DIRECTION('',(1.23086802860452E-16,-2.45039432007627E-29,1.0));
#429=DIRECTION('',(-1.0,-6.04068837963686E-61,1.23086802860452E-16));
#430=ORIENTED_EDGE('',*,*,#513,.T.);
#431=CARTESIAN_POINT('',(-3.34636014909316E-15,11.0,-34.0));
#432=DIRECTION('',(-1.23086802860452E-16,2.45039432007627E-29,-1.0));
#433=DIRECTION('',(-1.0,0.0,1.23086802860452E-16));
#434=ORIENTED_EDGE('',*,*,#514,.F.);
#435=ORIENTED_EDGE('',*,*,#470,.F.);
#436=CARTESIAN_POINT('',(-15.0000000000011,-7.0,-32.81));
#437=DIRECTION('',(-0.0,-0.0,1.0));
#438=DIRECTION('',(1.0,0.0,0.0));
#439=ORIENTED_EDGE('',*,*,#505,.F.);
#440=ORIENTED_EDGE('',*,*,#514,.T.);
#441=CARTESIAN_POINT('',(-15.0000000000011,-7.0,-31.15));
#442=DIRECTION('',(0.0,0.0,-1.0));
#443=DIRECTION('',(1.0,0.0,0.0));
#444=ORIENTED_EDGE('',*,*,#515,.F.);
#445=ORIENTED_EDGE('',*,*,#469,.F.);
#446=CARTESIAN_POINT('',(15.0,-7.0,-32.81));
#447=DIRECTION('',(-0.0,-0.0,1.0));
#448=DIRECTION('',(1.0,0.0,0.0));
#449=ORIENTED_EDGE('',*,*,#504,.F.);
#450=ORIENTED_EDGE('',*,*,#515,.T.);
#451=CARTESIAN_POINT('',(15.0,-7.0,-31.15));
#452=DIRECTION('',(0.0,0.0,-1.0));
#453=DIRECTION('',(1.0,0.0,0.0));
#454=ORIENTED_EDGE('',*,*,#516,.F.);
#455=ORIENTED_EDGE('',*,*,#468,.F.);
#456=CARTESIAN_POINT('',(1.30484563995065E-09,-70.5,-32.81));
#457=DIRECTION('',(-0.0,-0.0,1.0));
#458=DIRECTION('',(1.0,0.0,0.0));
#459=ORIENTED_EDGE('',*,*,#503,.F.);
#460=ORIENTED_EDGE('',*,*,#516,.T.);
#461=CARTESIAN_POINT('',(1.30484563995065E-09,-70.5,-31.15));
#462=DIRECTION('',(0.0,0.0,-1.0));
#463=DIRECTION('',(1.0,0.0,0.0));
#464=EDGE_CURVE('',#517,#518,#519,.T.);
#465=EDGE_CURVE('',#520,#517,#521,.T.);
#466=EDGE_CURVE('',#520,#522,#523,.T.);
#467=EDGE_CURVE('',#522,#518,#524,.T.);
#468=EDGE_CURVE('',#525,#525,#526,.T.);
#469=EDGE_CURVE('',#527,#527,#528,.T.);
#470=EDGE_CURVE('',#529,#529,#530,.T.);
#471=EDGE_CURVE('',#522,#531,#532,.T.);
#472=EDGE_CURVE('',#533,#520,#534,.T.);
#473=EDGE_CURVE('',#535,#533,#536,.T.);
#474=EDGE_CURVE('',#537,#535,#538,.T.);
#475=EDGE_CURVE('',#539,#537,#540,.T.);
#476=EDGE_CURVE('',#541,#539,#542,.T.);
#477=EDGE_CURVE('',#543,#541,#544,.T.);
#478=EDGE_CURVE('',#545,#543,#546,.T.);
#479=EDGE_CURVE('',#547,#545,#548,.T.);
#480=EDGE_CURVE('',#549,#547,#550,.T.);
#481=EDGE_CURVE('',#531,#549,#551,.T.);
#482=EDGE_CURVE('',#552,#517,#553,.T.);
#483=EDGE_CURVE('',#533,#552,#554,.T.);
#484=EDGE_CURVE('',#518,#555,#556,.T.);
#485=EDGE_CURVE('',#531,#555,#557,.T.);
#486=EDGE_CURVE('',#555,#558,#559,.T.);
#487=EDGE_CURVE('',#549,#558,#560,.T.);
#488=EDGE_CURVE('',#558,#561,#562,.T.);
#489=EDGE_CURVE('',#547,#561,#563,.T.);
#490=EDGE_CURVE('',#561,#564,#565,.T.);
#491=EDGE_CURVE('',#545,#564,#566,.T.);
#492=EDGE_CURVE('',#564,#567,#568,.T.);
#493=EDGE_CURVE('',#543,#567,#569,.T.);
#494=EDGE_CURVE('',#567,#570,#571,.T.);
#495=EDGE_CURVE('',#541,#570,#572,.T.);
#496=EDGE_CURVE('',#570,#573,#574,.T.);
#497=EDGE_CURVE('',#539,#573,#575,.T.);
#498=EDGE_CURVE('',#573,#576,#577,.T.);
#499=EDGE_CURVE('',#537,#576,#578,.T.);
#500=EDGE_CURVE('',#576,#579,#580,.T.);
#501=EDGE_CURVE('',#535,#579,#581,.T.);
#502=EDGE_CURVE('',#579,#552,#582,.T.);
#503=EDGE_CURVE('',#583,#583,#584,.F.);
#504=EDGE_CURVE('',#585,#585,#586,.F.);
#505=EDGE_CURVE('',#587,#587,#588,.F.);
#506=EDGE_CURVE('',#589,#589,#590,.T.);
#507=EDGE_CURVE('',#591,#591,#592,.T.);
#508=EDGE_CURVE('',#593,#593,#594,.T.);
#509=EDGE_CURVE('',#595,#595,#596,.T.);
#510=EDGE_CURVE('',#597,#597,#598,.T.);
#511=EDGE_CURVE('',#599,#599,#600,.T.);
#512=EDGE_CURVE('',#601,#601,#602,.T.);
#513=EDGE_CURVE('',#603,#603,#604,.T.);
#514=EDGE_CURVE('',#605,#605,#606,.T.);
#515=EDGE_CURVE('',#607,#607,#608,.T.);
#516=EDGE_CURVE('',#609,#609,#610,.T.);
#517=VERTEX_POINT('',#611);
#518=VERTEX_POINT('',#612);
#519=CIRCLE('',#613,4.0);
#520=VERTEX_POINT('',#614);
#521=LINE('',#615,#616);
#522=VERTEX_POINT('',#617);
#523=CIRCLE('',#618,4.0);
#524=LINE('',#619,#620);
#525=VERTEX_POINT('',#621);
#526=CIRCLE('',#622,3.51);
#527=VERTEX_POINT('',#623);
#528=CIRCLE('',#624,3.51);
#529=VERTEX_POINT('',#625);
#530=CIRCLE('',#626,3.51);
#531=VERTEX_POINT('',#627);
#532=LINE('',#628,#629);
#533=VERTEX_POINT('',#630);
#534=LINE('',#631,#632);
#535=VERTEX_POINT('',#633);
#536=CIRCLE('',#634,4.0);
#537=VERTEX_POINT('',#635);
#538=LINE('',#636,#637);
#539=VERTEX_POINT('',#638);
#540=CIRCLE('',#639,17.5);
#541=VERTEX_POINT('',#640);
#542=LINE('',#641,#642);
#543=VERTEX_POINT('',#643);
#544=CIRCLE('',#644,4.0);
#545=VERTEX_POINT('',#645);
#546=LINE('',#646,#647);
#547=VERTEX_POINT('',#648);
#548=CIRCLE('',#649,4.0);
#549=VERTEX_POINT('',#650);
#550=LINE('',#651,#652);
#551=CIRCLE('',#653,17.5);
#552=VERTEX_POINT('',#654);
#553=LINE('',#655,#656);
#554=LINE('',#657,#658);
#555=VERTEX_POINT('',#659);
#556=LINE('',#660,#661);
#557=LINE('',#662,#663);
#558=VERTEX_POINT('',#664);
#559=CIRCLE('',#665,17.5);
#560=LINE('',#666,#667);
#561=VERTEX_POINT('',#668);
#562=LINE('',#669,#670);
#563=LINE('',#671,#672);
#564=VERTEX_POINT('',#673);
#565=CIRCLE('',#674,4.0);
#566=LINE('',#675,#676);
#567=VERTEX_POINT('',#677);
#568=LINE('',#678,#679);
#569=LINE('',#680,#681);
#570=VERTEX_POINT('',#682);
#571=CIRCLE('',#683,4.0);
#572=LINE('',#684,#685);
#573=VERTEX_POINT('',#686);
#574=LINE('',#687,#688);
#575=LINE('',#689,#690);
#576=VERTEX_POINT('',#691);
#577=CIRCLE('',#692,17.5);
#578=LINE('',#693,#694);
#579=VERTEX_POINT('',#695);
#580=LINE('',#696,#697);
#581=LINE('',#698,#699);
#582=CIRCLE('',#700,4.0);
#583=VERTEX_POINT('',#701);
#584=CIRCLE('',#702,1.7);
#585=VERTEX_POINT('',#703);
#586=CIRCLE('',#704,1.7);
#587=VERTEX_POINT('',#705);
#588=CIRCLE('',#706,1.7);
#589=VERTEX_POINT('',#707);
#590=CIRCLE('',#708,17.7);
#591=VERTEX_POINT('',#709);
#592=CIRCLE('',#710,17.7);
#593=VERTEX_POINT('',#711);
#594=CIRCLE('',#712,17.7);
#595=VERTEX_POINT('',#713);
#596=CIRCLE('',#714,17.7);
#597=VERTEX_POINT('',#715);
#598=CIRCLE('',#716,17.7);
#599=VERTEX_POINT('',#717);
#600=CIRCLE('',#718,17.7);
#601=VERTEX_POINT('',#719);
#602=CIRCLE('',#720,17.7);
#603=VERTEX_POINT('',#721);
#604=CIRCLE('',#722,17.7);
#605=VERTEX_POINT('',#723);
#606=CIRCLE('',#724,1.7);
#607=VERTEX_POINT('',#725);
#608=CIRCLE('',#726,1.7);
#609=VERTEX_POINT('',#727);
#610=CIRCLE('',#728,1.7);
#611=CARTESIAN_POINT('',(-32.5,-74.5,-35.0));
#612=CARTESIAN_POINT('',(-36.5,-70.5,-35.0));
#613=AXIS2_PLACEMENT_3D('',#729,#730,#731);
#614=CARTESIAN_POINT('',(-32.5,-74.5,-31.0));
#615=CARTESIAN_POINT('',(-32.5,-74.5,-31.0));
#616=VECTOR('',#732,1.0);
#617=CARTESIAN_POINT('',(-36.5,-70.5,-31.0));
#618=AXIS2_PLACEMENT_3D('',#733,#734,#735);
#619=CARTESIAN_POINT('',(-36.5,-70.5,-31.0));
#620=VECTOR('',#736,1.0);
#621=CARTESIAN_POINT('',(-3.50999999869516,-70.5,-31.0));
#622=AXIS2_PLACEMENT_3D('',#737,#738,#739);
#623=CARTESIAN_POINT('',(11.49,-7.0,-31.0));
#624=AXIS2_PLACEMENT_3D('',#740,#741,#742);
#625=CARTESIAN_POINT('',(-18.5100000000011,-7.0,-31.0));
#626=AXIS2_PLACEMENT_3D('',#743,#744,#745);
#627=CARTESIAN_POINT('',(-36.5,-54.9714052096562,-31.0));
#628=CARTESIAN_POINT('',(-36.5,-64.7357026048281,-31.0));
#629=VECTOR('',#746,1.0);
#630=CARTESIAN_POINT('',(32.5,-74.5,-31.0));
#631=CARTESIAN_POINT('',(7.50565140612555E-17,-74.5,-31.0));
#632=VECTOR('',#747,1.0);
#633=CARTESIAN_POINT('',(36.5,-70.5,-31.0));
#634=AXIS2_PLACEMENT_3D('',#748,#749,#750);
#635=CARTESIAN_POINT('',(36.5,-54.9714052096562,-31.0));
#636=CARTESIAN_POINT('',(36.5,-64.7357026048281,-31.0));
#637=VECTOR('',#751,1.0);
#638=CARTESIAN_POINT('',(20.0,-37.5,-31.0));
#639=AXIS2_PLACEMENT_3D('',#752,#753,#754);
#640=CARTESIAN_POINT('',(20.0,25.5,-31.0));
#641=CARTESIAN_POINT('',(20.0,-4.0,-31.0));
#642=VECTOR('',#755,1.0);
#643=CARTESIAN_POINT('',(16.0,29.5,-31.0));
#644=AXIS2_PLACEMENT_3D('',#756,#757,#758);
#645=CARTESIAN_POINT('',(-16.0,29.5,-31.0));
#646=CARTESIAN_POINT('',(-3.32005560982428E-15,29.5,-31.0));
#647=VECTOR('',#759,1.0);
#648=CARTESIAN_POINT('',(-20.0,25.5,-31.0));
#649=AXIS2_PLACEMENT_3D('',#760,#761,#762);
#650=CARTESIAN_POINT('',(-20.0,-37.5,-31.0));
#651=CARTESIAN_POINT('',(-20.0,-4.0,-31.0));
#652=VECTOR('',#763,1.0);
#653=AXIS2_PLACEMENT_3D('',#764,#765,#766);
#654=CARTESIAN_POINT('',(32.5,-74.5,-35.0));
#655=CARTESIAN_POINT('',(-4.17290697380553E-16,-74.5,-35.0));
#656=VECTOR('',#767,1.0);
#657=CARTESIAN_POINT('',(32.5,-74.5,-31.0));
#658=VECTOR('',#768,1.0);
#659=CARTESIAN_POINT('',(-36.5,-54.9714052096562,-35.0));
#660=CARTESIAN_POINT('',(-36.5,-64.7357026048281,-35.0));
#661=VECTOR('',#769,1.0);
#662=CARTESIAN_POINT('',(-36.5,-54.9714052096562,-31.0));
#663=VECTOR('',#770,1.0);
#664=CARTESIAN_POINT('',(-20.0,-37.5,-35.0));
#665=AXIS2_PLACEMENT_3D('',#771,#772,#773);
#666=CARTESIAN_POINT('',(-20.0,-37.5,-31.0));
#667=VECTOR('',#774,1.0);
#668=CARTESIAN_POINT('',(-20.0,25.5,-35.0));
#669=CARTESIAN_POINT('',(-20.0,-4.0,-35.0));
#670=VECTOR('',#775,1.0);
#671=CARTESIAN_POINT('',(-20.0,25.5,-31.0));
#672=VECTOR('',#776,1.0);
#673=CARTESIAN_POINT('',(-16.0,29.5,-35.0));
#674=AXIS2_PLACEMENT_3D('',#777,#778,#779);
#675=CARTESIAN_POINT('',(-16.0,29.5,-31.0));
#676=VECTOR('',#780,1.0);
#677=CARTESIAN_POINT('',(16.0,29.5,-35.0));
#678=CARTESIAN_POINT('',(-3.81240282126609E-15,29.5,-35.0));
#679=VECTOR('',#781,1.0);
#680=CARTESIAN_POINT('',(16.0,29.5,-31.0));
#681=VECTOR('',#782,1.0);
#682=CARTESIAN_POINT('',(20.0,25.5,-35.0));
#683=AXIS2_PLACEMENT_3D('',#783,#784,#785);
#684=CARTESIAN_POINT('',(20.0,25.5,-31.0));
#685=VECTOR('',#786,1.0);
#686=CARTESIAN_POINT('',(20.0,-37.5,-35.0));
#687=CARTESIAN_POINT('',(20.0,-4.0,-35.0));
#688=VECTOR('',#787,1.0);
#689=CARTESIAN_POINT('',(20.0,-37.5,-31.0));
#690=VECTOR('',#788,1.0);
#691=CARTESIAN_POINT('',(36.5,-54.9714052096562,-35.0));
#692=AXIS2_PLACEMENT_3D('',#789,#790,#791);
#693=CARTESIAN_POINT('',(36.5,-54.9714052096562,-31.0));
#694=VECTOR('',#792,1.0);
#695=CARTESIAN_POINT('',(36.5,-70.5,-35.0));
#696=CARTESIAN_POINT('',(36.5,-64.7357026048281,-35.0));
#697=VECTOR('',#793,1.0);
#698=CARTESIAN_POINT('',(36.5,-70.5,-31.0));
#699=VECTOR('',#794,1.0);
#700=AXIS2_PLACEMENT_3D('',#795,#796,#797);
#701=CARTESIAN_POINT('',(-1.69999999869515,-70.5,-35.0));
#702=AXIS2_PLACEMENT_3D('',#798,#799,#800);
#703=CARTESIAN_POINT('',(13.3,-7.0,-35.0));
#704=AXIS2_PLACEMENT_3D('',#801,#802,#803);
#705=CARTESIAN_POINT('',(-16.7000000000012,-7.0,-35.0));
#706=AXIS2_PLACEMENT_3D('',#804,#805,#806);
#707=CARTESIAN_POINT('',(-17.7,-25.0,-35.0));
#708=AXIS2_PLACEMENT_3D('',#807,#808,#809);
#709=CARTESIAN_POINT('',(-17.7,11.0,-35.0));
#710=AXIS2_PLACEMENT_3D('',#810,#811,#812);
#711=CARTESIAN_POINT('',(-35.7,-56.0,-35.0));
#712=AXIS2_PLACEMENT_3D('',#813,#814,#815);
#713=CARTESIAN_POINT('',(0.300000000000001,-56.0,-35.0));
#714=AXIS2_PLACEMENT_3D('',#816,#817,#818);
#715=CARTESIAN_POINT('',(0.300000000000001,-56.0,-34.0));
#716=AXIS2_PLACEMENT_3D('',#819,#820,#821);
#717=CARTESIAN_POINT('',(-17.7,-25.0,-34.0));
#718=AXIS2_PLACEMENT_3D('',#822,#823,#824);
#719=CARTESIAN_POINT('',(-35.7,-56.0,-34.0));
#720=AXIS2_PLACEMENT_3D('',#825,#826,#827);
#721=CARTESIAN_POINT('',(-17.7,11.0,-34.0));
#722=AXIS2_PLACEMENT_3D('',#828,#829,#830);
#723=CARTESIAN_POINT('',(-13.3000000000012,-7.0,-32.81));
#724=AXIS2_PLACEMENT_3D('',#831,#832,#833);
#725=CARTESIAN_POINT('',(16.7,-7.0,-32.81));
#726=AXIS2_PLACEMENT_3D('',#834,#835,#836);
#727=CARTESIAN_POINT('',(1.70000000130485,-70.5,-32.81));
#728=AXIS2_PLACEMENT_3D('',#837,#838,#839);
#729=CARTESIAN_POINT('',(-32.5,-70.5,-35.0));
#730=DIRECTION('',(-1.23086802860452E-16,2.45039432007627E-29,-1.0));
#731=DIRECTION('',(-1.0,0.0,1.23086802860452E-16));
#732=DIRECTION('',(-1.23086802860452E-16,2.45039432007627E-29,-1.0));
#733=CARTESIAN_POINT('',(-32.5,-70.5,-31.0));
#734=DIRECTION('',(-1.23086802860452E-16,2.45039432007627E-29,-1.0));
#735=DIRECTION('',(-1.0,0.0,1.23086802860452E-16));
#736=DIRECTION('',(-1.23086802860452E-16,2.45039432007627E-29,-1.0));
#737=CARTESIAN_POINT('',(1.30484520791597E-09,-70.5,-31.0));
#738=DIRECTION('',(-1.23086802860452E-16,2.45039432007628E-29,-1.0));
#739=DIRECTION('',(-1.0,0.0,1.23086802860452E-16));
#740=CARTESIAN_POINT('',(15.0,-7.0,-31.0));
#741=DIRECTION('',(-1.23086802860452E-16,2.45039432007628E-29,-1.0));
#742=DIRECTION('',(-1.0,0.0,1.23086802860452E-16));
#743=CARTESIAN_POINT('',(-15.0000000000011,-7.0,-31.0));
#744=DIRECTION('',(-1.23086802860452E-16,2.45039432007628E-29,-1.0));
#745=DIRECTION('',(-1.0,0.0,1.23086802860452E-16));
#746=DIRECTION('',(-6.12303176911189E-17,1.0,2.45114798448055E-29));
#747=DIRECTION('',(-1.0,0.0,1.23086802860452E-16));
#748=CARTESIAN_POINT('',(32.5,-70.5,-31.0));
#749=DIRECTION('',(-1.23086802860452E-16,2.45039432007627E-29,-1.0));
#750=DIRECTION('',(-1.0,0.0,1.23086802860452E-16));
#751=DIRECTION('',(-6.12303176911189E-17,-1.0,-2.449640655672E-29));
#752=CARTESIAN_POINT('',(19.0,-54.9714052096562,-31.0));
#753=DIRECTION('',(-1.23086802860452E-16,2.45039432007627E-29,-1.0));
#754=DIRECTION('',(-1.0,0.0,1.23086802860452E-16));
#755=DIRECTION('',(-6.12303176911189E-17,-1.0,-2.449640655672E-29));
#756=CARTESIAN_POINT('',(16.0,25.5,-31.0));
#757=DIRECTION('',(-1.23086802860452E-16,2.45039432007627E-29,-1.0));
#758=DIRECTION('',(-1.0,0.0,1.23086802860452E-16));
#759=DIRECTION('',(1.0,-1.22460635382238E-16,-1.23086802860452E-16));
#760=CARTESIAN_POINT('',(-16.0,25.5,-31.0));
#761=DIRECTION('',(-1.23086802860452E-16,2.45039432007627E-29,-1.0));
#762=DIRECTION('',(-1.0,0.0,1.23086802860452E-16));
#763=DIRECTION('',(-6.12303176911189E-17,1.0,2.45114798448055E-29));
#764=CARTESIAN_POINT('',(-19.0,-54.9714052096562,-31.0));
#765=DIRECTION('',(-1.23086802860452E-16,2.45039432007627E-29,-1.0));
#766=DIRECTION('',(-1.0,0.0,1.23086802860452E-16));
#767=DIRECTION('',(-1.0,0.0,1.23086802860452E-16));
#768=DIRECTION('',(-1.23086802860452E-16,2.45039432007627E-29,-1.0));
#769=DIRECTION('',(-6.12303176911189E-17,1.0,2.45114798448055E-29));
#770=DIRECTION('',(-1.23086802860452E-16,2.45039432007627E-29,-1.0));
#771=CARTESIAN_POINT('',(-19.0,-54.9714052096562,-35.0));
#772=DIRECTION('',(-1.23086802860452E-16,2.45039432007627E-29,-1.0));
#773=DIRECTION('',(-1.0,0.0,1.23086802860452E-16));
#774=DIRECTION('',(-1.23086802860452E-16,2.45039432007627E-29,-1.0));
#775=DIRECTION('',(-6.12303176911189E-17,1.0,2.45114798448055E-29));
#776=DIRECTION('',(-1.23086802860452E-16,2.45039432007627E-29,-1.0));
#777=CARTESIAN_POINT('',(-16.0,25.5,-35.0));
#778=DIRECTION('',(-1.23086802860452E-16,2.45039432007627E-29,-1.0));
#779=DIRECTION('',(-1.0,0.0,1.23086802860452E-16));
#780=DIRECTION('',(-1.23086802860452E-16,2.45039432007627E-29,-1.0));
#781=DIRECTION('',(1.0,-1.22460635382238E-16,-1.23086802860452E-16));
#782=DIRECTION('',(-1.23086802860452E-16,2.45039432007627E-29,-1.0));
#783=CARTESIAN_POINT('',(16.0,25.5,-35.0));
#784=DIRECTION('',(-1.23086802860452E-16,2.45039432007627E-29,-1.0));
#785=DIRECTION('',(-1.0,0.0,1.23086802860452E-16));
#786=DIRECTION('',(-1.23086802860452E-16,2.45039432007627E-29,-1.0));
#787=DIRECTION('',(-6.12303176911189E-17,-1.0,-2.449640655672E-29));
#788=DIRECTION('',(-1.23086802860452E-16,2.45039432007627E-29,-1.0));
#789=CARTESIAN_POINT('',(19.0,-54.9714052096562,-35.0));
#790=DIRECTION('',(-1.23086802860452E-16,2.45039432007627E-29,-1.0));
#791=DIRECTION('',(-1.0,0.0,1.23086802860452E-16));
#792=DIRECTION('',(-1.23086802860452E-16,2.45039432007627E-29,-1.0));
#793=DIRECTION('',(-6.12303176911189E-17,-1.0,-2.449640655672E-29));
#794=DIRECTION('',(-1.23086802860452E-16,2.45039432007627E-29,-1.0));
#795=CARTESIAN_POINT('',(32.5,-70.5,-35.0));
#796=DIRECTION('',(-1.23086802860452E-16,2.45039432007627E-29,-1.0));
#797=DIRECTION('',(-1.0,0.0,1.23086802860452E-16));
#798=CARTESIAN_POINT('',(1.30484563995065E-09,-70.5,-35.0));
#799=DIRECTION('',(-1.23086802860452E-16,2.45039432007627E-29,-1.0));
#800=DIRECTION('',(-1.0,0.0,1.23086802860452E-16));
#801=CARTESIAN_POINT('',(15.0,-7.0,-35.0));
#802=DIRECTION('',(-1.23086802860452E-16,2.45039432007627E-29,-1.0));
#803=DIRECTION('',(-1.0,0.0,1.23086802860452E-16));
#804=CARTESIAN_POINT('',(-15.0000000000011,-7.0,-35.0));
#805=DIRECTION('',(-1.23086802860452E-16,2.45039432007627E-29,-1.0));
#806=DIRECTION('',(-1.0,0.0,1.23086802860452E-16));
#807=CARTESIAN_POINT('',(-3.46944695195361E-15,-25.0,-35.0));
#808=DIRECTION('',(-1.23086802860452E-16,2.45039432007627E-29,-1.0));
#809=DIRECTION('',(-1.0,0.0,1.23086802860452E-16));
#810=CARTESIAN_POINT('',(-3.46944695195361E-15,11.0,-35.0));
#811=DIRECTION('',(-1.23086802860452E-16,2.45039432007627E-29,-1.0));
#812=DIRECTION('',(-1.0,0.0,1.23086802860452E-16));
#813=CARTESIAN_POINT('',(-18.0,-56.0,-35.0));
#814=DIRECTION('',(-1.23086802860452E-16,2.45039432007627E-29,-1.0));
#815=DIRECTION('',(-1.0,0.0,1.23086802860452E-16));
#816=CARTESIAN_POINT('',(18.0,-56.0,-35.0));
#817=DIRECTION('',(-1.23086802860452E-16,2.45039432007627E-29,-1.0));
#818=DIRECTION('',(-1.0,0.0,1.23086802860452E-16));
#819=CARTESIAN_POINT('',(18.0,-56.0,-34.0));
#820=DIRECTION('',(-1.23086802860452E-16,2.45039432007627E-29,-1.0));
#821=DIRECTION('',(-1.0,0.0,1.23086802860452E-16));
#822=CARTESIAN_POINT('',(-3.34636014909316E-15,-25.0,-34.0));
#823=DIRECTION('',(-1.23086802860452E-16,2.45039432007627E-29,-1.0));
#824=DIRECTION('',(-1.0,0.0,1.23086802860452E-16));
#825=CARTESIAN_POINT('',(-18.0,-56.0,-34.0));
#826=DIRECTION('',(-1.23086802860452E-16,2.45039432007627E-29,-1.0));
#827=DIRECTION('',(-1.0,0.0,1.23086802860452E-16));
#828=CARTESIAN_POINT('',(-3.34636014909316E-15,11.0,-34.0));
#829=DIRECTION('',(-1.23086802860452E-16,2.45039432007627E-29,-1.0));
#830=DIRECTION('',(-1.0,0.0,1.23086802860452E-16));
#831=CARTESIAN_POINT('',(-15.0000000000011,-7.0,-32.81));
#832=DIRECTION('',(0.0,0.0,1.0));
#833=DIRECTION('',(1.0,0.0,0.0));
#834=CARTESIAN_POINT('',(15.0,-7.0,-32.81));
#835=DIRECTION('',(0.0,0.0,1.0));
#836=DIRECTION('',(1.0,0.0,0.0));
#837=CARTESIAN_POINT('',(1.30484563995065E-09,-70.5,-32.81));
#838=DIRECTION('',(0.0,0.0,1.0));
#839=DIRECTION('',(1.0,0.0,0.0));
ENDSEC;
END-ISO-10303-21;
