ISO-10303-21;
HEADER;
FILE_DESCRIPTION(('STEP AP203'),'1');
FILE_NAME('lo Flat.stp','2022-08-30T19:00:07',(' '),(' '),'Spatial InterOp 3D',' ',' ');
FILE_SCHEMA(('CONFIG_CONTROL_DESIGN'));
ENDSEC;
DATA;
#1=DESIGN_CONTEXT('',#33,'design');
#2=APPLICATION_PROTOCOL_DEFINITION('INTERNATIONAL STANDARD','config_control_design',1994,#33);
#3=PRODUCT_CATEGORY_RELATIONSHIP('NONE','NONE',#34,#35);
#4=DATE_AND_TIME(#36,#37);
#5=DATE_TIME_ROLE('creation_date');
#6=DATE_TIME_ROLE('classification_date');
#7=PERSON_AND_ORGANIZATION_ROLE('creator');
#8=PERSON_AND_ORGANIZATION_ROLE('design_supplier');
#9=PERSON_AND_ORGANIZATION_ROLE('classification_officer');
#10=PERSON_AND_ORGANIZATION_ROLE('design_owner');
#11=APPROVAL_PERSON_ORGANIZATION(#38,#39,#40);
#12=APPROVAL_DATE_TIME(#4,#39);
#13=CC_DESIGN_APPROVAL(#39,(#41,#42,#43));
#14=CC_DESIGN_DATE_AND_TIME_ASSIGNMENT(#4,#5,(#43));
#15=CC_DESIGN_DATE_AND_TIME_ASSIGNMENT(#4,#6,(#41));
#16=CC_DESIGN_PERSON_AND_ORGANIZATION_ASSIGNMENT(#38,#10,(#44));
#17=CC_DESIGN_PERSON_AND_ORGANIZATION_ASSIGNMENT(#38,#7,(#43));
#18=CC_DESIGN_PERSON_AND_ORGANIZATION_ASSIGNMENT(#38,#7,(#42));
#19=CC_DESIGN_PERSON_AND_ORGANIZATION_ASSIGNMENT(#38,#8,(#42));
#20=CC_DESIGN_SECURITY_CLASSIFICATION(#41,(#42));
#21=CC_DESIGN_PERSON_AND_ORGANIZATION_ASSIGNMENT(#38,#9,(#41));
#22=SHAPE_DEFINITION_REPRESENTATION(#45,#46);
#23= (GEOMETRIC_REPRESENTATION_CONTEXT(3)GLOBAL_UNCERTAINTY_ASSIGNED_CONTEXT((#49))GLOBAL_UNIT_ASSIGNED_CONTEXT((#51,#52,#53))REPRESENTATION_CONTEXT('NONE','WORKSPACE'));
#24=PROPERTY_DEFINITION_REPRESENTATION(#55,#56);
#25=GENERAL_PROPERTY_ASSOCIATION('','',#57,#55);
#26=PROPERTY_DEFINITION_REPRESENTATION(#58,#59);
#27=GENERAL_PROPERTY_ASSOCIATION('','',#60,#58);
#28=PROPERTY_DEFINITION_REPRESENTATION(#61,#62);
#29=GENERAL_PROPERTY_ASSOCIATION('','',#63,#61);
#33=APPLICATION_CONTEXT('CONFIGURATION CONTROLLED 3D DESIGNS OF MECHANICAL PARTS AND ASSEMBLIES');
#34=PRODUCT_CATEGORY('part','NONE');
#35=PRODUCT_RELATED_PRODUCT_CATEGORY('detail',' ',(#44));
#36=CALENDAR_DATE(2022,30,7);
#37=LOCAL_TIME(16,0,7.0,#64);
#38=PERSON_AND_ORGANIZATION(#65,#66);
#39=APPROVAL(#67,'SOLID MODEL');
#40=APPROVAL_ROLE('APPROVED');
#41=SECURITY_CLASSIFICATION('','',#68);
#42=PRODUCT_DEFINITION_FORMATION_WITH_SPECIFIED_SOURCE('A','NONE',#44,.NOT_KNOWN.);
#43=PRODUCT_DEFINITION('','NONE',#42,#1);
#44=PRODUCT('\X2\00CA\X0\mbolo Flat','','1',(#69));
#45=PRODUCT_DEFINITION_SHAPE('NONE','NONE',#43);
#46=ADVANCED_BREP_SHAPE_REPRESENTATION('1',(#70,#71),#23);
#49=UNCERTAINTY_MEASURE_WITH_UNIT(LENGTH_MEASURE(0.001),#51,'','');
#51= (CONVERSION_BASED_UNIT('MILLIMETRE',#74)LENGTH_UNIT()NAMED_UNIT(#77));
#52= (NAMED_UNIT(#79)PLANE_ANGLE_UNIT()SI_UNIT($,.RADIAN.));
#53= (NAMED_UNIT(#79)SOLID_ANGLE_UNIT()SI_UNIT($,.STERADIAN.));
#55=PROPERTY_DEFINITION('PdmObjectId','',#43);
#56=REPRESENTATION('',(#85),#23);
#57=GENERAL_PROPERTY('','19_2d33aa80-3400-4df2-88c1-bd50ab977ea6&2_65_0_70','');
#58=PROPERTY_DEFINITION('CreationDate','',#43);
#59=REPRESENTATION('',(#86),#23);
#60=GENERAL_PROPERTY('','31/03/2022 19:55:39','');
#61=PROPERTY_DEFINITION('Minor Revision','',#43);
#62=REPRESENTATION('',(#87),#23);
#63=GENERAL_PROPERTY('','14','');
#64=COORDINATED_UNIVERSAL_TIME_OFFSET(3,0,.BEHIND.);
#65=PERSON('','UNSPECIFIED',$,$,$,$);
#66=ORGANIZATION('UNSPECIFIED','UNSPECIFIED','UNSPECIFIED');
#67=APPROVAL_STATUS('approved');
#68=SECURITY_CLASSIFICATION_LEVEL('unclassified');
#69=MECHANICAL_CONTEXT('',#33,'mechanical');
#70=MANIFOLD_SOLID_BREP('1',#88);
#71=AXIS2_PLACEMENT_3D('',#89,#90,#91);
#74=LENGTH_MEASURE_WITH_UNIT(LENGTH_MEASURE(1.0),#92);
#77=DIMENSIONAL_EXPONENTS(1.0,0.0,0.0,0.0,0.0,0.0,0.0);
#79=DIMENSIONAL_EXPONENTS(0.0,0.0,0.0,0.0,0.0,0.0,0.0);
#85=VALUE_REPRESENTATION_ITEM('19_2d33aa80-3400-4df2-88c1-bd50ab977ea6&2_65_0_70',);
#86=VALUE_REPRESENTATION_ITEM('31/03/2022 19:55:39',);
#87=VALUE_REPRESENTATION_ITEM('14',);
#88=CLOSED_SHELL('',(#93,#94,#95,#96,#97,#98,#99,#100,#101,#102,#103,#104,#105,#106,#107,#108,#109,#110,#111,#112,#113,#114,#115,#116,#117,#118,#119,#120,#121,#122));
#89=CARTESIAN_POINT('',(0.0,0.0,0.0));
#90=DIRECTION('',(0.0,0.0,1.0));
#91=DIRECTION('',(1.0,0.0,0.0));
#92= (NAMED_UNIT(#77)LENGTH_UNIT()SI_UNIT(.MILLI.,.METRE.));
#93=ADVANCED_FACE('',(#124),#125,.F.);
#94=ADVANCED_FACE('',(#126),#127,.T.);
#95=ADVANCED_FACE('',(#128),#129,.T.);
#96=ADVANCED_FACE('',(#130),#131,.F.);
#97=ADVANCED_FACE('',(#132),#133,.T.);
#98=ADVANCED_FACE('',(#134),#135,.T.);
#99=ADVANCED_FACE('',(#136),#137,.T.);
#100=ADVANCED_FACE('',(#138),#139,.T.);
#101=ADVANCED_FACE('',(#140,#141,#142),#143,.T.);
#102=ADVANCED_FACE('',(#144),#145,.F.);
#103=ADVANCED_FACE('',(#146),#147,.T.);
#104=ADVANCED_FACE('',(#148),#149,.T.);
#105=ADVANCED_FACE('',(#150),#151,.T.);
#106=ADVANCED_FACE('',(#152,#153,#154),#155,.T.);
#107=ADVANCED_FACE('',(#156),#157,.F.);
#108=ADVANCED_FACE('',(#158),#159,.T.);
#109=ADVANCED_FACE('',(#160,#161),#162,.F.);
#110=ADVANCED_FACE('',(#163,#164),#165,.F.);
#111=ADVANCED_FACE('',(#166),#167,.F.);
#112=ADVANCED_FACE('',(#168),#169,.T.);
#113=ADVANCED_FACE('',(#170,#171,#172),#173,.T.);
#114=ADVANCED_FACE('',(#174),#175,.T.);
#115=ADVANCED_FACE('',(#176,#177,#178),#179,.T.);
#116=ADVANCED_FACE('',(#180,#181),#182,.F.);
#117=ADVANCED_FACE('',(#183,#184),#185,.F.);
#118=ADVANCED_FACE('',(#186,#187),#188,.F.);
#119=ADVANCED_FACE('',(#189,#190),#191,.F.);
#120=ADVANCED_FACE('',(#192,#193),#194,.F.);
#121=ADVANCED_FACE('',(#195,#196),#197,.F.);
#122=ADVANCED_FACE('',(#198),#199,.T.);
#124=FACE_OUTER_BOUND('',#200,.T.);
#125=CYLINDRICAL_SURFACE('',#201,0.5);
#126=FACE_OUTER_BOUND('',#202,.T.);
#127=PLANE('',#203);
#128=FACE_OUTER_BOUND('',#204,.T.);
#129=PLANE('',#205);
#130=FACE_OUTER_BOUND('',#206,.T.);
#131=PLANE('',#207);
#132=FACE_OUTER_BOUND('',#208,.T.);
#133=PLANE('',#209);
#134=FACE_OUTER_BOUND('',#210,.T.);
#135=PLANE('',#211);
#136=FACE_OUTER_BOUND('',#212,.T.);
#137=CYLINDRICAL_SURFACE('',#213,1.8);
#138=FACE_OUTER_BOUND('',#214,.T.);
#139=CYLINDRICAL_SURFACE('',#215,0.5);
#140=FACE_BOUND('',#216,.T.);
#141=FACE_BOUND('',#217,.T.);
#142=FACE_OUTER_BOUND('',#218,.T.);
#143=PLANE('',#219);
#144=FACE_OUTER_BOUND('',#220,.T.);
#145=CYLINDRICAL_SURFACE('',#221,0.5);
#146=FACE_OUTER_BOUND('',#222,.T.);
#147=PLANE('',#223);
#148=FACE_OUTER_BOUND('',#224,.T.);
#149=CYLINDRICAL_SURFACE('',#225,0.5);
#150=FACE_OUTER_BOUND('',#226,.T.);
#151=PLANE('',#227);
#152=FACE_BOUND('',#228,.T.);
#153=FACE_BOUND('',#229,.T.);
#154=FACE_OUTER_BOUND('',#230,.T.);
#155=PLANE('',#231);
#156=FACE_OUTER_BOUND('',#232,.T.);
#157=CYLINDRICAL_SURFACE('',#233,0.5);
#158=FACE_OUTER_BOUND('',#234,.T.);
#159=PLANE('',#235);
#160=FACE_OUTER_BOUND('',#236,.T.);
#161=FACE_OUTER_BOUND('',#237,.T.);
#162=CYLINDRICAL_SURFACE('',#238,1.25);
#163=FACE_OUTER_BOUND('',#239,.T.);
#164=FACE_OUTER_BOUND('',#240,.T.);
#165=CYLINDRICAL_SURFACE('',#241,1.25);
#166=FACE_OUTER_BOUND('',#242,.T.);
#167=CYLINDRICAL_SURFACE('',#243,0.5);
#168=FACE_OUTER_BOUND('',#244,.T.);
#169=CYLINDRICAL_SURFACE('',#245,0.5);
#170=FACE_BOUND('',#246,.T.);
#171=FACE_BOUND('',#247,.T.);
#172=FACE_OUTER_BOUND('',#248,.T.);
#173=PLANE('',#249);
#174=FACE_OUTER_BOUND('',#250,.T.);
#175=CYLINDRICAL_SURFACE('',#251,1.8);
#176=FACE_BOUND('',#252,.T.);
#177=FACE_BOUND('',#253,.T.);
#178=FACE_OUTER_BOUND('',#254,.T.);
#179=PLANE('',#255);
#180=FACE_OUTER_BOUND('',#256,.T.);
#181=FACE_OUTER_BOUND('',#257,.T.);
#182=CYLINDRICAL_SURFACE('',#258,1.25);
#183=FACE_OUTER_BOUND('',#259,.T.);
#184=FACE_OUTER_BOUND('',#260,.T.);
#185=CYLINDRICAL_SURFACE('',#261,1.25);
#186=FACE_OUTER_BOUND('',#262,.T.);
#187=FACE_OUTER_BOUND('',#263,.T.);
#188=CYLINDRICAL_SURFACE('',#264,1.25);
#189=FACE_OUTER_BOUND('',#265,.T.);
#190=FACE_OUTER_BOUND('',#266,.T.);
#191=CYLINDRICAL_SURFACE('',#267,1.25);
#192=FACE_OUTER_BOUND('',#268,.T.);
#193=FACE_OUTER_BOUND('',#269,.T.);
#194=CYLINDRICAL_SURFACE('',#270,1.25);
#195=FACE_OUTER_BOUND('',#271,.T.);
#196=FACE_OUTER_BOUND('',#272,.T.);
#197=CYLINDRICAL_SURFACE('',#273,1.25);
#198=FACE_OUTER_BOUND('',#274,.T.);
#199=CYLINDRICAL_SURFACE('',#275,0.5);
#200=EDGE_LOOP('',(#276,#277,#278,#279));
#201=AXIS2_PLACEMENT_3D('',#280,#281,#282);
#202=EDGE_LOOP('',(#283,#284,#285,#286));
#203=AXIS2_PLACEMENT_3D('',#287,#288,#289);
#204=EDGE_LOOP('',(#290,#291,#292,#293));
#205=AXIS2_PLACEMENT_3D('',#294,#295,#296);
#206=EDGE_LOOP('',(#297,#298,#299,#300,#301,#302,#303,#304,#305,#306,#307,#308,#309,#310,#311,#312,#313,#314,#315,#316));
#207=AXIS2_PLACEMENT_3D('',#317,#318,#319);
#208=EDGE_LOOP('',(#320,#321,#322,#323,#324,#325,#326,#327,#328,#329,#330,#331,#332,#333,#334,#335,#336,#337,#338,#339));
#209=AXIS2_PLACEMENT_3D('',#340,#341,#342);
#210=EDGE_LOOP('',(#343,#344,#345,#346));
#211=AXIS2_PLACEMENT_3D('',#347,#348,#349);
#212=EDGE_LOOP('',(#350,#351,#352,#353));
#213=AXIS2_PLACEMENT_3D('',#354,#355,#356);
#214=EDGE_LOOP('',(#357,#358,#359,#360));
#215=AXIS2_PLACEMENT_3D('',#361,#362,#363);
#216=EDGE_LOOP('',(#364));
#217=EDGE_LOOP('',(#365));
#218=EDGE_LOOP('',(#366,#367,#368,#369));
#219=AXIS2_PLACEMENT_3D('',#370,#371,#372);
#220=EDGE_LOOP('',(#373,#374,#375,#376));
#221=AXIS2_PLACEMENT_3D('',#377,#378,#379);
#222=EDGE_LOOP('',(#380,#381,#382,#383));
#223=AXIS2_PLACEMENT_3D('',#384,#385,#386);
#224=EDGE_LOOP('',(#387,#388,#389,#390));
#225=AXIS2_PLACEMENT_3D('',#391,#392,#393);
#226=EDGE_LOOP('',(#394,#395,#396,#397));
#227=AXIS2_PLACEMENT_3D('',#398,#399,#400);
#228=EDGE_LOOP('',(#401));
#229=EDGE_LOOP('',(#402));
#230=EDGE_LOOP('',(#403,#404,#405,#406));
#231=AXIS2_PLACEMENT_3D('',#407,#408,#409);
#232=EDGE_LOOP('',(#410,#411,#412,#413));
#233=AXIS2_PLACEMENT_3D('',#414,#415,#416);
#234=EDGE_LOOP('',(#417,#418,#419,#420));
#235=AXIS2_PLACEMENT_3D('',#421,#422,#423);
#236=EDGE_LOOP('',(#424));
#237=EDGE_LOOP('',(#425));
#238=AXIS2_PLACEMENT_3D('',#426,#427,#428);
#239=EDGE_LOOP('',(#429));
#240=EDGE_LOOP('',(#430));
#241=AXIS2_PLACEMENT_3D('',#431,#432,#433);
#242=EDGE_LOOP('',(#434,#435,#436,#437));
#243=AXIS2_PLACEMENT_3D('',#438,#439,#440);
#244=EDGE_LOOP('',(#441,#442,#443,#444));
#245=AXIS2_PLACEMENT_3D('',#445,#446,#447);
#246=EDGE_LOOP('',(#448));
#247=EDGE_LOOP('',(#449));
#248=EDGE_LOOP('',(#450,#451,#452,#453));
#249=AXIS2_PLACEMENT_3D('',#454,#455,#456);
#250=EDGE_LOOP('',(#457,#458,#459,#460));
#251=AXIS2_PLACEMENT_3D('',#461,#462,#463);
#252=EDGE_LOOP('',(#464));
#253=EDGE_LOOP('',(#465));
#254=EDGE_LOOP('',(#466,#467,#468,#469));
#255=AXIS2_PLACEMENT_3D('',#470,#471,#472);
#256=EDGE_LOOP('',(#473));
#257=EDGE_LOOP('',(#474));
#258=AXIS2_PLACEMENT_3D('',#475,#476,#477);
#259=EDGE_LOOP('',(#478));
#260=EDGE_LOOP('',(#479));
#261=AXIS2_PLACEMENT_3D('',#480,#481,#482);
#262=EDGE_LOOP('',(#483));
#263=EDGE_LOOP('',(#484));
#264=AXIS2_PLACEMENT_3D('',#485,#486,#487);
#265=EDGE_LOOP('',(#488));
#266=EDGE_LOOP('',(#489));
#267=AXIS2_PLACEMENT_3D('',#490,#491,#492);
#268=EDGE_LOOP('',(#493));
#269=EDGE_LOOP('',(#494));
#270=AXIS2_PLACEMENT_3D('',#495,#496,#497);
#271=EDGE_LOOP('',(#498));
#272=EDGE_LOOP('',(#499));
#273=AXIS2_PLACEMENT_3D('',#500,#501,#502);
#274=EDGE_LOOP('',(#503,#504,#505,#506));
#275=AXIS2_PLACEMENT_3D('',#507,#508,#509);
#276=ORIENTED_EDGE('',*,*,#510,.F.);
#277=ORIENTED_EDGE('',*,*,#511,.F.);
#278=ORIENTED_EDGE('',*,*,#512,.T.);
#279=ORIENTED_EDGE('',*,*,#513,.T.);
#280=CARTESIAN_POINT('',(-1.1,1.1,0.0));
#281=DIRECTION('',(0.0,0.0,1.0));
#282=DIRECTION('',(1.0,0.0,0.0));
#283=ORIENTED_EDGE('',*,*,#514,.F.);
#284=ORIENTED_EDGE('',*,*,#515,.F.);
#285=ORIENTED_EDGE('',*,*,#516,.T.);
#286=ORIENTED_EDGE('',*,*,#511,.T.);
#287=CARTESIAN_POINT('',(-1.6,0.6,0.0));
#288=DIRECTION('',(-0.0,1.0,0.0));
#289=DIRECTION('',(1.0,0.0,0.0));
#290=ORIENTED_EDGE('',*,*,#517,.F.);
#291=ORIENTED_EDGE('',*,*,#513,.F.);
#292=ORIENTED_EDGE('',*,*,#518,.T.);
#293=ORIENTED_EDGE('',*,*,#519,.T.);
#294=CARTESIAN_POINT('',(-1.6,0.6,0.0));
#295=DIRECTION('',(1.0,6.12303176911189E-17,0.0));
#296=DIRECTION('',(-6.12303176911189E-17,1.0,0.0));
#297=ORIENTED_EDGE('',*,*,#520,.F.);
#298=ORIENTED_EDGE('',*,*,#521,.F.);
#299=ORIENTED_EDGE('',*,*,#522,.F.);
#300=ORIENTED_EDGE('',*,*,#523,.F.);
#301=ORIENTED_EDGE('',*,*,#524,.F.);
#302=ORIENTED_EDGE('',*,*,#525,.F.);
#303=ORIENTED_EDGE('',*,*,#518,.F.);
#304=ORIENTED_EDGE('',*,*,#512,.F.);
#305=ORIENTED_EDGE('',*,*,#516,.F.);
#306=ORIENTED_EDGE('',*,*,#526,.F.);
#307=ORIENTED_EDGE('',*,*,#527,.F.);
#308=ORIENTED_EDGE('',*,*,#528,.F.);
#309=ORIENTED_EDGE('',*,*,#529,.F.);
#310=ORIENTED_EDGE('',*,*,#530,.F.);
#311=ORIENTED_EDGE('',*,*,#531,.F.);
#312=ORIENTED_EDGE('',*,*,#532,.F.);
#313=ORIENTED_EDGE('',*,*,#533,.F.);
#314=ORIENTED_EDGE('',*,*,#534,.F.);
#315=ORIENTED_EDGE('',*,*,#535,.F.);
#316=ORIENTED_EDGE('',*,*,#536,.F.);
#317=CARTESIAN_POINT('',(-1.1,-1.1,0.0));
#318=DIRECTION('',(0.0,0.0,1.0));
#319=DIRECTION('',(1.0,0.0,0.0));
#320=ORIENTED_EDGE('',*,*,#537,.T.);
#321=ORIENTED_EDGE('',*,*,#538,.T.);
#322=ORIENTED_EDGE('',*,*,#539,.T.);
#323=ORIENTED_EDGE('',*,*,#540,.T.);
#324=ORIENTED_EDGE('',*,*,#541,.T.);
#325=ORIENTED_EDGE('',*,*,#542,.T.);
#326=ORIENTED_EDGE('',*,*,#543,.T.);
#327=ORIENTED_EDGE('',*,*,#544,.T.);
#328=ORIENTED_EDGE('',*,*,#545,.T.);
#329=ORIENTED_EDGE('',*,*,#546,.T.);
#330=ORIENTED_EDGE('',*,*,#547,.T.);
#331=ORIENTED_EDGE('',*,*,#548,.T.);
#332=ORIENTED_EDGE('',*,*,#514,.T.);
#333=ORIENTED_EDGE('',*,*,#510,.T.);
#334=ORIENTED_EDGE('',*,*,#517,.T.);
#335=ORIENTED_EDGE('',*,*,#549,.T.);
#336=ORIENTED_EDGE('',*,*,#550,.T.);
#337=ORIENTED_EDGE('',*,*,#551,.T.);
#338=ORIENTED_EDGE('',*,*,#552,.T.);
#339=ORIENTED_EDGE('',*,*,#553,.T.);
#340=CARTESIAN_POINT('',(-1.1,-1.1,66.0));
#341=DIRECTION('',(0.0,0.0,1.0));
#342=DIRECTION('',(1.0,0.0,0.0));
#343=ORIENTED_EDGE('',*,*,#539,.F.);
#344=ORIENTED_EDGE('',*,*,#554,.F.);
#345=ORIENTED_EDGE('',*,*,#535,.T.);
#346=ORIENTED_EDGE('',*,*,#555,.T.);
#347=CARTESIAN_POINT('',(1.6,-0.6,0.0));
#348=DIRECTION('',(0.0,-1.0,0.0));
#349=DIRECTION('',(0.0,0.0,-1.0));
#350=ORIENTED_EDGE('',*,*,#544,.F.);
#351=ORIENTED_EDGE('',*,*,#556,.F.);
#352=ORIENTED_EDGE('',*,*,#530,.T.);
#353=ORIENTED_EDGE('',*,*,#557,.T.);
#354=CARTESIAN_POINT('',(18.0,-2.38790835578426E-17,0.0));
#355=DIRECTION('',(0.0,0.0,1.0));
#356=DIRECTION('',(1.0,0.0,0.0));
#357=ORIENTED_EDGE('',*,*,#546,.F.);
#358=ORIENTED_EDGE('',*,*,#558,.F.);
#359=ORIENTED_EDGE('',*,*,#528,.T.);
#360=ORIENTED_EDGE('',*,*,#559,.T.);
#361=CARTESIAN_POINT('',(2.1,1.3,0.0));
#362=DIRECTION('',(0.0,0.0,1.0));
#363=DIRECTION('',(1.0,0.0,0.0));
#364=ORIENTED_EDGE('',*,*,#560,.T.);
#365=ORIENTED_EDGE('',*,*,#561,.T.);
#366=ORIENTED_EDGE('',*,*,#550,.F.);
#367=ORIENTED_EDGE('',*,*,#562,.F.);
#368=ORIENTED_EDGE('',*,*,#524,.T.);
#369=ORIENTED_EDGE('',*,*,#563,.T.);
#370=CARTESIAN_POINT('',(-18.0,1.8,0.0));
#371=DIRECTION('',(-0.0,1.0,0.0));
#372=DIRECTION('',(1.0,0.0,0.0));
#373=ORIENTED_EDGE('',*,*,#548,.F.);
#374=ORIENTED_EDGE('',*,*,#564,.F.);
#375=ORIENTED_EDGE('',*,*,#526,.T.);
#376=ORIENTED_EDGE('',*,*,#515,.T.);
#377=CARTESIAN_POINT('',(1.1,1.1,0.0));
#378=DIRECTION('',(0.0,0.0,1.0));
#379=DIRECTION('',(1.0,0.0,0.0));
#380=ORIENTED_EDGE('',*,*,#547,.F.);
#381=ORIENTED_EDGE('',*,*,#559,.F.);
#382=ORIENTED_EDGE('',*,*,#527,.T.);
#383=ORIENTED_EDGE('',*,*,#564,.T.);
#384=CARTESIAN_POINT('',(1.6,1.8,0.0));
#385=DIRECTION('',(-1.0,6.12303176911189E-17,0.0));
#386=DIRECTION('',(0.0,0.0,1.0));
#387=ORIENTED_EDGE('',*,*,#553,.F.);
#388=ORIENTED_EDGE('',*,*,#565,.F.);
#389=ORIENTED_EDGE('',*,*,#521,.T.);
#390=ORIENTED_EDGE('',*,*,#566,.T.);
#391=CARTESIAN_POINT('',(-2.1,-1.3,0.0));
#392=DIRECTION('',(0.0,0.0,1.0));
#393=DIRECTION('',(1.0,0.0,0.0));
#394=ORIENTED_EDGE('',*,*,#541,.F.);
#395=ORIENTED_EDGE('',*,*,#567,.F.);
#396=ORIENTED_EDGE('',*,*,#533,.T.);
#397=ORIENTED_EDGE('',*,*,#568,.T.);
#398=CARTESIAN_POINT('',(1.6,-0.6,0.0));
#399=DIRECTION('',(-1.0,-6.12303176911189E-17,0.0));
#400=DIRECTION('',(-6.12303176911189E-17,1.0,0.0));
#401=ORIENTED_EDGE('',*,*,#569,.T.);
#402=ORIENTED_EDGE('',*,*,#570,.T.);
#403=ORIENTED_EDGE('',*,*,#543,.F.);
#404=ORIENTED_EDGE('',*,*,#571,.F.);
#405=ORIENTED_EDGE('',*,*,#531,.T.);
#406=ORIENTED_EDGE('',*,*,#556,.T.);
#407=CARTESIAN_POINT('',(18.0,-1.8,0.0));
#408=DIRECTION('',(1.22460635382238E-16,-1.0,0.0));
#409=DIRECTION('',(0.0,0.0,-1.0));
#410=ORIENTED_EDGE('',*,*,#538,.F.);
#411=ORIENTED_EDGE('',*,*,#572,.F.);
#412=ORIENTED_EDGE('',*,*,#536,.T.);
#413=ORIENTED_EDGE('',*,*,#554,.T.);
#414=CARTESIAN_POINT('',(-1.1,-1.1,0.0));
#415=DIRECTION('',(0.0,0.0,1.0));
#416=DIRECTION('',(1.0,0.0,0.0));
#417=ORIENTED_EDGE('',*,*,#537,.F.);
#418=ORIENTED_EDGE('',*,*,#566,.F.);
#419=ORIENTED_EDGE('',*,*,#520,.T.);
#420=ORIENTED_EDGE('',*,*,#572,.T.);
#421=CARTESIAN_POINT('',(-1.6,-1.8,0.0));
#422=DIRECTION('',(1.0,-6.12303176911189E-17,0.0));
#423=DIRECTION('',(-6.12303176911189E-17,-1.0,0.0));
#424=ORIENTED_EDGE('',*,*,#573,.F.);
#425=ORIENTED_EDGE('',*,*,#574,.F.);
#426=CARTESIAN_POINT('',(-15.5,-5.8,2.5));
#427=DIRECTION('',(-1.22460666803792E-16,1.0,-1.81591993849532E-24));
#428=DIRECTION('',(-1.0,-1.22460666803792E-16,6.42609522816374E-16));
#429=ORIENTED_EDGE('',*,*,#561,.F.);
#430=ORIENTED_EDGE('',*,*,#574,.T.);
#431=CARTESIAN_POINT('',(-15.5,-5.8,2.5));
#432=DIRECTION('',(-1.22460666803792E-16,1.0,-1.81591993849532E-24));
#433=DIRECTION('',(-1.0,-1.22460666803792E-16,6.42609522816374E-16));
#434=ORIENTED_EDGE('',*,*,#540,.F.);
#435=ORIENTED_EDGE('',*,*,#555,.F.);
#436=ORIENTED_EDGE('',*,*,#534,.T.);
#437=ORIENTED_EDGE('',*,*,#567,.T.);
#438=CARTESIAN_POINT('',(1.1,-1.1,0.0));
#439=DIRECTION('',(0.0,0.0,1.0));
#440=DIRECTION('',(1.0,0.0,0.0));
#441=ORIENTED_EDGE('',*,*,#542,.F.);
#442=ORIENTED_EDGE('',*,*,#568,.F.);
#443=ORIENTED_EDGE('',*,*,#532,.T.);
#444=ORIENTED_EDGE('',*,*,#571,.T.);
#445=CARTESIAN_POINT('',(2.1,-1.3,0.0));
#446=DIRECTION('',(0.0,0.0,1.0));
#447=DIRECTION('',(1.0,0.0,0.0));
#448=ORIENTED_EDGE('',*,*,#575,.T.);
#449=ORIENTED_EDGE('',*,*,#576,.T.);
#450=ORIENTED_EDGE('',*,*,#545,.F.);
#451=ORIENTED_EDGE('',*,*,#557,.F.);
#452=ORIENTED_EDGE('',*,*,#529,.T.);
#453=ORIENTED_EDGE('',*,*,#558,.T.);
#454=CARTESIAN_POINT('',(9.8,1.8,0.0));
#455=DIRECTION('',(-0.0,1.0,0.0));
#456=DIRECTION('',(1.0,0.0,0.0));
#457=ORIENTED_EDGE('',*,*,#551,.F.);
#458=ORIENTED_EDGE('',*,*,#563,.F.);
#459=ORIENTED_EDGE('',*,*,#523,.T.);
#460=ORIENTED_EDGE('',*,*,#577,.T.);
#461=CARTESIAN_POINT('',(-18.0,2.38790835578433E-17,0.0));
#462=DIRECTION('',(0.0,0.0,1.0));
#463=DIRECTION('',(1.0,0.0,0.0));
#464=ORIENTED_EDGE('',*,*,#578,.T.);
#465=ORIENTED_EDGE('',*,*,#573,.T.);
#466=ORIENTED_EDGE('',*,*,#552,.F.);
#467=ORIENTED_EDGE('',*,*,#577,.F.);
#468=ORIENTED_EDGE('',*,*,#522,.T.);
#469=ORIENTED_EDGE('',*,*,#565,.T.);
#470=CARTESIAN_POINT('',(-9.8,-1.8,0.0));
#471=DIRECTION('',(1.22460635382238E-16,-1.0,0.0));
#472=DIRECTION('',(0.0,0.0,-1.0));
#473=ORIENTED_EDGE('',*,*,#578,.F.);
#474=ORIENTED_EDGE('',*,*,#579,.F.);
#475=CARTESIAN_POINT('',(-3.5,-5.8,2.5));
#476=DIRECTION('',(-1.22460666803792E-16,1.0,-5.12464238870743E-24));
#477=DIRECTION('',(-1.0,-1.22460666803792E-16,6.42609522816373E-16));
#478=ORIENTED_EDGE('',*,*,#560,.F.);
#479=ORIENTED_EDGE('',*,*,#579,.T.);
#480=CARTESIAN_POINT('',(-3.5,-5.8,2.5));
#481=DIRECTION('',(-1.22460666803792E-16,1.0,-5.12464238870743E-24));
#482=DIRECTION('',(-1.0,-1.22460666803792E-16,6.42609522816373E-16));
#483=ORIENTED_EDGE('',*,*,#570,.F.);
#484=ORIENTED_EDGE('',*,*,#580,.F.);
#485=CARTESIAN_POINT('',(3.5,-5.8,2.5));
#486=DIRECTION('',(-1.22460666803792E-16,1.0,-5.12464238870743E-24));
#487=DIRECTION('',(-1.0,-1.22460666803792E-16,6.42609522816373E-16));
#488=ORIENTED_EDGE('',*,*,#576,.F.);
#489=ORIENTED_EDGE('',*,*,#580,.T.);
#490=CARTESIAN_POINT('',(3.5,-5.8,2.5));
#491=DIRECTION('',(-1.22460666803792E-16,1.0,-5.12464238870743E-24));
#492=DIRECTION('',(-1.0,-1.22460666803792E-16,6.42609522816373E-16));
#493=ORIENTED_EDGE('',*,*,#575,.F.);
#494=ORIENTED_EDGE('',*,*,#581,.T.);
#495=CARTESIAN_POINT('',(15.5,-5.8,2.5));
#496=DIRECTION('',(-1.22460666803792E-16,1.0,-5.12464238870743E-24));
#497=DIRECTION('',(-1.0,-1.22460666803792E-16,6.42609522816373E-16));
#498=ORIENTED_EDGE('',*,*,#569,.F.);
#499=ORIENTED_EDGE('',*,*,#581,.F.);
#500=CARTESIAN_POINT('',(15.5,-5.8,2.5));
#501=DIRECTION('',(-1.22460666803792E-16,1.0,-5.12464238870743E-24));
#502=DIRECTION('',(-1.0,-1.22460666803792E-16,6.42609522816373E-16));
#503=ORIENTED_EDGE('',*,*,#549,.F.);
#504=ORIENTED_EDGE('',*,*,#519,.F.);
#505=ORIENTED_EDGE('',*,*,#525,.T.);
#506=ORIENTED_EDGE('',*,*,#562,.T.);
#507=CARTESIAN_POINT('',(-2.1,1.3,0.0));
#508=DIRECTION('',(0.0,0.0,1.0));
#509=DIRECTION('',(1.0,0.0,0.0));
#510=EDGE_CURVE('',#582,#583,#584,.T.);
#511=EDGE_CURVE('',#585,#582,#586,.T.);
#512=EDGE_CURVE('',#585,#587,#588,.T.);
#513=EDGE_CURVE('',#587,#583,#589,.T.);
#514=EDGE_CURVE('',#590,#582,#591,.T.);
#515=EDGE_CURVE('',#592,#590,#593,.T.);
#516=EDGE_CURVE('',#592,#585,#594,.T.);
#517=EDGE_CURVE('',#583,#595,#596,.T.);
#518=EDGE_CURVE('',#587,#597,#598,.T.);
#519=EDGE_CURVE('',#597,#595,#599,.T.);
#520=EDGE_CURVE('',#600,#601,#602,.T.);
#521=EDGE_CURVE('',#603,#600,#604,.T.);
#522=EDGE_CURVE('',#605,#603,#606,.T.);
#523=EDGE_CURVE('',#607,#605,#608,.T.);
#524=EDGE_CURVE('',#609,#607,#610,.T.);
#525=EDGE_CURVE('',#597,#609,#611,.T.);
#526=EDGE_CURVE('',#612,#592,#613,.T.);
#527=EDGE_CURVE('',#614,#612,#615,.T.);
#528=EDGE_CURVE('',#616,#614,#617,.T.);
#529=EDGE_CURVE('',#618,#616,#619,.T.);
#530=EDGE_CURVE('',#620,#618,#621,.T.);
#531=EDGE_CURVE('',#622,#620,#623,.T.);
#532=EDGE_CURVE('',#624,#622,#625,.T.);
#533=EDGE_CURVE('',#626,#624,#627,.T.);
#534=EDGE_CURVE('',#628,#626,#629,.T.);
#535=EDGE_CURVE('',#630,#628,#631,.T.);
#536=EDGE_CURVE('',#601,#630,#632,.T.);
#537=EDGE_CURVE('',#633,#634,#635,.T.);
#538=EDGE_CURVE('',#634,#636,#637,.T.);
#539=EDGE_CURVE('',#636,#638,#639,.T.);
#540=EDGE_CURVE('',#638,#640,#641,.T.);
#541=EDGE_CURVE('',#640,#642,#643,.T.);
#542=EDGE_CURVE('',#642,#644,#645,.T.);
#543=EDGE_CURVE('',#644,#646,#647,.T.);
#544=EDGE_CURVE('',#646,#648,#649,.T.);
#545=EDGE_CURVE('',#648,#650,#651,.T.);
#546=EDGE_CURVE('',#650,#652,#653,.T.);
#547=EDGE_CURVE('',#652,#654,#655,.T.);
#548=EDGE_CURVE('',#654,#590,#656,.T.);
#549=EDGE_CURVE('',#595,#657,#658,.T.);
#550=EDGE_CURVE('',#657,#659,#660,.T.);
#551=EDGE_CURVE('',#659,#661,#662,.T.);
#552=EDGE_CURVE('',#661,#663,#664,.T.);
#553=EDGE_CURVE('',#663,#633,#665,.T.);
#554=EDGE_CURVE('',#630,#636,#666,.T.);
#555=EDGE_CURVE('',#628,#638,#667,.T.);
#556=EDGE_CURVE('',#620,#646,#668,.T.);
#557=EDGE_CURVE('',#618,#648,#669,.T.);
#558=EDGE_CURVE('',#616,#650,#670,.T.);
#559=EDGE_CURVE('',#614,#652,#671,.T.);
#560=EDGE_CURVE('',#672,#672,#673,.F.);
#561=EDGE_CURVE('',#674,#674,#675,.F.);
#562=EDGE_CURVE('',#609,#657,#676,.T.);
#563=EDGE_CURVE('',#607,#659,#677,.T.);
#564=EDGE_CURVE('',#612,#654,#678,.T.);
#565=EDGE_CURVE('',#603,#663,#679,.T.);
#566=EDGE_CURVE('',#600,#633,#680,.T.);
#567=EDGE_CURVE('',#626,#640,#681,.T.);
#568=EDGE_CURVE('',#624,#642,#682,.T.);
#569=EDGE_CURVE('',#683,#683,#684,.F.);
#570=EDGE_CURVE('',#685,#685,#686,.F.);
#571=EDGE_CURVE('',#622,#644,#687,.T.);
#572=EDGE_CURVE('',#601,#634,#688,.T.);
#573=EDGE_CURVE('',#689,#689,#690,.F.);
#574=EDGE_CURVE('',#691,#691,#692,.F.);
#575=EDGE_CURVE('',#693,#693,#694,.F.);
#576=EDGE_CURVE('',#695,#695,#696,.F.);
#577=EDGE_CURVE('',#605,#661,#697,.T.);
#578=EDGE_CURVE('',#698,#698,#699,.F.);
#579=EDGE_CURVE('',#700,#700,#701,.F.);
#580=EDGE_CURVE('',#702,#702,#703,.F.);
#581=EDGE_CURVE('',#704,#704,#705,.F.);
#582=VERTEX_POINT('',#706);
#583=VERTEX_POINT('',#707);
#584=CIRCLE('',#708,0.5);
#585=VERTEX_POINT('',#709);
#586=LINE('',#710,#711);
#587=VERTEX_POINT('',#712);
#588=CIRCLE('',#713,0.5);
#589=LINE('',#714,#715);
#590=VERTEX_POINT('',#716);
#591=LINE('',#717,#718);
#592=VERTEX_POINT('',#719);
#593=LINE('',#720,#721);
#594=LINE('',#722,#723);
#595=VERTEX_POINT('',#724);
#596=LINE('',#725,#726);
#597=VERTEX_POINT('',#727);
#598=LINE('',#728,#729);
#599=LINE('',#730,#731);
#600=VERTEX_POINT('',#732);
#601=VERTEX_POINT('',#733);
#602=LINE('',#734,#735);
#603=VERTEX_POINT('',#736);
#604=CIRCLE('',#737,0.5);
#605=VERTEX_POINT('',#738);
#606=LINE('',#739,#740);
#607=VERTEX_POINT('',#741);
#608=CIRCLE('',#742,1.8);
#609=VERTEX_POINT('',#743);
#610=LINE('',#744,#745);
#611=CIRCLE('',#746,0.5);
#612=VERTEX_POINT('',#747);
#613=CIRCLE('',#748,0.5);
#614=VERTEX_POINT('',#749);
#615=LINE('',#750,#751);
#616=VERTEX_POINT('',#752);
#617=CIRCLE('',#753,0.5);
#618=VERTEX_POINT('',#754);
#619=LINE('',#755,#756);
#620=VERTEX_POINT('',#757);
#621=CIRCLE('',#758,1.8);
#622=VERTEX_POINT('',#759);
#623=LINE('',#760,#761);
#624=VERTEX_POINT('',#762);
#625=CIRCLE('',#763,0.5);
#626=VERTEX_POINT('',#764);
#627=LINE('',#765,#766);
#628=VERTEX_POINT('',#767);
#629=CIRCLE('',#768,0.5);
#630=VERTEX_POINT('',#769);
#631=LINE('',#770,#771);
#632=CIRCLE('',#772,0.5);
#633=VERTEX_POINT('',#773);
#634=VERTEX_POINT('',#774);
#635=LINE('',#775,#776);
#636=VERTEX_POINT('',#777);
#637=CIRCLE('',#778,0.5);
#638=VERTEX_POINT('',#779);
#639=LINE('',#780,#781);
#640=VERTEX_POINT('',#782);
#641=CIRCLE('',#783,0.5);
#642=VERTEX_POINT('',#784);
#643=LINE('',#785,#786);
#644=VERTEX_POINT('',#787);
#645=CIRCLE('',#788,0.5);
#646=VERTEX_POINT('',#789);
#647=LINE('',#790,#791);
#648=VERTEX_POINT('',#792);
#649=CIRCLE('',#793,1.8);
#650=VERTEX_POINT('',#794);
#651=LINE('',#795,#796);
#652=VERTEX_POINT('',#797);
#653=CIRCLE('',#798,0.5);
#654=VERTEX_POINT('',#799);
#655=LINE('',#800,#801);
#656=CIRCLE('',#802,0.5);
#657=VERTEX_POINT('',#803);
#658=CIRCLE('',#804,0.5);
#659=VERTEX_POINT('',#805);
#660=LINE('',#806,#807);
#661=VERTEX_POINT('',#808);
#662=CIRCLE('',#809,1.8);
#663=VERTEX_POINT('',#810);
#664=LINE('',#811,#812);
#665=CIRCLE('',#813,0.5);
#666=LINE('',#814,#815);
#667=LINE('',#816,#817);
#668=LINE('',#818,#819);
#669=LINE('',#820,#821);
#670=LINE('',#822,#823);
#671=LINE('',#824,#825);
#672=VERTEX_POINT('',#826);
#673=CIRCLE('',#827,1.25);
#674=VERTEX_POINT('',#828);
#675=CIRCLE('',#829,1.25);
#676=LINE('',#830,#831);
#677=LINE('',#832,#833);
#678=LINE('',#834,#835);
#679=LINE('',#836,#837);
#680=LINE('',#838,#839);
#681=LINE('',#840,#841);
#682=LINE('',#842,#843);
#683=VERTEX_POINT('',#844);
#684=CIRCLE('',#845,1.25);
#685=VERTEX_POINT('',#846);
#686=CIRCLE('',#847,1.25);
#687=LINE('',#848,#849);
#688=LINE('',#850,#851);
#689=VERTEX_POINT('',#852);
#690=CIRCLE('',#853,1.25);
#691=VERTEX_POINT('',#854);
#692=CIRCLE('',#855,1.25);
#693=VERTEX_POINT('',#856);
#694=CIRCLE('',#857,1.25);
#695=VERTEX_POINT('',#858);
#696=CIRCLE('',#859,1.25);
#697=LINE('',#860,#861);
#698=VERTEX_POINT('',#862);
#699=CIRCLE('',#863,1.25);
#700=VERTEX_POINT('',#864);
#701=CIRCLE('',#865,1.25);
#702=VERTEX_POINT('',#866);
#703=CIRCLE('',#867,1.25);
#704=VERTEX_POINT('',#868);
#705=CIRCLE('',#869,1.25);
#706=CARTESIAN_POINT('',(-1.1,0.6,66.0));
#707=CARTESIAN_POINT('',(-1.6,1.1,66.0));
#708=AXIS2_PLACEMENT_3D('',#870,#871,#872);
#709=CARTESIAN_POINT('',(-1.1,0.6,0.0));
#710=CARTESIAN_POINT('',(-1.1,0.6,0.0));
#711=VECTOR('',#873,1.0);
#712=CARTESIAN_POINT('',(-1.6,1.1,0.0));
#713=AXIS2_PLACEMENT_3D('',#874,#875,#876);
#714=CARTESIAN_POINT('',(-1.6,1.1,0.0));
#715=VECTOR('',#877,1.0);
#716=CARTESIAN_POINT('',(1.1,0.6,66.0));
#717=CARTESIAN_POINT('',(-1.6,0.6,66.0));
#718=VECTOR('',#878,1.0);
#719=CARTESIAN_POINT('',(1.1,0.6,0.0));
#720=CARTESIAN_POINT('',(1.1,0.6,0.0));
#721=VECTOR('',#879,1.0);
#722=CARTESIAN_POINT('',(-1.6,0.6,0.0));
#723=VECTOR('',#880,1.0);
#724=CARTESIAN_POINT('',(-1.6,1.3,66.0));
#725=CARTESIAN_POINT('',(-1.6,0.6,66.0));
#726=VECTOR('',#881,1.0);
#727=CARTESIAN_POINT('',(-1.6,1.3,0.0));
#728=CARTESIAN_POINT('',(-1.6,0.6,0.0));
#729=VECTOR('',#882,1.0);
#730=CARTESIAN_POINT('',(-1.6,1.3,0.0));
#731=VECTOR('',#883,1.0);
#732=CARTESIAN_POINT('',(-1.6,-1.3,0.0));
#733=CARTESIAN_POINT('',(-1.6,-1.1,0.0));
#734=CARTESIAN_POINT('',(-1.6,-1.8,0.0));
#735=VECTOR('',#884,1.0);
#736=CARTESIAN_POINT('',(-2.1,-1.8,0.0));
#737=AXIS2_PLACEMENT_3D('',#885,#886,#887);
#738=CARTESIAN_POINT('',(-18.0,-1.8,0.0));
#739=CARTESIAN_POINT('',(-9.8,-1.8,0.0));
#740=VECTOR('',#888,1.0);
#741=CARTESIAN_POINT('',(-18.0,1.8,0.0));
#742=AXIS2_PLACEMENT_3D('',#889,#890,#891);
#743=CARTESIAN_POINT('',(-2.1,1.8,0.0));
#744=CARTESIAN_POINT('',(-18.0,1.8,0.0));
#745=VECTOR('',#892,1.0);
#746=AXIS2_PLACEMENT_3D('',#893,#894,#895);
#747=CARTESIAN_POINT('',(1.6,1.1,0.0));
#748=AXIS2_PLACEMENT_3D('',#896,#897,#898);
#749=CARTESIAN_POINT('',(1.6,1.3,0.0));
#750=CARTESIAN_POINT('',(1.6,1.8,0.0));
#751=VECTOR('',#899,1.0);
#752=CARTESIAN_POINT('',(2.1,1.8,0.0));
#753=AXIS2_PLACEMENT_3D('',#900,#901,#902);
#754=CARTESIAN_POINT('',(18.0,1.8,0.0));
#755=CARTESIAN_POINT('',(9.8,1.8,0.0));
#756=VECTOR('',#903,1.0);
#757=CARTESIAN_POINT('',(18.0,-1.8,0.0));
#758=AXIS2_PLACEMENT_3D('',#904,#905,#906);
#759=CARTESIAN_POINT('',(2.1,-1.8,0.0));
#760=CARTESIAN_POINT('',(18.0,-1.8,0.0));
#761=VECTOR('',#907,1.0);
#762=CARTESIAN_POINT('',(1.6,-1.3,0.0));
#763=AXIS2_PLACEMENT_3D('',#908,#909,#910);
#764=CARTESIAN_POINT('',(1.6,-1.1,0.0));
#765=CARTESIAN_POINT('',(1.6,-0.6,0.0));
#766=VECTOR('',#911,1.0);
#767=CARTESIAN_POINT('',(1.1,-0.6,0.0));
#768=AXIS2_PLACEMENT_3D('',#912,#913,#914);
#769=CARTESIAN_POINT('',(-1.1,-0.6,0.0));
#770=CARTESIAN_POINT('',(1.6,-0.6,0.0));
#771=VECTOR('',#915,1.0);
#772=AXIS2_PLACEMENT_3D('',#916,#917,#918);
#773=CARTESIAN_POINT('',(-1.6,-1.3,66.0));
#774=CARTESIAN_POINT('',(-1.6,-1.1,66.0));
#775=CARTESIAN_POINT('',(-1.6,-1.8,66.0));
#776=VECTOR('',#919,1.0);
#777=CARTESIAN_POINT('',(-1.1,-0.6,66.0));
#778=AXIS2_PLACEMENT_3D('',#920,#921,#922);
#779=CARTESIAN_POINT('',(1.1,-0.6,66.0));
#780=CARTESIAN_POINT('',(1.6,-0.6,66.0));
#781=VECTOR('',#923,1.0);
#782=CARTESIAN_POINT('',(1.6,-1.1,66.0));
#783=AXIS2_PLACEMENT_3D('',#924,#925,#926);
#784=CARTESIAN_POINT('',(1.6,-1.3,66.0));
#785=CARTESIAN_POINT('',(1.6,-0.6,66.0));
#786=VECTOR('',#927,1.0);
#787=CARTESIAN_POINT('',(2.1,-1.8,66.0));
#788=AXIS2_PLACEMENT_3D('',#928,#929,#930);
#789=CARTESIAN_POINT('',(18.0,-1.8,66.0));
#790=CARTESIAN_POINT('',(18.0,-1.8,66.0));
#791=VECTOR('',#931,1.0);
#792=CARTESIAN_POINT('',(18.0,1.8,66.0));
#793=AXIS2_PLACEMENT_3D('',#932,#933,#934);
#794=CARTESIAN_POINT('',(2.1,1.8,66.0));
#795=CARTESIAN_POINT('',(9.8,1.8,66.0));
#796=VECTOR('',#935,1.0);
#797=CARTESIAN_POINT('',(1.6,1.3,66.0));
#798=AXIS2_PLACEMENT_3D('',#936,#937,#938);
#799=CARTESIAN_POINT('',(1.6,1.1,66.0));
#800=CARTESIAN_POINT('',(1.6,1.8,66.0));
#801=VECTOR('',#939,1.0);
#802=AXIS2_PLACEMENT_3D('',#940,#941,#942);
#803=CARTESIAN_POINT('',(-2.1,1.8,66.0));
#804=AXIS2_PLACEMENT_3D('',#943,#944,#945);
#805=CARTESIAN_POINT('',(-18.0,1.8,66.0));
#806=CARTESIAN_POINT('',(-18.0,1.8,66.0));
#807=VECTOR('',#946,1.0);
#808=CARTESIAN_POINT('',(-18.0,-1.8,66.0));
#809=AXIS2_PLACEMENT_3D('',#947,#948,#949);
#810=CARTESIAN_POINT('',(-2.1,-1.8,66.0));
#811=CARTESIAN_POINT('',(-9.8,-1.8,66.0));
#812=VECTOR('',#950,1.0);
#813=AXIS2_PLACEMENT_3D('',#951,#952,#953);
#814=CARTESIAN_POINT('',(-1.1,-0.6,0.0));
#815=VECTOR('',#954,1.0);
#816=CARTESIAN_POINT('',(1.1,-0.6,0.0));
#817=VECTOR('',#955,1.0);
#818=CARTESIAN_POINT('',(18.0,-1.8,0.0));
#819=VECTOR('',#956,1.0);
#820=CARTESIAN_POINT('',(18.0,1.8,0.0));
#821=VECTOR('',#957,1.0);
#822=CARTESIAN_POINT('',(2.1,1.8,0.0));
#823=VECTOR('',#958,1.0);
#824=CARTESIAN_POINT('',(1.6,1.3,0.0));
#825=VECTOR('',#959,1.0);
#826=CARTESIAN_POINT('',(-3.5,1.8,3.75));
#827=AXIS2_PLACEMENT_3D('',#960,#961,#962);
#828=CARTESIAN_POINT('',(-15.5,1.8,3.75));
#829=AXIS2_PLACEMENT_3D('',#963,#964,#965);
#830=CARTESIAN_POINT('',(-2.1,1.8,0.0));
#831=VECTOR('',#966,1.0);
#832=CARTESIAN_POINT('',(-18.0,1.8,0.0));
#833=VECTOR('',#967,1.0);
#834=CARTESIAN_POINT('',(1.6,1.1,0.0));
#835=VECTOR('',#968,1.0);
#836=CARTESIAN_POINT('',(-2.1,-1.8,0.0));
#837=VECTOR('',#969,1.0);
#838=CARTESIAN_POINT('',(-1.6,-1.3,0.0));
#839=VECTOR('',#970,1.0);
#840=CARTESIAN_POINT('',(1.6,-1.1,0.0));
#841=VECTOR('',#971,1.0);
#842=CARTESIAN_POINT('',(1.6,-1.3,0.0));
#843=VECTOR('',#972,1.0);
#844=CARTESIAN_POINT('',(16.75,-1.8,2.5));
#845=AXIS2_PLACEMENT_3D('',#973,#974,#975);
#846=CARTESIAN_POINT('',(4.75,-1.8,2.5));
#847=AXIS2_PLACEMENT_3D('',#976,#977,#978);
#848=CARTESIAN_POINT('',(2.1,-1.8,0.0));
#849=VECTOR('',#979,1.0);
#850=CARTESIAN_POINT('',(-1.6,-1.1,0.0));
#851=VECTOR('',#980,1.0);
#852=CARTESIAN_POINT('',(-14.25,-1.8,2.5));
#853=AXIS2_PLACEMENT_3D('',#981,#982,#983);
#854=CARTESIAN_POINT('',(-16.75,1.2,2.49999999999999));
#855=AXIS2_PLACEMENT_3D('',#984,#985,#986);
#856=CARTESIAN_POINT('',(15.5,1.8,3.75));
#857=AXIS2_PLACEMENT_3D('',#987,#988,#989);
#858=CARTESIAN_POINT('',(3.5,1.8,3.75));
#859=AXIS2_PLACEMENT_3D('',#990,#991,#992);
#860=CARTESIAN_POINT('',(-18.0,-1.8,0.0));
#861=VECTOR('',#993,1.0);
#862=CARTESIAN_POINT('',(-2.25,-1.8,2.5));
#863=AXIS2_PLACEMENT_3D('',#994,#995,#996);
#864=CARTESIAN_POINT('',(-4.75,1.2,2.49999999999999));
#865=AXIS2_PLACEMENT_3D('',#997,#998,#999);
#866=CARTESIAN_POINT('',(2.25,1.2,2.49999999999999));
#867=AXIS2_PLACEMENT_3D('',#1000,#1001,#1002);
#868=CARTESIAN_POINT('',(14.25,1.2,2.49999999999999));
#869=AXIS2_PLACEMENT_3D('',#1003,#1004,#1005);
#870=CARTESIAN_POINT('',(-1.1,1.1,66.0));
#871=DIRECTION('',(0.0,0.0,-1.0));
#872=DIRECTION('',(1.0,0.0,0.0));
#873=DIRECTION('',(0.0,0.0,1.0));
#874=CARTESIAN_POINT('',(-1.1,1.1,0.0));
#875=DIRECTION('',(0.0,0.0,-1.0));
#876=DIRECTION('',(1.0,0.0,0.0));
#877=DIRECTION('',(0.0,0.0,1.0));
#878=DIRECTION('',(-1.0,0.0,0.0));
#879=DIRECTION('',(0.0,0.0,1.0));
#880=DIRECTION('',(-1.0,0.0,0.0));
#881=DIRECTION('',(-6.12303176911189E-17,1.0,0.0));
#882=DIRECTION('',(-6.12303176911189E-17,1.0,0.0));
#883=DIRECTION('',(0.0,0.0,1.0));
#884=DIRECTION('',(6.12303176911189E-17,1.0,0.0));
#885=CARTESIAN_POINT('',(-2.1,-1.3,0.0));
#886=DIRECTION('',(0.0,0.0,1.0));
#887=DIRECTION('',(1.0,0.0,0.0));
#888=DIRECTION('',(1.0,1.22460635382238E-16,0.0));
#889=CARTESIAN_POINT('',(-18.0,2.38790835578433E-17,0.0));
#890=DIRECTION('',(0.0,0.0,1.0));
#891=DIRECTION('',(1.0,0.0,0.0));
#892=DIRECTION('',(-1.0,0.0,0.0));
#893=CARTESIAN_POINT('',(-2.1,1.3,0.0));
#894=DIRECTION('',(0.0,0.0,1.0));
#895=DIRECTION('',(1.0,0.0,0.0));
#896=CARTESIAN_POINT('',(1.1,1.1,0.0));
#897=DIRECTION('',(0.0,0.0,-1.0));
#898=DIRECTION('',(1.0,0.0,0.0));
#899=DIRECTION('',(-6.12303176911189E-17,-1.0,0.0));
#900=CARTESIAN_POINT('',(2.1,1.3,0.0));
#901=DIRECTION('',(0.0,0.0,1.0));
#902=DIRECTION('',(1.0,0.0,0.0));
#903=DIRECTION('',(-1.0,0.0,0.0));
#904=CARTESIAN_POINT('',(18.0,-2.38790835578426E-17,0.0));
#905=DIRECTION('',(0.0,0.0,1.0));
#906=DIRECTION('',(1.0,0.0,0.0));
#907=DIRECTION('',(1.0,1.22460635382238E-16,0.0));
#908=CARTESIAN_POINT('',(2.1,-1.3,0.0));
#909=DIRECTION('',(0.0,0.0,1.0));
#910=DIRECTION('',(1.0,0.0,0.0));
#911=DIRECTION('',(6.12303176911189E-17,-1.0,0.0));
#912=CARTESIAN_POINT('',(1.1,-1.1,0.0));
#913=DIRECTION('',(0.0,0.0,-1.0));
#914=DIRECTION('',(1.0,0.0,0.0));
#915=DIRECTION('',(1.0,0.0,0.0));
#916=CARTESIAN_POINT('',(-1.1,-1.1,0.0));
#917=DIRECTION('',(0.0,0.0,-1.0));
#918=DIRECTION('',(1.0,0.0,0.0));
#919=DIRECTION('',(6.12303176911189E-17,1.0,0.0));
#920=CARTESIAN_POINT('',(-1.1,-1.1,66.0));
#921=DIRECTION('',(0.0,0.0,-1.0));
#922=DIRECTION('',(1.0,0.0,0.0));
#923=DIRECTION('',(1.0,0.0,0.0));
#924=CARTESIAN_POINT('',(1.1,-1.1,66.0));
#925=DIRECTION('',(0.0,0.0,-1.0));
#926=DIRECTION('',(1.0,0.0,0.0));
#927=DIRECTION('',(6.12303176911189E-17,-1.0,0.0));
#928=CARTESIAN_POINT('',(2.1,-1.3,66.0));
#929=DIRECTION('',(0.0,0.0,1.0));
#930=DIRECTION('',(1.0,0.0,0.0));
#931=DIRECTION('',(1.0,1.22460635382238E-16,0.0));
#932=CARTESIAN_POINT('',(18.0,-2.38790835578426E-17,66.0));
#933=DIRECTION('',(0.0,0.0,1.0));
#934=DIRECTION('',(1.0,0.0,0.0));
#935=DIRECTION('',(-1.0,0.0,0.0));
#936=CARTESIAN_POINT('',(2.1,1.3,66.0));
#937=DIRECTION('',(0.0,0.0,1.0));
#938=DIRECTION('',(1.0,0.0,0.0));
#939=DIRECTION('',(-6.12303176911189E-17,-1.0,0.0));
#940=CARTESIAN_POINT('',(1.1,1.1,66.0));
#941=DIRECTION('',(0.0,0.0,-1.0));
#942=DIRECTION('',(1.0,0.0,0.0));
#943=CARTESIAN_POINT('',(-2.1,1.3,66.0));
#944=DIRECTION('',(0.0,0.0,1.0));
#945=DIRECTION('',(1.0,0.0,0.0));
#946=DIRECTION('',(-1.0,0.0,0.0));
#947=CARTESIAN_POINT('',(-18.0,2.38790835578433E-17,66.0));
#948=DIRECTION('',(0.0,0.0,1.0));
#949=DIRECTION('',(1.0,0.0,0.0));
#950=DIRECTION('',(1.0,1.22460635382238E-16,0.0));
#951=CARTESIAN_POINT('',(-2.1,-1.3,66.0));
#952=DIRECTION('',(0.0,0.0,1.0));
#953=DIRECTION('',(1.0,0.0,0.0));
#954=DIRECTION('',(0.0,0.0,1.0));
#955=DIRECTION('',(0.0,0.0,1.0));
#956=DIRECTION('',(0.0,0.0,1.0));
#957=DIRECTION('',(0.0,0.0,1.0));
#958=DIRECTION('',(0.0,0.0,1.0));
#959=DIRECTION('',(0.0,0.0,1.0));
#960=CARTESIAN_POINT('',(-3.5,1.8,2.5));
#961=DIRECTION('',(0.0,1.0,0.0));
#962=DIRECTION('',(0.0,0.0,1.0));
#963=CARTESIAN_POINT('',(-15.5,1.8,2.5));
#964=DIRECTION('',(0.0,1.0,0.0));
#965=DIRECTION('',(0.0,0.0,1.0));
#966=DIRECTION('',(0.0,0.0,1.0));
#967=DIRECTION('',(0.0,0.0,1.0));
#968=DIRECTION('',(0.0,0.0,1.0));
#969=DIRECTION('',(0.0,0.0,1.0));
#970=DIRECTION('',(0.0,0.0,1.0));
#971=DIRECTION('',(0.0,0.0,1.0));
#972=DIRECTION('',(0.0,0.0,1.0));
#973=CARTESIAN_POINT('',(15.5,-1.8,2.5));
#974=DIRECTION('',(1.22460635382238E-16,-1.0,0.0));
#975=DIRECTION('',(1.0,1.22460635382238E-16,0.0));
#976=CARTESIAN_POINT('',(3.5,-1.8,2.5));
#977=DIRECTION('',(1.22460635382238E-16,-1.0,0.0));
#978=DIRECTION('',(1.0,1.22460635382238E-16,0.0));
#979=DIRECTION('',(0.0,0.0,1.0));
#980=DIRECTION('',(0.0,0.0,1.0));
#981=CARTESIAN_POINT('',(-15.5,-1.8,2.5));
#982=DIRECTION('',(1.22460635382238E-16,-1.0,0.0));
#983=DIRECTION('',(1.0,1.22460635382238E-16,0.0));
#984=CARTESIAN_POINT('',(-15.5,1.2,2.5));
#985=DIRECTION('',(-1.22460666803792E-16,1.0,-1.81591993849532E-24));
#986=DIRECTION('',(-1.0,-1.22460666803792E-16,0.0));
#987=CARTESIAN_POINT('',(15.5,1.8,2.5));
#988=DIRECTION('',(0.0,1.0,0.0));
#989=DIRECTION('',(0.0,0.0,1.0));
#990=CARTESIAN_POINT('',(3.5,1.8,2.5));
#991=DIRECTION('',(0.0,1.0,0.0));
#992=DIRECTION('',(0.0,0.0,1.0));
#993=DIRECTION('',(0.0,0.0,1.0));
#994=CARTESIAN_POINT('',(-3.5,-1.8,2.5));
#995=DIRECTION('',(1.22460635382238E-16,-1.0,0.0));
#996=DIRECTION('',(1.0,1.22460635382238E-16,0.0));
#997=CARTESIAN_POINT('',(-3.5,1.2,2.5));
#998=DIRECTION('',(-1.22460666803792E-16,1.0,-5.12464238870743E-24));
#999=DIRECTION('',(-1.0,-1.22460666803792E-16,0.0));
#1000=CARTESIAN_POINT('',(3.5,1.2,2.5));
#1001=DIRECTION('',(-1.22460666803792E-16,1.0,-5.12464238870743E-24));
#1002=DIRECTION('',(-1.0,-1.22460666803792E-16,0.0));
#1003=CARTESIAN_POINT('',(15.5,1.2,2.5));
#1004=DIRECTION('',(-1.22460666803792E-16,1.0,-5.12464238870743E-24));
#1005=DIRECTION('',(-1.0,-1.22460666803792E-16,0.0));
ENDSEC;
END-ISO-10303-21;
