ISO-10303-21;
HEADER;
FILE_DESCRIPTION(('STEP AP203'),'1');
FILE_NAME('RBF22.P202-1 Suporte do Roller Esquerdo.stp','2022-08-30T23:22:05',(' '),(' '),'Spatial InterOp 3D',' ',' ');
FILE_SCHEMA(('CONFIG_CONTROL_DESIGN'));
ENDSEC;
DATA;
#1=DESIGN_CONTEXT('',#33,'design');
#2=APPLICATION_PROTOCOL_DEFINITION('INTERNATIONAL STANDARD','config_control_design',1994,#33);
#3=PRODUCT_CATEGORY_RELATIONSHIP('NONE','NONE',#34,#35);
#4=DATE_AND_TIME(#36,#37);
#5=DATE_TIME_ROLE('creation_date');
#6=DATE_TIME_ROLE('classification_date');
#7=PERSON_AND_ORGANIZATION_ROLE('creator');
#8=PERSON_AND_ORGANIZATION_ROLE('design_supplier');
#9=PERSON_AND_ORGANIZATION_ROLE('classification_officer');
#10=PERSON_AND_ORGANIZATION_ROLE('design_owner');
#11=APPROVAL_PERSON_ORGANIZATION(#38,#39,#40);
#12=APPROVAL_DATE_TIME(#4,#39);
#13=CC_DESIGN_APPROVAL(#39,(#41,#42,#43));
#14=CC_DESIGN_DATE_AND_TIME_ASSIGNMENT(#4,#5,(#43));
#15=CC_DESIGN_DATE_AND_TIME_ASSIGNMENT(#4,#6,(#41));
#16=CC_DESIGN_PERSON_AND_ORGANIZATION_ASSIGNMENT(#38,#10,(#44));
#17=CC_DESIGN_PERSON_AND_ORGANIZATION_ASSIGNMENT(#38,#7,(#43));
#18=CC_DESIGN_PERSON_AND_ORGANIZATION_ASSIGNMENT(#38,#7,(#42));
#19=CC_DESIGN_PERSON_AND_ORGANIZATION_ASSIGNMENT(#38,#8,(#42));
#20=CC_DESIGN_SECURITY_CLASSIFICATION(#41,(#42));
#21=CC_DESIGN_PERSON_AND_ORGANIZATION_ASSIGNMENT(#38,#9,(#41));
#22=SHAPE_DEFINITION_REPRESENTATION(#45,#46);
#23= (GEOMETRIC_REPRESENTATION_CONTEXT(3)GLOBAL_UNCERTAINTY_ASSIGNED_CONTEXT((#49))GLOBAL_UNIT_ASSIGNED_CONTEXT((#51,#52,#53))REPRESENTATION_CONTEXT('NONE','WORKSPACE'));
#24=PROPERTY_DEFINITION_REPRESENTATION(#55,#56);
#25=GENERAL_PROPERTY_ASSOCIATION('','',#57,#55);
#26=PROPERTY_DEFINITION_REPRESENTATION(#58,#59);
#27=GENERAL_PROPERTY_ASSOCIATION('','',#60,#58);
#28=PROPERTY_DEFINITION_REPRESENTATION(#61,#62);
#29=GENERAL_PROPERTY_ASSOCIATION('','',#63,#61);
#33=APPLICATION_CONTEXT('CONFIGURATION CONTROLLED 3D DESIGNS OF MECHANICAL PARTS AND ASSEMBLIES');
#34=PRODUCT_CATEGORY('part','NONE');
#35=PRODUCT_RELATED_PRODUCT_CATEGORY('detail',' ',(#44));
#36=CALENDAR_DATE(2022,30,7);
#37=LOCAL_TIME(20,22,5.0,#64);
#38=PERSON_AND_ORGANIZATION(#65,#66);
#39=APPROVAL(#67,'SOLID MODEL');
#40=APPROVAL_ROLE('APPROVED');
#41=SECURITY_CLASSIFICATION('','',#68);
#42=PRODUCT_DEFINITION_FORMATION_WITH_SPECIFIED_SOURCE('A','NONE',#44,.NOT_KNOWN.);
#43=PRODUCT_DEFINITION('','NONE',#42,#1);
#44=PRODUCT('Suporte do Roller Esquerdo - elevado','','1',(#69));
#45=PRODUCT_DEFINITION_SHAPE('NONE','NONE',#43);
#46=ADVANCED_BREP_SHAPE_REPRESENTATION('1',(#70,#71),#23);
#49=UNCERTAINTY_MEASURE_WITH_UNIT(LENGTH_MEASURE(0.001),#51,'','');
#51= (CONVERSION_BASED_UNIT('MILLIMETRE',#74)LENGTH_UNIT()NAMED_UNIT(#77));
#52= (NAMED_UNIT(#79)PLANE_ANGLE_UNIT()SI_UNIT($,.RADIAN.));
#53= (NAMED_UNIT(#79)SOLID_ANGLE_UNIT()SI_UNIT($,.STERADIAN.));
#55=PROPERTY_DEFINITION('PdmObjectId','',#43);
#56=REPRESENTATION('',(#85),#23);
#57=GENERAL_PROPERTY('','19_00f82d99-4513-4df2-a5c1-c16c200575b9&2_3_0_199','');
#58=PROPERTY_DEFINITION('CreationDate','',#43);
#59=REPRESENTATION('',(#86),#23);
#60=GENERAL_PROPERTY('','08/04/2022 19:03:13','');
#61=PROPERTY_DEFINITION('Minor Revision','',#43);
#62=REPRESENTATION('',(#87),#23);
#63=GENERAL_PROPERTY('','31','');
#64=COORDINATED_UNIVERSAL_TIME_OFFSET(3,0,.BEHIND.);
#65=PERSON('','UNSPECIFIED',$,$,$,$);
#66=ORGANIZATION('UNSPECIFIED','UNSPECIFIED','UNSPECIFIED');
#67=APPROVAL_STATUS('approved');
#68=SECURITY_CLASSIFICATION_LEVEL('unclassified');
#69=MECHANICAL_CONTEXT('',#33,'mechanical');
#70=MANIFOLD_SOLID_BREP('1',#88);
#71=AXIS2_PLACEMENT_3D('',#89,#90,#91);
#74=LENGTH_MEASURE_WITH_UNIT(LENGTH_MEASURE(1.0),#92);
#77=DIMENSIONAL_EXPONENTS(1.0,0.0,0.0,0.0,0.0,0.0,0.0);
#79=DIMENSIONAL_EXPONENTS(0.0,0.0,0.0,0.0,0.0,0.0,0.0);
#85=VALUE_REPRESENTATION_ITEM('19_00f82d99-4513-4df2-a5c1-c16c200575b9&2_3_0_199',);
#86=VALUE_REPRESENTATION_ITEM('08/04/2022 19:03:13',);
#87=VALUE_REPRESENTATION_ITEM('31',);
#88=CLOSED_SHELL('',(#93,#94,#95,#96,#97,#98,#99,#100,#101,#102,#103,#104,#105,#106,#107,#108,#109,#110,#111,#112,#113,#114,#115,#116,#117,#118,#119,#120,#121,#122,#123,#124,#125,#126,#127,#128,#129,#130,#131,#132,#133,#134,#135,#136,#137,#138,#139,#140,#141));
#89=CARTESIAN_POINT('',(0.0,0.0,0.0));
#90=DIRECTION('',(0.0,0.0,1.0));
#91=DIRECTION('',(1.0,0.0,0.0));
#92= (NAMED_UNIT(#77)LENGTH_UNIT()SI_UNIT(.MILLI.,.METRE.));
#93=ADVANCED_FACE('',(#143),#144,.T.);
#94=ADVANCED_FACE('',(#145),#146,.F.);
#95=ADVANCED_FACE('',(#147),#148,.T.);
#96=ADVANCED_FACE('',(#149,#150,#151),#152,.F.);
#97=ADVANCED_FACE('',(#153),#154,.T.);
#98=ADVANCED_FACE('',(#155),#156,.F.);
#99=ADVANCED_FACE('',(#157),#158,.T.);
#100=ADVANCED_FACE('',(#159,#160),#161,.T.);
#101=ADVANCED_FACE('',(#162),#163,.T.);
#102=ADVANCED_FACE('',(#164),#165,.F.);
#103=ADVANCED_FACE('',(#166,#167,#168),#169,.F.);
#104=ADVANCED_FACE('',(#170),#171,.T.);
#105=ADVANCED_FACE('',(#172),#173,.T.);
#106=ADVANCED_FACE('',(#174),#175,.F.);
#107=ADVANCED_FACE('',(#176),#177,.F.);
#108=ADVANCED_FACE('',(#178),#179,.T.);
#109=ADVANCED_FACE('',(#180),#181,.F.);
#110=ADVANCED_FACE('',(#182),#183,.T.);
#111=ADVANCED_FACE('',(#184),#185,.T.);
#112=ADVANCED_FACE('',(#186),#187,.T.);
#113=ADVANCED_FACE('',(#188,#189),#190,.F.);
#114=ADVANCED_FACE('',(#191),#192,.F.);
#115=ADVANCED_FACE('',(#193),#194,.T.);
#116=ADVANCED_FACE('',(#195),#196,.F.);
#117=ADVANCED_FACE('',(#197,#198),#199,.F.);
#118=ADVANCED_FACE('',(#200,#201),#202,.F.);
#119=ADVANCED_FACE('',(#203,#204),#205,.F.);
#120=ADVANCED_FACE('',(#206,#207),#208,.F.);
#121=ADVANCED_FACE('',(#209),#210,.F.);
#122=ADVANCED_FACE('',(#211),#212,.F.);
#123=ADVANCED_FACE('',(#213),#214,.T.);
#124=ADVANCED_FACE('',(#215,#216),#217,.F.);
#125=ADVANCED_FACE('',(#218),#219,.T.);
#126=ADVANCED_FACE('',(#220),#221,.T.);
#127=ADVANCED_FACE('',(#222),#223,.T.);
#128=ADVANCED_FACE('',(#224,#225),#226,.F.);
#129=ADVANCED_FACE('',(#227,#228),#229,.F.);
#130=ADVANCED_FACE('',(#230,#231),#232,.F.);
#131=ADVANCED_FACE('',(#233),#234,.T.);
#132=ADVANCED_FACE('',(#235),#236,.F.);
#133=ADVANCED_FACE('',(#237),#238,.T.);
#134=ADVANCED_FACE('',(#239),#240,.T.);
#135=ADVANCED_FACE('',(#241),#242,.T.);
#136=ADVANCED_FACE('',(#243),#244,.T.);
#137=ADVANCED_FACE('',(#245),#246,.T.);
#138=ADVANCED_FACE('',(#247),#248,.F.);
#139=ADVANCED_FACE('',(#249),#250,.T.);
#140=ADVANCED_FACE('',(#251),#252,.T.);
#141=ADVANCED_FACE('',(#253),#254,.T.);
#143=FACE_OUTER_BOUND('',#255,.T.);
#144=CYLINDRICAL_SURFACE('',#256,2.0);
#145=FACE_OUTER_BOUND('',#257,.T.);
#146=CYLINDRICAL_SURFACE('',#258,11.9720218335139);
#147=FACE_OUTER_BOUND('',#259,.T.);
#148=PLANE('',#260);
#149=FACE_BOUND('',#261,.T.);
#150=FACE_BOUND('',#262,.T.);
#151=FACE_OUTER_BOUND('',#263,.T.);
#152=PLANE('',#264);
#153=FACE_OUTER_BOUND('',#265,.T.);
#154=CYLINDRICAL_SURFACE('',#266,13.9990578443828);
#155=FACE_OUTER_BOUND('',#267,.T.);
#156=CYLINDRICAL_SURFACE('',#268,4.0);
#157=FACE_OUTER_BOUND('',#269,.T.);
#158=PLANE('',#270);
#159=FACE_BOUND('',#271,.T.);
#160=FACE_OUTER_BOUND('',#272,.T.);
#161=PLANE('',#273);
#162=FACE_OUTER_BOUND('',#274,.T.);
#163=CYLINDRICAL_SURFACE('',#275,14.0);
#164=FACE_OUTER_BOUND('',#276,.T.);
#165=CYLINDRICAL_SURFACE('',#277,4.0);
#166=FACE_BOUND('',#278,.T.);
#167=FACE_OUTER_BOUND('',#279,.T.);
#168=FACE_BOUND('',#280,.T.);
#169=PLANE('',#281);
#170=FACE_OUTER_BOUND('',#282,.T.);
#171=PLANE('',#283);
#172=FACE_OUTER_BOUND('',#284,.T.);
#173=PLANE('',#285);
#174=FACE_OUTER_BOUND('',#286,.T.);
#175=CYLINDRICAL_SURFACE('',#287,4.0);
#176=FACE_OUTER_BOUND('',#288,.T.);
#177=CYLINDRICAL_SURFACE('',#289,0.5);
#178=FACE_OUTER_BOUND('',#290,.T.);
#179=CYLINDRICAL_SURFACE('',#291,0.5);
#180=FACE_OUTER_BOUND('',#292,.T.);
#181=CYLINDRICAL_SURFACE('',#293,1.0);
#182=FACE_OUTER_BOUND('',#294,.T.);
#183=CYLINDRICAL_SURFACE('',#295,4.0);
#184=FACE_OUTER_BOUND('',#296,.T.);
#185=PLANE('',#297);
#186=FACE_OUTER_BOUND('',#298,.T.);
#187=PLANE('',#299);
#188=FACE_OUTER_BOUND('',#300,.T.);
#189=FACE_OUTER_BOUND('',#301,.T.);
#190=CYLINDRICAL_SURFACE('',#302,1.55);
#191=FACE_OUTER_BOUND('',#303,.T.);
#192=PLANE('',#304);
#193=FACE_OUTER_BOUND('',#305,.T.);
#194=CYLINDRICAL_SURFACE('',#306,2.0);
#195=FACE_OUTER_BOUND('',#307,.T.);
#196=PLANE('',#308);
#197=FACE_OUTER_BOUND('',#309,.T.);
#198=FACE_BOUND('',#310,.T.);
#199=CONICAL_SURFACE('',#311,866.025403784439,1.0471975511966);
#200=FACE_OUTER_BOUND('',#312,.T.);
#201=FACE_OUTER_BOUND('',#313,.T.);
#202=CYLINDRICAL_SURFACE('',#314,1.25);
#203=FACE_OUTER_BOUND('',#315,.T.);
#204=FACE_BOUND('',#316,.T.);
#205=CONICAL_SURFACE('',#317,866.025403784439,1.0471975511966);
#206=FACE_OUTER_BOUND('',#318,.T.);
#207=FACE_OUTER_BOUND('',#319,.T.);
#208=CYLINDRICAL_SURFACE('',#320,1.25);
#209=FACE_OUTER_BOUND('',#321,.T.);
#210=PLANE('',#322);
#211=FACE_OUTER_BOUND('',#323,.T.);
#212=PLANE('',#324);
#213=FACE_OUTER_BOUND('',#325,.T.);
#214=PLANE('',#326);
#215=FACE_OUTER_BOUND('',#327,.T.);
#216=FACE_OUTER_BOUND('',#328,.T.);
#217=CYLINDRICAL_SURFACE('',#329,4.05);
#218=FACE_OUTER_BOUND('',#330,.T.);
#219=PLANE('',#331);
#220=FACE_OUTER_BOUND('',#332,.T.);
#221=CYLINDRICAL_SURFACE('',#333,6.5);
#222=FACE_OUTER_BOUND('',#334,.T.);
#223=PLANE('',#335);
#224=FACE_OUTER_BOUND('',#336,.T.);
#225=FACE_OUTER_BOUND('',#337,.T.);
#226=CYLINDRICAL_SURFACE('',#338,4.0);
#227=FACE_OUTER_BOUND('',#339,.T.);
#228=FACE_OUTER_BOUND('',#340,.T.);
#229=CYLINDRICAL_SURFACE('',#341,1.25);
#230=FACE_OUTER_BOUND('',#342,.T.);
#231=FACE_OUTER_BOUND('',#343,.T.);
#232=CYLINDRICAL_SURFACE('',#344,1.25);
#233=FACE_OUTER_BOUND('',#345,.T.);
#234=PLANE('',#346);
#235=FACE_OUTER_BOUND('',#347,.T.);
#236=CYLINDRICAL_SURFACE('',#348,9.08648093280679);
#237=FACE_OUTER_BOUND('',#349,.T.);
#238=PLANE('',#350);
#239=FACE_OUTER_BOUND('',#351,.T.);
#240=CYLINDRICAL_SURFACE('',#352,8.87202183351388);
#241=FACE_OUTER_BOUND('',#353,.T.);
#242=CYLINDRICAL_SURFACE('',#354,1.9);
#243=FACE_OUTER_BOUND('',#355,.T.);
#244=PLANE('',#356);
#245=FACE_OUTER_BOUND('',#357,.T.);
#246=PLANE('',#358);
#247=FACE_OUTER_BOUND('',#359,.T.);
#248=CYLINDRICAL_SURFACE('',#360,5.0);
#249=FACE_OUTER_BOUND('',#361,.T.);
#250=PLANE('',#362);
#251=FACE_OUTER_BOUND('',#363,.T.);
#252=CYLINDRICAL_SURFACE('',#364,5.98648093280679);
#253=FACE_OUTER_BOUND('',#365,.T.);
#254=PLANE('',#366);
#255=EDGE_LOOP('',(#367,#368,#369,#370));
#256=AXIS2_PLACEMENT_3D('',#371,#372,#373);
#257=EDGE_LOOP('',(#374,#375,#376,#377));
#258=AXIS2_PLACEMENT_3D('',#378,#379,#380);
#259=EDGE_LOOP('',(#381,#382,#383,#384,#385,#386,#387,#388,#389,#390,#391,#392,#393,#394,#395,#396,#397,#398,#399,#400,#401,#402,#403,#404,#405,#406,#407,#408,#409,#410,#411,#412));
#260=AXIS2_PLACEMENT_3D('',#413,#414,#415);
#261=EDGE_LOOP('',(#416));
#262=EDGE_LOOP('',(#417));
#263=EDGE_LOOP('',(#418,#419,#420,#421,#422,#423,#424,#425));
#264=AXIS2_PLACEMENT_3D('',#426,#427,#428);
#265=EDGE_LOOP('',(#429,#430,#431,#432,#433));
#266=AXIS2_PLACEMENT_3D('',#434,#435,#436);
#267=EDGE_LOOP('',(#437,#438,#439,#440));
#268=AXIS2_PLACEMENT_3D('',#441,#442,#443);
#269=EDGE_LOOP('',(#444,#445,#446,#447));
#270=AXIS2_PLACEMENT_3D('',#448,#449,#450);
#271=EDGE_LOOP('',(#451));
#272=EDGE_LOOP('',(#452,#453,#454,#455,#456,#457,#458,#459,#460,#461));
#273=AXIS2_PLACEMENT_3D('',#462,#463,#464);
#274=EDGE_LOOP('',(#465,#466,#467,#468));
#275=AXIS2_PLACEMENT_3D('',#469,#470,#471);
#276=EDGE_LOOP('',(#472,#473,#474,#475));
#277=AXIS2_PLACEMENT_3D('',#476,#477,#478);
#278=EDGE_LOOP('',(#479));
#279=EDGE_LOOP('',(#480,#481,#482,#483,#484,#485,#486,#487,#488,#489,#490,#491,#492,#493,#494,#495,#496));
#280=EDGE_LOOP('',(#497));
#281=AXIS2_PLACEMENT_3D('',#498,#499,#500);
#282=EDGE_LOOP('',(#501,#502,#503,#504));
#283=AXIS2_PLACEMENT_3D('',#505,#506,#507);
#284=EDGE_LOOP('',(#508,#509,#510,#511));
#285=AXIS2_PLACEMENT_3D('',#512,#513,#514);
#286=EDGE_LOOP('',(#515,#516,#517,#518));
#287=AXIS2_PLACEMENT_3D('',#519,#520,#521);
#288=EDGE_LOOP('',(#522,#523,#524,#525));
#289=AXIS2_PLACEMENT_3D('',#526,#527,#528);
#290=EDGE_LOOP('',(#529,#530,#531,#532));
#291=AXIS2_PLACEMENT_3D('',#533,#534,#535);
#292=EDGE_LOOP('',(#536,#537,#538,#539));
#293=AXIS2_PLACEMENT_3D('',#540,#541,#542);
#294=EDGE_LOOP('',(#543,#544,#545,#546));
#295=AXIS2_PLACEMENT_3D('',#547,#548,#549);
#296=EDGE_LOOP('',(#550,#551,#552,#553));
#297=AXIS2_PLACEMENT_3D('',#554,#555,#556);
#298=EDGE_LOOP('',(#557,#558,#559,#560));
#299=AXIS2_PLACEMENT_3D('',#561,#562,#563);
#300=EDGE_LOOP('',(#564));
#301=EDGE_LOOP('',(#565,#566,#567,#568));
#302=AXIS2_PLACEMENT_3D('',#569,#570,#571);
#303=EDGE_LOOP('',(#572,#573,#574,#575));
#304=AXIS2_PLACEMENT_3D('',#576,#577,#578);
#305=EDGE_LOOP('',(#579,#580,#581,#582));
#306=AXIS2_PLACEMENT_3D('',#583,#584,#585);
#307=EDGE_LOOP('',(#586,#587,#588,#589));
#308=AXIS2_PLACEMENT_3D('',#590,#591,#592);
#309=EDGE_LOOP('',(#593));
#310=VERTEX_LOOP('',#594);
#311=AXIS2_PLACEMENT_3D('',#595,#596,#597);
#312=EDGE_LOOP('',(#598));
#313=EDGE_LOOP('',(#599));
#314=AXIS2_PLACEMENT_3D('',#600,#601,#602);
#315=EDGE_LOOP('',(#603));
#316=VERTEX_LOOP('',#604);
#317=AXIS2_PLACEMENT_3D('',#605,#606,#607);
#318=EDGE_LOOP('',(#608));
#319=EDGE_LOOP('',(#609));
#320=AXIS2_PLACEMENT_3D('',#610,#611,#612);
#321=EDGE_LOOP('',(#613));
#322=AXIS2_PLACEMENT_3D('',#614,#615,#616);
#323=EDGE_LOOP('',(#617,#618,#619,#620));
#324=AXIS2_PLACEMENT_3D('',#621,#622,#623);
#325=EDGE_LOOP('',(#624));
#326=AXIS2_PLACEMENT_3D('',#625,#626,#627);
#327=EDGE_LOOP('',(#628));
#328=EDGE_LOOP('',(#629));
#329=AXIS2_PLACEMENT_3D('',#630,#631,#632);
#330=EDGE_LOOP('',(#633,#634,#635,#636,#637,#638));
#331=AXIS2_PLACEMENT_3D('',#639,#640,#641);
#332=EDGE_LOOP('',(#642,#643,#644,#645));
#333=AXIS2_PLACEMENT_3D('',#646,#647,#648);
#334=EDGE_LOOP('',(#649,#650,#651,#652));
#335=AXIS2_PLACEMENT_3D('',#653,#654,#655);
#336=EDGE_LOOP('',(#656));
#337=EDGE_LOOP('',(#657));
#338=AXIS2_PLACEMENT_3D('',#658,#659,#660);
#339=EDGE_LOOP('',(#661));
#340=EDGE_LOOP('',(#662));
#341=AXIS2_PLACEMENT_3D('',#663,#664,#665);
#342=EDGE_LOOP('',(#666));
#343=EDGE_LOOP('',(#667));
#344=AXIS2_PLACEMENT_3D('',#668,#669,#670);
#345=EDGE_LOOP('',(#671,#672,#673,#674));
#346=AXIS2_PLACEMENT_3D('',#675,#676,#677);
#347=EDGE_LOOP('',(#678,#679,#680,#681));
#348=AXIS2_PLACEMENT_3D('',#682,#683,#684);
#349=EDGE_LOOP('',(#685,#686,#687,#688));
#350=AXIS2_PLACEMENT_3D('',#689,#690,#691);
#351=EDGE_LOOP('',(#692,#693,#694,#695));
#352=AXIS2_PLACEMENT_3D('',#696,#697,#698);
#353=EDGE_LOOP('',(#699,#700,#701,#702));
#354=AXIS2_PLACEMENT_3D('',#703,#704,#705);
#355=EDGE_LOOP('',(#706,#707,#708,#709));
#356=AXIS2_PLACEMENT_3D('',#710,#711,#712);
#357=EDGE_LOOP('',(#713,#714,#715,#716));
#358=AXIS2_PLACEMENT_3D('',#717,#718,#719);
#359=EDGE_LOOP('',(#720,#721,#722,#723));
#360=AXIS2_PLACEMENT_3D('',#724,#725,#726);
#361=EDGE_LOOP('',(#727,#728,#729,#730));
#362=AXIS2_PLACEMENT_3D('',#731,#732,#733);
#363=EDGE_LOOP('',(#734,#735,#736,#737));
#364=AXIS2_PLACEMENT_3D('',#738,#739,#740);
#365=EDGE_LOOP('',(#741,#742,#743,#744,#745,#746,#747,#748,#749,#750,#751,#752,#753,#754));
#366=AXIS2_PLACEMENT_3D('',#755,#756,#757);
#367=ORIENTED_EDGE('',*,*,#758,.F.);
#368=ORIENTED_EDGE('',*,*,#759,.F.);
#369=ORIENTED_EDGE('',*,*,#760,.F.);
#370=ORIENTED_EDGE('',*,*,#761,.F.);
#371=CARTESIAN_POINT('',(-3.0,3.5,4.0));
#372=DIRECTION('',(0.0,0.0,1.0));
#373=DIRECTION('',(1.0,0.0,0.0));
#374=ORIENTED_EDGE('',*,*,#762,.F.);
#375=ORIENTED_EDGE('',*,*,#763,.F.);
#376=ORIENTED_EDGE('',*,*,#764,.T.);
#377=ORIENTED_EDGE('',*,*,#765,.T.);
#378=CARTESIAN_POINT('',(15.0279781664862,41.6368255736707,5.0));
#379=DIRECTION('',(0.0,0.0,-1.0));
#380=DIRECTION('',(1.0,0.0,0.0));
#381=ORIENTED_EDGE('',*,*,#766,.T.);
#382=ORIENTED_EDGE('',*,*,#758,.T.);
#383=ORIENTED_EDGE('',*,*,#767,.T.);
#384=ORIENTED_EDGE('',*,*,#768,.F.);
#385=ORIENTED_EDGE('',*,*,#769,.F.);
#386=ORIENTED_EDGE('',*,*,#770,.F.);
#387=ORIENTED_EDGE('',*,*,#771,.F.);
#388=ORIENTED_EDGE('',*,*,#772,.F.);
#389=ORIENTED_EDGE('',*,*,#773,.T.);
#390=ORIENTED_EDGE('',*,*,#774,.T.);
#391=ORIENTED_EDGE('',*,*,#775,.F.);
#392=ORIENTED_EDGE('',*,*,#776,.F.);
#393=ORIENTED_EDGE('',*,*,#764,.F.);
#394=ORIENTED_EDGE('',*,*,#777,.F.);
#395=ORIENTED_EDGE('',*,*,#778,.F.);
#396=ORIENTED_EDGE('',*,*,#779,.F.);
#397=ORIENTED_EDGE('',*,*,#780,.F.);
#398=ORIENTED_EDGE('',*,*,#781,.F.);
#399=ORIENTED_EDGE('',*,*,#782,.F.);
#400=ORIENTED_EDGE('',*,*,#783,.F.);
#401=ORIENTED_EDGE('',*,*,#784,.F.);
#402=ORIENTED_EDGE('',*,*,#785,.F.);
#403=ORIENTED_EDGE('',*,*,#786,.F.);
#404=ORIENTED_EDGE('',*,*,#787,.F.);
#405=ORIENTED_EDGE('',*,*,#788,.F.);
#406=ORIENTED_EDGE('',*,*,#789,.T.);
#407=ORIENTED_EDGE('',*,*,#790,.T.);
#408=ORIENTED_EDGE('',*,*,#791,.T.);
#409=ORIENTED_EDGE('',*,*,#792,.T.);
#410=ORIENTED_EDGE('',*,*,#793,.T.);
#411=ORIENTED_EDGE('',*,*,#794,.T.);
#412=ORIENTED_EDGE('',*,*,#795,.T.);
#413=CARTESIAN_POINT('',(15.0009421556172,40.035,5.0));
#414=DIRECTION('',(0.0,0.0,1.0));
#415=DIRECTION('',(1.0,0.0,0.0));
#416=ORIENTED_EDGE('',*,*,#796,.F.);
#417=ORIENTED_EDGE('',*,*,#797,.F.);
#418=ORIENTED_EDGE('',*,*,#798,.F.);
#419=ORIENTED_EDGE('',*,*,#775,.T.);
#420=ORIENTED_EDGE('',*,*,#799,.T.);
#421=ORIENTED_EDGE('',*,*,#800,.T.);
#422=ORIENTED_EDGE('',*,*,#801,.T.);
#423=ORIENTED_EDGE('',*,*,#788,.T.);
#424=ORIENTED_EDGE('',*,*,#802,.F.);
#425=ORIENTED_EDGE('',*,*,#803,.F.);
#426=CARTESIAN_POINT('',(0.0,59.0,0.0));
#427=DIRECTION('',(0.0,-1.0,0.0));
#428=DIRECTION('',(1.0,0.0,0.0));
#429=ORIENTED_EDGE('',*,*,#773,.F.);
#430=ORIENTED_EDGE('',*,*,#804,.T.);
#431=ORIENTED_EDGE('',*,*,#805,.F.);
#432=ORIENTED_EDGE('',*,*,#806,.T.);
#433=ORIENTED_EDGE('',*,*,#807,.T.);
#434=CARTESIAN_POINT('',(15.0009421556172,40.035,0.0));
#435=DIRECTION('',(0.0,0.0,1.0));
#436=DIRECTION('',(1.0,0.0,0.0));
#437=ORIENTED_EDGE('',*,*,#808,.F.);
#438=ORIENTED_EDGE('',*,*,#809,.F.);
#439=ORIENTED_EDGE('',*,*,#810,.T.);
#440=ORIENTED_EDGE('',*,*,#811,.T.);
#441=CARTESIAN_POINT('',(17.9999999990919,22.2874969710626,0.0));
#442=DIRECTION('',(0.0,0.0,1.0));
#443=DIRECTION('',(-1.0,0.0,0.0));
#444=ORIENTED_EDGE('',*,*,#812,.T.);
#445=ORIENTED_EDGE('',*,*,#771,.T.);
#446=ORIENTED_EDGE('',*,*,#813,.T.);
#447=ORIENTED_EDGE('',*,*,#814,.F.);
#448=CARTESIAN_POINT('',(19.9999999985966,26.9589516208863,0.0));
#449=DIRECTION('',(1.0,-6.12303176911189E-17,0.0));
#450=DIRECTION('',(-6.12303176911189E-17,-1.0,0.0));
#451=ORIENTED_EDGE('',*,*,#815,.T.);
#452=ORIENTED_EDGE('',*,*,#814,.T.);
#453=ORIENTED_EDGE('',*,*,#816,.T.);
#454=ORIENTED_EDGE('',*,*,#817,.T.);
#455=ORIENTED_EDGE('',*,*,#818,.T.);
#456=ORIENTED_EDGE('',*,*,#819,.T.);
#457=ORIENTED_EDGE('',*,*,#820,.T.);
#458=ORIENTED_EDGE('',*,*,#821,.T.);
#459=ORIENTED_EDGE('',*,*,#808,.T.);
#460=ORIENTED_EDGE('',*,*,#822,.T.);
#461=ORIENTED_EDGE('',*,*,#823,.T.);
#462=CARTESIAN_POINT('',(15.0004711024671,40.0358159449349,1.0));
#463=DIRECTION('',(0.0,0.0,-1.0));
#464=DIRECTION('',(0.0,-1.0,0.0));
#465=ORIENTED_EDGE('',*,*,#822,.F.);
#466=ORIENTED_EDGE('',*,*,#811,.F.);
#467=ORIENTED_EDGE('',*,*,#824,.T.);
#468=ORIENTED_EDGE('',*,*,#805,.T.);
#469=CARTESIAN_POINT('',(15.0004711024671,40.0358159449349,0.0));
#470=DIRECTION('',(0.0,0.0,1.0));
#471=DIRECTION('',(-1.0,0.0,0.0));
#472=ORIENTED_EDGE('',*,*,#823,.F.);
#473=ORIENTED_EDGE('',*,*,#804,.F.);
#474=ORIENTED_EDGE('',*,*,#772,.T.);
#475=ORIENTED_EDGE('',*,*,#812,.F.);
#476=CARTESIAN_POINT('',(23.9999999985966,24.4470866943614,0.0));
#477=DIRECTION('',(0.0,0.0,1.0));
#478=DIRECTION('',(1.0,0.0,0.0));
#479=ORIENTED_EDGE('',*,*,#825,.F.);
#480=ORIENTED_EDGE('',*,*,#826,.F.);
#481=ORIENTED_EDGE('',*,*,#760,.T.);
#482=ORIENTED_EDGE('',*,*,#827,.T.);
#483=ORIENTED_EDGE('',*,*,#828,.T.);
#484=ORIENTED_EDGE('',*,*,#829,.T.);
#485=ORIENTED_EDGE('',*,*,#830,.T.);
#486=ORIENTED_EDGE('',*,*,#831,.T.);
#487=ORIENTED_EDGE('',*,*,#832,.T.);
#488=ORIENTED_EDGE('',*,*,#833,.T.);
#489=ORIENTED_EDGE('',*,*,#834,.F.);
#490=ORIENTED_EDGE('',*,*,#800,.F.);
#491=ORIENTED_EDGE('',*,*,#835,.F.);
#492=ORIENTED_EDGE('',*,*,#806,.F.);
#493=ORIENTED_EDGE('',*,*,#824,.F.);
#494=ORIENTED_EDGE('',*,*,#810,.F.);
#495=ORIENTED_EDGE('',*,*,#836,.F.);
#496=ORIENTED_EDGE('',*,*,#837,.T.);
#497=ORIENTED_EDGE('',*,*,#838,.F.);
#498=CARTESIAN_POINT('',(15.0009421556172,40.035,0.0));
#499=DIRECTION('',(0.0,0.0,1.0));
#500=DIRECTION('',(1.0,0.0,0.0));
#501=ORIENTED_EDGE('',*,*,#834,.T.);
#502=ORIENTED_EDGE('',*,*,#839,.T.);
#503=ORIENTED_EDGE('',*,*,#789,.F.);
#504=ORIENTED_EDGE('',*,*,#801,.F.);
#505=CARTESIAN_POINT('',(0.0,9.7845,0.0));
#506=DIRECTION('',(-1.0,-1.60814287233912E-16,0.0));
#507=DIRECTION('',(-1.60814287233912E-16,1.0,0.0));
#508=ORIENTED_EDGE('',*,*,#821,.F.);
#509=ORIENTED_EDGE('',*,*,#840,.T.);
#510=ORIENTED_EDGE('',*,*,#836,.T.);
#511=ORIENTED_EDGE('',*,*,#809,.T.);
#512=CARTESIAN_POINT('',(13.9999999992157,17.8519895457596,5.0));
#513=DIRECTION('',(1.0,-6.12303176911189E-17,0.0));
#514=DIRECTION('',(-6.12303176911189E-17,-1.0,0.0));
#515=ORIENTED_EDGE('',*,*,#813,.F.);
#516=ORIENTED_EDGE('',*,*,#770,.T.);
#517=ORIENTED_EDGE('',*,*,#841,.F.);
#518=ORIENTED_EDGE('',*,*,#816,.F.);
#519=CARTESIAN_POINT('',(23.9999999985966,18.5,0.0));
#520=DIRECTION('',(0.0,0.0,1.0));
#521=DIRECTION('',(1.0,0.0,0.0));
#522=ORIENTED_EDGE('',*,*,#833,.F.);
#523=ORIENTED_EDGE('',*,*,#842,.T.);
#524=ORIENTED_EDGE('',*,*,#790,.F.);
#525=ORIENTED_EDGE('',*,*,#839,.F.);
#526=CARTESIAN_POINT('',(-0.5,34.9389995429616,0.0));
#527=DIRECTION('',(0.0,0.0,1.0));
#528=DIRECTION('',(1.0,0.0,0.0));
#529=ORIENTED_EDGE('',*,*,#842,.F.);
#530=ORIENTED_EDGE('',*,*,#832,.F.);
#531=ORIENTED_EDGE('',*,*,#843,.F.);
#532=ORIENTED_EDGE('',*,*,#791,.F.);
#533=CARTESIAN_POINT('',(-0.5,33.9389995429616,0.0));
#534=DIRECTION('',(0.0,0.0,1.0));
#535=DIRECTION('',(1.0,0.0,0.0));
#536=ORIENTED_EDGE('',*,*,#830,.F.);
#537=ORIENTED_EDGE('',*,*,#844,.F.);
#538=ORIENTED_EDGE('',*,*,#793,.F.);
#539=ORIENTED_EDGE('',*,*,#845,.F.);
#540=CARTESIAN_POINT('',(-2.0,25.9389995429616,0.0));
#541=DIRECTION('',(0.0,0.0,-1.0));
#542=DIRECTION('',(-1.0,0.0,0.0));
#543=ORIENTED_EDGE('',*,*,#820,.F.);
#544=ORIENTED_EDGE('',*,*,#846,.F.);
#545=ORIENTED_EDGE('',*,*,#837,.F.);
#546=ORIENTED_EDGE('',*,*,#840,.F.);
#547=CARTESIAN_POINT('',(9.9999999992157,5.5,5.0));
#548=DIRECTION('',(0.0,0.0,-1.0));
#549=DIRECTION('',(-1.0,0.0,0.0));
#550=ORIENTED_EDGE('',*,*,#798,.T.);
#551=ORIENTED_EDGE('',*,*,#847,.F.);
#552=ORIENTED_EDGE('',*,*,#765,.F.);
#553=ORIENTED_EDGE('',*,*,#776,.T.);
#554=CARTESIAN_POINT('',(27.0,50.6933376770153,5.0));
#555=DIRECTION('',(-1.0,6.12303176911189E-17,0.0));
#556=DIRECTION('',(6.12303176911189E-17,1.0,0.0));
#557=ORIENTED_EDGE('',*,*,#802,.T.);
#558=ORIENTED_EDGE('',*,*,#787,.T.);
#559=ORIENTED_EDGE('',*,*,#848,.T.);
#560=ORIENTED_EDGE('',*,*,#849,.F.);
#561=CARTESIAN_POINT('',(23.9,50.6933376770153,5.0));
#562=DIRECTION('',(1.0,-6.12303176911189E-17,0.0));
#563=DIRECTION('',(-6.12303176911189E-17,-1.0,0.0));
#564=ORIENTED_EDGE('',*,*,#825,.T.);
#565=ORIENTED_EDGE('',*,*,#850,.T.);
#566=ORIENTED_EDGE('',*,*,#851,.F.);
#567=ORIENTED_EDGE('',*,*,#781,.T.);
#568=ORIENTED_EDGE('',*,*,#852,.T.);
#569=CARTESIAN_POINT('',(-3.0,13.2194997714808,5.0));
#570=DIRECTION('',(0.0,0.0,-1.0));
#571=DIRECTION('',(1.0,0.0,0.0));
#572=ORIENTED_EDGE('',*,*,#794,.F.);
#573=ORIENTED_EDGE('',*,*,#844,.T.);
#574=ORIENTED_EDGE('',*,*,#829,.F.);
#575=ORIENTED_EDGE('',*,*,#853,.F.);
#576=CARTESIAN_POINT('',(-0.5,24.9389995429616,5.0));
#577=DIRECTION('',(0.0,-1.0,0.0));
#578=DIRECTION('',(-1.0,0.0,0.0));
#579=ORIENTED_EDGE('',*,*,#828,.F.);
#580=ORIENTED_EDGE('',*,*,#854,.F.);
#581=ORIENTED_EDGE('',*,*,#795,.F.);
#582=ORIENTED_EDGE('',*,*,#853,.T.);
#583=CARTESIAN_POINT('',(-3.0,22.9389995429616,5.0));
#584=DIRECTION('',(0.0,0.0,-1.0));
#585=DIRECTION('',(1.0,0.0,0.0));
#586=ORIENTED_EDGE('',*,*,#827,.F.);
#587=ORIENTED_EDGE('',*,*,#759,.T.);
#588=ORIENTED_EDGE('',*,*,#766,.F.);
#589=ORIENTED_EDGE('',*,*,#854,.T.);
#590=CARTESIAN_POINT('',(-5.0,13.2194997714808,5.0));
#591=DIRECTION('',(1.0,-6.12303176911189E-17,0.0));
#592=DIRECTION('',(-6.12303176911189E-17,-1.0,0.0));
#593=ORIENTED_EDGE('',*,*,#855,.F.);
#594=VERTEX_POINT('',#856);
#595=CARTESIAN_POINT('',(19.9999999987784,551.778312163547,2.5000000000001));
#596=DIRECTION('',(-2.39002567398391E-12,1.0,4.96735760103524E-18));
#597=DIRECTION('',(-5.2935253982588E-15,-4.9673576136869E-18,1.0));
#598=ORIENTED_EDGE('',*,*,#857,.T.);
#599=ORIENTED_EDGE('',*,*,#855,.T.);
#600=CARTESIAN_POINT('',(19.999999999949,62.0000000000345,2.5000000000001));
#601=DIRECTION('',(2.39002567398391E-12,-1.0,-4.96735760103524E-18));
#602=DIRECTION('',(-5.2935253982588E-15,-4.9673576136869E-18,1.0));
#603=ORIENTED_EDGE('',*,*,#858,.F.);
#604=VERTEX_POINT('',#859);
#605=CARTESIAN_POINT('',(2.4999999988,551.778312163505,2.49999999999926));
#606=DIRECTION('',(-2.39002567398308E-12,1.0,4.96733113134847E-18));
#607=DIRECTION('',(-5.32128097387443E-15,-4.96733114406647E-18,1.0));
#608=ORIENTED_EDGE('',*,*,#860,.T.);
#609=ORIENTED_EDGE('',*,*,#858,.T.);
#610=CARTESIAN_POINT('',(2.49999999997059,61.9999999999927,2.49999999999925));
#611=DIRECTION('',(2.39002567398308E-12,-1.0,-4.96733113134847E-18));
#612=DIRECTION('',(-5.32128097387443E-15,-4.96733114406647E-18,1.0));
#613=ORIENTED_EDGE('',*,*,#861,.F.);
#614=CARTESIAN_POINT('',(23.9999999989062,18.5,4.0));
#615=DIRECTION('',(0.0,0.0,1.0));
#616=DIRECTION('',(1.0,0.0,0.0));
#617=ORIENTED_EDGE('',*,*,#831,.F.);
#618=ORIENTED_EDGE('',*,*,#845,.T.);
#619=ORIENTED_EDGE('',*,*,#792,.F.);
#620=ORIENTED_EDGE('',*,*,#843,.T.);
#621=CARTESIAN_POINT('',(-1.0,29.4389995429616,0.0));
#622=DIRECTION('',(1.0,-6.12303176911189E-17,0.0));
#623=DIRECTION('',(6.12303176911189E-17,1.0,0.0));
#624=ORIENTED_EDGE('',*,*,#862,.T.);
#625=CARTESIAN_POINT('',(5.0,29.4389995429616,3.0));
#626=DIRECTION('',(0.0,0.0,-1.0));
#627=DIRECTION('',(-1.0,0.0,0.0));
#628=ORIENTED_EDGE('',*,*,#838,.T.);
#629=ORIENTED_EDGE('',*,*,#862,.F.);
#630=CARTESIAN_POINT('',(5.0,29.4389995429616,0.0));
#631=DIRECTION('',(0.0,0.0,1.0));
#632=DIRECTION('',(-1.0,0.0,0.0));
#633=ORIENTED_EDGE('',*,*,#767,.F.);
#634=ORIENTED_EDGE('',*,*,#761,.T.);
#635=ORIENTED_EDGE('',*,*,#826,.T.);
#636=ORIENTED_EDGE('',*,*,#846,.T.);
#637=ORIENTED_EDGE('',*,*,#819,.F.);
#638=ORIENTED_EDGE('',*,*,#863,.F.);
#639=CARTESIAN_POINT('',(19.4999999999994,1.5,4.0));
#640=DIRECTION('',(0.0,-1.0,0.0));
#641=DIRECTION('',(-1.0,0.0,0.0));
#642=ORIENTED_EDGE('',*,*,#864,.F.);
#643=ORIENTED_EDGE('',*,*,#768,.T.);
#644=ORIENTED_EDGE('',*,*,#863,.T.);
#645=ORIENTED_EDGE('',*,*,#818,.F.);
#646=CARTESIAN_POINT('',(24.9999999999988,8.0,4.0));
#647=DIRECTION('',(0.0,0.0,-1.0));
#648=DIRECTION('',(1.0,0.0,0.0));
#649=ORIENTED_EDGE('',*,*,#817,.F.);
#650=ORIENTED_EDGE('',*,*,#841,.T.);
#651=ORIENTED_EDGE('',*,*,#769,.T.);
#652=ORIENTED_EDGE('',*,*,#864,.T.);
#653=CARTESIAN_POINT('',(22.4999999992978,14.5,4.0));
#654=DIRECTION('',(1.22460635382238E-16,1.0,0.0));
#655=DIRECTION('',(1.0,-1.22460635382238E-16,0.0));
#656=ORIENTED_EDGE('',*,*,#815,.F.);
#657=ORIENTED_EDGE('',*,*,#861,.T.);
#658=CARTESIAN_POINT('',(25.0,8.0,4.0));
#659=DIRECTION('',(0.0,0.0,-1.0));
#660=DIRECTION('',(1.0,0.0,0.0));
#661=ORIENTED_EDGE('',*,*,#860,.F.);
#662=ORIENTED_EDGE('',*,*,#796,.T.);
#663=CARTESIAN_POINT('',(2.49999999997059,61.9999999999927,2.49999999999925));
#664=DIRECTION('',(2.39002567398308E-12,-1.0,-4.96733113134847E-18));
#665=DIRECTION('',(-5.32128097387443E-15,-4.96733114406647E-18,1.0));
#666=ORIENTED_EDGE('',*,*,#857,.F.);
#667=ORIENTED_EDGE('',*,*,#797,.T.);
#668=CARTESIAN_POINT('',(19.999999999949,62.0000000000345,2.5000000000001));
#669=DIRECTION('',(2.39002567398391E-12,-1.0,-4.96735760103524E-18));
#670=DIRECTION('',(-5.2935253982588E-15,-4.9673576136869E-18,1.0));
#671=ORIENTED_EDGE('',*,*,#774,.F.);
#672=ORIENTED_EDGE('',*,*,#807,.F.);
#673=ORIENTED_EDGE('',*,*,#835,.T.);
#674=ORIENTED_EDGE('',*,*,#799,.F.);
#675=CARTESIAN_POINT('',(29.0,47.0175,0.0));
#676=DIRECTION('',(1.0,6.12303176911189E-17,0.0));
#677=DIRECTION('',(-6.12303176911189E-17,1.0,0.0));
#678=ORIENTED_EDGE('',*,*,#865,.F.);
#679=ORIENTED_EDGE('',*,*,#866,.F.);
#680=ORIENTED_EDGE('',*,*,#785,.T.);
#681=ORIENTED_EDGE('',*,*,#867,.T.);
#682=CARTESIAN_POINT('',(24.0067595328868,26.0840346092706,5.0));
#683=DIRECTION('',(0.0,0.0,-1.0));
#684=DIRECTION('',(1.0,0.0,0.0));
#685=ORIENTED_EDGE('',*,*,#868,.F.);
#686=ORIENTED_EDGE('',*,*,#867,.F.);
#687=ORIENTED_EDGE('',*,*,#784,.T.);
#688=ORIENTED_EDGE('',*,*,#869,.T.);
#689=CARTESIAN_POINT('',(14.9202786000254,21.3767671904174,5.0));
#690=DIRECTION('',(1.0,-1.15975505295216E-11,0.0));
#691=DIRECTION('',(-1.15975505295216E-11,-1.0,0.0));
#692=ORIENTED_EDGE('',*,*,#870,.F.);
#693=ORIENTED_EDGE('',*,*,#848,.F.);
#694=ORIENTED_EDGE('',*,*,#786,.T.);
#695=ORIENTED_EDGE('',*,*,#866,.T.);
#696=CARTESIAN_POINT('',(15.0279781664862,41.6368255736707,5.0));
#697=DIRECTION('',(0.0,0.0,-1.0));
#698=DIRECTION('',(1.0,0.0,0.0));
#699=ORIENTED_EDGE('',*,*,#871,.F.);
#700=ORIENTED_EDGE('',*,*,#869,.F.);
#701=ORIENTED_EDGE('',*,*,#783,.T.);
#702=ORIENTED_EDGE('',*,*,#872,.T.);
#703=CARTESIAN_POINT('',(13.0202785999708,16.6694997714808,5.0));
#704=DIRECTION('',(0.0,0.0,-1.0));
#705=DIRECTION('',(1.0,0.0,0.0));
#706=ORIENTED_EDGE('',*,*,#873,.F.);
#707=ORIENTED_EDGE('',*,*,#872,.F.);
#708=ORIENTED_EDGE('',*,*,#782,.T.);
#709=ORIENTED_EDGE('',*,*,#851,.T.);
#710=CARTESIAN_POINT('',(5.0101392999854,14.7694997714808,5.0));
#711=DIRECTION('',(0.0,-1.0,0.0));
#712=DIRECTION('',(-1.0,0.0,0.0));
#713=ORIENTED_EDGE('',*,*,#874,.F.);
#714=ORIENTED_EDGE('',*,*,#852,.F.);
#715=ORIENTED_EDGE('',*,*,#780,.T.);
#716=ORIENTED_EDGE('',*,*,#875,.T.);
#717=CARTESIAN_POINT('',(5.0101392999854,11.6694997714808,5.0));
#718=DIRECTION('',(-0.0,1.0,0.0));
#719=DIRECTION('',(1.0,0.0,0.0));
#720=ORIENTED_EDGE('',*,*,#876,.F.);
#721=ORIENTED_EDGE('',*,*,#875,.F.);
#722=ORIENTED_EDGE('',*,*,#779,.T.);
#723=ORIENTED_EDGE('',*,*,#877,.T.);
#724=CARTESIAN_POINT('',(13.0202785999708,16.6694997714808,5.0));
#725=DIRECTION('',(0.0,0.0,-1.0));
#726=DIRECTION('',(1.0,0.0,0.0));
#727=ORIENTED_EDGE('',*,*,#878,.F.);
#728=ORIENTED_EDGE('',*,*,#877,.F.);
#729=ORIENTED_EDGE('',*,*,#778,.T.);
#730=ORIENTED_EDGE('',*,*,#879,.T.);
#731=CARTESIAN_POINT('',(18.0202786000254,21.3767671903814,5.0));
#732=DIRECTION('',(-1.0,1.15975505295216E-11,0.0));
#733=DIRECTION('',(1.15975505295216E-11,1.0,0.0));
#734=ORIENTED_EDGE('',*,*,#880,.F.);
#735=ORIENTED_EDGE('',*,*,#879,.F.);
#736=ORIENTED_EDGE('',*,*,#777,.T.);
#737=ORIENTED_EDGE('',*,*,#763,.T.);
#738=CARTESIAN_POINT('',(24.0067595328868,26.0840346092706,5.0));
#739=DIRECTION('',(0.0,0.0,-1.0));
#740=DIRECTION('',(1.0,0.0,0.0));
#741=ORIENTED_EDGE('',*,*,#803,.T.);
#742=ORIENTED_EDGE('',*,*,#849,.T.);
#743=ORIENTED_EDGE('',*,*,#870,.T.);
#744=ORIENTED_EDGE('',*,*,#865,.T.);
#745=ORIENTED_EDGE('',*,*,#868,.T.);
#746=ORIENTED_EDGE('',*,*,#871,.T.);
#747=ORIENTED_EDGE('',*,*,#873,.T.);
#748=ORIENTED_EDGE('',*,*,#850,.F.);
#749=ORIENTED_EDGE('',*,*,#874,.T.);
#750=ORIENTED_EDGE('',*,*,#876,.T.);
#751=ORIENTED_EDGE('',*,*,#878,.T.);
#752=ORIENTED_EDGE('',*,*,#880,.T.);
#753=ORIENTED_EDGE('',*,*,#762,.T.);
#754=ORIENTED_EDGE('',*,*,#847,.T.);
#755=CARTESIAN_POINT('',(15.0279781664862,41.6368255736707,3.0));
#756=DIRECTION('',(0.0,0.0,1.0));
#757=DIRECTION('',(1.0,0.0,0.0));
#758=EDGE_CURVE('',#881,#882,#883,.T.);
#759=EDGE_CURVE('',#884,#881,#885,.F.);
#760=EDGE_CURVE('',#886,#884,#887,.F.);
#761=EDGE_CURVE('',#882,#886,#888,.T.);
#762=EDGE_CURVE('',#889,#890,#891,.T.);
#763=EDGE_CURVE('',#892,#889,#893,.T.);
#764=EDGE_CURVE('',#892,#894,#895,.T.);
#765=EDGE_CURVE('',#894,#890,#896,.T.);
#766=EDGE_CURVE('',#897,#881,#898,.T.);
#767=EDGE_CURVE('',#882,#899,#900,.T.);
#768=EDGE_CURVE('',#901,#899,#902,.F.);
#769=EDGE_CURVE('',#903,#901,#904,.T.);
#770=EDGE_CURVE('',#905,#903,#906,.T.);
#771=EDGE_CURVE('',#907,#905,#908,.T.);
#772=EDGE_CURVE('',#909,#907,#910,.T.);
#773=EDGE_CURVE('',#909,#911,#912,.T.);
#774=EDGE_CURVE('',#911,#913,#914,.T.);
#775=EDGE_CURVE('',#915,#913,#916,.T.);
#776=EDGE_CURVE('',#894,#915,#917,.T.);
#777=EDGE_CURVE('',#918,#892,#919,.T.);
#778=EDGE_CURVE('',#920,#918,#921,.T.);
#779=EDGE_CURVE('',#922,#920,#923,.T.);
#780=EDGE_CURVE('',#924,#922,#925,.T.);
#781=EDGE_CURVE('',#926,#924,#927,.T.);
#782=EDGE_CURVE('',#928,#926,#929,.T.);
#783=EDGE_CURVE('',#930,#928,#931,.T.);
#784=EDGE_CURVE('',#932,#930,#933,.T.);
#785=EDGE_CURVE('',#934,#932,#935,.T.);
#786=EDGE_CURVE('',#936,#934,#937,.T.);
#787=EDGE_CURVE('',#938,#936,#939,.T.);
#788=EDGE_CURVE('',#940,#938,#941,.T.);
#789=EDGE_CURVE('',#940,#942,#943,.T.);
#790=EDGE_CURVE('',#942,#944,#945,.F.);
#791=EDGE_CURVE('',#944,#946,#947,.T.);
#792=EDGE_CURVE('',#946,#948,#949,.T.);
#793=EDGE_CURVE('',#948,#950,#951,.F.);
#794=EDGE_CURVE('',#950,#952,#953,.T.);
#795=EDGE_CURVE('',#952,#897,#954,.T.);
#796=EDGE_CURVE('',#955,#955,#956,.F.);
#797=EDGE_CURVE('',#957,#957,#958,.F.);
#798=EDGE_CURVE('',#915,#959,#960,.T.);
#799=EDGE_CURVE('',#913,#961,#962,.T.);
#800=EDGE_CURVE('',#961,#963,#964,.T.);
#801=EDGE_CURVE('',#963,#940,#965,.T.);
#802=EDGE_CURVE('',#966,#938,#967,.T.);
#803=EDGE_CURVE('',#959,#966,#968,.T.);
#804=EDGE_CURVE('',#909,#969,#970,.T.);
#805=EDGE_CURVE('',#971,#969,#972,.T.);
#806=EDGE_CURVE('',#971,#973,#974,.T.);
#807=EDGE_CURVE('',#973,#911,#975,.T.);
#808=EDGE_CURVE('',#976,#977,#978,.T.);
#809=EDGE_CURVE('',#979,#976,#980,.T.);
#810=EDGE_CURVE('',#979,#981,#982,.T.);
#811=EDGE_CURVE('',#981,#977,#983,.T.);
#812=EDGE_CURVE('',#984,#907,#985,.T.);
#813=EDGE_CURVE('',#905,#986,#987,.T.);
#814=EDGE_CURVE('',#984,#986,#988,.T.);
#815=EDGE_CURVE('',#989,#989,#990,.F.);
#816=EDGE_CURVE('',#986,#991,#992,.F.);
#817=EDGE_CURVE('',#991,#993,#994,.T.);
#818=EDGE_CURVE('',#993,#995,#996,.T.);
#819=EDGE_CURVE('',#995,#997,#998,.T.);
#820=EDGE_CURVE('',#997,#999,#1000,.F.);
#821=EDGE_CURVE('',#999,#976,#1001,.T.);
#822=EDGE_CURVE('',#977,#969,#1002,.T.);
#823=EDGE_CURVE('',#969,#984,#1003,.T.);
#824=EDGE_CURVE('',#981,#971,#1004,.T.);
#825=EDGE_CURVE('',#1005,#1005,#1006,.T.);
#826=EDGE_CURVE('',#886,#1007,#1008,.T.);
#827=EDGE_CURVE('',#884,#1009,#1010,.T.);
#828=EDGE_CURVE('',#1009,#1011,#1012,.T.);
#829=EDGE_CURVE('',#1011,#1013,#1014,.T.);
#830=EDGE_CURVE('',#1013,#1015,#1016,.T.);
#831=EDGE_CURVE('',#1015,#1017,#1018,.T.);
#832=EDGE_CURVE('',#1017,#1019,#1020,.F.);
#833=EDGE_CURVE('',#1019,#1021,#1022,.T.);
#834=EDGE_CURVE('',#963,#1021,#1023,.T.);
#835=EDGE_CURVE('',#973,#961,#1024,.T.);
#836=EDGE_CURVE('',#1025,#979,#1026,.T.);
#837=EDGE_CURVE('',#1025,#1007,#1027,.F.);
#838=EDGE_CURVE('',#1028,#1028,#1029,.T.);
#839=EDGE_CURVE('',#1021,#942,#1030,.T.);
#840=EDGE_CURVE('',#999,#1025,#1031,.T.);
#841=EDGE_CURVE('',#991,#903,#1032,.F.);
#842=EDGE_CURVE('',#1019,#944,#1033,.T.);
#843=EDGE_CURVE('',#946,#1017,#1034,.F.);
#844=EDGE_CURVE('',#950,#1013,#1035,.F.);
#845=EDGE_CURVE('',#1015,#948,#1036,.T.);
#846=EDGE_CURVE('',#1007,#997,#1037,.F.);
#847=EDGE_CURVE('',#890,#959,#1038,.T.);
#848=EDGE_CURVE('',#936,#1039,#1040,.T.);
#849=EDGE_CURVE('',#966,#1039,#1041,.T.);
#850=EDGE_CURVE('',#1042,#1043,#1044,.T.);
#851=EDGE_CURVE('',#926,#1043,#1045,.T.);
#852=EDGE_CURVE('',#924,#1042,#1046,.T.);
#853=EDGE_CURVE('',#952,#1011,#1047,.T.);
#854=EDGE_CURVE('',#897,#1009,#1048,.T.);
#855=EDGE_CURVE('',#1049,#1049,#1050,.T.);
#856=CARTESIAN_POINT('',(19.9999999999734,51.7783121635475,2.5000000000001));
#857=EDGE_CURVE('',#1051,#1051,#1052,.F.);
#858=EDGE_CURVE('',#1053,#1053,#1054,.T.);
#859=CARTESIAN_POINT('',(2.49999999999502,51.7783121635056,2.49999999999925));
#860=EDGE_CURVE('',#1055,#1055,#1056,.F.);
#861=EDGE_CURVE('',#1057,#1057,#1058,.T.);
#862=EDGE_CURVE('',#1059,#1059,#1060,.T.);
#863=EDGE_CURVE('',#899,#995,#1061,.T.);
#864=EDGE_CURVE('',#901,#993,#1062,.T.);
#865=EDGE_CURVE('',#1063,#1064,#1065,.T.);
#866=EDGE_CURVE('',#934,#1063,#1066,.T.);
#867=EDGE_CURVE('',#932,#1064,#1067,.T.);
#868=EDGE_CURVE('',#1064,#1068,#1069,.T.);
#869=EDGE_CURVE('',#930,#1068,#1070,.T.);
#870=EDGE_CURVE('',#1039,#1063,#1071,.T.);
#871=EDGE_CURVE('',#1068,#1072,#1073,.T.);
#872=EDGE_CURVE('',#928,#1072,#1074,.T.);
#873=EDGE_CURVE('',#1072,#1043,#1075,.T.);
#874=EDGE_CURVE('',#1042,#1076,#1077,.T.);
#875=EDGE_CURVE('',#922,#1076,#1078,.T.);
#876=EDGE_CURVE('',#1076,#1079,#1080,.T.);
#877=EDGE_CURVE('',#920,#1079,#1081,.T.);
#878=EDGE_CURVE('',#1079,#1082,#1083,.T.);
#879=EDGE_CURVE('',#918,#1082,#1084,.T.);
#880=EDGE_CURVE('',#1082,#889,#1085,.T.);
#881=VERTEX_POINT('',#1086);
#882=VERTEX_POINT('',#1087);
#883=CIRCLE('',#1088,2.0);
#884=VERTEX_POINT('',#1089);
#885=LINE('',#1090,#1091);
#886=VERTEX_POINT('',#1092);
#887=CIRCLE('',#1093,2.0);
#888=LINE('',#1094,#1095);
#889=VERTEX_POINT('',#1096);
#890=VERTEX_POINT('',#1097);
#891=CIRCLE('',#1098,11.9720218335139);
#892=VERTEX_POINT('',#1099);
#893=LINE('',#1100,#1101);
#894=VERTEX_POINT('',#1102);
#895=CIRCLE('',#1103,11.9720218335139);
#896=LINE('',#1104,#1105);
#897=VERTEX_POINT('',#1106);
#898=LINE('',#1107,#1108);
#899=VERTEX_POINT('',#1109);
#900=LINE('',#1110,#1111);
#901=VERTEX_POINT('',#1112);
#902=CIRCLE('',#1113,6.5);
#903=VERTEX_POINT('',#1114);
#904=LINE('',#1115,#1116);
#905=VERTEX_POINT('',#1117);
#906=CIRCLE('',#1118,4.0);
#907=VERTEX_POINT('',#1119);
#908=LINE('',#1120,#1121);
#909=VERTEX_POINT('',#1122);
#910=CIRCLE('',#1123,4.0);
#911=VERTEX_POINT('',#1124);
#912=CIRCLE('',#1125,13.9990578443828);
#913=VERTEX_POINT('',#1126);
#914=LINE('',#1127,#1128);
#915=VERTEX_POINT('',#1129);
#916=LINE('',#1130,#1131);
#917=LINE('',#1132,#1133);
#918=VERTEX_POINT('',#1134);
#919=CIRCLE('',#1135,5.98648093280679);
#920=VERTEX_POINT('',#1136);
#921=LINE('',#1137,#1138);
#922=VERTEX_POINT('',#1139);
#923=CIRCLE('',#1140,5.0);
#924=VERTEX_POINT('',#1141);
#925=LINE('',#1142,#1143);
#926=VERTEX_POINT('',#1144);
#927=CIRCLE('',#1145,1.55);
#928=VERTEX_POINT('',#1146);
#929=LINE('',#1147,#1148);
#930=VERTEX_POINT('',#1149);
#931=CIRCLE('',#1150,1.9);
#932=VERTEX_POINT('',#1151);
#933=LINE('',#1152,#1153);
#934=VERTEX_POINT('',#1154);
#935=CIRCLE('',#1155,9.08648093280679);
#936=VERTEX_POINT('',#1156);
#937=CIRCLE('',#1157,8.87202183351388);
#938=VERTEX_POINT('',#1158);
#939=LINE('',#1159,#1160);
#940=VERTEX_POINT('',#1161);
#941=LINE('',#1162,#1163);
#942=VERTEX_POINT('',#1164);
#943=LINE('',#1165,#1166);
#944=VERTEX_POINT('',#1167);
#945=CIRCLE('',#1168,0.5);
#946=VERTEX_POINT('',#1169);
#947=CIRCLE('',#1170,0.5);
#948=VERTEX_POINT('',#1171);
#949=LINE('',#1172,#1173);
#950=VERTEX_POINT('',#1174);
#951=CIRCLE('',#1175,1.0);
#952=VERTEX_POINT('',#1176);
#953=LINE('',#1177,#1178);
#954=CIRCLE('',#1179,2.0);
#955=VERTEX_POINT('',#1180);
#956=CIRCLE('',#1181,1.25);
#957=VERTEX_POINT('',#1182);
#958=CIRCLE('',#1183,1.25);
#959=VERTEX_POINT('',#1184);
#960=LINE('',#1185,#1186);
#961=VERTEX_POINT('',#1187);
#962=LINE('',#1188,#1189);
#963=VERTEX_POINT('',#1190);
#964=LINE('',#1191,#1192);
#965=LINE('',#1193,#1194);
#966=VERTEX_POINT('',#1195);
#967=LINE('',#1196,#1197);
#968=LINE('',#1198,#1199);
#969=VERTEX_POINT('',#1200);
#970=LINE('',#1201,#1202);
#971=VERTEX_POINT('',#1203);
#972=LINE('',#1204,#1205);
#973=VERTEX_POINT('',#1206);
#974=CIRCLE('',#1207,13.9990578443828);
#975=LINE('',#1208,#1209);
#976=VERTEX_POINT('',#1210);
#977=VERTEX_POINT('',#1211);
#978=CIRCLE('',#1212,4.0);
#979=VERTEX_POINT('',#1213);
#980=LINE('',#1214,#1215);
#981=VERTEX_POINT('',#1216);
#982=CIRCLE('',#1217,4.0);
#983=LINE('',#1218,#1219);
#984=VERTEX_POINT('',#1220);
#985=LINE('',#1221,#1222);
#986=VERTEX_POINT('',#1223);
#987=LINE('',#1224,#1225);
#988=LINE('',#1226,#1227);
#989=VERTEX_POINT('',#1228);
#990=CIRCLE('',#1229,4.0);
#991=VERTEX_POINT('',#1230);
#992=CIRCLE('',#1231,4.0);
#993=VERTEX_POINT('',#1232);
#994=LINE('',#1233,#1234);
#995=VERTEX_POINT('',#1235);
#996=CIRCLE('',#1236,6.5);
#997=VERTEX_POINT('',#1237);
#998=LINE('',#1238,#1239);
#999=VERTEX_POINT('',#1240);
#1000=CIRCLE('',#1241,4.0);
#1001=LINE('',#1242,#1243);
#1002=CIRCLE('',#1244,14.0);
#1003=CIRCLE('',#1245,3.99999999999753);
#1004=CIRCLE('',#1246,14.0);
#1005=VERTEX_POINT('',#1247);
#1006=CIRCLE('',#1248,1.55);
#1007=VERTEX_POINT('',#1249);
#1008=LINE('',#1250,#1251);
#1009=VERTEX_POINT('',#1252);
#1010=LINE('',#1253,#1254);
#1011=VERTEX_POINT('',#1255);
#1012=CIRCLE('',#1256,2.0);
#1013=VERTEX_POINT('',#1257);
#1014=LINE('',#1258,#1259);
#1015=VERTEX_POINT('',#1260);
#1016=CIRCLE('',#1261,1.0);
#1017=VERTEX_POINT('',#1262);
#1018=LINE('',#1263,#1264);
#1019=VERTEX_POINT('',#1265);
#1020=CIRCLE('',#1266,0.5);
#1021=VERTEX_POINT('',#1267);
#1022=CIRCLE('',#1268,0.5);
#1023=LINE('',#1269,#1270);
#1024=LINE('',#1271,#1272);
#1025=VERTEX_POINT('',#1273);
#1026=LINE('',#1274,#1275);
#1027=CIRCLE('',#1276,4.0);
#1028=VERTEX_POINT('',#1277);
#1029=CIRCLE('',#1278,4.05);
#1030=LINE('',#1279,#1280);
#1031=LINE('',#1281,#1282);
#1032=LINE('',#1283,#1284);
#1033=LINE('',#1285,#1286);
#1034=LINE('',#1287,#1288);
#1035=LINE('',#1289,#1290);
#1036=LINE('',#1291,#1292);
#1037=LINE('',#1293,#1294);
#1038=LINE('',#1295,#1296);
#1039=VERTEX_POINT('',#1297);
#1040=LINE('',#1298,#1299);
#1041=LINE('',#1300,#1301);
#1042=VERTEX_POINT('',#1302);
#1043=VERTEX_POINT('',#1303);
#1044=CIRCLE('',#1304,1.55);
#1045=LINE('',#1305,#1306);
#1046=LINE('',#1307,#1308);
#1047=LINE('',#1309,#1310);
#1048=LINE('',#1311,#1312);
#1049=VERTEX_POINT('',#1313);
#1050=CIRCLE('',#1314,1.25);
#1051=VERTEX_POINT('',#1315);
#1052=CIRCLE('',#1316,1.25);
#1053=VERTEX_POINT('',#1317);
#1054=CIRCLE('',#1318,1.25);
#1055=VERTEX_POINT('',#1319);
#1056=CIRCLE('',#1320,1.25);
#1057=VERTEX_POINT('',#1321);
#1058=CIRCLE('',#1322,4.0);
#1059=VERTEX_POINT('',#1323);
#1060=CIRCLE('',#1324,4.05);
#1061=LINE('',#1325,#1326);
#1062=LINE('',#1327,#1328);
#1063=VERTEX_POINT('',#1329);
#1064=VERTEX_POINT('',#1330);
#1065=CIRCLE('',#1331,9.08648093280679);
#1066=LINE('',#1332,#1333);
#1067=LINE('',#1334,#1335);
#1068=VERTEX_POINT('',#1336);
#1069=LINE('',#1337,#1338);
#1070=LINE('',#1339,#1340);
#1071=CIRCLE('',#1341,8.87202183351388);
#1072=VERTEX_POINT('',#1342);
#1073=CIRCLE('',#1343,1.9);
#1074=LINE('',#1344,#1345);
#1075=LINE('',#1346,#1347);
#1076=VERTEX_POINT('',#1348);
#1077=LINE('',#1349,#1350);
#1078=LINE('',#1351,#1352);
#1079=VERTEX_POINT('',#1353);
#1080=CIRCLE('',#1354,5.0);
#1081=LINE('',#1355,#1356);
#1082=VERTEX_POINT('',#1357);
#1083=LINE('',#1358,#1359);
#1084=LINE('',#1360,#1361);
#1085=CIRCLE('',#1362,5.98648093280679);
#1086=CARTESIAN_POINT('',(-5.0,3.5,5.0));
#1087=CARTESIAN_POINT('',(-3.0,1.5,5.0));
#1088=AXIS2_PLACEMENT_3D('',#1363,#1364,#1365);
#1089=CARTESIAN_POINT('',(-5.0,3.5,0.0));
#1090=CARTESIAN_POINT('',(-5.0,3.5,5.0));
#1091=VECTOR('',#1366,1.0);
#1092=CARTESIAN_POINT('',(-3.0,1.5,0.0));
#1093=AXIS2_PLACEMENT_3D('',#1367,#1368,#1369);
#1094=CARTESIAN_POINT('',(-3.0,1.5,0.0));
#1095=VECTOR('',#1370,1.0);
#1096=CARTESIAN_POINT('',(21.0136757469376,31.2685696326982,3.0));
#1097=CARTESIAN_POINT('',(27.0,41.6368255736707,3.0));
#1098=AXIS2_PLACEMENT_3D('',#1371,#1372,#1373);
#1099=CARTESIAN_POINT('',(21.0136757469376,31.2685696326982,5.0));
#1100=CARTESIAN_POINT('',(21.0136757469376,31.2685696326982,5.0));
#1101=VECTOR('',#1374,1.0);
#1102=CARTESIAN_POINT('',(27.0,41.6368255736707,5.0));
#1103=AXIS2_PLACEMENT_3D('',#1375,#1376,#1377);
#1104=CARTESIAN_POINT('',(27.0,41.6368255736707,5.0));
#1105=VECTOR('',#1378,1.0);
#1106=CARTESIAN_POINT('',(-5.0,22.9389995429616,5.0));
#1107=CARTESIAN_POINT('',(-5.0,13.2194997714808,5.0));
#1108=VECTOR('',#1379,1.0);
#1109=CARTESIAN_POINT('',(24.9999999999988,1.5,5.0));
#1110=CARTESIAN_POINT('',(15.0009421556172,1.5,5.0));
#1111=VECTOR('',#1380,1.0);
#1112=CARTESIAN_POINT('',(24.9999999999988,14.5,5.0));
#1113=AXIS2_PLACEMENT_3D('',#1381,#1382,#1383);
#1114=CARTESIAN_POINT('',(23.9999999985966,14.5,5.0));
#1115=CARTESIAN_POINT('',(24.4999999992977,14.5,5.0));
#1116=VECTOR('',#1384,1.0);
#1117=CARTESIAN_POINT('',(19.9999999989062,18.5,5.0));
#1118=AXIS2_PLACEMENT_3D('',#1385,#1386,#1387);
#1119=CARTESIAN_POINT('',(19.9999999990299,24.4470866943614,5.0));
#1120=CARTESIAN_POINT('',(19.999999998968,21.4735433471807,5.0));
#1121=VECTOR('',#1388,1.0);
#1122=CARTESIAN_POINT('',(22.0001046884074,27.9112487499374,5.0));
#1123=AXIS2_PLACEMENT_3D('',#1389,#1390,#1391);
#1124=CARTESIAN_POINT('',(29.0,40.035,5.0));
#1125=AXIS2_PLACEMENT_3D('',#1392,#1393,#1394);
#1126=CARTESIAN_POINT('',(29.0,59.0,5.0));
#1127=CARTESIAN_POINT('',(29.0,47.0175,5.0));
#1128=VECTOR('',#1395,1.0);
#1129=CARTESIAN_POINT('',(27.0,59.0,5.0));
#1130=CARTESIAN_POINT('',(14.5,59.0,5.0));
#1131=VECTOR('',#1396,1.0);
#1132=CARTESIAN_POINT('',(27.0,50.6933376770153,5.0));
#1133=VECTOR('',#1397,1.0);
#1134=CARTESIAN_POINT('',(18.02027860008,26.0840346093401,5.0));
#1135=AXIS2_PLACEMENT_3D('',#1398,#1399,#1400);
#1136=CARTESIAN_POINT('',(18.0202785999708,16.6694997714228,5.0));
#1137=CARTESIAN_POINT('',(18.0202786000254,21.3767671903814,5.0));
#1138=VECTOR('',#1401,1.0);
#1139=CARTESIAN_POINT('',(13.0202785999708,11.6694997714808,5.0));
#1140=AXIS2_PLACEMENT_3D('',#1402,#1403,#1404);
#1141=CARTESIAN_POINT('',(-3.0,11.6694997714808,5.0));
#1142=CARTESIAN_POINT('',(5.0101392999854,11.6694997714808,5.0));
#1143=VECTOR('',#1405,1.0);
#1144=CARTESIAN_POINT('',(-3.0,14.7694997714808,5.0));
#1145=AXIS2_PLACEMENT_3D('',#1406,#1407,#1408);
#1146=CARTESIAN_POINT('',(13.0202785999708,14.7694997714808,5.0));
#1147=CARTESIAN_POINT('',(5.0101392999854,14.7694997714808,5.0));
#1148=VECTOR('',#1409,1.0);
#1149=CARTESIAN_POINT('',(14.9202785999708,16.6694997714587,5.0));
#1150=AXIS2_PLACEMENT_3D('',#1410,#1411,#1412);
#1151=CARTESIAN_POINT('',(14.92027860008,26.084034609376,5.0));
#1152=CARTESIAN_POINT('',(14.9202786000254,21.3767671904174,5.0));
#1153=VECTOR('',#1413,1.0);
#1154=CARTESIAN_POINT('',(19.4637568813157,33.9532952257504,5.0));
#1155=AXIS2_PLACEMENT_3D('',#1414,#1415,#1416);
#1156=CARTESIAN_POINT('',(23.9,41.6368255736707,5.0));
#1157=AXIS2_PLACEMENT_3D('',#1417,#1418,#1419);
#1158=CARTESIAN_POINT('',(23.9,59.0,5.0));
#1159=CARTESIAN_POINT('',(23.9,50.6933376770153,5.0));
#1160=VECTOR('',#1420,1.0);
#1161=CARTESIAN_POINT('',(-3.46944695195361E-15,59.0,5.0));
#1162=CARTESIAN_POINT('',(14.5,59.0,5.0));
#1163=VECTOR('',#1421,1.0);
#1164=CARTESIAN_POINT('',(-4.04520291472714E-15,34.9389995429616,5.0));
#1165=CARTESIAN_POINT('',(0.0,9.7845,5.0));
#1166=VECTOR('',#1422,1.0);
#1167=CARTESIAN_POINT('',(-0.5,34.4389995429616,5.0));
#1168=AXIS2_PLACEMENT_3D('',#1423,#1424,#1425);
#1169=CARTESIAN_POINT('',(-1.0,33.9389995429616,5.0));
#1170=AXIS2_PLACEMENT_3D('',#1426,#1427,#1428);
#1171=CARTESIAN_POINT('',(-1.0,25.9389995429616,5.0));
#1172=CARTESIAN_POINT('',(-1.0,29.4389995429616,5.0));
#1173=VECTOR('',#1429,1.0);
#1174=CARTESIAN_POINT('',(-2.0,24.9389995429616,5.0));
#1175=AXIS2_PLACEMENT_3D('',#1430,#1431,#1432);
#1176=CARTESIAN_POINT('',(-3.0,24.9389995429616,5.0));
#1177=CARTESIAN_POINT('',(-3.0,24.9389995429616,5.0));
#1178=VECTOR('',#1433,1.0);
#1179=AXIS2_PLACEMENT_3D('',#1434,#1435,#1436);
#1180=CARTESIAN_POINT('',(2.49999999997775,59.0,1.24999999999925));
#1181=AXIS2_PLACEMENT_3D('',#1437,#1438,#1439);
#1182=CARTESIAN_POINT('',(19.9999999999561,59.0,1.2500000000001));
#1183=AXIS2_PLACEMENT_3D('',#1440,#1441,#1442);
#1184=CARTESIAN_POINT('',(27.0,59.0,3.0));
#1185=CARTESIAN_POINT('',(27.0,59.0,0.0));
#1186=VECTOR('',#1443,1.0);
#1187=CARTESIAN_POINT('',(29.0,59.0,0.0));
#1188=CARTESIAN_POINT('',(29.0,59.0,2.5));
#1189=VECTOR('',#1444,1.0);
#1190=CARTESIAN_POINT('',(-3.31637115772581E-15,59.0,0.0));
#1191=CARTESIAN_POINT('',(14.5,59.0,0.0));
#1192=VECTOR('',#1445,1.0);
#1193=CARTESIAN_POINT('',(-3.46944695195361E-15,59.0,2.5));
#1194=VECTOR('',#1446,1.0);
#1195=CARTESIAN_POINT('',(23.9,59.0,3.0));
#1196=CARTESIAN_POINT('',(23.9,59.0,0.0));
#1197=VECTOR('',#1447,1.0);
#1198=CARTESIAN_POINT('',(0.0,59.0,3.0));
#1199=VECTOR('',#1448,1.0);
#1200=CARTESIAN_POINT('',(22.0001046883461,27.9112487500435,1.0));
#1201=CARTESIAN_POINT('',(22.0001046884074,27.9112487499374,5.0));
#1202=VECTOR('',#1449,1.0);
#1203=CARTESIAN_POINT('',(22.0001046883461,27.9112487500435,0.0));
#1204=CARTESIAN_POINT('',(22.0001046883461,27.9112487500435,0.0));
#1205=VECTOR('',#1450,1.0);
#1206=CARTESIAN_POINT('',(29.0,40.035,0.0));
#1207=AXIS2_PLACEMENT_3D('',#1451,#1452,#1453);
#1208=CARTESIAN_POINT('',(29.0,40.035,0.0));
#1209=VECTOR('',#1454,1.0);
#1210=CARTESIAN_POINT('',(13.9999999990919,22.2874969710626,1.0));
#1211=CARTESIAN_POINT('',(17.3334380220642,26.2315678541454,1.0));
#1212=AXIS2_PLACEMENT_3D('',#1455,#1456,#1457);
#1213=CARTESIAN_POINT('',(13.9999999990919,22.2874969710626,0.0));
#1214=CARTESIAN_POINT('',(13.9999999990919,22.2874969710626,0.0));
#1215=VECTOR('',#1458,1.0);
#1216=CARTESIAN_POINT('',(17.3334380220642,26.2315678541454,0.0));
#1217=AXIS2_PLACEMENT_3D('',#1459,#1460,#1461);
#1218=CARTESIAN_POINT('',(17.3334380220642,26.2315678541454,0.0));
#1219=VECTOR('',#1462,1.0);
#1220=CARTESIAN_POINT('',(19.9999999990919,24.4470866943614,1.0));
#1221=CARTESIAN_POINT('',(19.9999999985966,24.4470866943614,0.0));
#1222=VECTOR('',#1463,1.0);
#1223=CARTESIAN_POINT('',(19.9999999990919,18.5,1.0));
#1224=CARTESIAN_POINT('',(19.9999999985966,18.5,1.0));
#1225=VECTOR('',#1464,1.0);
#1226=CARTESIAN_POINT('',(19.9999999990919,18.2235433471807,1.0));
#1227=VECTOR('',#1465,1.0);
#1228=CARTESIAN_POINT('',(21.0,8.0,1.0));
#1229=AXIS2_PLACEMENT_3D('',#1466,#1467,#1468);
#1230=CARTESIAN_POINT('',(23.9999999985966,14.5,1.0));
#1231=AXIS2_PLACEMENT_3D('',#1469,#1470,#1471);
#1232=CARTESIAN_POINT('',(24.9999999999988,14.5,1.0));
#1233=CARTESIAN_POINT('',(15.0004711024671,14.5,1.0));
#1234=VECTOR('',#1472,1.0);
#1235=CARTESIAN_POINT('',(24.9999999999988,1.5,1.0));
#1236=AXIS2_PLACEMENT_3D('',#1473,#1474,#1475);
#1237=CARTESIAN_POINT('',(9.9999999992157,1.5,1.0));
#1238=CARTESIAN_POINT('',(15.0004711024671,1.5,1.0));
#1239=VECTOR('',#1476,1.0);
#1240=CARTESIAN_POINT('',(13.9999999990919,5.5,1.0));
#1241=AXIS2_PLACEMENT_3D('',#1477,#1478,#1479);
#1242=CARTESIAN_POINT('',(13.9999999990919,17.0358048227834,1.0));
#1243=VECTOR('',#1480,1.0);
#1244=AXIS2_PLACEMENT_3D('',#1481,#1482,#1483);
#1245=AXIS2_PLACEMENT_3D('',#1484,#1485,#1486);
#1246=AXIS2_PLACEMENT_3D('',#1487,#1488,#1489);
#1247=CARTESIAN_POINT('',(-4.55,13.2194997714808,0.0));
#1248=AXIS2_PLACEMENT_3D('',#1490,#1491,#1492);
#1249=CARTESIAN_POINT('',(9.9999999992157,1.5,0.0));
#1250=CARTESIAN_POINT('',(15.0009421556172,1.5,0.0));
#1251=VECTOR('',#1493,1.0);
#1252=CARTESIAN_POINT('',(-5.0,22.9389995429616,0.0));
#1253=CARTESIAN_POINT('',(-5.0,13.2194997714808,0.0));
#1254=VECTOR('',#1494,1.0);
#1255=CARTESIAN_POINT('',(-3.0,24.9389995429616,0.0));
#1256=AXIS2_PLACEMENT_3D('',#1495,#1496,#1497);
#1257=CARTESIAN_POINT('',(-2.0,24.9389995429616,0.0));
#1258=CARTESIAN_POINT('',(-0.5,24.9389995429616,0.0));
#1259=VECTOR('',#1498,1.0);
#1260=CARTESIAN_POINT('',(-1.0,25.9389995429616,0.0));
#1261=AXIS2_PLACEMENT_3D('',#1499,#1500,#1501);
#1262=CARTESIAN_POINT('',(-1.0,33.9389995429616,0.0));
#1263=CARTESIAN_POINT('',(-1.0,29.4389995429616,0.0));
#1264=VECTOR('',#1502,1.0);
#1265=CARTESIAN_POINT('',(-0.5,34.4389995429616,0.0));
#1266=AXIS2_PLACEMENT_3D('',#1503,#1504,#1505);
#1267=CARTESIAN_POINT('',(-4.04520291472714E-15,34.9389995429616,0.0));
#1268=AXIS2_PLACEMENT_3D('',#1506,#1507,#1508);
#1269=CARTESIAN_POINT('',(0.0,9.7845,0.0));
#1270=VECTOR('',#1509,1.0);
#1271=CARTESIAN_POINT('',(29.0,47.0175,0.0));
#1272=VECTOR('',#1510,1.0);
#1273=CARTESIAN_POINT('',(13.9999999990919,5.5,0.0));
#1274=CARTESIAN_POINT('',(13.9999999990919,17.0358048227834,0.0));
#1275=VECTOR('',#1511,1.0);
#1276=AXIS2_PLACEMENT_3D('',#1512,#1513,#1514);
#1277=CARTESIAN_POINT('',(0.95,29.4389995429616,0.0));
#1278=AXIS2_PLACEMENT_3D('',#1515,#1516,#1517);
#1279=CARTESIAN_POINT('',(-4.04520291472714E-15,34.9389995429616,0.0));
#1280=VECTOR('',#1518,1.0);
#1281=CARTESIAN_POINT('',(13.9999999992157,5.5,5.0));
#1282=VECTOR('',#1519,1.0);
#1283=CARTESIAN_POINT('',(23.9999999985966,14.5,4.0));
#1284=VECTOR('',#1520,1.0);
#1285=CARTESIAN_POINT('',(-0.5,34.4389995429616,0.0));
#1286=VECTOR('',#1521,1.0);
#1287=CARTESIAN_POINT('',(-1.0,33.9389995429616,0.0));
#1288=VECTOR('',#1522,1.0);
#1289=CARTESIAN_POINT('',(-2.0,24.9389995429616,0.0));
#1290=VECTOR('',#1523,1.0);
#1291=CARTESIAN_POINT('',(-1.0,25.9389995429616,5.0));
#1292=VECTOR('',#1524,1.0);
#1293=CARTESIAN_POINT('',(9.9999999992157,1.5,4.0));
#1294=VECTOR('',#1525,1.0);
#1295=CARTESIAN_POINT('',(27.0,50.6933376770153,3.0));
#1296=VECTOR('',#1526,1.0);
#1297=CARTESIAN_POINT('',(23.9,41.6368255736707,3.0));
#1298=CARTESIAN_POINT('',(23.9,41.6368255736707,5.0));
#1299=VECTOR('',#1527,1.0);
#1300=CARTESIAN_POINT('',(23.9,50.6933376770153,3.0));
#1301=VECTOR('',#1528,1.0);
#1302=CARTESIAN_POINT('',(-3.0,11.6694997714808,3.0));
#1303=CARTESIAN_POINT('',(-3.0,14.7694997714808,3.0));
#1304=AXIS2_PLACEMENT_3D('',#1529,#1530,#1531);
#1305=CARTESIAN_POINT('',(-3.0,14.7694997714808,5.0));
#1306=VECTOR('',#1532,1.0);
#1307=CARTESIAN_POINT('',(-3.0,11.6694997714808,5.0));
#1308=VECTOR('',#1533,1.0);
#1309=CARTESIAN_POINT('',(-3.0,24.9389995429616,5.0));
#1310=VECTOR('',#1534,1.0);
#1311=CARTESIAN_POINT('',(-5.0,22.9389995429616,5.0));
#1312=VECTOR('',#1535,1.0);
#1313=CARTESIAN_POINT('',(19.9999999999716,52.5000000000345,3.7500000000001));
#1314=AXIS2_PLACEMENT_3D('',#1536,#1537,#1538);
#1315=CARTESIAN_POINT('',(19.9999999999657,55.0000000000345,3.7500000000001));
#1316=AXIS2_PLACEMENT_3D('',#1539,#1540,#1541);
#1317=CARTESIAN_POINT('',(2.49999999999328,52.4999999999927,3.74999999999925));
#1318=AXIS2_PLACEMENT_3D('',#1542,#1543,#1544);
#1319=CARTESIAN_POINT('',(2.4999999999873,54.9999999999927,3.74999999999925));
#1320=AXIS2_PLACEMENT_3D('',#1545,#1546,#1547);
#1321=CARTESIAN_POINT('',(29.0,8.0,4.0));
#1322=AXIS2_PLACEMENT_3D('',#1548,#1549,#1550);
#1323=CARTESIAN_POINT('',(0.95,29.4389995429616,3.0));
#1324=AXIS2_PLACEMENT_3D('',#1551,#1552,#1553);
#1325=CARTESIAN_POINT('',(24.9999999999988,1.5,4.0));
#1326=VECTOR('',#1554,1.0);
#1327=CARTESIAN_POINT('',(24.9999999999988,14.5,4.0));
#1328=VECTOR('',#1555,1.0);
#1329=CARTESIAN_POINT('',(19.4637568813157,33.9532952257504,3.0));
#1330=CARTESIAN_POINT('',(14.92027860008,26.084034609376,3.0));
#1331=AXIS2_PLACEMENT_3D('',#1556,#1557,#1558);
#1332=CARTESIAN_POINT('',(19.4637568813157,33.9532952257504,5.0));
#1333=VECTOR('',#1559,1.0);
#1334=CARTESIAN_POINT('',(14.92027860008,26.084034609376,5.0));
#1335=VECTOR('',#1560,1.0);
#1336=CARTESIAN_POINT('',(14.9202785999708,16.6694997714587,3.0));
#1337=CARTESIAN_POINT('',(14.9202786000254,21.3767671904174,3.0));
#1338=VECTOR('',#1561,1.0);
#1339=CARTESIAN_POINT('',(14.9202785999708,16.6694997714587,5.0));
#1340=VECTOR('',#1562,1.0);
#1341=AXIS2_PLACEMENT_3D('',#1563,#1564,#1565);
#1342=CARTESIAN_POINT('',(13.0202785999708,14.7694997714808,3.0));
#1343=AXIS2_PLACEMENT_3D('',#1566,#1567,#1568);
#1344=CARTESIAN_POINT('',(13.0202785999708,14.7694997714808,5.0));
#1345=VECTOR('',#1569,1.0);
#1346=CARTESIAN_POINT('',(5.0101392999854,14.7694997714808,3.0));
#1347=VECTOR('',#1570,1.0);
#1348=CARTESIAN_POINT('',(13.0202785999708,11.6694997714808,3.0));
#1349=CARTESIAN_POINT('',(5.0101392999854,11.6694997714808,3.0));
#1350=VECTOR('',#1571,1.0);
#1351=CARTESIAN_POINT('',(13.0202785999708,11.6694997714808,5.0));
#1352=VECTOR('',#1572,1.0);
#1353=CARTESIAN_POINT('',(18.0202785999708,16.6694997714228,3.0));
#1354=AXIS2_PLACEMENT_3D('',#1573,#1574,#1575);
#1355=CARTESIAN_POINT('',(18.0202785999708,16.6694997714228,5.0));
#1356=VECTOR('',#1576,1.0);
#1357=CARTESIAN_POINT('',(18.02027860008,26.0840346093401,3.0));
#1358=CARTESIAN_POINT('',(18.0202786000254,21.3767671903814,3.0));
#1359=VECTOR('',#1577,1.0);
#1360=CARTESIAN_POINT('',(18.02027860008,26.0840346093401,5.0));
#1361=VECTOR('',#1578,1.0);
#1362=AXIS2_PLACEMENT_3D('',#1579,#1580,#1581);
#1363=CARTESIAN_POINT('',(-3.0,3.5,5.0));
#1364=DIRECTION('',(0.0,0.0,1.0));
#1365=DIRECTION('',(1.0,0.0,0.0));
#1366=DIRECTION('',(0.0,0.0,-1.0));
#1367=CARTESIAN_POINT('',(-3.0,3.5,0.0));
#1368=DIRECTION('',(0.0,0.0,1.0));
#1369=DIRECTION('',(1.0,0.0,0.0));
#1370=DIRECTION('',(0.0,0.0,-1.0));
#1371=CARTESIAN_POINT('',(15.0279781664862,41.6368255736707,3.0));
#1372=DIRECTION('',(0.0,0.0,1.0));
#1373=DIRECTION('',(1.0,0.0,0.0));
#1374=DIRECTION('',(0.0,0.0,-1.0));
#1375=CARTESIAN_POINT('',(15.0279781664862,41.6368255736707,5.0));
#1376=DIRECTION('',(0.0,0.0,1.0));
#1377=DIRECTION('',(1.0,0.0,0.0));
#1378=DIRECTION('',(0.0,0.0,-1.0));
#1379=DIRECTION('',(-6.12303176911189E-17,-1.0,0.0));
#1380=DIRECTION('',(1.0,0.0,0.0));
#1381=CARTESIAN_POINT('',(24.9999999999988,8.0,5.0));
#1382=DIRECTION('',(0.0,0.0,1.0));
#1383=DIRECTION('',(1.0,0.0,0.0));
#1384=DIRECTION('',(1.0,1.77635683940025E-15,0.0));
#1385=CARTESIAN_POINT('',(23.9999999989062,18.5,5.0));
#1386=DIRECTION('',(0.0,0.0,1.0));
#1387=DIRECTION('',(1.0,0.0,0.0));
#1388=DIRECTION('',(-2.08167429420394E-11,-1.0,0.0));
#1389=CARTESIAN_POINT('',(23.9999999990299,24.4470866945025,5.0));
#1390=DIRECTION('',(0.0,0.0,1.0));
#1391=DIRECTION('',(1.0,0.0,0.0));
#1392=CARTESIAN_POINT('',(15.0009421556172,40.035,5.0));
#1393=DIRECTION('',(0.0,0.0,1.0));
#1394=DIRECTION('',(1.0,0.0,0.0));
#1395=DIRECTION('',(-6.12303176911189E-17,1.0,0.0));
#1396=DIRECTION('',(1.0,0.0,0.0));
#1397=DIRECTION('',(6.12303176911189E-17,1.0,0.0));
#1398=CARTESIAN_POINT('',(24.0067595328868,26.0840346092706,5.0));
#1399=DIRECTION('',(0.0,0.0,-1.0));
#1400=DIRECTION('',(1.0,0.0,0.0));
#1401=DIRECTION('',(1.15975505295216E-11,1.0,0.0));
#1402=CARTESIAN_POINT('',(13.0202785999708,16.6694997714808,5.0));
#1403=DIRECTION('',(0.0,0.0,1.0));
#1404=DIRECTION('',(1.0,0.0,0.0));
#1405=DIRECTION('',(1.0,0.0,0.0));
#1406=CARTESIAN_POINT('',(-3.0,13.2194997714808,5.0));
#1407=DIRECTION('',(0.0,0.0,1.0));
#1408=DIRECTION('',(1.0,0.0,0.0));
#1409=DIRECTION('',(-1.0,0.0,0.0));
#1410=CARTESIAN_POINT('',(13.0202785999708,16.6694997714808,5.0));
#1411=DIRECTION('',(0.0,0.0,-1.0));
#1412=DIRECTION('',(1.0,0.0,0.0));
#1413=DIRECTION('',(-1.15975505295216E-11,-1.0,0.0));
#1414=CARTESIAN_POINT('',(24.0067595328868,26.0840346092706,5.0));
#1415=DIRECTION('',(0.0,0.0,1.0));
#1416=DIRECTION('',(1.0,0.0,0.0));
#1417=CARTESIAN_POINT('',(15.0279781664862,41.6368255736707,5.0));
#1418=DIRECTION('',(0.0,0.0,-1.0));
#1419=DIRECTION('',(1.0,0.0,0.0));
#1420=DIRECTION('',(-6.12303176911189E-17,-1.0,0.0));
#1421=DIRECTION('',(1.0,0.0,0.0));
#1422=DIRECTION('',(1.60814287233912E-16,-1.0,0.0));
#1423=CARTESIAN_POINT('',(-0.5,34.9389995429616,5.0));
#1424=DIRECTION('',(0.0,0.0,1.0));
#1425=DIRECTION('',(1.0,0.0,0.0));
#1426=CARTESIAN_POINT('',(-0.5,33.9389995429616,5.0));
#1427=DIRECTION('',(0.0,0.0,1.0));
#1428=DIRECTION('',(1.0,0.0,0.0));
#1429=DIRECTION('',(-6.12303176911189E-17,-1.0,0.0));
#1430=CARTESIAN_POINT('',(-2.0,25.9389995429616,5.0));
#1431=DIRECTION('',(0.0,0.0,1.0));
#1432=DIRECTION('',(1.0,0.0,0.0));
#1433=DIRECTION('',(-1.0,0.0,0.0));
#1434=CARTESIAN_POINT('',(-3.0,22.9389995429616,5.0));
#1435=DIRECTION('',(0.0,0.0,1.0));
#1436=DIRECTION('',(1.0,0.0,0.0));
#1437=CARTESIAN_POINT('',(2.49999999997776,59.0,2.49999999999925));
#1438=DIRECTION('',(0.0,-1.0,0.0));
#1439=DIRECTION('',(0.0,0.0,-1.0));
#1440=CARTESIAN_POINT('',(19.9999999999561,59.0,2.5000000000001));
#1441=DIRECTION('',(0.0,-1.0,0.0));
#1442=DIRECTION('',(0.0,0.0,-1.0));
#1443=DIRECTION('',(0.0,0.0,-1.0));
#1444=DIRECTION('',(6.12303176911189E-17,0.0,-1.0));
#1445=DIRECTION('',(-1.0,0.0,0.0));
#1446=DIRECTION('',(-6.12303176911189E-17,0.0,1.0));
#1447=DIRECTION('',(0.0,0.0,1.0));
#1448=DIRECTION('',(-1.0,0.0,0.0));
#1449=DIRECTION('',(0.0,0.0,-1.0));
#1450=DIRECTION('',(0.0,0.0,1.0));
#1451=CARTESIAN_POINT('',(15.0009421556172,40.035,0.0));
#1452=DIRECTION('',(0.0,0.0,1.0));
#1453=DIRECTION('',(1.0,0.0,0.0));
#1454=DIRECTION('',(0.0,0.0,1.0));
#1455=CARTESIAN_POINT('',(17.9999999990919,22.2874969710626,1.0));
#1456=DIRECTION('',(0.0,0.0,-1.0));
#1457=DIRECTION('',(-1.0,0.0,0.0));
#1458=DIRECTION('',(0.0,0.0,1.0));
#1459=CARTESIAN_POINT('',(17.9999999990919,22.2874969710626,0.0));
#1460=DIRECTION('',(0.0,0.0,-1.0));
#1461=DIRECTION('',(-1.0,0.0,0.0));
#1462=DIRECTION('',(0.0,0.0,1.0));
#1463=DIRECTION('',(0.0,0.0,1.0));
#1464=DIRECTION('',(0.0,0.0,-1.0));
#1465=DIRECTION('',(6.12303176911189E-17,-1.0,0.0));
#1466=CARTESIAN_POINT('',(25.0,8.0,1.0));
#1467=DIRECTION('',(0.0,0.0,-1.0));
#1468=DIRECTION('',(-1.0,0.0,0.0));
#1469=CARTESIAN_POINT('',(23.9999999985966,18.5,1.0));
#1470=DIRECTION('',(0.0,0.0,-1.0));
#1471=DIRECTION('',(-1.0,0.0,0.0));
#1472=DIRECTION('',(1.0,-1.22460635382238E-16,0.0));
#1473=CARTESIAN_POINT('',(24.9999999999988,8.0,1.0));
#1474=DIRECTION('',(0.0,0.0,-1.0));
#1475=DIRECTION('',(-1.0,0.0,0.0));
#1476=DIRECTION('',(-1.0,0.0,0.0));
#1477=CARTESIAN_POINT('',(9.9999999992157,5.5,1.0));
#1478=DIRECTION('',(0.0,0.0,-1.0));
#1479=DIRECTION('',(-1.0,0.0,0.0));
#1480=DIRECTION('',(-6.12303176911189E-17,1.0,0.0));
#1481=CARTESIAN_POINT('',(15.0004711024671,40.0358159449349,1.0));
#1482=DIRECTION('',(0.0,0.0,1.0));
#1483=DIRECTION('',(-1.0,0.0,0.0));
#1484=CARTESIAN_POINT('',(23.9999999985941,24.4470866943614,1.0));
#1485=DIRECTION('',(0.0,0.0,1.0));
#1486=DIRECTION('',(-1.0,0.0,0.0));
#1487=CARTESIAN_POINT('',(15.0004711024671,40.0358159449349,0.0));
#1488=DIRECTION('',(0.0,0.0,1.0));
#1489=DIRECTION('',(-1.0,0.0,0.0));
#1490=CARTESIAN_POINT('',(-3.0,13.2194997714808,0.0));
#1491=DIRECTION('',(0.0,0.0,-1.0));
#1492=DIRECTION('',(-1.0,0.0,0.0));
#1493=DIRECTION('',(1.0,0.0,0.0));
#1494=DIRECTION('',(6.12303176911189E-17,1.0,0.0));
#1495=CARTESIAN_POINT('',(-3.0,22.9389995429616,0.0));
#1496=DIRECTION('',(0.0,0.0,-1.0));
#1497=DIRECTION('',(-1.0,0.0,0.0));
#1498=DIRECTION('',(1.0,0.0,0.0));
#1499=CARTESIAN_POINT('',(-2.0,25.9389995429616,0.0));
#1500=DIRECTION('',(0.0,0.0,1.0));
#1501=DIRECTION('',(1.0,0.0,0.0));
#1502=DIRECTION('',(6.12303176911189E-17,1.0,0.0));
#1503=CARTESIAN_POINT('',(-0.5,33.9389995429616,0.0));
#1504=DIRECTION('',(0.0,0.0,1.0));
#1505=DIRECTION('',(1.0,0.0,0.0));
#1506=CARTESIAN_POINT('',(-0.5,34.9389995429616,0.0));
#1507=DIRECTION('',(0.0,0.0,1.0));
#1508=DIRECTION('',(1.0,0.0,0.0));
#1509=DIRECTION('',(1.60814287233912E-16,-1.0,0.0));
#1510=DIRECTION('',(-6.12303176911189E-17,1.0,0.0));
#1511=DIRECTION('',(-6.12303176911189E-17,1.0,0.0));
#1512=CARTESIAN_POINT('',(9.9999999992157,5.5,0.0));
#1513=DIRECTION('',(0.0,0.0,1.0));
#1514=DIRECTION('',(1.0,0.0,0.0));
#1515=CARTESIAN_POINT('',(5.0,29.4389995429616,0.0));
#1516=DIRECTION('',(0.0,0.0,-1.0));
#1517=DIRECTION('',(-1.0,0.0,0.0));
#1518=DIRECTION('',(0.0,0.0,1.0));
#1519=DIRECTION('',(0.0,0.0,-1.0));
#1520=DIRECTION('',(0.0,0.0,-1.0));
#1521=DIRECTION('',(0.0,0.0,1.0));
#1522=DIRECTION('',(0.0,0.0,1.0));
#1523=DIRECTION('',(0.0,0.0,1.0));
#1524=DIRECTION('',(0.0,0.0,1.0));
#1525=DIRECTION('',(0.0,0.0,-1.0));
#1526=DIRECTION('',(6.12303176911189E-17,1.0,0.0));
#1527=DIRECTION('',(0.0,0.0,-1.0));
#1528=DIRECTION('',(-6.12303176911189E-17,-1.0,0.0));
#1529=CARTESIAN_POINT('',(-3.0,13.2194997714808,3.0));
#1530=DIRECTION('',(0.0,0.0,1.0));
#1531=DIRECTION('',(1.0,0.0,0.0));
#1532=DIRECTION('',(0.0,0.0,-1.0));
#1533=DIRECTION('',(0.0,0.0,-1.0));
#1534=DIRECTION('',(0.0,0.0,-1.0));
#1535=DIRECTION('',(0.0,0.0,-1.0));
#1536=CARTESIAN_POINT('',(19.9999999999716,52.5000000000345,2.5000000000001));
#1537=DIRECTION('',(2.39002567398391E-12,-1.0,-4.96735760103524E-18));
#1538=DIRECTION('',(-5.2935253982588E-15,-4.9673576136869E-18,1.0));
#1539=CARTESIAN_POINT('',(19.9999999999657,55.0000000000345,2.5000000000001));
#1540=DIRECTION('',(2.39002567398391E-12,-1.0,-4.96735760103524E-18));
#1541=DIRECTION('',(1.0,2.39002567398391E-12,0.0));
#1542=CARTESIAN_POINT('',(2.49999999999329,52.4999999999927,2.49999999999925));
#1543=DIRECTION('',(2.39002567398308E-12,-1.0,-4.96733113134847E-18));
#1544=DIRECTION('',(-5.32128097387443E-15,-4.96733114406647E-18,1.0));
#1545=CARTESIAN_POINT('',(2.49999999998732,54.9999999999927,2.49999999999925));
#1546=DIRECTION('',(2.39002567398308E-12,-1.0,-4.96733113134847E-18));
#1547=DIRECTION('',(1.0,2.39002567398308E-12,0.0));
#1548=CARTESIAN_POINT('',(25.0,8.0,4.0));
#1549=DIRECTION('',(0.0,0.0,1.0));
#1550=DIRECTION('',(1.0,0.0,0.0));
#1551=CARTESIAN_POINT('',(5.0,29.4389995429616,3.0));
#1552=DIRECTION('',(0.0,0.0,-1.0));
#1553=DIRECTION('',(-1.0,0.0,0.0));
#1554=DIRECTION('',(0.0,0.0,-1.0));
#1555=DIRECTION('',(0.0,0.0,-1.0));
#1556=CARTESIAN_POINT('',(24.0067595328868,26.0840346092706,3.0));
#1557=DIRECTION('',(0.0,0.0,1.0));
#1558=DIRECTION('',(1.0,0.0,0.0));
#1559=DIRECTION('',(0.0,0.0,-1.0));
#1560=DIRECTION('',(0.0,0.0,-1.0));
#1561=DIRECTION('',(-1.15975505295216E-11,-1.0,0.0));
#1562=DIRECTION('',(0.0,0.0,-1.0));
#1563=CARTESIAN_POINT('',(15.0279781664862,41.6368255736707,3.0));
#1564=DIRECTION('',(0.0,0.0,-1.0));
#1565=DIRECTION('',(1.0,0.0,0.0));
#1566=CARTESIAN_POINT('',(13.0202785999708,16.6694997714808,3.0));
#1567=DIRECTION('',(0.0,0.0,-1.0));
#1568=DIRECTION('',(1.0,0.0,0.0));
#1569=DIRECTION('',(0.0,0.0,-1.0));
#1570=DIRECTION('',(-1.0,0.0,0.0));
#1571=DIRECTION('',(1.0,0.0,0.0));
#1572=DIRECTION('',(0.0,0.0,-1.0));
#1573=CARTESIAN_POINT('',(13.0202785999708,16.6694997714808,3.0));
#1574=DIRECTION('',(0.0,0.0,1.0));
#1575=DIRECTION('',(1.0,0.0,0.0));
#1576=DIRECTION('',(0.0,0.0,-1.0));
#1577=DIRECTION('',(1.15975505295216E-11,1.0,0.0));
#1578=DIRECTION('',(0.0,0.0,-1.0));
#1579=CARTESIAN_POINT('',(24.0067595328868,26.0840346092706,3.0));
#1580=DIRECTION('',(0.0,0.0,-1.0));
#1581=DIRECTION('',(1.0,0.0,0.0));
ENDSEC;
END-ISO-10303-21;
