ISO-10303-21;
HEADER;
FILE_DESCRIPTION(('STEP AP203'),'1');
FILE_NAME('RBF22.304-1 Suporte Encoder traseiro.stp','2022-08-29T18:37:13',(' '),(' '),'Spatial InterOp 3D',' ',' ');
FILE_SCHEMA(('CONFIG_CONTROL_DESIGN'));
ENDSEC;
DATA;
#1=DESIGN_CONTEXT('',#33,'design');
#2=APPLICATION_PROTOCOL_DEFINITION('INTERNATIONAL STANDARD','config_control_design',1994,#33);
#3=PRODUCT_CATEGORY_RELATIONSHIP('NONE','NONE',#34,#35);
#4=DATE_AND_TIME(#36,#37);
#5=DATE_TIME_ROLE('creation_date');
#6=DATE_TIME_ROLE('classification_date');
#7=PERSON_AND_ORGANIZATION_ROLE('creator');
#8=PERSON_AND_ORGANIZATION_ROLE('design_supplier');
#9=PERSON_AND_ORGANIZATION_ROLE('classification_officer');
#10=PERSON_AND_ORGANIZATION_ROLE('design_owner');
#11=APPROVAL_PERSON_ORGANIZATION(#38,#39,#40);
#12=APPROVAL_DATE_TIME(#4,#39);
#13=CC_DESIGN_APPROVAL(#39,(#41,#42,#43));
#14=CC_DESIGN_DATE_AND_TIME_ASSIGNMENT(#4,#5,(#43));
#15=CC_DESIGN_DATE_AND_TIME_ASSIGNMENT(#4,#6,(#41));
#16=CC_DESIGN_PERSON_AND_ORGANIZATION_ASSIGNMENT(#38,#10,(#44));
#17=CC_DESIGN_PERSON_AND_ORGANIZATION_ASSIGNMENT(#38,#7,(#43));
#18=CC_DESIGN_PERSON_AND_ORGANIZATION_ASSIGNMENT(#38,#7,(#42));
#19=CC_DESIGN_PERSON_AND_ORGANIZATION_ASSIGNMENT(#38,#8,(#42));
#20=CC_DESIGN_SECURITY_CLASSIFICATION(#41,(#42));
#21=CC_DESIGN_PERSON_AND_ORGANIZATION_ASSIGNMENT(#38,#9,(#41));
#22=SHAPE_DEFINITION_REPRESENTATION(#45,#46);
#23= (GEOMETRIC_REPRESENTATION_CONTEXT(3)GLOBAL_UNCERTAINTY_ASSIGNED_CONTEXT((#49))GLOBAL_UNIT_ASSIGNED_CONTEXT((#51,#52,#53))REPRESENTATION_CONTEXT('NONE','WORKSPACE'));
#24=PROPERTY_DEFINITION_REPRESENTATION(#55,#56);
#25=GENERAL_PROPERTY_ASSOCIATION('','',#57,#55);
#26=PROPERTY_DEFINITION_REPRESENTATION(#58,#59);
#27=GENERAL_PROPERTY_ASSOCIATION('','',#60,#58);
#28=PROPERTY_DEFINITION_REPRESENTATION(#61,#62);
#29=GENERAL_PROPERTY_ASSOCIATION('','',#63,#61);
#33=APPLICATION_CONTEXT('CONFIGURATION CONTROLLED 3D DESIGNS OF MECHANICAL PARTS AND ASSEMBLIES');
#34=PRODUCT_CATEGORY('part','NONE');
#35=PRODUCT_RELATED_PRODUCT_CATEGORY('detail',' ',(#44));
#36=CALENDAR_DATE(2022,29,7);
#37=LOCAL_TIME(15,37,13.0,#64);
#38=PERSON_AND_ORGANIZATION(#65,#66);
#39=APPROVAL(#67,'SOLID MODEL');
#40=APPROVAL_ROLE('APPROVED');
#41=SECURITY_CLASSIFICATION('','',#68);
#42=PRODUCT_DEFINITION_FORMATION_WITH_SPECIFIED_SOURCE('A','NONE',#44,.NOT_KNOWN.);
#43=PRODUCT_DEFINITION('','NONE',#42,#1);
#44=PRODUCT('Suporte Encoder traseiro','','S\X\F3lido1',(#69));
#45=PRODUCT_DEFINITION_SHAPE('NONE','NONE',#43);
#46=ADVANCED_BREP_SHAPE_REPRESENTATION('1',(#70,#71),#23);
#49=UNCERTAINTY_MEASURE_WITH_UNIT(LENGTH_MEASURE(0.001),#51,'','');
#51= (CONVERSION_BASED_UNIT('MILLIMETRE',#74)LENGTH_UNIT()NAMED_UNIT(#77));
#52= (NAMED_UNIT(#79)PLANE_ANGLE_UNIT()SI_UNIT($,.RADIAN.));
#53= (NAMED_UNIT(#79)SOLID_ANGLE_UNIT()SI_UNIT($,.STERADIAN.));
#55=PROPERTY_DEFINITION('PdmObjectId','',#43);
#56=REPRESENTATION('',(#85),#23);
#57=GENERAL_PROPERTY('','19_2d33aa80-3400-4df2-88c1-bd50ab977ea6&2_28_0_3','');
#58=PROPERTY_DEFINITION('CreationDate','',#43);
#59=REPRESENTATION('',(#86),#23);
#60=GENERAL_PROPERTY('','20/09/2021 22:12:02','');
#61=PROPERTY_DEFINITION('Minor Revision','',#43);
#62=REPRESENTATION('',(#87),#23);
#63=GENERAL_PROPERTY('','1','');
#64=COORDINATED_UNIVERSAL_TIME_OFFSET(3,0,.BEHIND.);
#65=PERSON('','UNSPECIFIED',$,$,$,$);
#66=ORGANIZATION('UNSPECIFIED','UNSPECIFIED','UNSPECIFIED');
#67=APPROVAL_STATUS('approved');
#68=SECURITY_CLASSIFICATION_LEVEL('unclassified');
#69=MECHANICAL_CONTEXT('',#33,'mechanical');
#70=MANIFOLD_SOLID_BREP('1',#88);
#71=AXIS2_PLACEMENT_3D('',#89,#90,#91);
#74=LENGTH_MEASURE_WITH_UNIT(LENGTH_MEASURE(1.0),#92);
#77=DIMENSIONAL_EXPONENTS(1.0,0.0,0.0,0.0,0.0,0.0,0.0);
#79=DIMENSIONAL_EXPONENTS(0.0,0.0,0.0,0.0,0.0,0.0,0.0);
#85=VALUE_REPRESENTATION_ITEM('19_2d33aa80-3400-4df2-88c1-bd50ab977ea6&2_28_0_3',);
#86=VALUE_REPRESENTATION_ITEM('20/09/2021 22:12:02',);
#87=VALUE_REPRESENTATION_ITEM('1',);
#88=CLOSED_SHELL('',(#93,#94,#95,#96,#97,#98,#99,#100,#101,#102,#103,#104,#105,#106,#107,#108,#109));
#89=CARTESIAN_POINT('',(0.0,0.0,0.0));
#90=DIRECTION('',(0.0,0.0,1.0));
#91=DIRECTION('',(1.0,0.0,0.0));
#92= (NAMED_UNIT(#77)LENGTH_UNIT()SI_UNIT(.MILLI.,.METRE.));
#93=ADVANCED_FACE('',(#111),#112,.T.);
#94=ADVANCED_FACE('',(#113),#114,.T.);
#95=ADVANCED_FACE('',(#115),#116,.T.);
#96=ADVANCED_FACE('',(#117,#118,#119,#120,#121,#122,#123,#124,#125,#126),#127,.F.);
#97=ADVANCED_FACE('',(#128,#129,#130,#131,#132,#133,#134,#135,#136,#137),#138,.T.);
#98=ADVANCED_FACE('',(#139),#140,.F.);
#99=ADVANCED_FACE('',(#141),#142,.F.);
#100=ADVANCED_FACE('',(#143),#144,.F.);
#101=ADVANCED_FACE('',(#145),#146,.F.);
#102=ADVANCED_FACE('',(#147,#148),#149,.F.);
#103=ADVANCED_FACE('',(#150),#151,.T.);
#104=ADVANCED_FACE('',(#152),#153,.T.);
#105=ADVANCED_FACE('',(#154),#155,.F.);
#106=ADVANCED_FACE('',(#156),#157,.F.);
#107=ADVANCED_FACE('',(#158),#159,.F.);
#108=ADVANCED_FACE('',(#160),#161,.T.);
#109=ADVANCED_FACE('',(#162,#163),#164,.F.);
#111=FACE_OUTER_BOUND('',#165,.T.);
#112=PLANE('',#166);
#113=FACE_OUTER_BOUND('',#167,.T.);
#114=CYLINDRICAL_SURFACE('',#168,11.9571389400877);
#115=FACE_OUTER_BOUND('',#169,.T.);
#116=CYLINDRICAL_SURFACE('',#170,2.5);
#117=FACE_BOUND('',#171,.T.);
#118=FACE_BOUND('',#172,.T.);
#119=FACE_BOUND('',#173,.T.);
#120=FACE_BOUND('',#174,.T.);
#121=FACE_BOUND('',#175,.T.);
#122=FACE_BOUND('',#176,.T.);
#123=FACE_BOUND('',#177,.T.);
#124=FACE_BOUND('',#178,.T.);
#125=FACE_BOUND('',#179,.T.);
#126=FACE_OUTER_BOUND('',#180,.T.);
#127=PLANE('',#181);
#128=FACE_BOUND('',#182,.T.);
#129=FACE_BOUND('',#183,.T.);
#130=FACE_BOUND('',#184,.T.);
#131=FACE_BOUND('',#185,.T.);
#132=FACE_BOUND('',#186,.T.);
#133=FACE_BOUND('',#187,.T.);
#134=FACE_BOUND('',#188,.T.);
#135=FACE_BOUND('',#189,.T.);
#136=FACE_BOUND('',#190,.T.);
#137=FACE_OUTER_BOUND('',#191,.T.);
#138=PLANE('',#192);
#139=FACE_OUTER_BOUND('',#193,.T.);
#140=CYLINDRICAL_SURFACE('',#194,1.0065);
#141=FACE_OUTER_BOUND('',#195,.T.);
#142=CYLINDRICAL_SURFACE('',#196,4.0);
#143=FACE_OUTER_BOUND('',#197,.T.);
#144=CYLINDRICAL_SURFACE('',#198,1.0065);
#145=FACE_OUTER_BOUND('',#199,.T.);
#146=CYLINDRICAL_SURFACE('',#200,1.0065);
#147=FACE_OUTER_BOUND('',#201,.T.);
#148=FACE_OUTER_BOUND('',#202,.T.);
#149=CYLINDRICAL_SURFACE('',#203,1.55);
#150=FACE_OUTER_BOUND('',#204,.T.);
#151=PLANE('',#205);
#152=FACE_OUTER_BOUND('',#206,.T.);
#153=CYLINDRICAL_SURFACE('',#207,2.5);
#154=FACE_OUTER_BOUND('',#208,.T.);
#155=CYLINDRICAL_SURFACE('',#209,1.0065);
#156=FACE_OUTER_BOUND('',#210,.T.);
#157=CYLINDRICAL_SURFACE('',#211,1.0065);
#158=FACE_OUTER_BOUND('',#212,.T.);
#159=CYLINDRICAL_SURFACE('',#213,1.0065);
#160=FACE_OUTER_BOUND('',#214,.T.);
#161=PLANE('',#215);
#162=FACE_OUTER_BOUND('',#216,.T.);
#163=FACE_OUTER_BOUND('',#217,.T.);
#164=CYLINDRICAL_SURFACE('',#218,1.55);
#165=EDGE_LOOP('',(#219,#220,#221,#222));
#166=AXIS2_PLACEMENT_3D('',#223,#224,#225);
#167=EDGE_LOOP('',(#226,#227,#228,#229));
#168=AXIS2_PLACEMENT_3D('',#230,#231,#232);
#169=EDGE_LOOP('',(#233,#234,#235,#236));
#170=AXIS2_PLACEMENT_3D('',#237,#238,#239);
#171=EDGE_LOOP('',(#240));
#172=EDGE_LOOP('',(#241));
#173=EDGE_LOOP('',(#242));
#174=EDGE_LOOP('',(#243));
#175=EDGE_LOOP('',(#244));
#176=EDGE_LOOP('',(#245));
#177=EDGE_LOOP('',(#246));
#178=EDGE_LOOP('',(#247));
#179=EDGE_LOOP('',(#248));
#180=EDGE_LOOP('',(#249,#250,#251,#252,#253,#254));
#181=AXIS2_PLACEMENT_3D('',#255,#256,#257);
#182=EDGE_LOOP('',(#258));
#183=EDGE_LOOP('',(#259));
#184=EDGE_LOOP('',(#260));
#185=EDGE_LOOP('',(#261,#262));
#186=EDGE_LOOP('',(#263,#264));
#187=EDGE_LOOP('',(#265,#266));
#188=EDGE_LOOP('',(#267,#268));
#189=EDGE_LOOP('',(#269,#270));
#190=EDGE_LOOP('',(#271,#272));
#191=EDGE_LOOP('',(#273,#274,#275,#276,#277,#278));
#192=AXIS2_PLACEMENT_3D('',#279,#280,#281);
#193=EDGE_LOOP('',(#282,#283,#284,#285,#286));
#194=AXIS2_PLACEMENT_3D('',#287,#288,#289);
#195=EDGE_LOOP('',(#290,#291,#292,#293));
#196=AXIS2_PLACEMENT_3D('',#294,#295,#296);
#197=EDGE_LOOP('',(#297,#298,#299,#300,#301));
#198=AXIS2_PLACEMENT_3D('',#302,#303,#304);
#199=EDGE_LOOP('',(#305,#306,#307,#308,#309));
#200=AXIS2_PLACEMENT_3D('',#310,#311,#312);
#201=EDGE_LOOP('',(#313));
#202=EDGE_LOOP('',(#314));
#203=AXIS2_PLACEMENT_3D('',#315,#316,#317);
#204=EDGE_LOOP('',(#318,#319,#320,#321));
#205=AXIS2_PLACEMENT_3D('',#322,#323,#324);
#206=EDGE_LOOP('',(#325,#326,#327,#328));
#207=AXIS2_PLACEMENT_3D('',#329,#330,#331);
#208=EDGE_LOOP('',(#332,#333,#334,#335,#336));
#209=AXIS2_PLACEMENT_3D('',#337,#338,#339);
#210=EDGE_LOOP('',(#340,#341,#342,#343,#344));
#211=AXIS2_PLACEMENT_3D('',#345,#346,#347);
#212=EDGE_LOOP('',(#348,#349,#350,#351,#352));
#213=AXIS2_PLACEMENT_3D('',#353,#354,#355);
#214=EDGE_LOOP('',(#356,#357,#358,#359));
#215=AXIS2_PLACEMENT_3D('',#360,#361,#362);
#216=EDGE_LOOP('',(#363));
#217=EDGE_LOOP('',(#364));
#218=AXIS2_PLACEMENT_3D('',#365,#366,#367);
#219=ORIENTED_EDGE('',*,*,#368,.T.);
#220=ORIENTED_EDGE('',*,*,#369,.T.);
#221=ORIENTED_EDGE('',*,*,#370,.F.);
#222=ORIENTED_EDGE('',*,*,#371,.F.);
#223=CARTESIAN_POINT('',(14.4922615794744,-22.2249407832732,0.0));
#224=DIRECTION('',(0.993920242462945,0.110102459656449,0.0));
#225=DIRECTION('',(0.0,0.0,-1.0));
#226=ORIENTED_EDGE('',*,*,#372,.T.);
#227=ORIENTED_EDGE('',*,*,#373,.T.);
#228=ORIENTED_EDGE('',*,*,#374,.F.);
#229=ORIENTED_EDGE('',*,*,#369,.F.);
#230=CARTESIAN_POINT('',(0.0,0.0,0.0));
#231=DIRECTION('',(0.0,0.0,1.0));
#232=DIRECTION('',(1.0,0.0,0.0));
#233=ORIENTED_EDGE('',*,*,#375,.T.);
#234=ORIENTED_EDGE('',*,*,#371,.T.);
#235=ORIENTED_EDGE('',*,*,#376,.F.);
#236=ORIENTED_EDGE('',*,*,#377,.F.);
#237=CARTESIAN_POINT('',(12.0074609733171,-22.5001969324143,0.0));
#238=DIRECTION('',(0.0,0.0,1.0));
#239=DIRECTION('',(-0.0177380154329381,-0.999842669027733,0.0));
#240=ORIENTED_EDGE('',*,*,#378,.F.);
#241=ORIENTED_EDGE('',*,*,#379,.F.);
#242=ORIENTED_EDGE('',*,*,#380,.F.);
#243=ORIENTED_EDGE('',*,*,#381,.T.);
#244=ORIENTED_EDGE('',*,*,#382,.T.);
#245=ORIENTED_EDGE('',*,*,#383,.T.);
#246=ORIENTED_EDGE('',*,*,#384,.T.);
#247=ORIENTED_EDGE('',*,*,#385,.T.);
#248=ORIENTED_EDGE('',*,*,#386,.T.);
#249=ORIENTED_EDGE('',*,*,#387,.F.);
#250=ORIENTED_EDGE('',*,*,#372,.F.);
#251=ORIENTED_EDGE('',*,*,#368,.F.);
#252=ORIENTED_EDGE('',*,*,#375,.F.);
#253=ORIENTED_EDGE('',*,*,#388,.F.);
#254=ORIENTED_EDGE('',*,*,#389,.F.);
#255=CARTESIAN_POINT('',(0.005794849886539,-6.52152899616333,0.0));
#256=DIRECTION('',(0.0,0.0,1.0));
#257=DIRECTION('',(1.0,0.0,0.0));
#258=ORIENTED_EDGE('',*,*,#390,.T.);
#259=ORIENTED_EDGE('',*,*,#391,.T.);
#260=ORIENTED_EDGE('',*,*,#392,.T.);
#261=ORIENTED_EDGE('',*,*,#393,.T.);
#262=ORIENTED_EDGE('',*,*,#394,.T.);
#263=ORIENTED_EDGE('',*,*,#395,.T.);
#264=ORIENTED_EDGE('',*,*,#396,.T.);
#265=ORIENTED_EDGE('',*,*,#397,.T.);
#266=ORIENTED_EDGE('',*,*,#398,.T.);
#267=ORIENTED_EDGE('',*,*,#399,.T.);
#268=ORIENTED_EDGE('',*,*,#400,.T.);
#269=ORIENTED_EDGE('',*,*,#401,.T.);
#270=ORIENTED_EDGE('',*,*,#402,.T.);
#271=ORIENTED_EDGE('',*,*,#403,.T.);
#272=ORIENTED_EDGE('',*,*,#404,.T.);
#273=ORIENTED_EDGE('',*,*,#405,.T.);
#274=ORIENTED_EDGE('',*,*,#406,.T.);
#275=ORIENTED_EDGE('',*,*,#407,.T.);
#276=ORIENTED_EDGE('',*,*,#376,.T.);
#277=ORIENTED_EDGE('',*,*,#370,.T.);
#278=ORIENTED_EDGE('',*,*,#374,.T.);
#279=CARTESIAN_POINT('',(0.005794849886539,-6.52152899616333,3.0));
#280=DIRECTION('',(0.0,0.0,1.0));
#281=DIRECTION('',(1.0,0.0,0.0));
#282=ORIENTED_EDGE('',*,*,#401,.F.);
#283=ORIENTED_EDGE('',*,*,#402,.F.);
#284=ORIENTED_EDGE('',*,*,#408,.T.);
#285=ORIENTED_EDGE('',*,*,#385,.F.);
#286=ORIENTED_EDGE('',*,*,#408,.F.);
#287=CARTESIAN_POINT('',(-6.49519052838329,-3.75,-44.0748123332929));
#288=DIRECTION('',(0.0,0.0,1.0));
#289=DIRECTION('',(1.0,0.0,0.0));
#290=ORIENTED_EDGE('',*,*,#392,.F.);
#291=ORIENTED_EDGE('',*,*,#409,.T.);
#292=ORIENTED_EDGE('',*,*,#380,.T.);
#293=ORIENTED_EDGE('',*,*,#409,.F.);
#294=CARTESIAN_POINT('',(0.0,0.0,0.0));
#295=DIRECTION('',(0.0,0.0,1.0));
#296=DIRECTION('',(-1.0,0.0,0.0));
#297=ORIENTED_EDGE('',*,*,#393,.F.);
#298=ORIENTED_EDGE('',*,*,#394,.F.);
#299=ORIENTED_EDGE('',*,*,#410,.T.);
#300=ORIENTED_EDGE('',*,*,#381,.F.);
#301=ORIENTED_EDGE('',*,*,#410,.F.);
#302=CARTESIAN_POINT('',(6.49519052838329,3.75,-44.0748123332929));
#303=DIRECTION('',(0.0,0.0,1.0));
#304=DIRECTION('',(1.0,0.0,0.0));
#305=ORIENTED_EDGE('',*,*,#403,.F.);
#306=ORIENTED_EDGE('',*,*,#404,.F.);
#307=ORIENTED_EDGE('',*,*,#411,.T.);
#308=ORIENTED_EDGE('',*,*,#386,.F.);
#309=ORIENTED_EDGE('',*,*,#411,.F.);
#310=CARTESIAN_POINT('',(6.49519052838329,-3.75,-44.0748123332929));
#311=DIRECTION('',(0.0,0.0,1.0));
#312=DIRECTION('',(1.0,0.0,0.0));
#313=ORIENTED_EDGE('',*,*,#391,.F.);
#314=ORIENTED_EDGE('',*,*,#379,.T.);
#315=CARTESIAN_POINT('',(-12.0,-22.0001970001271,0.0));
#316=DIRECTION('',(0.0,0.0,1.0));
#317=DIRECTION('',(-1.0,0.0,0.0));
#318=ORIENTED_EDGE('',*,*,#388,.T.);
#319=ORIENTED_EDGE('',*,*,#377,.T.);
#320=ORIENTED_EDGE('',*,*,#407,.F.);
#321=ORIENTED_EDGE('',*,*,#412,.F.);
#322=CARTESIAN_POINT('',(-11.9958302317666,-25.0001969320775,0.0));
#323=DIRECTION('',(1.64167109441376E-05,-0.999999999865246,0.0));
#324=DIRECTION('',(0.0,0.0,-1.0));
#325=ORIENTED_EDGE('',*,*,#389,.T.);
#326=ORIENTED_EDGE('',*,*,#412,.T.);
#327=ORIENTED_EDGE('',*,*,#406,.F.);
#328=ORIENTED_EDGE('',*,*,#413,.F.);
#329=CARTESIAN_POINT('',(-11.995871273544,-22.5001969324144,0.0));
#330=DIRECTION('',(0.0,0.0,1.0));
#331=DIRECTION('',(-0.993973703945826,0.109618775144659,0.0));
#332=ORIENTED_EDGE('',*,*,#395,.F.);
#333=ORIENTED_EDGE('',*,*,#396,.F.);
#334=ORIENTED_EDGE('',*,*,#414,.T.);
#335=ORIENTED_EDGE('',*,*,#382,.F.);
#336=ORIENTED_EDGE('',*,*,#414,.F.);
#337=CARTESIAN_POINT('',(0.0,-7.5,-44.0748123332929));
#338=DIRECTION('',(0.0,0.0,1.0));
#339=DIRECTION('',(1.0,0.0,0.0));
#340=ORIENTED_EDGE('',*,*,#399,.F.);
#341=ORIENTED_EDGE('',*,*,#400,.F.);
#342=ORIENTED_EDGE('',*,*,#415,.T.);
#343=ORIENTED_EDGE('',*,*,#384,.F.);
#344=ORIENTED_EDGE('',*,*,#415,.F.);
#345=CARTESIAN_POINT('',(9.18485099360515E-16,7.5,-44.0748123332929));
#346=DIRECTION('',(0.0,0.0,1.0));
#347=DIRECTION('',(1.0,0.0,0.0));
#348=ORIENTED_EDGE('',*,*,#397,.F.);
#349=ORIENTED_EDGE('',*,*,#398,.F.);
#350=ORIENTED_EDGE('',*,*,#416,.T.);
#351=ORIENTED_EDGE('',*,*,#383,.F.);
#352=ORIENTED_EDGE('',*,*,#416,.F.);
#353=CARTESIAN_POINT('',(-6.49519052838329,3.75,-44.0748123332929));
#354=DIRECTION('',(0.0,0.0,1.0));
#355=DIRECTION('',(1.0,0.0,0.0));
#356=ORIENTED_EDGE('',*,*,#387,.T.);
#357=ORIENTED_EDGE('',*,*,#413,.T.);
#358=ORIENTED_EDGE('',*,*,#405,.F.);
#359=ORIENTED_EDGE('',*,*,#373,.F.);
#360=CARTESIAN_POINT('',(-11.8859039750848,1.30324914257651,0.0));
#361=DIRECTION('',(-0.993973703945826,0.10961877514466,0.0));
#362=DIRECTION('',(0.0,0.0,1.0));
#363=ORIENTED_EDGE('',*,*,#390,.F.);
#364=ORIENTED_EDGE('',*,*,#378,.T.);
#365=CARTESIAN_POINT('',(12.0,-22.0000029990644,0.0));
#366=DIRECTION('',(0.0,0.0,1.0));
#367=DIRECTION('',(-1.0,0.0,0.0));
#368=EDGE_CURVE('',#417,#418,#419,.T.);
#369=EDGE_CURVE('',#418,#420,#421,.T.);
#370=EDGE_CURVE('',#422,#420,#423,.T.);
#371=EDGE_CURVE('',#417,#422,#424,.T.);
#372=EDGE_CURVE('',#418,#425,#426,.T.);
#373=EDGE_CURVE('',#425,#427,#428,.T.);
#374=EDGE_CURVE('',#420,#427,#429,.T.);
#375=EDGE_CURVE('',#430,#417,#431,.T.);
#376=EDGE_CURVE('',#432,#422,#433,.T.);
#377=EDGE_CURVE('',#430,#432,#434,.T.);
#378=EDGE_CURVE('',#435,#435,#436,.T.);
#379=EDGE_CURVE('',#437,#437,#438,.T.);
#380=EDGE_CURVE('',#439,#439,#440,.T.);
#381=EDGE_CURVE('',#441,#441,#442,.T.);
#382=EDGE_CURVE('',#443,#443,#444,.T.);
#383=EDGE_CURVE('',#445,#445,#446,.T.);
#384=EDGE_CURVE('',#447,#447,#448,.T.);
#385=EDGE_CURVE('',#449,#449,#450,.T.);
#386=EDGE_CURVE('',#451,#451,#452,.T.);
#387=EDGE_CURVE('',#425,#453,#454,.T.);
#388=EDGE_CURVE('',#455,#430,#456,.T.);
#389=EDGE_CURVE('',#453,#455,#457,.T.);
#390=EDGE_CURVE('',#458,#458,#459,.F.);
#391=EDGE_CURVE('',#460,#460,#461,.F.);
#392=EDGE_CURVE('',#462,#462,#463,.T.);
#393=EDGE_CURVE('',#464,#465,#466,.T.);
#394=EDGE_CURVE('',#465,#464,#467,.T.);
#395=EDGE_CURVE('',#468,#469,#470,.T.);
#396=EDGE_CURVE('',#469,#468,#471,.T.);
#397=EDGE_CURVE('',#472,#473,#474,.T.);
#398=EDGE_CURVE('',#473,#472,#475,.T.);
#399=EDGE_CURVE('',#476,#477,#478,.T.);
#400=EDGE_CURVE('',#477,#476,#479,.T.);
#401=EDGE_CURVE('',#480,#481,#482,.T.);
#402=EDGE_CURVE('',#481,#480,#483,.T.);
#403=EDGE_CURVE('',#484,#485,#486,.T.);
#404=EDGE_CURVE('',#485,#484,#487,.T.);
#405=EDGE_CURVE('',#427,#488,#489,.T.);
#406=EDGE_CURVE('',#488,#490,#491,.T.);
#407=EDGE_CURVE('',#490,#432,#492,.T.);
#408=EDGE_CURVE('',#481,#449,#493,.T.);
#409=EDGE_CURVE('',#462,#439,#494,.T.);
#410=EDGE_CURVE('',#465,#441,#495,.T.);
#411=EDGE_CURVE('',#485,#451,#496,.T.);
#412=EDGE_CURVE('',#455,#490,#497,.T.);
#413=EDGE_CURVE('',#453,#488,#498,.T.);
#414=EDGE_CURVE('',#469,#443,#499,.T.);
#415=EDGE_CURVE('',#477,#447,#500,.T.);
#416=EDGE_CURVE('',#473,#445,#501,.T.);
#417=VERTEX_POINT('',#502);
#418=VERTEX_POINT('',#503);
#419=LINE('',#504,#505);
#420=VERTEX_POINT('',#506);
#421=LINE('',#507,#508);
#422=VERTEX_POINT('',#509);
#423=LINE('',#510,#511);
#424=LINE('',#512,#513);
#425=VERTEX_POINT('',#514);
#426=CIRCLE('',#515,11.9571389400877);
#427=VERTEX_POINT('',#516);
#428=LINE('',#517,#518);
#429=CIRCLE('',#519,11.9571389400877);
#430=VERTEX_POINT('',#520);
#431=CIRCLE('',#521,2.5);
#432=VERTEX_POINT('',#522);
#433=CIRCLE('',#523,2.5);
#434=LINE('',#524,#525);
#435=VERTEX_POINT('',#526);
#436=CIRCLE('',#527,1.55);
#437=VERTEX_POINT('',#528);
#438=CIRCLE('',#529,1.55);
#439=VERTEX_POINT('',#530);
#440=CIRCLE('',#531,4.0);
#441=VERTEX_POINT('',#532);
#442=CIRCLE('',#533,1.0065);
#443=VERTEX_POINT('',#534);
#444=CIRCLE('',#535,1.0065);
#445=VERTEX_POINT('',#536);
#446=CIRCLE('',#537,1.0065);
#447=VERTEX_POINT('',#538);
#448=CIRCLE('',#539,1.0065);
#449=VERTEX_POINT('',#540);
#450=CIRCLE('',#541,1.0065);
#451=VERTEX_POINT('',#542);
#452=CIRCLE('',#543,1.0065);
#453=VERTEX_POINT('',#544);
#454=LINE('',#545,#546);
#455=VERTEX_POINT('',#547);
#456=LINE('',#548,#549);
#457=CIRCLE('',#550,2.5);
#458=VERTEX_POINT('',#551);
#459=CIRCLE('',#552,1.55);
#460=VERTEX_POINT('',#553);
#461=CIRCLE('',#554,1.55);
#462=VERTEX_POINT('',#555);
#463=CIRCLE('',#556,4.0);
#464=VERTEX_POINT('',#557);
#465=VERTEX_POINT('',#558);
#466=CIRCLE('',#559,1.0065);
#467=CIRCLE('',#560,1.0065);
#468=VERTEX_POINT('',#561);
#469=VERTEX_POINT('',#562);
#470=CIRCLE('',#563,1.0065);
#471=CIRCLE('',#564,1.0065);
#472=VERTEX_POINT('',#565);
#473=VERTEX_POINT('',#566);
#474=CIRCLE('',#567,1.0065);
#475=CIRCLE('',#568,1.0065);
#476=VERTEX_POINT('',#569);
#477=VERTEX_POINT('',#570);
#478=CIRCLE('',#571,1.0065);
#479=CIRCLE('',#572,1.0065);
#480=VERTEX_POINT('',#573);
#481=VERTEX_POINT('',#574);
#482=CIRCLE('',#575,1.0065);
#483=CIRCLE('',#576,1.0065);
#484=VERTEX_POINT('',#577);
#485=VERTEX_POINT('',#578);
#486=CIRCLE('',#579,1.0065);
#487=CIRCLE('',#580,1.0065);
#488=VERTEX_POINT('',#581);
#489=LINE('',#582,#583);
#490=VERTEX_POINT('',#584);
#491=CIRCLE('',#585,2.5);
#492=LINE('',#586,#587);
#493=LINE('',#588,#589);
#494=LINE('',#590,#591);
#495=LINE('',#592,#593);
#496=LINE('',#594,#595);
#497=LINE('',#596,#597);
#498=LINE('',#598,#599);
#499=LINE('',#600,#601);
#500=LINE('',#602,#603);
#501=LINE('',#604,#605);
#502=CARTESIAN_POINT('',(14.4922615794744,-22.2249407832732,0.0));
#503=CARTESIAN_POINT('',(11.8859039750847,1.30324914257651,0.0));
#504=CARTESIAN_POINT('',(14.4922615794744,-22.2249407832732,0.0));
#505=VECTOR('',#606,1.0);
#506=CARTESIAN_POINT('',(11.8859039750848,1.30324914257651,3.0));
#507=CARTESIAN_POINT('',(11.8859039750847,1.30324914257651,0.0));
#508=VECTOR('',#607,1.0);
#509=CARTESIAN_POINT('',(14.4922615794744,-22.2249407832732,3.0));
#510=CARTESIAN_POINT('',(14.4922615794744,-22.2249407832732,3.0));
#511=VECTOR('',#608,1.0);
#512=CARTESIAN_POINT('',(14.4922615794744,-22.2249407832732,0.0));
#513=VECTOR('',#609,1.0);
#514=CARTESIAN_POINT('',(-11.8859039750848,1.30324914257651,0.0));
#515=AXIS2_PLACEMENT_3D('',#610,#611,#612);
#516=CARTESIAN_POINT('',(-11.8859039750848,1.30324914257651,3.0));
#517=CARTESIAN_POINT('',(-11.8859039750848,1.30324914257651,0.0));
#518=VECTOR('',#613,1.0);
#519=AXIS2_PLACEMENT_3D('',#614,#615,#616);
#520=CARTESIAN_POINT('',(12.0518880825159,-24.999802147637,0.0));
#521=AXIS2_PLACEMENT_3D('',#617,#618,#619);
#522=CARTESIAN_POINT('',(12.0518880825159,-24.999802147637,3.0));
#523=AXIS2_PLACEMENT_3D('',#620,#621,#622);
#524=CARTESIAN_POINT('',(12.0518880825159,-24.999802147637,0.0));
#525=VECTOR('',#623,1.0);
#526=CARTESIAN_POINT('',(10.45,-22.0000029990644,0.0));
#527=AXIS2_PLACEMENT_3D('',#624,#625,#626);
#528=CARTESIAN_POINT('',(-13.55,-22.0001970001271,0.0));
#529=AXIS2_PLACEMENT_3D('',#627,#628,#629);
#530=CARTESIAN_POINT('',(4.0,4.89858719658941E-16,0.0));
#531=AXIS2_PLACEMENT_3D('',#630,#631,#632);
#532=CARTESIAN_POINT('',(5.48869052838329,3.75,0.0));
#533=AXIS2_PLACEMENT_3D('',#633,#634,#635);
#534=CARTESIAN_POINT('',(-1.0065,-7.5,0.0));
#535=AXIS2_PLACEMENT_3D('',#636,#637,#638);
#536=CARTESIAN_POINT('',(-7.50169052838329,3.75,0.0));
#537=AXIS2_PLACEMENT_3D('',#639,#640,#641);
#538=CARTESIAN_POINT('',(-1.0065,7.5,0.0));
#539=AXIS2_PLACEMENT_3D('',#642,#643,#644);
#540=CARTESIAN_POINT('',(-7.50169052838329,-3.75,0.0));
#541=AXIS2_PLACEMENT_3D('',#645,#646,#647);
#542=CARTESIAN_POINT('',(5.48869052838329,-3.75,0.0));
#543=AXIS2_PLACEMENT_3D('',#648,#649,#650);
#544=CARTESIAN_POINT('',(-14.4808055334086,-22.2261499945527,0.0));
#545=CARTESIAN_POINT('',(-11.8859039750848,1.30324914257651,0.0));
#546=VECTOR('',#651,1.0);
#547=CARTESIAN_POINT('',(-11.9958302317666,-25.0001969320775,0.0));
#548=CARTESIAN_POINT('',(-11.9958302317666,-25.0001969320775,0.0));
#549=VECTOR('',#652,1.0);
#550=AXIS2_PLACEMENT_3D('',#653,#654,#655);
#551=CARTESIAN_POINT('',(13.55,-22.0000029990644,3.0));
#552=AXIS2_PLACEMENT_3D('',#656,#657,#658);
#553=CARTESIAN_POINT('',(-10.45,-22.0001970001271,3.0));
#554=AXIS2_PLACEMENT_3D('',#659,#660,#661);
#555=CARTESIAN_POINT('',(4.0,5.55111512312578E-16,3.0));
#556=AXIS2_PLACEMENT_3D('',#662,#663,#664);
#557=CARTESIAN_POINT('',(7.50169052838329,3.75,3.0));
#558=CARTESIAN_POINT('',(5.48869052838329,3.75,3.0));
#559=AXIS2_PLACEMENT_3D('',#665,#666,#667);
#560=AXIS2_PLACEMENT_3D('',#668,#669,#670);
#561=CARTESIAN_POINT('',(1.0065,-7.5,3.0));
#562=CARTESIAN_POINT('',(-1.0065,-7.5,3.0));
#563=AXIS2_PLACEMENT_3D('',#671,#672,#673);
#564=AXIS2_PLACEMENT_3D('',#674,#675,#676);
#565=CARTESIAN_POINT('',(-5.48869052838329,3.75,3.0));
#566=CARTESIAN_POINT('',(-7.50169052838329,3.75,3.0));
#567=AXIS2_PLACEMENT_3D('',#677,#678,#679);
#568=AXIS2_PLACEMENT_3D('',#680,#681,#682);
#569=CARTESIAN_POINT('',(1.0065,7.5,3.0));
#570=CARTESIAN_POINT('',(-1.0065,7.5,3.0));
#571=AXIS2_PLACEMENT_3D('',#683,#684,#685);
#572=AXIS2_PLACEMENT_3D('',#686,#687,#688);
#573=CARTESIAN_POINT('',(-5.48869052838329,-3.75,3.0));
#574=CARTESIAN_POINT('',(-7.50169052838329,-3.75,3.0));
#575=AXIS2_PLACEMENT_3D('',#689,#690,#691);
#576=AXIS2_PLACEMENT_3D('',#692,#693,#694);
#577=CARTESIAN_POINT('',(7.50169052838329,-3.75,3.0));
#578=CARTESIAN_POINT('',(5.48869052838329,-3.75,3.0));
#579=AXIS2_PLACEMENT_3D('',#695,#696,#697);
#580=AXIS2_PLACEMENT_3D('',#698,#699,#700);
#581=CARTESIAN_POINT('',(-14.4808055334086,-22.2261499945527,3.0));
#582=CARTESIAN_POINT('',(-11.8859039750848,1.30324914257651,3.0));
#583=VECTOR('',#701,1.0);
#584=CARTESIAN_POINT('',(-11.9958302317666,-25.0001969320775,3.0));
#585=AXIS2_PLACEMENT_3D('',#702,#703,#704);
#586=CARTESIAN_POINT('',(-11.9958302317666,-25.0001969320775,3.0));
#587=VECTOR('',#705,1.0);
#588=CARTESIAN_POINT('',(-7.50169052838329,-3.75,-44.0748123332929));
#589=VECTOR('',#706,1.0);
#590=CARTESIAN_POINT('',(4.0,4.89858719658941E-16,0.0));
#591=VECTOR('',#707,1.0);
#592=CARTESIAN_POINT('',(5.48869052838329,3.75,-44.0748123332929));
#593=VECTOR('',#708,1.0);
#594=CARTESIAN_POINT('',(5.48869052838329,-3.75,-44.0748123332929));
#595=VECTOR('',#709,1.0);
#596=CARTESIAN_POINT('',(-11.9958302317666,-25.0001969320775,0.0));
#597=VECTOR('',#710,1.0);
#598=CARTESIAN_POINT('',(-14.4808055334086,-22.2261499945527,0.0));
#599=VECTOR('',#711,1.0);
#600=CARTESIAN_POINT('',(-1.0065,-7.5,-44.0748123332929));
#601=VECTOR('',#712,1.0);
#602=CARTESIAN_POINT('',(-1.0065,7.5,-44.0748123332929));
#603=VECTOR('',#713,1.0);
#604=CARTESIAN_POINT('',(-7.50169052838329,3.75,-44.0748123332929));
#605=VECTOR('',#714,1.0);
#606=DIRECTION('',(-0.110102459656449,0.993920242462945,0.0));
#607=DIRECTION('',(0.0,0.0,1.0));
#608=DIRECTION('',(-0.110102459656449,0.993920242462945,0.0));
#609=DIRECTION('',(0.0,0.0,1.0));
#610=CARTESIAN_POINT('',(0.0,0.0,0.0));
#611=DIRECTION('',(0.0,0.0,1.0));
#612=DIRECTION('',(1.0,0.0,0.0));
#613=DIRECTION('',(0.0,0.0,1.0));
#614=CARTESIAN_POINT('',(0.0,0.0,3.0));
#615=DIRECTION('',(0.0,0.0,1.0));
#616=DIRECTION('',(1.0,0.0,0.0));
#617=CARTESIAN_POINT('',(12.0074609733171,-22.5001969324143,0.0));
#618=DIRECTION('',(0.0,0.0,1.0));
#619=DIRECTION('',(-0.0177380154329381,-0.999842669027733,0.0));
#620=CARTESIAN_POINT('',(12.0074609733171,-22.5001969324143,3.0));
#621=DIRECTION('',(0.0,0.0,1.0));
#622=DIRECTION('',(-0.0177380154329381,-0.999842669027733,0.0));
#623=DIRECTION('',(0.0,0.0,1.0));
#624=CARTESIAN_POINT('',(12.0,-22.0000029990644,0.0));
#625=DIRECTION('',(0.0,0.0,-1.0));
#626=DIRECTION('',(-1.0,0.0,0.0));
#627=CARTESIAN_POINT('',(-12.0,-22.0001970001271,0.0));
#628=DIRECTION('',(0.0,0.0,-1.0));
#629=DIRECTION('',(-1.0,0.0,0.0));
#630=CARTESIAN_POINT('',(0.0,0.0,0.0));
#631=DIRECTION('',(0.0,0.0,-1.0));
#632=DIRECTION('',(-1.0,0.0,0.0));
#633=CARTESIAN_POINT('',(6.49519052838329,3.75,0.0));
#634=DIRECTION('',(0.0,0.0,1.0));
#635=DIRECTION('',(1.0,0.0,0.0));
#636=CARTESIAN_POINT('',(0.0,-7.5,0.0));
#637=DIRECTION('',(0.0,0.0,1.0));
#638=DIRECTION('',(1.0,0.0,0.0));
#639=CARTESIAN_POINT('',(-6.49519052838329,3.75,0.0));
#640=DIRECTION('',(0.0,0.0,1.0));
#641=DIRECTION('',(1.0,0.0,0.0));
#642=CARTESIAN_POINT('',(9.18485099360515E-16,7.5,0.0));
#643=DIRECTION('',(0.0,0.0,1.0));
#644=DIRECTION('',(1.0,0.0,0.0));
#645=CARTESIAN_POINT('',(-6.49519052838329,-3.75,0.0));
#646=DIRECTION('',(0.0,0.0,1.0));
#647=DIRECTION('',(1.0,0.0,0.0));
#648=CARTESIAN_POINT('',(6.49519052838329,-3.75,0.0));
#649=DIRECTION('',(0.0,0.0,1.0));
#650=DIRECTION('',(1.0,0.0,0.0));
#651=DIRECTION('',(-0.10961877514466,-0.993973703945826,0.0));
#652=DIRECTION('',(0.999999999865246,1.64167109441376E-05,0.0));
#653=CARTESIAN_POINT('',(-11.995871273544,-22.5001969324144,0.0));
#654=DIRECTION('',(0.0,0.0,1.0));
#655=DIRECTION('',(-0.993973703945826,0.109618775144659,0.0));
#656=CARTESIAN_POINT('',(12.0,-22.0000029990644,3.0));
#657=DIRECTION('',(0.0,0.0,1.0));
#658=DIRECTION('',(1.0,0.0,0.0));
#659=CARTESIAN_POINT('',(-12.0,-22.0001970001271,3.0));
#660=DIRECTION('',(0.0,0.0,1.0));
#661=DIRECTION('',(1.0,0.0,0.0));
#662=CARTESIAN_POINT('',(0.0,0.0,3.0));
#663=DIRECTION('',(0.0,0.0,-1.0));
#664=DIRECTION('',(-1.0,0.0,0.0));
#665=CARTESIAN_POINT('',(6.49519052838329,3.75,3.0));
#666=DIRECTION('',(0.0,0.0,-1.0));
#667=DIRECTION('',(1.0,0.0,0.0));
#668=CARTESIAN_POINT('',(6.49519052838329,3.75,3.0));
#669=DIRECTION('',(0.0,0.0,-1.0));
#670=DIRECTION('',(1.0,0.0,0.0));
#671=CARTESIAN_POINT('',(0.0,-7.5,3.0));
#672=DIRECTION('',(0.0,0.0,-1.0));
#673=DIRECTION('',(1.0,0.0,0.0));
#674=CARTESIAN_POINT('',(0.0,-7.5,3.0));
#675=DIRECTION('',(0.0,0.0,-1.0));
#676=DIRECTION('',(1.0,0.0,0.0));
#677=CARTESIAN_POINT('',(-6.49519052838329,3.75,3.0));
#678=DIRECTION('',(0.0,0.0,-1.0));
#679=DIRECTION('',(1.0,0.0,0.0));
#680=CARTESIAN_POINT('',(-6.49519052838329,3.75,3.0));
#681=DIRECTION('',(0.0,0.0,-1.0));
#682=DIRECTION('',(1.0,0.0,0.0));
#683=CARTESIAN_POINT('',(9.18485099360515E-16,7.5,3.0));
#684=DIRECTION('',(0.0,0.0,-1.0));
#685=DIRECTION('',(1.0,0.0,0.0));
#686=CARTESIAN_POINT('',(9.18485099360515E-16,7.5,3.0));
#687=DIRECTION('',(0.0,0.0,-1.0));
#688=DIRECTION('',(1.0,0.0,0.0));
#689=CARTESIAN_POINT('',(-6.49519052838329,-3.75,3.0));
#690=DIRECTION('',(0.0,0.0,-1.0));
#691=DIRECTION('',(1.0,0.0,0.0));
#692=CARTESIAN_POINT('',(-6.49519052838329,-3.75,3.0));
#693=DIRECTION('',(0.0,0.0,-1.0));
#694=DIRECTION('',(1.0,0.0,0.0));
#695=CARTESIAN_POINT('',(6.49519052838329,-3.75,3.0));
#696=DIRECTION('',(0.0,0.0,-1.0));
#697=DIRECTION('',(1.0,0.0,0.0));
#698=CARTESIAN_POINT('',(6.49519052838329,-3.75,3.0));
#699=DIRECTION('',(0.0,0.0,-1.0));
#700=DIRECTION('',(1.0,0.0,0.0));
#701=DIRECTION('',(-0.10961877514466,-0.993973703945826,0.0));
#702=CARTESIAN_POINT('',(-11.995871273544,-22.5001969324144,3.0));
#703=DIRECTION('',(0.0,0.0,1.0));
#704=DIRECTION('',(-0.993973703945826,0.109618775144659,0.0));
#705=DIRECTION('',(0.999999999865246,1.64167109441376E-05,0.0));
#706=DIRECTION('',(0.0,0.0,-1.0));
#707=DIRECTION('',(0.0,0.0,-1.0));
#708=DIRECTION('',(0.0,0.0,-1.0));
#709=DIRECTION('',(0.0,0.0,-1.0));
#710=DIRECTION('',(0.0,0.0,1.0));
#711=DIRECTION('',(0.0,0.0,1.0));
#712=DIRECTION('',(0.0,0.0,-1.0));
#713=DIRECTION('',(0.0,0.0,-1.0));
#714=DIRECTION('',(0.0,0.0,-1.0));
ENDSEC;
END-ISO-10303-21;
