ISO-10303-21;
HEADER;
FILE_DESCRIPTION(('STEP AP203'),'1');
FILE_NAME('ador do Encoder Dianteiro.stp','2022-08-29T18:35:51',(' '),(' '),'Spatial InterOp 3D',' ',' ');
FILE_SCHEMA(('CONFIG_CONTROL_DESIGN'));
ENDSEC;
DATA;
#1=DESIGN_CONTEXT('',#33,'design');
#2=APPLICATION_PROTOCOL_DEFINITION('INTERNATIONAL STANDARD','config_control_design',1994,#33);
#3=PRODUCT_CATEGORY_RELATIONSHIP('NONE','NONE',#34,#35);
#4=DATE_AND_TIME(#36,#37);
#5=DATE_TIME_ROLE('creation_date');
#6=DATE_TIME_ROLE('classification_date');
#7=PERSON_AND_ORGANIZATION_ROLE('creator');
#8=PERSON_AND_ORGANIZATION_ROLE('design_supplier');
#9=PERSON_AND_ORGANIZATION_ROLE('classification_officer');
#10=PERSON_AND_ORGANIZATION_ROLE('design_owner');
#11=APPROVAL_PERSON_ORGANIZATION(#38,#39,#40);
#12=APPROVAL_DATE_TIME(#4,#39);
#13=CC_DESIGN_APPROVAL(#39,(#41,#42,#43));
#14=CC_DESIGN_DATE_AND_TIME_ASSIGNMENT(#4,#5,(#43));
#15=CC_DESIGN_DATE_AND_TIME_ASSIGNMENT(#4,#6,(#41));
#16=CC_DESIGN_PERSON_AND_ORGANIZATION_ASSIGNMENT(#38,#10,(#44));
#17=CC_DESIGN_PERSON_AND_ORGANIZATION_ASSIGNMENT(#38,#7,(#43));
#18=CC_DESIGN_PERSON_AND_ORGANIZATION_ASSIGNMENT(#38,#7,(#42));
#19=CC_DESIGN_PERSON_AND_ORGANIZATION_ASSIGNMENT(#38,#8,(#42));
#20=CC_DESIGN_SECURITY_CLASSIFICATION(#41,(#42));
#21=CC_DESIGN_PERSON_AND_ORGANIZATION_ASSIGNMENT(#38,#9,(#41));
#22=SHAPE_DEFINITION_REPRESENTATION(#45,#46);
#23= (GEOMETRIC_REPRESENTATION_CONTEXT(3)GLOBAL_UNCERTAINTY_ASSIGNED_CONTEXT((#49))GLOBAL_UNIT_ASSIGNED_CONTEXT((#51,#52,#53))REPRESENTATION_CONTEXT('NONE','WORKSPACE'));
#24=PROPERTY_DEFINITION_REPRESENTATION(#55,#56);
#25=GENERAL_PROPERTY_ASSOCIATION('','',#57,#55);
#26=PROPERTY_DEFINITION_REPRESENTATION(#58,#59);
#27=GENERAL_PROPERTY_ASSOCIATION('','',#60,#58);
#28=PROPERTY_DEFINITION_REPRESENTATION(#61,#62);
#29=GENERAL_PROPERTY_ASSOCIATION('','',#63,#61);
#33=APPLICATION_CONTEXT('CONFIGURATION CONTROLLED 3D DESIGNS OF MECHANICAL PARTS AND ASSEMBLIES');
#34=PRODUCT_CATEGORY('part','NONE');
#35=PRODUCT_RELATED_PRODUCT_CATEGORY('detail',' ',(#44));
#36=CALENDAR_DATE(2022,29,7);
#37=LOCAL_TIME(15,35,51.0,#64);
#38=PERSON_AND_ORGANIZATION(#65,#66);
#39=APPROVAL(#67,'SOLID MODEL');
#40=APPROVAL_ROLE('APPROVED');
#41=SECURITY_CLASSIFICATION('','',#68);
#42=PRODUCT_DEFINITION_FORMATION_WITH_SPECIFIED_SOURCE('A','NONE',#44,.NOT_KNOWN.);
#43=PRODUCT_DEFINITION('','NONE',#42,#1);
#44=PRODUCT('Espa\X2\00E7\X0\ador do encoder dianteiro','','PART--DESC',(#69));
#45=PRODUCT_DEFINITION_SHAPE('NONE','NONE',#43);
#46=ADVANCED_BREP_SHAPE_REPRESENTATION('1',(#70,#71),#23);
#49=UNCERTAINTY_MEASURE_WITH_UNIT(LENGTH_MEASURE(0.001),#51,'','');
#51= (CONVERSION_BASED_UNIT('MILLIMETRE',#74)LENGTH_UNIT()NAMED_UNIT(#77));
#52= (NAMED_UNIT(#79)PLANE_ANGLE_UNIT()SI_UNIT($,.RADIAN.));
#53= (NAMED_UNIT(#79)SOLID_ANGLE_UNIT()SI_UNIT($,.STERADIAN.));
#55=PROPERTY_DEFINITION('PdmObjectId','',#43);
#56=REPRESENTATION('',(#85),#23);
#57=GENERAL_PROPERTY('','19_7683ec67-2c7c-47a4-b1d3-44d0ea5bc769&2_100_0_0','');
#58=PROPERTY_DEFINITION('CreationDate','',#43);
#59=REPRESENTATION('',(#86),#23);
#60=GENERAL_PROPERTY('','26/04/2022 18:24:09','');
#61=PROPERTY_DEFINITION('Minor Revision','',#43);
#62=REPRESENTATION('',(#87),#23);
#63=GENERAL_PROPERTY('','0','');
#64=COORDINATED_UNIVERSAL_TIME_OFFSET(3,0,.BEHIND.);
#65=PERSON('','UNSPECIFIED',$,$,$,$);
#66=ORGANIZATION('UNSPECIFIED','UNSPECIFIED','UNSPECIFIED');
#67=APPROVAL_STATUS('approved');
#68=SECURITY_CLASSIFICATION_LEVEL('unclassified');
#69=MECHANICAL_CONTEXT('',#33,'mechanical');
#70=MANIFOLD_SOLID_BREP('1',#88);
#71=AXIS2_PLACEMENT_3D('',#89,#90,#91);
#74=LENGTH_MEASURE_WITH_UNIT(LENGTH_MEASURE(1.0),#92);
#77=DIMENSIONAL_EXPONENTS(1.0,0.0,0.0,0.0,0.0,0.0,0.0);
#79=DIMENSIONAL_EXPONENTS(0.0,0.0,0.0,0.0,0.0,0.0,0.0);
#85=VALUE_REPRESENTATION_ITEM('19_7683ec67-2c7c-47a4-b1d3-44d0ea5bc769&2_100_0_0',);
#86=VALUE_REPRESENTATION_ITEM('26/04/2022 18:24:09',);
#87=VALUE_REPRESENTATION_ITEM('0',);
#88=CLOSED_SHELL('',(#93,#94,#95,#96));
#89=CARTESIAN_POINT('',(0.0,0.0,0.0));
#90=DIRECTION('',(0.0,0.0,1.0));
#91=DIRECTION('',(1.0,0.0,0.0));
#92= (NAMED_UNIT(#77)LENGTH_UNIT()SI_UNIT(.MILLI.,.METRE.));
#93=ADVANCED_FACE('',(#98,#99),#100,.T.);
#94=ADVANCED_FACE('',(#101,#102),#103,.T.);
#95=ADVANCED_FACE('',(#104,#105),#106,.T.);
#96=ADVANCED_FACE('',(#107,#108),#109,.F.);
#98=FACE_BOUND('',#110,.T.);
#99=FACE_OUTER_BOUND('',#111,.T.);
#100=PLANE('',#112);
#101=FACE_OUTER_BOUND('',#113,.T.);
#102=FACE_OUTER_BOUND('',#114,.T.);
#103=CYLINDRICAL_SURFACE('',#115,3.0);
#104=FACE_BOUND('',#116,.T.);
#105=FACE_OUTER_BOUND('',#117,.T.);
#106=PLANE('',#118);
#107=FACE_OUTER_BOUND('',#119,.T.);
#108=FACE_OUTER_BOUND('',#120,.T.);
#109=CYLINDRICAL_SURFACE('',#121,1.25);
#110=EDGE_LOOP('',(#122));
#111=EDGE_LOOP('',(#123));
#112=AXIS2_PLACEMENT_3D('',#124,#125,#126);
#113=EDGE_LOOP('',(#127));
#114=EDGE_LOOP('',(#128));
#115=AXIS2_PLACEMENT_3D('',#129,#130,#131);
#116=EDGE_LOOP('',(#132));
#117=EDGE_LOOP('',(#133));
#118=AXIS2_PLACEMENT_3D('',#134,#135,#136);
#119=EDGE_LOOP('',(#137));
#120=EDGE_LOOP('',(#138));
#121=AXIS2_PLACEMENT_3D('',#139,#140,#141);
#122=ORIENTED_EDGE('',*,*,#142,.F.);
#123=ORIENTED_EDGE('',*,*,#143,.F.);
#124=CARTESIAN_POINT('',(0.0,0.0,-7.0));
#125=DIRECTION('',(0.0,0.0,-1.0));
#126=DIRECTION('',(-1.0,0.0,0.0));
#127=ORIENTED_EDGE('',*,*,#144,.T.);
#128=ORIENTED_EDGE('',*,*,#143,.T.);
#129=CARTESIAN_POINT('',(0.0,0.0,-7.0));
#130=DIRECTION('',(0.0,0.0,1.0));
#131=DIRECTION('',(1.0,0.0,0.0));
#132=ORIENTED_EDGE('',*,*,#145,.F.);
#133=ORIENTED_EDGE('',*,*,#144,.F.);
#134=CARTESIAN_POINT('',(0.0,0.0,7.0));
#135=DIRECTION('',(0.0,0.0,1.0));
#136=DIRECTION('',(1.0,0.0,0.0));
#137=ORIENTED_EDGE('',*,*,#145,.T.);
#138=ORIENTED_EDGE('',*,*,#142,.T.);
#139=CARTESIAN_POINT('',(0.0,0.0,7.0));
#140=DIRECTION('',(0.0,0.0,-1.0));
#141=DIRECTION('',(1.0,0.0,0.0));
#142=EDGE_CURVE('',#146,#146,#147,.T.);
#143=EDGE_CURVE('',#148,#148,#149,.T.);
#144=EDGE_CURVE('',#150,#150,#151,.T.);
#145=EDGE_CURVE('',#152,#152,#153,.T.);
#146=VERTEX_POINT('',#154);
#147=CIRCLE('',#155,1.25);
#148=VERTEX_POINT('',#156);
#149=CIRCLE('',#157,3.0);
#150=VERTEX_POINT('',#158);
#151=CIRCLE('',#159,3.0);
#152=VERTEX_POINT('',#160);
#153=CIRCLE('',#161,1.25);
#154=CARTESIAN_POINT('',(-1.25,0.0,-7.0));
#155=AXIS2_PLACEMENT_3D('',#162,#163,#164);
#156=CARTESIAN_POINT('',(3.0,0.0,-7.0));
#157=AXIS2_PLACEMENT_3D('',#165,#166,#167);
#158=CARTESIAN_POINT('',(3.0,0.0,7.0));
#159=AXIS2_PLACEMENT_3D('',#168,#169,#170);
#160=CARTESIAN_POINT('',(1.25,0.0,7.0));
#161=AXIS2_PLACEMENT_3D('',#171,#172,#173);
#162=CARTESIAN_POINT('',(0.0,0.0,-7.0));
#163=DIRECTION('',(0.0,0.0,-1.0));
#164=DIRECTION('',(-1.0,0.0,0.0));
#165=CARTESIAN_POINT('',(0.0,0.0,-7.0));
#166=DIRECTION('',(0.0,0.0,1.0));
#167=DIRECTION('',(1.0,0.0,0.0));
#168=CARTESIAN_POINT('',(0.0,0.0,7.0));
#169=DIRECTION('',(0.0,0.0,-1.0));
#170=DIRECTION('',(1.0,0.0,0.0));
#171=CARTESIAN_POINT('',(0.0,0.0,7.0));
#172=DIRECTION('',(0.0,0.0,1.0));
#173=DIRECTION('',(1.0,0.0,0.0));
ENDSEC;
END-ISO-10303-21;
