ISO-10303-21;
HEADER;
FILE_DESCRIPTION(('STEP AP203'),'1');
FILE_NAME('RBF22.P502-1 Suporte Superior dos Capacitores.stp','2022-08-30T19:33:02',(' '),(' '),'Spatial InterOp 3D',' ',' ');
FILE_SCHEMA(('CONFIG_CONTROL_DESIGN'));
ENDSEC;
DATA;
#1=DESIGN_CONTEXT('',#33,'design');
#2=APPLICATION_PROTOCOL_DEFINITION('INTERNATIONAL STANDARD','config_control_design',1994,#33);
#3=PRODUCT_CATEGORY_RELATIONSHIP('NONE','NONE',#34,#35);
#4=DATE_AND_TIME(#36,#37);
#5=DATE_TIME_ROLE('creation_date');
#6=DATE_TIME_ROLE('classification_date');
#7=PERSON_AND_ORGANIZATION_ROLE('creator');
#8=PERSON_AND_ORGANIZATION_ROLE('design_supplier');
#9=PERSON_AND_ORGANIZATION_ROLE('classification_officer');
#10=PERSON_AND_ORGANIZATION_ROLE('design_owner');
#11=APPROVAL_PERSON_ORGANIZATION(#38,#39,#40);
#12=APPROVAL_DATE_TIME(#4,#39);
#13=CC_DESIGN_APPROVAL(#39,(#41,#42,#43));
#14=CC_DESIGN_DATE_AND_TIME_ASSIGNMENT(#4,#5,(#43));
#15=CC_DESIGN_DATE_AND_TIME_ASSIGNMENT(#4,#6,(#41));
#16=CC_DESIGN_PERSON_AND_ORGANIZATION_ASSIGNMENT(#38,#10,(#44));
#17=CC_DESIGN_PERSON_AND_ORGANIZATION_ASSIGNMENT(#38,#7,(#43));
#18=CC_DESIGN_PERSON_AND_ORGANIZATION_ASSIGNMENT(#38,#7,(#42));
#19=CC_DESIGN_PERSON_AND_ORGANIZATION_ASSIGNMENT(#38,#8,(#42));
#20=CC_DESIGN_SECURITY_CLASSIFICATION(#41,(#42));
#21=CC_DESIGN_PERSON_AND_ORGANIZATION_ASSIGNMENT(#38,#9,(#41));
#22=SHAPE_DEFINITION_REPRESENTATION(#45,#46);
#23= (GEOMETRIC_REPRESENTATION_CONTEXT(3)GLOBAL_UNCERTAINTY_ASSIGNED_CONTEXT((#49))GLOBAL_UNIT_ASSIGNED_CONTEXT((#51,#52,#53))REPRESENTATION_CONTEXT('NONE','WORKSPACE'));
#24=PROPERTY_DEFINITION_REPRESENTATION(#55,#56);
#25=GENERAL_PROPERTY_ASSOCIATION('','',#57,#55);
#26=PROPERTY_DEFINITION_REPRESENTATION(#58,#59);
#27=GENERAL_PROPERTY_ASSOCIATION('','',#60,#58);
#28=PROPERTY_DEFINITION_REPRESENTATION(#61,#62);
#29=GENERAL_PROPERTY_ASSOCIATION('','',#63,#61);
#33=APPLICATION_CONTEXT('CONFIGURATION CONTROLLED 3D DESIGNS OF MECHANICAL PARTS AND ASSEMBLIES');
#34=PRODUCT_CATEGORY('part','NONE');
#35=PRODUCT_RELATED_PRODUCT_CATEGORY('detail',' ',(#44));
#36=CALENDAR_DATE(2022,30,7);
#37=LOCAL_TIME(16,33,2.0,#64);
#38=PERSON_AND_ORGANIZATION(#65,#66);
#39=APPROVAL(#67,'SOLID MODEL');
#40=APPROVAL_ROLE('APPROVED');
#41=SECURITY_CLASSIFICATION('','',#68);
#42=PRODUCT_DEFINITION_FORMATION_WITH_SPECIFIED_SOURCE('A','NONE',#44,.NOT_KNOWN.);
#43=PRODUCT_DEFINITION('','NONE',#42,#1);
#44=PRODUCT('Suporte dos Capacitores e Baterias','','PART--DESC',(#69));
#45=PRODUCT_DEFINITION_SHAPE('NONE','NONE',#43);
#46=ADVANCED_BREP_SHAPE_REPRESENTATION('1',(#70,#71),#23);
#49=UNCERTAINTY_MEASURE_WITH_UNIT(LENGTH_MEASURE(0.001),#51,'','');
#51= (CONVERSION_BASED_UNIT('MILLIMETRE',#74)LENGTH_UNIT()NAMED_UNIT(#77));
#52= (NAMED_UNIT(#79)PLANE_ANGLE_UNIT()SI_UNIT($,.RADIAN.));
#53= (NAMED_UNIT(#79)SOLID_ANGLE_UNIT()SI_UNIT($,.STERADIAN.));
#55=PROPERTY_DEFINITION('PdmObjectId','',#43);
#56=REPRESENTATION('',(#85),#23);
#57=GENERAL_PROPERTY('','19_7683ec67-2c7c-47a4-b1d3-44d0ea5bc769&2_13_0_190','');
#58=PROPERTY_DEFINITION('CreationDate','',#43);
#59=REPRESENTATION('',(#86),#23);
#60=GENERAL_PROPERTY('','25/04/2022 18:24:23','');
#61=PROPERTY_DEFINITION('Minor Revision','',#43);
#62=REPRESENTATION('',(#87),#23);
#63=GENERAL_PROPERTY('','27','');
#64=COORDINATED_UNIVERSAL_TIME_OFFSET(3,0,.BEHIND.);
#65=PERSON('','UNSPECIFIED',$,$,$,$);
#66=ORGANIZATION('UNSPECIFIED','UNSPECIFIED','UNSPECIFIED');
#67=APPROVAL_STATUS('approved');
#68=SECURITY_CLASSIFICATION_LEVEL('unclassified');
#69=MECHANICAL_CONTEXT('',#33,'mechanical');
#70=MANIFOLD_SOLID_BREP('1',#88);
#71=AXIS2_PLACEMENT_3D('',#89,#90,#91);
#74=LENGTH_MEASURE_WITH_UNIT(LENGTH_MEASURE(1.0),#92);
#77=DIMENSIONAL_EXPONENTS(1.0,0.0,0.0,0.0,0.0,0.0,0.0);
#79=DIMENSIONAL_EXPONENTS(0.0,0.0,0.0,0.0,0.0,0.0,0.0);
#85=VALUE_REPRESENTATION_ITEM('19_7683ec67-2c7c-47a4-b1d3-44d0ea5bc769&2_13_0_190',);
#86=VALUE_REPRESENTATION_ITEM('25/04/2022 18:24:23',);
#87=VALUE_REPRESENTATION_ITEM('27',);
#88=CLOSED_SHELL('',(#93,#94,#95,#96,#97,#98,#99,#100,#101,#102,#103,#104,#105,#106,#107,#108,#109,#110,#111,#112,#113,#114,#115,#116,#117,#118,#119,#120,#121,#122,#123,#124,#125,#126,#127,#128,#129,#130,#131,#132,#133,#134,#135,#136,#137,#138,#139,#140,#141,#142,#143,#144,#145,#146,#147,#148,#149,#150,#151,#152,#153,#154,#155,#156,#157,#158));
#89=CARTESIAN_POINT('',(0.0,0.0,0.0));
#90=DIRECTION('',(0.0,0.0,1.0));
#91=DIRECTION('',(1.0,0.0,0.0));
#92= (NAMED_UNIT(#77)LENGTH_UNIT()SI_UNIT(.MILLI.,.METRE.));
#93=ADVANCED_FACE('',(#160,#161,#162,#163,#164,#165,#166,#167,#168,#169,#170,#171,#172,#173,#174,#175,#176,#177,#178),#179,.T.);
#94=ADVANCED_FACE('',(#180,#181),#182,.F.);
#95=ADVANCED_FACE('',(#183,#184),#185,.F.);
#96=ADVANCED_FACE('',(#186,#187),#188,.F.);
#97=ADVANCED_FACE('',(#189,#190,#191,#192,#193,#194,#195,#196,#197,#198,#199,#200,#201,#202,#203,#204,#205,#206,#207),#208,.F.);
#98=ADVANCED_FACE('',(#209),#210,.T.);
#99=ADVANCED_FACE('',(#211),#212,.F.);
#100=ADVANCED_FACE('',(#213),#214,.T.);
#101=ADVANCED_FACE('',(#215),#216,.F.);
#102=ADVANCED_FACE('',(#217),#218,.T.);
#103=ADVANCED_FACE('',(#219),#220,.T.);
#104=ADVANCED_FACE('',(#221),#222,.F.);
#105=ADVANCED_FACE('',(#223),#224,.T.);
#106=ADVANCED_FACE('',(#225),#226,.F.);
#107=ADVANCED_FACE('',(#227),#228,.T.);
#108=ADVANCED_FACE('',(#229),#230,.T.);
#109=ADVANCED_FACE('',(#231),#232,.F.);
#110=ADVANCED_FACE('',(#233),#234,.T.);
#111=ADVANCED_FACE('',(#235),#236,.T.);
#112=ADVANCED_FACE('',(#237),#238,.T.);
#113=ADVANCED_FACE('',(#239),#240,.F.);
#114=ADVANCED_FACE('',(#241),#242,.T.);
#115=ADVANCED_FACE('',(#243),#244,.T.);
#116=ADVANCED_FACE('',(#245),#246,.T.);
#117=ADVANCED_FACE('',(#247,#248),#249,.F.);
#118=ADVANCED_FACE('',(#250,#251),#252,.F.);
#119=ADVANCED_FACE('',(#253),#254,.T.);
#120=ADVANCED_FACE('',(#255),#256,.F.);
#121=ADVANCED_FACE('',(#257),#258,.T.);
#122=ADVANCED_FACE('',(#259,#260),#261,.F.);
#123=ADVANCED_FACE('',(#262,#263),#264,.F.);
#124=ADVANCED_FACE('',(#265,#266),#267,.F.);
#125=ADVANCED_FACE('',(#268,#269),#270,.F.);
#126=ADVANCED_FACE('',(#271,#272),#273,.F.);
#127=ADVANCED_FACE('',(#274,#275),#276,.F.);
#128=ADVANCED_FACE('',(#277,#278),#279,.F.);
#129=ADVANCED_FACE('',(#280,#281),#282,.F.);
#130=ADVANCED_FACE('',(#283,#284),#285,.F.);
#131=ADVANCED_FACE('',(#286,#287),#288,.F.);
#132=ADVANCED_FACE('',(#289),#290,.F.);
#133=ADVANCED_FACE('',(#291),#292,.T.);
#134=ADVANCED_FACE('',(#293),#294,.F.);
#135=ADVANCED_FACE('',(#295),#296,.T.);
#136=ADVANCED_FACE('',(#297),#298,.F.);
#137=ADVANCED_FACE('',(#299),#300,.T.);
#138=ADVANCED_FACE('',(#301),#302,.F.);
#139=ADVANCED_FACE('',(#303),#304,.T.);
#140=ADVANCED_FACE('',(#305),#306,.T.);
#141=ADVANCED_FACE('',(#307),#308,.F.);
#142=ADVANCED_FACE('',(#309),#310,.T.);
#143=ADVANCED_FACE('',(#311),#312,.F.);
#144=ADVANCED_FACE('',(#313),#314,.T.);
#145=ADVANCED_FACE('',(#315),#316,.F.);
#146=ADVANCED_FACE('',(#317),#318,.T.);
#147=ADVANCED_FACE('',(#319),#320,.F.);
#148=ADVANCED_FACE('',(#321,#322),#323,.F.);
#149=ADVANCED_FACE('',(#324,#325),#326,.F.);
#150=ADVANCED_FACE('',(#327,#328),#329,.F.);
#151=ADVANCED_FACE('',(#330,#331),#332,.F.);
#152=ADVANCED_FACE('',(#333,#334),#335,.F.);
#153=ADVANCED_FACE('',(#336,#337),#338,.F.);
#154=ADVANCED_FACE('',(#339,#340),#341,.F.);
#155=ADVANCED_FACE('',(#342,#343),#344,.F.);
#156=ADVANCED_FACE('',(#345,#346),#347,.F.);
#157=ADVANCED_FACE('',(#348,#349),#350,.F.);
#158=ADVANCED_FACE('',(#351,#352),#353,.F.);
#160=FACE_BOUND('',#354,.T.);
#161=FACE_BOUND('',#355,.T.);
#162=FACE_BOUND('',#356,.T.);
#163=FACE_BOUND('',#357,.T.);
#164=FACE_BOUND('',#358,.T.);
#165=FACE_BOUND('',#359,.T.);
#166=FACE_BOUND('',#360,.T.);
#167=FACE_BOUND('',#361,.T.);
#168=FACE_BOUND('',#362,.T.);
#169=FACE_BOUND('',#363,.T.);
#170=FACE_BOUND('',#364,.T.);
#171=FACE_BOUND('',#365,.T.);
#172=FACE_OUTER_BOUND('',#366,.T.);
#173=FACE_BOUND('',#367,.T.);
#174=FACE_BOUND('',#368,.T.);
#175=FACE_BOUND('',#369,.T.);
#176=FACE_BOUND('',#370,.T.);
#177=FACE_BOUND('',#371,.T.);
#178=FACE_BOUND('',#372,.T.);
#179=PLANE('',#373);
#180=FACE_OUTER_BOUND('',#374,.T.);
#181=FACE_OUTER_BOUND('',#375,.T.);
#182=CYLINDRICAL_SURFACE('',#376,15.5);
#183=FACE_OUTER_BOUND('',#377,.T.);
#184=FACE_OUTER_BOUND('',#378,.T.);
#185=CYLINDRICAL_SURFACE('',#379,15.5);
#186=FACE_OUTER_BOUND('',#380,.T.);
#187=FACE_OUTER_BOUND('',#381,.T.);
#188=CYLINDRICAL_SURFACE('',#382,15.5);
#189=FACE_BOUND('',#383,.T.);
#190=FACE_BOUND('',#384,.T.);
#191=FACE_BOUND('',#385,.T.);
#192=FACE_BOUND('',#386,.T.);
#193=FACE_BOUND('',#387,.T.);
#194=FACE_BOUND('',#388,.T.);
#195=FACE_BOUND('',#389,.T.);
#196=FACE_BOUND('',#390,.T.);
#197=FACE_BOUND('',#391,.T.);
#198=FACE_BOUND('',#392,.T.);
#199=FACE_BOUND('',#393,.T.);
#200=FACE_BOUND('',#394,.T.);
#201=FACE_OUTER_BOUND('',#395,.T.);
#202=FACE_BOUND('',#396,.T.);
#203=FACE_BOUND('',#397,.T.);
#204=FACE_BOUND('',#398,.T.);
#205=FACE_BOUND('',#399,.T.);
#206=FACE_BOUND('',#400,.T.);
#207=FACE_BOUND('',#401,.T.);
#208=PLANE('',#402);
#209=FACE_OUTER_BOUND('',#403,.T.);
#210=PLANE('',#404);
#211=FACE_OUTER_BOUND('',#405,.T.);
#212=CYLINDRICAL_SURFACE('',#406,4.0);
#213=FACE_OUTER_BOUND('',#407,.T.);
#214=PLANE('',#408);
#215=FACE_OUTER_BOUND('',#409,.T.);
#216=CYLINDRICAL_SURFACE('',#410,4.0);
#217=FACE_OUTER_BOUND('',#411,.T.);
#218=PLANE('',#412);
#219=FACE_OUTER_BOUND('',#413,.T.);
#220=PLANE('',#414);
#221=FACE_OUTER_BOUND('',#415,.T.);
#222=CYLINDRICAL_SURFACE('',#416,4.0);
#223=FACE_OUTER_BOUND('',#417,.T.);
#224=PLANE('',#418);
#225=FACE_OUTER_BOUND('',#419,.T.);
#226=CYLINDRICAL_SURFACE('',#420,4.0);
#227=FACE_OUTER_BOUND('',#421,.T.);
#228=PLANE('',#422);
#229=FACE_OUTER_BOUND('',#423,.T.);
#230=PLANE('',#424);
#231=FACE_OUTER_BOUND('',#425,.T.);
#232=CYLINDRICAL_SURFACE('',#426,4.0);
#233=FACE_OUTER_BOUND('',#427,.T.);
#234=PLANE('',#428);
#235=FACE_OUTER_BOUND('',#429,.T.);
#236=PLANE('',#430);
#237=FACE_OUTER_BOUND('',#431,.T.);
#238=PLANE('',#432);
#239=FACE_OUTER_BOUND('',#433,.T.);
#240=CYLINDRICAL_SURFACE('',#434,4.0);
#241=FACE_OUTER_BOUND('',#435,.T.);
#242=PLANE('',#436);
#243=FACE_OUTER_BOUND('',#437,.T.);
#244=CYLINDRICAL_SURFACE('',#438,6.0);
#245=FACE_OUTER_BOUND('',#439,.T.);
#246=CYLINDRICAL_SURFACE('',#440,6.0);
#247=FACE_OUTER_BOUND('',#441,.T.);
#248=FACE_OUTER_BOUND('',#442,.T.);
#249=CYLINDRICAL_SURFACE('',#443,4.25);
#250=FACE_OUTER_BOUND('',#444,.T.);
#251=FACE_OUTER_BOUND('',#445,.T.);
#252=CYLINDRICAL_SURFACE('',#446,4.25);
#253=FACE_OUTER_BOUND('',#447,.T.);
#254=CYLINDRICAL_SURFACE('',#448,4.0);
#255=FACE_OUTER_BOUND('',#449,.T.);
#256=PLANE('',#450);
#257=FACE_OUTER_BOUND('',#451,.T.);
#258=CYLINDRICAL_SURFACE('',#452,4.0);
#259=FACE_OUTER_BOUND('',#453,.T.);
#260=FACE_BOUND('',#454,.T.);
#261=CONICAL_SURFACE('',#455,1.7,0.785398163397448);
#262=FACE_OUTER_BOUND('',#456,.T.);
#263=FACE_OUTER_BOUND('',#457,.T.);
#264=CYLINDRICAL_SURFACE('',#458,1.7);
#265=FACE_OUTER_BOUND('',#459,.T.);
#266=FACE_BOUND('',#460,.T.);
#267=CONICAL_SURFACE('',#461,1.7,0.785398163397448);
#268=FACE_OUTER_BOUND('',#462,.T.);
#269=FACE_OUTER_BOUND('',#463,.T.);
#270=CYLINDRICAL_SURFACE('',#464,1.7);
#271=FACE_OUTER_BOUND('',#465,.T.);
#272=FACE_BOUND('',#466,.T.);
#273=CONICAL_SURFACE('',#467,1.7,0.785398163397448);
#274=FACE_OUTER_BOUND('',#468,.T.);
#275=FACE_OUTER_BOUND('',#469,.T.);
#276=CYLINDRICAL_SURFACE('',#470,1.7);
#277=FACE_BOUND('',#471,.T.);
#278=FACE_OUTER_BOUND('',#472,.T.);
#279=CONICAL_SURFACE('',#473,1.7,0.785398163397448);
#280=FACE_OUTER_BOUND('',#474,.T.);
#281=FACE_OUTER_BOUND('',#475,.T.);
#282=CYLINDRICAL_SURFACE('',#476,1.7);
#283=FACE_BOUND('',#477,.T.);
#284=FACE_OUTER_BOUND('',#478,.T.);
#285=CONICAL_SURFACE('',#479,1.7,0.785398163397448);
#286=FACE_OUTER_BOUND('',#480,.T.);
#287=FACE_OUTER_BOUND('',#481,.T.);
#288=CYLINDRICAL_SURFACE('',#482,1.7);
#289=FACE_OUTER_BOUND('',#483,.T.);
#290=CYLINDRICAL_SURFACE('',#484,3.0);
#291=FACE_OUTER_BOUND('',#485,.T.);
#292=PLANE('',#486);
#293=FACE_OUTER_BOUND('',#487,.T.);
#294=CYLINDRICAL_SURFACE('',#488,3.0);
#295=FACE_OUTER_BOUND('',#489,.T.);
#296=PLANE('',#490);
#297=FACE_OUTER_BOUND('',#491,.T.);
#298=CYLINDRICAL_SURFACE('',#492,3.0);
#299=FACE_OUTER_BOUND('',#493,.T.);
#300=PLANE('',#494);
#301=FACE_OUTER_BOUND('',#495,.T.);
#302=CYLINDRICAL_SURFACE('',#496,3.0);
#303=FACE_OUTER_BOUND('',#497,.T.);
#304=PLANE('',#498);
#305=FACE_OUTER_BOUND('',#499,.T.);
#306=PLANE('',#500);
#307=FACE_OUTER_BOUND('',#501,.T.);
#308=CYLINDRICAL_SURFACE('',#502,3.0);
#309=FACE_OUTER_BOUND('',#503,.T.);
#310=PLANE('',#504);
#311=FACE_OUTER_BOUND('',#505,.T.);
#312=CYLINDRICAL_SURFACE('',#506,3.0);
#313=FACE_OUTER_BOUND('',#507,.T.);
#314=PLANE('',#508);
#315=FACE_OUTER_BOUND('',#509,.T.);
#316=CYLINDRICAL_SURFACE('',#510,3.0);
#317=FACE_OUTER_BOUND('',#511,.T.);
#318=PLANE('',#512);
#319=FACE_OUTER_BOUND('',#513,.T.);
#320=CYLINDRICAL_SURFACE('',#514,3.0);
#321=FACE_OUTER_BOUND('',#515,.T.);
#322=FACE_OUTER_BOUND('',#516,.T.);
#323=CYLINDRICAL_SURFACE('',#517,15.5);
#324=FACE_BOUND('',#518,.T.);
#325=FACE_OUTER_BOUND('',#519,.T.);
#326=CONICAL_SURFACE('',#520,1.7,0.785398163397448);
#327=FACE_OUTER_BOUND('',#521,.T.);
#328=FACE_OUTER_BOUND('',#522,.T.);
#329=CYLINDRICAL_SURFACE('',#523,1.7);
#330=FACE_BOUND('',#524,.T.);
#331=FACE_OUTER_BOUND('',#525,.T.);
#332=CONICAL_SURFACE('',#526,1.7,0.785398163397448);
#333=FACE_OUTER_BOUND('',#527,.T.);
#334=FACE_OUTER_BOUND('',#528,.T.);
#335=CYLINDRICAL_SURFACE('',#529,1.7);
#336=FACE_OUTER_BOUND('',#530,.T.);
#337=FACE_BOUND('',#531,.T.);
#338=CONICAL_SURFACE('',#532,1.7,0.785398163397448);
#339=FACE_OUTER_BOUND('',#533,.T.);
#340=FACE_OUTER_BOUND('',#534,.T.);
#341=CYLINDRICAL_SURFACE('',#535,1.7);
#342=FACE_OUTER_BOUND('',#536,.T.);
#343=FACE_BOUND('',#537,.T.);
#344=CONICAL_SURFACE('',#538,1.7,0.785398163397448);
#345=FACE_OUTER_BOUND('',#539,.T.);
#346=FACE_OUTER_BOUND('',#540,.T.);
#347=CYLINDRICAL_SURFACE('',#541,1.7);
#348=FACE_OUTER_BOUND('',#542,.T.);
#349=FACE_BOUND('',#543,.T.);
#350=CONICAL_SURFACE('',#544,1.7,0.785398163397448);
#351=FACE_OUTER_BOUND('',#545,.T.);
#352=FACE_OUTER_BOUND('',#546,.T.);
#353=CYLINDRICAL_SURFACE('',#547,1.7);
#354=EDGE_LOOP('',(#548));
#355=EDGE_LOOP('',(#549));
#356=EDGE_LOOP('',(#550));
#357=EDGE_LOOP('',(#551));
#358=EDGE_LOOP('',(#552));
#359=EDGE_LOOP('',(#553,#554,#555,#556,#557,#558,#559,#560));
#360=EDGE_LOOP('',(#561,#562,#563,#564,#565,#566,#567,#568));
#361=EDGE_LOOP('',(#569));
#362=EDGE_LOOP('',(#570));
#363=EDGE_LOOP('',(#571));
#364=EDGE_LOOP('',(#572));
#365=EDGE_LOOP('',(#573));
#366=EDGE_LOOP('',(#574,#575,#576,#577,#578,#579,#580,#581,#582,#583,#584,#585,#586,#587,#588,#589,#590,#591,#592,#593,#594,#595));
#367=EDGE_LOOP('',(#596));
#368=EDGE_LOOP('',(#597));
#369=EDGE_LOOP('',(#598));
#370=EDGE_LOOP('',(#599));
#371=EDGE_LOOP('',(#600));
#372=EDGE_LOOP('',(#601));
#373=AXIS2_PLACEMENT_3D('',#602,#603,#604);
#374=EDGE_LOOP('',(#605));
#375=EDGE_LOOP('',(#606));
#376=AXIS2_PLACEMENT_3D('',#607,#608,#609);
#377=EDGE_LOOP('',(#610));
#378=EDGE_LOOP('',(#611));
#379=AXIS2_PLACEMENT_3D('',#612,#613,#614);
#380=EDGE_LOOP('',(#615));
#381=EDGE_LOOP('',(#616));
#382=AXIS2_PLACEMENT_3D('',#617,#618,#619);
#383=EDGE_LOOP('',(#620));
#384=EDGE_LOOP('',(#621));
#385=EDGE_LOOP('',(#622));
#386=EDGE_LOOP('',(#623));
#387=EDGE_LOOP('',(#624));
#388=EDGE_LOOP('',(#625,#626,#627,#628,#629,#630,#631,#632));
#389=EDGE_LOOP('',(#633,#634,#635,#636,#637,#638,#639,#640));
#390=EDGE_LOOP('',(#641));
#391=EDGE_LOOP('',(#642));
#392=EDGE_LOOP('',(#643));
#393=EDGE_LOOP('',(#644));
#394=EDGE_LOOP('',(#645));
#395=EDGE_LOOP('',(#646,#647,#648,#649,#650,#651,#652,#653,#654,#655,#656,#657,#658,#659,#660,#661,#662,#663,#664,#665,#666,#667));
#396=EDGE_LOOP('',(#668));
#397=EDGE_LOOP('',(#669));
#398=EDGE_LOOP('',(#670));
#399=EDGE_LOOP('',(#671));
#400=EDGE_LOOP('',(#672));
#401=EDGE_LOOP('',(#673));
#402=AXIS2_PLACEMENT_3D('',#674,#675,#676);
#403=EDGE_LOOP('',(#677,#678,#679,#680));
#404=AXIS2_PLACEMENT_3D('',#681,#682,#683);
#405=EDGE_LOOP('',(#684,#685,#686,#687));
#406=AXIS2_PLACEMENT_3D('',#688,#689,#690);
#407=EDGE_LOOP('',(#691,#692,#693,#694));
#408=AXIS2_PLACEMENT_3D('',#695,#696,#697);
#409=EDGE_LOOP('',(#698,#699,#700,#701));
#410=AXIS2_PLACEMENT_3D('',#702,#703,#704);
#411=EDGE_LOOP('',(#705,#706,#707,#708));
#412=AXIS2_PLACEMENT_3D('',#709,#710,#711);
#413=EDGE_LOOP('',(#712,#713,#714,#715));
#414=AXIS2_PLACEMENT_3D('',#716,#717,#718);
#415=EDGE_LOOP('',(#719,#720,#721,#722));
#416=AXIS2_PLACEMENT_3D('',#723,#724,#725);
#417=EDGE_LOOP('',(#726,#727,#728,#729));
#418=AXIS2_PLACEMENT_3D('',#730,#731,#732);
#419=EDGE_LOOP('',(#733,#734,#735,#736));
#420=AXIS2_PLACEMENT_3D('',#737,#738,#739);
#421=EDGE_LOOP('',(#740,#741,#742,#743));
#422=AXIS2_PLACEMENT_3D('',#744,#745,#746);
#423=EDGE_LOOP('',(#747,#748,#749,#750));
#424=AXIS2_PLACEMENT_3D('',#751,#752,#753);
#425=EDGE_LOOP('',(#754,#755,#756,#757));
#426=AXIS2_PLACEMENT_3D('',#758,#759,#760);
#427=EDGE_LOOP('',(#761,#762,#763,#764));
#428=AXIS2_PLACEMENT_3D('',#765,#766,#767);
#429=EDGE_LOOP('',(#768,#769,#770,#771));
#430=AXIS2_PLACEMENT_3D('',#772,#773,#774);
#431=EDGE_LOOP('',(#775,#776,#777,#778));
#432=AXIS2_PLACEMENT_3D('',#779,#780,#781);
#433=EDGE_LOOP('',(#782,#783,#784,#785));
#434=AXIS2_PLACEMENT_3D('',#786,#787,#788);
#435=EDGE_LOOP('',(#789,#790,#791,#792));
#436=AXIS2_PLACEMENT_3D('',#793,#794,#795);
#437=EDGE_LOOP('',(#796,#797,#798,#799));
#438=AXIS2_PLACEMENT_3D('',#800,#801,#802);
#439=EDGE_LOOP('',(#803,#804,#805,#806));
#440=AXIS2_PLACEMENT_3D('',#807,#808,#809);
#441=EDGE_LOOP('',(#810));
#442=EDGE_LOOP('',(#811));
#443=AXIS2_PLACEMENT_3D('',#812,#813,#814);
#444=EDGE_LOOP('',(#815));
#445=EDGE_LOOP('',(#816));
#446=AXIS2_PLACEMENT_3D('',#817,#818,#819);
#447=EDGE_LOOP('',(#820,#821,#822,#823));
#448=AXIS2_PLACEMENT_3D('',#824,#825,#826);
#449=EDGE_LOOP('',(#827,#828,#829,#830));
#450=AXIS2_PLACEMENT_3D('',#831,#832,#833);
#451=EDGE_LOOP('',(#834,#835,#836,#837));
#452=AXIS2_PLACEMENT_3D('',#838,#839,#840);
#453=EDGE_LOOP('',(#841));
#454=EDGE_LOOP('',(#842));
#455=AXIS2_PLACEMENT_3D('',#843,#844,#845);
#456=EDGE_LOOP('',(#846));
#457=EDGE_LOOP('',(#847));
#458=AXIS2_PLACEMENT_3D('',#848,#849,#850);
#459=EDGE_LOOP('',(#851));
#460=EDGE_LOOP('',(#852));
#461=AXIS2_PLACEMENT_3D('',#853,#854,#855);
#462=EDGE_LOOP('',(#856));
#463=EDGE_LOOP('',(#857));
#464=AXIS2_PLACEMENT_3D('',#858,#859,#860);
#465=EDGE_LOOP('',(#861));
#466=EDGE_LOOP('',(#862));
#467=AXIS2_PLACEMENT_3D('',#863,#864,#865);
#468=EDGE_LOOP('',(#866));
#469=EDGE_LOOP('',(#867));
#470=AXIS2_PLACEMENT_3D('',#868,#869,#870);
#471=EDGE_LOOP('',(#871));
#472=EDGE_LOOP('',(#872));
#473=AXIS2_PLACEMENT_3D('',#873,#874,#875);
#474=EDGE_LOOP('',(#876));
#475=EDGE_LOOP('',(#877));
#476=AXIS2_PLACEMENT_3D('',#878,#879,#880);
#477=EDGE_LOOP('',(#881));
#478=EDGE_LOOP('',(#882));
#479=AXIS2_PLACEMENT_3D('',#883,#884,#885);
#480=EDGE_LOOP('',(#886));
#481=EDGE_LOOP('',(#887));
#482=AXIS2_PLACEMENT_3D('',#888,#889,#890);
#483=EDGE_LOOP('',(#891,#892,#893,#894));
#484=AXIS2_PLACEMENT_3D('',#895,#896,#897);
#485=EDGE_LOOP('',(#898,#899,#900,#901));
#486=AXIS2_PLACEMENT_3D('',#902,#903,#904);
#487=EDGE_LOOP('',(#905,#906,#907,#908));
#488=AXIS2_PLACEMENT_3D('',#909,#910,#911);
#489=EDGE_LOOP('',(#912,#913,#914,#915));
#490=AXIS2_PLACEMENT_3D('',#916,#917,#918);
#491=EDGE_LOOP('',(#919,#920,#921,#922));
#492=AXIS2_PLACEMENT_3D('',#923,#924,#925);
#493=EDGE_LOOP('',(#926,#927,#928,#929));
#494=AXIS2_PLACEMENT_3D('',#930,#931,#932);
#495=EDGE_LOOP('',(#933,#934,#935,#936));
#496=AXIS2_PLACEMENT_3D('',#937,#938,#939);
#497=EDGE_LOOP('',(#940,#941,#942,#943));
#498=AXIS2_PLACEMENT_3D('',#944,#945,#946);
#499=EDGE_LOOP('',(#947,#948,#949,#950));
#500=AXIS2_PLACEMENT_3D('',#951,#952,#953);
#501=EDGE_LOOP('',(#954,#955,#956,#957));
#502=AXIS2_PLACEMENT_3D('',#958,#959,#960);
#503=EDGE_LOOP('',(#961,#962,#963,#964));
#504=AXIS2_PLACEMENT_3D('',#965,#966,#967);
#505=EDGE_LOOP('',(#968,#969,#970,#971));
#506=AXIS2_PLACEMENT_3D('',#972,#973,#974);
#507=EDGE_LOOP('',(#975,#976,#977,#978));
#508=AXIS2_PLACEMENT_3D('',#979,#980,#981);
#509=EDGE_LOOP('',(#982,#983,#984,#985));
#510=AXIS2_PLACEMENT_3D('',#986,#987,#988);
#511=EDGE_LOOP('',(#989,#990,#991,#992));
#512=AXIS2_PLACEMENT_3D('',#993,#994,#995);
#513=EDGE_LOOP('',(#996,#997,#998,#999));
#514=AXIS2_PLACEMENT_3D('',#1000,#1001,#1002);
#515=EDGE_LOOP('',(#1003));
#516=EDGE_LOOP('',(#1004));
#517=AXIS2_PLACEMENT_3D('',#1005,#1006,#1007);
#518=EDGE_LOOP('',(#1008));
#519=EDGE_LOOP('',(#1009));
#520=AXIS2_PLACEMENT_3D('',#1010,#1011,#1012);
#521=EDGE_LOOP('',(#1013));
#522=EDGE_LOOP('',(#1014));
#523=AXIS2_PLACEMENT_3D('',#1015,#1016,#1017);
#524=EDGE_LOOP('',(#1018));
#525=EDGE_LOOP('',(#1019));
#526=AXIS2_PLACEMENT_3D('',#1020,#1021,#1022);
#527=EDGE_LOOP('',(#1023));
#528=EDGE_LOOP('',(#1024));
#529=AXIS2_PLACEMENT_3D('',#1025,#1026,#1027);
#530=EDGE_LOOP('',(#1028));
#531=EDGE_LOOP('',(#1029));
#532=AXIS2_PLACEMENT_3D('',#1030,#1031,#1032);
#533=EDGE_LOOP('',(#1033));
#534=EDGE_LOOP('',(#1034));
#535=AXIS2_PLACEMENT_3D('',#1035,#1036,#1037);
#536=EDGE_LOOP('',(#1038));
#537=EDGE_LOOP('',(#1039));
#538=AXIS2_PLACEMENT_3D('',#1040,#1041,#1042);
#539=EDGE_LOOP('',(#1043));
#540=EDGE_LOOP('',(#1044));
#541=AXIS2_PLACEMENT_3D('',#1045,#1046,#1047);
#542=EDGE_LOOP('',(#1048));
#543=EDGE_LOOP('',(#1049));
#544=AXIS2_PLACEMENT_3D('',#1050,#1051,#1052);
#545=EDGE_LOOP('',(#1053));
#546=EDGE_LOOP('',(#1054));
#547=AXIS2_PLACEMENT_3D('',#1055,#1056,#1057);
#548=ORIENTED_EDGE('',*,*,#1058,.F.);
#549=ORIENTED_EDGE('',*,*,#1059,.F.);
#550=ORIENTED_EDGE('',*,*,#1060,.F.);
#551=ORIENTED_EDGE('',*,*,#1061,.T.);
#552=ORIENTED_EDGE('',*,*,#1062,.T.);
#553=ORIENTED_EDGE('',*,*,#1063,.T.);
#554=ORIENTED_EDGE('',*,*,#1064,.T.);
#555=ORIENTED_EDGE('',*,*,#1065,.T.);
#556=ORIENTED_EDGE('',*,*,#1066,.T.);
#557=ORIENTED_EDGE('',*,*,#1067,.T.);
#558=ORIENTED_EDGE('',*,*,#1068,.T.);
#559=ORIENTED_EDGE('',*,*,#1069,.T.);
#560=ORIENTED_EDGE('',*,*,#1070,.T.);
#561=ORIENTED_EDGE('',*,*,#1071,.T.);
#562=ORIENTED_EDGE('',*,*,#1072,.T.);
#563=ORIENTED_EDGE('',*,*,#1073,.T.);
#564=ORIENTED_EDGE('',*,*,#1074,.T.);
#565=ORIENTED_EDGE('',*,*,#1075,.T.);
#566=ORIENTED_EDGE('',*,*,#1076,.T.);
#567=ORIENTED_EDGE('',*,*,#1077,.T.);
#568=ORIENTED_EDGE('',*,*,#1078,.T.);
#569=ORIENTED_EDGE('',*,*,#1079,.T.);
#570=ORIENTED_EDGE('',*,*,#1080,.T.);
#571=ORIENTED_EDGE('',*,*,#1081,.F.);
#572=ORIENTED_EDGE('',*,*,#1082,.F.);
#573=ORIENTED_EDGE('',*,*,#1083,.F.);
#574=ORIENTED_EDGE('',*,*,#1084,.T.);
#575=ORIENTED_EDGE('',*,*,#1085,.T.);
#576=ORIENTED_EDGE('',*,*,#1086,.T.);
#577=ORIENTED_EDGE('',*,*,#1087,.T.);
#578=ORIENTED_EDGE('',*,*,#1088,.T.);
#579=ORIENTED_EDGE('',*,*,#1089,.T.);
#580=ORIENTED_EDGE('',*,*,#1090,.T.);
#581=ORIENTED_EDGE('',*,*,#1091,.T.);
#582=ORIENTED_EDGE('',*,*,#1092,.T.);
#583=ORIENTED_EDGE('',*,*,#1093,.T.);
#584=ORIENTED_EDGE('',*,*,#1094,.T.);
#585=ORIENTED_EDGE('',*,*,#1095,.T.);
#586=ORIENTED_EDGE('',*,*,#1096,.T.);
#587=ORIENTED_EDGE('',*,*,#1097,.T.);
#588=ORIENTED_EDGE('',*,*,#1098,.T.);
#589=ORIENTED_EDGE('',*,*,#1099,.T.);
#590=ORIENTED_EDGE('',*,*,#1100,.T.);
#591=ORIENTED_EDGE('',*,*,#1101,.T.);
#592=ORIENTED_EDGE('',*,*,#1102,.T.);
#593=ORIENTED_EDGE('',*,*,#1103,.T.);
#594=ORIENTED_EDGE('',*,*,#1104,.T.);
#595=ORIENTED_EDGE('',*,*,#1105,.T.);
#596=ORIENTED_EDGE('',*,*,#1106,.F.);
#597=ORIENTED_EDGE('',*,*,#1107,.F.);
#598=ORIENTED_EDGE('',*,*,#1108,.F.);
#599=ORIENTED_EDGE('',*,*,#1109,.F.);
#600=ORIENTED_EDGE('',*,*,#1110,.F.);
#601=ORIENTED_EDGE('',*,*,#1111,.F.);
#602=CARTESIAN_POINT('',(-75.0,-5.32296523788069E-17,-73.0));
#603=DIRECTION('',(-1.23086802860452E-16,2.45114061367087E-19,-1.0));
#604=DIRECTION('',(-1.0,0.0,1.23086802860452E-16));
#605=ORIENTED_EDGE('',*,*,#1112,.T.);
#606=ORIENTED_EDGE('',*,*,#1111,.T.);
#607=CARTESIAN_POINT('',(-1.33854405963726E-14,-25.0,-69.0));
#608=DIRECTION('',(-1.23086802860452E-16,2.45114061367087E-19,-1.0));
#609=DIRECTION('',(1.0,3.01703061498153E-35,-1.23086802860452E-16));
#610=ORIENTED_EDGE('',*,*,#1113,.T.);
#611=ORIENTED_EDGE('',*,*,#1110,.T.);
#612=CARTESIAN_POINT('',(18.0,-56.0,-69.0));
#613=DIRECTION('',(-1.23086802860452E-16,2.45114061367087E-19,-1.0));
#614=DIRECTION('',(1.0,3.01703061498153E-35,-1.23086802860452E-16));
#615=ORIENTED_EDGE('',*,*,#1114,.T.);
#616=ORIENTED_EDGE('',*,*,#1108,.T.);
#617=CARTESIAN_POINT('',(-1.44654480618086E-14,11.0,-69.0));
#618=DIRECTION('',(-1.23086802860452E-16,2.45114061367087E-19,-1.0));
#619=DIRECTION('',(1.0,3.01703061498153E-35,-1.23086802860452E-16));
#620=ORIENTED_EDGE('',*,*,#1115,.F.);
#621=ORIENTED_EDGE('',*,*,#1116,.F.);
#622=ORIENTED_EDGE('',*,*,#1117,.F.);
#623=ORIENTED_EDGE('',*,*,#1118,.T.);
#624=ORIENTED_EDGE('',*,*,#1119,.T.);
#625=ORIENTED_EDGE('',*,*,#1120,.F.);
#626=ORIENTED_EDGE('',*,*,#1121,.F.);
#627=ORIENTED_EDGE('',*,*,#1122,.F.);
#628=ORIENTED_EDGE('',*,*,#1123,.F.);
#629=ORIENTED_EDGE('',*,*,#1124,.F.);
#630=ORIENTED_EDGE('',*,*,#1125,.F.);
#631=ORIENTED_EDGE('',*,*,#1126,.F.);
#632=ORIENTED_EDGE('',*,*,#1127,.F.);
#633=ORIENTED_EDGE('',*,*,#1128,.F.);
#634=ORIENTED_EDGE('',*,*,#1129,.F.);
#635=ORIENTED_EDGE('',*,*,#1130,.F.);
#636=ORIENTED_EDGE('',*,*,#1131,.F.);
#637=ORIENTED_EDGE('',*,*,#1132,.F.);
#638=ORIENTED_EDGE('',*,*,#1133,.F.);
#639=ORIENTED_EDGE('',*,*,#1134,.F.);
#640=ORIENTED_EDGE('',*,*,#1135,.F.);
#641=ORIENTED_EDGE('',*,*,#1136,.T.);
#642=ORIENTED_EDGE('',*,*,#1137,.T.);
#643=ORIENTED_EDGE('',*,*,#1138,.F.);
#644=ORIENTED_EDGE('',*,*,#1139,.F.);
#645=ORIENTED_EDGE('',*,*,#1140,.F.);
#646=ORIENTED_EDGE('',*,*,#1141,.F.);
#647=ORIENTED_EDGE('',*,*,#1142,.T.);
#648=ORIENTED_EDGE('',*,*,#1143,.T.);
#649=ORIENTED_EDGE('',*,*,#1144,.T.);
#650=ORIENTED_EDGE('',*,*,#1145,.F.);
#651=ORIENTED_EDGE('',*,*,#1146,.F.);
#652=ORIENTED_EDGE('',*,*,#1147,.F.);
#653=ORIENTED_EDGE('',*,*,#1148,.F.);
#654=ORIENTED_EDGE('',*,*,#1149,.F.);
#655=ORIENTED_EDGE('',*,*,#1150,.T.);
#656=ORIENTED_EDGE('',*,*,#1151,.F.);
#657=ORIENTED_EDGE('',*,*,#1152,.F.);
#658=ORIENTED_EDGE('',*,*,#1153,.F.);
#659=ORIENTED_EDGE('',*,*,#1154,.F.);
#660=ORIENTED_EDGE('',*,*,#1155,.F.);
#661=ORIENTED_EDGE('',*,*,#1156,.F.);
#662=ORIENTED_EDGE('',*,*,#1157,.F.);
#663=ORIENTED_EDGE('',*,*,#1158,.T.);
#664=ORIENTED_EDGE('',*,*,#1159,.F.);
#665=ORIENTED_EDGE('',*,*,#1160,.F.);
#666=ORIENTED_EDGE('',*,*,#1161,.F.);
#667=ORIENTED_EDGE('',*,*,#1162,.F.);
#668=ORIENTED_EDGE('',*,*,#1163,.F.);
#669=ORIENTED_EDGE('',*,*,#1164,.F.);
#670=ORIENTED_EDGE('',*,*,#1114,.F.);
#671=ORIENTED_EDGE('',*,*,#1165,.F.);
#672=ORIENTED_EDGE('',*,*,#1113,.F.);
#673=ORIENTED_EDGE('',*,*,#1112,.F.);
#674=CARTESIAN_POINT('',(-75.0,-5.42101086242752E-17,-69.0));
#675=DIRECTION('',(-1.23086802860452E-16,2.45114061367087E-19,-1.0));
#676=DIRECTION('',(-1.0,0.0,1.23086802860452E-16));
#677=ORIENTED_EDGE('',*,*,#1159,.T.);
#678=ORIENTED_EDGE('',*,*,#1166,.F.);
#679=ORIENTED_EDGE('',*,*,#1089,.F.);
#680=ORIENTED_EDGE('',*,*,#1167,.F.);
#681=CARTESIAN_POINT('',(-67.9336667108223,-6.0,-69.0));
#682=DIRECTION('',(-1.22460635382238E-16,-1.0,-2.45114061367072E-19));
#683=DIRECTION('',(-1.0,1.22460635382238E-16,1.23086802860452E-16));
#684=ORIENTED_EDGE('',*,*,#1088,.F.);
#685=ORIENTED_EDGE('',*,*,#1168,.F.);
#686=ORIENTED_EDGE('',*,*,#1160,.T.);
#687=ORIENTED_EDGE('',*,*,#1167,.T.);
#688=CARTESIAN_POINT('',(-63.0391562201983,-10.0,-69.0));
#689=DIRECTION('',(-1.23086802860452E-16,2.45114061367087E-19,-1.0));
#690=DIRECTION('',(-1.0,0.0,1.23086802860452E-16));
#691=ORIENTED_EDGE('',*,*,#1087,.F.);
#692=ORIENTED_EDGE('',*,*,#1169,.F.);
#693=ORIENTED_EDGE('',*,*,#1161,.T.);
#694=ORIENTED_EDGE('',*,*,#1168,.T.);
#695=CARTESIAN_POINT('',(-51.1836667108223,-20.9115390892528,-69.0));
#696=DIRECTION('',(-0.838670567945425,-0.544639035015026,1.0309578017571E-16));
#697=DIRECTION('',(-0.544639035015026,0.838670567945425,6.72434474820593E-17));
#698=ORIENTED_EDGE('',*,*,#1086,.F.);
#699=ORIENTED_EDGE('',*,*,#1170,.F.);
#700=ORIENTED_EDGE('',*,*,#1162,.T.);
#701=ORIENTED_EDGE('',*,*,#1169,.T.);
#702=CARTESIAN_POINT('',(-45.5,-37.0079321583541,-69.0));
#703=DIRECTION('',(-1.23086802860452E-16,2.45114061367087E-19,-1.0));
#704=DIRECTION('',(-1.0,0.0,1.23086802860452E-16));
#705=ORIENTED_EDGE('',*,*,#1085,.F.);
#706=ORIENTED_EDGE('',*,*,#1171,.F.);
#707=ORIENTED_EDGE('',*,*,#1141,.T.);
#708=ORIENTED_EDGE('',*,*,#1170,.T.);
#709=CARTESIAN_POINT('',(-41.5,-55.1615390892529,-69.0));
#710=DIRECTION('',(-1.0,6.12303176911189E-17,1.23086802860452E-16));
#711=DIRECTION('',(6.12303176911189E-17,1.0,2.4511406136708E-19));
#712=ORIENTED_EDGE('',*,*,#1103,.F.);
#713=ORIENTED_EDGE('',*,*,#1172,.F.);
#714=ORIENTED_EDGE('',*,*,#1145,.T.);
#715=ORIENTED_EDGE('',*,*,#1173,.T.);
#716=CARTESIAN_POINT('',(41.5,-55.1615390892529,-69.0));
#717=DIRECTION('',(1.0,6.12303176911189E-17,-1.23086802860452E-16));
#718=DIRECTION('',(6.12303176911189E-17,-1.0,-2.45114061367095E-19));
#719=ORIENTED_EDGE('',*,*,#1102,.F.);
#720=ORIENTED_EDGE('',*,*,#1174,.F.);
#721=ORIENTED_EDGE('',*,*,#1146,.T.);
#722=ORIENTED_EDGE('',*,*,#1172,.T.);
#723=CARTESIAN_POINT('',(45.5,-37.0079321583541,-69.0));
#724=DIRECTION('',(-1.23086802860452E-16,2.45114061367087E-19,-1.0));
#725=DIRECTION('',(-1.0,0.0,1.23086802860452E-16));
#726=ORIENTED_EDGE('',*,*,#1101,.F.);
#727=ORIENTED_EDGE('',*,*,#1175,.F.);
#728=ORIENTED_EDGE('',*,*,#1147,.T.);
#729=ORIENTED_EDGE('',*,*,#1174,.T.);
#730=CARTESIAN_POINT('',(51.1836667108223,-20.9115390892529,-69.0));
#731=DIRECTION('',(0.838670567945424,-0.544639035015028,-1.03362777547413E-16));
#732=DIRECTION('',(-0.544639035015028,-0.838670567945424,6.68323075839432E-17));
#733=ORIENTED_EDGE('',*,*,#1100,.F.);
#734=ORIENTED_EDGE('',*,*,#1176,.F.);
#735=ORIENTED_EDGE('',*,*,#1148,.T.);
#736=ORIENTED_EDGE('',*,*,#1175,.T.);
#737=CARTESIAN_POINT('',(63.0391562201984,-10.0,-69.0));
#738=DIRECTION('',(-1.23086802860452E-16,2.45114061367087E-19,-1.0));
#739=DIRECTION('',(-1.0,0.0,1.23086802860452E-16));
#740=ORIENTED_EDGE('',*,*,#1149,.T.);
#741=ORIENTED_EDGE('',*,*,#1176,.T.);
#742=ORIENTED_EDGE('',*,*,#1099,.F.);
#743=ORIENTED_EDGE('',*,*,#1177,.T.);
#744=CARTESIAN_POINT('',(67.9336667108223,-6.0,-69.0));
#745=DIRECTION('',(-1.22460635382238E-16,-1.0,-2.45114061367072E-19));
#746=DIRECTION('',(-1.0,1.22460635382238E-16,1.23086802860452E-16));
#747=ORIENTED_EDGE('',*,*,#1151,.T.);
#748=ORIENTED_EDGE('',*,*,#1178,.F.);
#749=ORIENTED_EDGE('',*,*,#1097,.F.);
#750=ORIENTED_EDGE('',*,*,#1179,.F.);
#751=CARTESIAN_POINT('',(67.9336667108223,6.0,-69.0));
#752=DIRECTION('',(3.01703061498153E-35,1.0,2.45114061367087E-19));
#753=DIRECTION('',(1.0,2.6727647100922E-50,-1.23086802860452E-16));
#754=ORIENTED_EDGE('',*,*,#1096,.F.);
#755=ORIENTED_EDGE('',*,*,#1180,.F.);
#756=ORIENTED_EDGE('',*,*,#1152,.T.);
#757=ORIENTED_EDGE('',*,*,#1179,.T.);
#758=CARTESIAN_POINT('',(63.0397300887279,10.0,-69.0));
#759=DIRECTION('',(-1.23086802860452E-16,2.45114061367087E-19,-1.0));
#760=DIRECTION('',(-1.0,0.0,1.23086802860452E-16));
#761=ORIENTED_EDGE('',*,*,#1095,.F.);
#762=ORIENTED_EDGE('',*,*,#1181,.F.);
#763=ORIENTED_EDGE('',*,*,#1153,.T.);
#764=ORIENTED_EDGE('',*,*,#1180,.T.);
#765=CARTESIAN_POINT('',(49.1836667108223,23.9999999999994,-69.0));
#766=DIRECTION('',(0.838791234789547,0.544453179291138,-1.03110678227615E-16));
#767=DIRECTION('',(0.544453179291138,-0.838791234789547,-6.72206006723528E-17));
#768=ORIENTED_EDGE('',*,*,#1094,.F.);
#769=ORIENTED_EDGE('',*,*,#1182,.F.);
#770=ORIENTED_EDGE('',*,*,#1154,.T.);
#771=ORIENTED_EDGE('',*,*,#1181,.T.);
#772=CARTESIAN_POINT('',(-1.47492024008753E-14,41.9999999999989,-69.0));
#773=DIRECTION('',(3.01703061498153E-35,1.0,2.45114061367087E-19));
#774=DIRECTION('',(1.0,2.6727647100922E-50,-1.23086802860452E-16));
#775=ORIENTED_EDGE('',*,*,#1093,.F.);
#776=ORIENTED_EDGE('',*,*,#1183,.F.);
#777=ORIENTED_EDGE('',*,*,#1155,.T.);
#778=ORIENTED_EDGE('',*,*,#1182,.T.);
#779=CARTESIAN_POINT('',(-49.1836667108223,23.9999999999994,-69.0));
#780=DIRECTION('',(-0.838791234789548,0.544453179291136,1.03377584487616E-16));
#781=DIRECTION('',(0.544453179291136,0.838791234789548,-6.68094016199557E-17));
#782=ORIENTED_EDGE('',*,*,#1092,.F.);
#783=ORIENTED_EDGE('',*,*,#1184,.F.);
#784=ORIENTED_EDGE('',*,*,#1156,.T.);
#785=ORIENTED_EDGE('',*,*,#1183,.T.);
#786=CARTESIAN_POINT('',(-63.0397300887278,10.0,-69.0));
#787=DIRECTION('',(-1.23086802860452E-16,2.45114061367087E-19,-1.0));
#788=DIRECTION('',(-1.0,0.0,1.23086802860452E-16));
#789=ORIENTED_EDGE('',*,*,#1157,.T.);
#790=ORIENTED_EDGE('',*,*,#1184,.T.);
#791=ORIENTED_EDGE('',*,*,#1091,.F.);
#792=ORIENTED_EDGE('',*,*,#1185,.T.);
#793=CARTESIAN_POINT('',(-67.9336667108223,6.0,-69.0));
#794=DIRECTION('',(3.01703061498153E-35,1.0,2.45114061367087E-19));
#795=DIRECTION('',(1.0,2.6727647100922E-50,-1.23086802860452E-16));
#796=ORIENTED_EDGE('',*,*,#1158,.F.);
#797=ORIENTED_EDGE('',*,*,#1185,.F.);
#798=ORIENTED_EDGE('',*,*,#1090,.F.);
#799=ORIENTED_EDGE('',*,*,#1166,.T.);
#800=CARTESIAN_POINT('',(-81.001,-2.46065124467557E-16,-73.0));
#801=DIRECTION('',(1.23086802860452E-16,-2.45114061367087E-19,1.0));
#802=DIRECTION('',(-1.0,0.0,1.23086802860452E-16));
#803=ORIENTED_EDGE('',*,*,#1150,.F.);
#804=ORIENTED_EDGE('',*,*,#1177,.F.);
#805=ORIENTED_EDGE('',*,*,#1098,.F.);
#806=ORIENTED_EDGE('',*,*,#1178,.T.);
#807=CARTESIAN_POINT('',(81.001,5.0442640334042E-16,-73.0));
#808=DIRECTION('',(1.23086802860452E-16,-2.45114061367087E-19,1.0));
#809=DIRECTION('',(-1.0,0.0,1.23086802860452E-16));
#810=ORIENTED_EDGE('',*,*,#1106,.T.);
#811=ORIENTED_EDGE('',*,*,#1164,.T.);
#812=CARTESIAN_POINT('',(-81.001,-2.46065124467557E-16,-73.0));
#813=DIRECTION('',(1.23086802860452E-16,-2.45114061367088E-19,1.0));
#814=DIRECTION('',(-1.0,-6.04252813538872E-51,1.23086802860452E-16));
#815=ORIENTED_EDGE('',*,*,#1107,.T.);
#816=ORIENTED_EDGE('',*,*,#1163,.T.);
#817=CARTESIAN_POINT('',(81.001,5.0442640334042E-16,-73.0));
#818=DIRECTION('',(1.23086802860452E-16,-2.45114061367088E-19,1.0));
#819=DIRECTION('',(-1.0,-6.04252813538872E-51,1.23086802860452E-16));
#820=ORIENTED_EDGE('',*,*,#1104,.F.);
#821=ORIENTED_EDGE('',*,*,#1173,.F.);
#822=ORIENTED_EDGE('',*,*,#1144,.F.);
#823=ORIENTED_EDGE('',*,*,#1186,.T.);
#824=CARTESIAN_POINT('',(37.5,-75.5,-69.0));
#825=DIRECTION('',(-1.23086802860452E-16,2.45114061367087E-19,-1.0));
#826=DIRECTION('',(1.0,3.01703061498153E-35,-1.23086802860452E-16));
#827=ORIENTED_EDGE('',*,*,#1105,.F.);
#828=ORIENTED_EDGE('',*,*,#1186,.F.);
#829=ORIENTED_EDGE('',*,*,#1143,.F.);
#830=ORIENTED_EDGE('',*,*,#1187,.T.);
#831=CARTESIAN_POINT('',(6.32214401159283E-16,-79.5,-69.0));
#832=DIRECTION('',(0.0,1.0,2.45114061367087E-19));
#833=DIRECTION('',(1.0,3.01703061498153E-35,-1.23086802860452E-16));
#834=ORIENTED_EDGE('',*,*,#1084,.F.);
#835=ORIENTED_EDGE('',*,*,#1187,.F.);
#836=ORIENTED_EDGE('',*,*,#1142,.F.);
#837=ORIENTED_EDGE('',*,*,#1171,.T.);
#838=CARTESIAN_POINT('',(-37.5,-75.5,-69.0));
#839=DIRECTION('',(-1.23086802860452E-16,2.45114061367087E-19,-1.0));
#840=DIRECTION('',(1.0,3.01703061498153E-35,-1.23086802860452E-16));
#841=ORIENTED_EDGE('',*,*,#1083,.T.);
#842=ORIENTED_EDGE('',*,*,#1188,.F.);
#843=CARTESIAN_POINT('',(-15.0000000000012,-7.0,-71.19));
#844=DIRECTION('',(-1.23086804488495E-16,2.45113467834163E-19,-1.0));
#845=DIRECTION('',(-1.0,6.86103081615519E-18,1.23086804488495E-16));
#846=ORIENTED_EDGE('',*,*,#1188,.T.);
#847=ORIENTED_EDGE('',*,*,#1140,.T.);
#848=CARTESIAN_POINT('',(-15.0000000000012,-7.0,-72.85));
#849=DIRECTION('',(1.23086804488495E-16,-2.45113467834163E-19,1.0));
#850=DIRECTION('',(-1.0,6.86103081615519E-18,1.23086804488495E-16));
#851=ORIENTED_EDGE('',*,*,#1082,.T.);
#852=ORIENTED_EDGE('',*,*,#1189,.F.);
#853=CARTESIAN_POINT('',(15.0000000000011,-7.0,-71.19));
#854=DIRECTION('',(-1.23086804488495E-16,2.45113467834163E-19,-1.0));
#855=DIRECTION('',(-1.0,6.86103081615519E-18,1.23086804488495E-16));
#856=ORIENTED_EDGE('',*,*,#1189,.T.);
#857=ORIENTED_EDGE('',*,*,#1139,.T.);
#858=CARTESIAN_POINT('',(15.0000000000011,-7.0,-72.85));
#859=DIRECTION('',(1.23086804488495E-16,-2.45113467834163E-19,1.0));
#860=DIRECTION('',(-1.0,6.86103081615519E-18,1.23086804488495E-16));
#861=ORIENTED_EDGE('',*,*,#1081,.T.);
#862=ORIENTED_EDGE('',*,*,#1190,.F.);
#863=CARTESIAN_POINT('',(-7.00643813074801E-13,-70.4999999999838,-71.19));
#864=DIRECTION('',(-1.23086791253606E-16,2.45111813472938E-19,-1.0));
#865=DIRECTION('',(1.0,-2.07388185735251E-17,-1.23086791253606E-16));
#866=ORIENTED_EDGE('',*,*,#1190,.T.);
#867=ORIENTED_EDGE('',*,*,#1138,.T.);
#868=CARTESIAN_POINT('',(-7.00848137148282E-13,-70.4999999999838,-72.85));
#869=DIRECTION('',(1.23086791253606E-16,-2.45111813472938E-19,1.0));
#870=DIRECTION('',(1.0,-2.07388185735251E-17,-1.23086791253606E-16));
#871=ORIENTED_EDGE('',*,*,#1191,.F.);
#872=ORIENTED_EDGE('',*,*,#1137,.F.);
#873=CARTESIAN_POINT('',(33.001,-29.9999999999497,-70.81));
#874=DIRECTION('',(-0.0,-0.0,1.0));
#875=DIRECTION('',(1.0,0.0,0.0));
#876=ORIENTED_EDGE('',*,*,#1080,.F.);
#877=ORIENTED_EDGE('',*,*,#1191,.T.);
#878=CARTESIAN_POINT('',(33.001,-29.9999999999497,-69.15));
#879=DIRECTION('',(0.0,0.0,-1.0));
#880=DIRECTION('',(1.0,0.0,0.0));
#881=ORIENTED_EDGE('',*,*,#1192,.F.);
#882=ORIENTED_EDGE('',*,*,#1136,.F.);
#883=CARTESIAN_POINT('',(33.001,21.999999999999,-70.81));
#884=DIRECTION('',(-0.0,-0.0,1.0));
#885=DIRECTION('',(1.0,0.0,0.0));
#886=ORIENTED_EDGE('',*,*,#1079,.F.);
#887=ORIENTED_EDGE('',*,*,#1192,.T.);
#888=CARTESIAN_POINT('',(33.001,21.999999999999,-69.15));
#889=DIRECTION('',(0.0,0.0,-1.0));
#890=DIRECTION('',(1.0,0.0,0.0));
#891=ORIENTED_EDGE('',*,*,#1193,.F.);
#892=ORIENTED_EDGE('',*,*,#1129,.T.);
#893=ORIENTED_EDGE('',*,*,#1194,.T.);
#894=ORIENTED_EDGE('',*,*,#1071,.F.);
#895=CARTESIAN_POINT('',(42.0,-21.0,-69.0));
#896=DIRECTION('',(-1.23086802860452E-16,2.45114061367087E-19,-1.0));
#897=DIRECTION('',(1.0,3.01703061498153E-35,-1.23086802860452E-16));
#898=ORIENTED_EDGE('',*,*,#1195,.F.);
#899=ORIENTED_EDGE('',*,*,#1130,.T.);
#900=ORIENTED_EDGE('',*,*,#1193,.T.);
#901=ORIENTED_EDGE('',*,*,#1078,.F.);
#902=CARTESIAN_POINT('',(35.0,-24.0,-69.0));
#903=DIRECTION('',(1.22460635382238E-16,1.0,2.45114061367072E-19));
#904=DIRECTION('',(1.0,-1.22460635382238E-16,-1.23086802860452E-16));
#905=ORIENTED_EDGE('',*,*,#1196,.F.);
#906=ORIENTED_EDGE('',*,*,#1131,.T.);
#907=ORIENTED_EDGE('',*,*,#1195,.T.);
#908=ORIENTED_EDGE('',*,*,#1077,.F.);
#909=CARTESIAN_POINT('',(28.0,-21.0,-69.0));
#910=DIRECTION('',(-1.23086802860452E-16,2.45114061367087E-19,-1.0));
#911=DIRECTION('',(1.0,3.01703061498153E-35,-1.23086802860452E-16));
#912=ORIENTED_EDGE('',*,*,#1197,.F.);
#913=ORIENTED_EDGE('',*,*,#1132,.T.);
#914=ORIENTED_EDGE('',*,*,#1196,.T.);
#915=ORIENTED_EDGE('',*,*,#1076,.F.);
#916=CARTESIAN_POINT('',(25.0,-4.0,-69.0));
#917=DIRECTION('',(1.0,-6.12303176911189E-17,-1.23086802860452E-16));
#918=DIRECTION('',(-6.12303176911189E-17,-1.0,-2.45114061367079E-19));
#919=ORIENTED_EDGE('',*,*,#1198,.F.);
#920=ORIENTED_EDGE('',*,*,#1133,.T.);
#921=ORIENTED_EDGE('',*,*,#1197,.T.);
#922=ORIENTED_EDGE('',*,*,#1075,.F.);
#923=CARTESIAN_POINT('',(28.0,13.0,-69.0));
#924=DIRECTION('',(-1.23086802860452E-16,2.45114061367087E-19,-1.0));
#925=DIRECTION('',(1.0,3.01703061498153E-35,-1.23086802860452E-16));
#926=ORIENTED_EDGE('',*,*,#1199,.F.);
#927=ORIENTED_EDGE('',*,*,#1134,.T.);
#928=ORIENTED_EDGE('',*,*,#1198,.T.);
#929=ORIENTED_EDGE('',*,*,#1074,.F.);
#930=CARTESIAN_POINT('',(35.0,16.0,-69.0));
#931=DIRECTION('',(-2.08475098604383E-16,-1.0,-2.45114061367061E-19));
#932=DIRECTION('',(-1.0,2.08475098604383E-16,1.23086802860452E-16));
#933=ORIENTED_EDGE('',*,*,#1200,.F.);
#934=ORIENTED_EDGE('',*,*,#1135,.T.);
#935=ORIENTED_EDGE('',*,*,#1199,.T.);
#936=ORIENTED_EDGE('',*,*,#1073,.F.);
#937=CARTESIAN_POINT('',(42.0,13.0,-69.0));
#938=DIRECTION('',(-1.23086802860452E-16,2.45114061367087E-19,-1.0));
#939=DIRECTION('',(1.0,3.01703061498153E-35,-1.23086802860452E-16));
#940=ORIENTED_EDGE('',*,*,#1194,.F.);
#941=ORIENTED_EDGE('',*,*,#1128,.T.);
#942=ORIENTED_EDGE('',*,*,#1200,.T.);
#943=ORIENTED_EDGE('',*,*,#1072,.F.);
#944=CARTESIAN_POINT('',(45.0,-4.0,-69.0));
#945=DIRECTION('',(-1.0,1.60814287233912E-16,1.23086802860452E-16));
#946=DIRECTION('',(1.60814287233912E-16,1.0,2.45114061367067E-19));
#947=ORIENTED_EDGE('',*,*,#1201,.F.);
#948=ORIENTED_EDGE('',*,*,#1120,.T.);
#949=ORIENTED_EDGE('',*,*,#1202,.T.);
#950=ORIENTED_EDGE('',*,*,#1064,.F.);
#951=CARTESIAN_POINT('',(-45.0,-4.0,-69.0));
#952=DIRECTION('',(1.0,6.12303176911189E-17,-1.23086802860452E-16));
#953=DIRECTION('',(6.12303176911189E-17,-1.0,-2.45114061367095E-19));
#954=ORIENTED_EDGE('',*,*,#1202,.F.);
#955=ORIENTED_EDGE('',*,*,#1127,.T.);
#956=ORIENTED_EDGE('',*,*,#1203,.T.);
#957=ORIENTED_EDGE('',*,*,#1065,.F.);
#958=CARTESIAN_POINT('',(-42.0,-21.0,-69.0));
#959=DIRECTION('',(-1.23086802860452E-16,2.45114061367087E-19,-1.0));
#960=DIRECTION('',(1.0,3.01703061498153E-35,-1.23086802860452E-16));
#961=ORIENTED_EDGE('',*,*,#1203,.F.);
#962=ORIENTED_EDGE('',*,*,#1126,.T.);
#963=ORIENTED_EDGE('',*,*,#1204,.T.);
#964=ORIENTED_EDGE('',*,*,#1066,.F.);
#965=CARTESIAN_POINT('',(-35.0,-24.0,-69.0));
#966=DIRECTION('',(0.0,1.0,2.45114061367087E-19));
#967=DIRECTION('',(1.0,3.01703061498153E-35,-1.23086802860452E-16));
#968=ORIENTED_EDGE('',*,*,#1204,.F.);
#969=ORIENTED_EDGE('',*,*,#1125,.T.);
#970=ORIENTED_EDGE('',*,*,#1205,.T.);
#971=ORIENTED_EDGE('',*,*,#1067,.F.);
#972=CARTESIAN_POINT('',(-28.0,-21.0,-69.0));
#973=DIRECTION('',(-1.23086802860452E-16,2.45114061367087E-19,-1.0));
#974=DIRECTION('',(1.0,3.01703061498153E-35,-1.23086802860452E-16));
#975=ORIENTED_EDGE('',*,*,#1205,.F.);
#976=ORIENTED_EDGE('',*,*,#1124,.T.);
#977=ORIENTED_EDGE('',*,*,#1206,.T.);
#978=ORIENTED_EDGE('',*,*,#1068,.F.);
#979=CARTESIAN_POINT('',(-25.0,-4.0,-69.0));
#980=DIRECTION('',(-1.0,6.12303176911189E-17,1.23086802860452E-16));
#981=DIRECTION('',(6.12303176911189E-17,1.0,2.45114061367079E-19));
#982=ORIENTED_EDGE('',*,*,#1206,.F.);
#983=ORIENTED_EDGE('',*,*,#1123,.T.);
#984=ORIENTED_EDGE('',*,*,#1207,.T.);
#985=ORIENTED_EDGE('',*,*,#1069,.F.);
#986=CARTESIAN_POINT('',(-28.0,13.0,-69.0));
#987=DIRECTION('',(-1.23086802860452E-16,2.45114061367087E-19,-1.0));
#988=DIRECTION('',(1.0,3.01703061498153E-35,-1.23086802860452E-16));
#989=ORIENTED_EDGE('',*,*,#1207,.F.);
#990=ORIENTED_EDGE('',*,*,#1122,.T.);
#991=ORIENTED_EDGE('',*,*,#1208,.T.);
#992=ORIENTED_EDGE('',*,*,#1070,.F.);
#993=CARTESIAN_POINT('',(-35.0,16.0,-69.0));
#994=DIRECTION('',(1.22460635382238E-16,-1.0,-2.45114061367102E-19));
#995=DIRECTION('',(-1.0,-1.22460635382238E-16,1.23086802860452E-16));
#996=ORIENTED_EDGE('',*,*,#1208,.F.);
#997=ORIENTED_EDGE('',*,*,#1121,.T.);
#998=ORIENTED_EDGE('',*,*,#1201,.T.);
#999=ORIENTED_EDGE('',*,*,#1063,.F.);
#1000=CARTESIAN_POINT('',(-42.0,13.0,-69.0));
#1001=DIRECTION('',(-1.23086802860452E-16,2.45114061367087E-19,-1.0));
#1002=DIRECTION('',(1.0,3.01703061498153E-35,-1.23086802860452E-16));
#1003=ORIENTED_EDGE('',*,*,#1165,.T.);
#1004=ORIENTED_EDGE('',*,*,#1109,.T.);
#1005=CARTESIAN_POINT('',(-18.0,-56.0,-69.0));
#1006=DIRECTION('',(-1.23086802860452E-16,2.45114061367087E-19,-1.0));
#1007=DIRECTION('',(1.0,3.01703061498153E-35,-1.23086802860452E-16));
#1008=ORIENTED_EDGE('',*,*,#1209,.F.);
#1009=ORIENTED_EDGE('',*,*,#1119,.F.);
#1010=CARTESIAN_POINT('',(-33.0010000823182,-39.5,-70.81));
#1011=DIRECTION('',(-0.0,-0.0,1.0));
#1012=DIRECTION('',(1.0,0.0,0.0));
#1013=ORIENTED_EDGE('',*,*,#1062,.F.);
#1014=ORIENTED_EDGE('',*,*,#1209,.T.);
#1015=CARTESIAN_POINT('',(-33.0010000823182,-39.5,-69.15));
#1016=DIRECTION('',(0.0,0.0,-1.0));
#1017=DIRECTION('',(1.0,0.0,0.0));
#1018=ORIENTED_EDGE('',*,*,#1210,.F.);
#1019=ORIENTED_EDGE('',*,*,#1118,.F.);
#1020=CARTESIAN_POINT('',(-52.9999999999865,8.5,-70.81));
#1021=DIRECTION('',(-0.0,-0.0,1.0));
#1022=DIRECTION('',(1.0,0.0,0.0));
#1023=ORIENTED_EDGE('',*,*,#1061,.F.);
#1024=ORIENTED_EDGE('',*,*,#1210,.T.);
#1025=CARTESIAN_POINT('',(-52.9999999999865,8.5,-69.15));
#1026=DIRECTION('',(0.0,0.0,-1.0));
#1027=DIRECTION('',(1.0,0.0,0.0));
#1028=ORIENTED_EDGE('',*,*,#1060,.T.);
#1029=ORIENTED_EDGE('',*,*,#1211,.F.);
#1030=CARTESIAN_POINT('',(-32.0,31.049999999955,-71.19));
#1031=DIRECTION('',(-1.23086804488495E-16,2.45110159111713E-19,-1.0));
#1032=DIRECTION('',(-1.0,2.07388186239696E-17,1.23086804488495E-16));
#1033=ORIENTED_EDGE('',*,*,#1211,.T.);
#1034=ORIENTED_EDGE('',*,*,#1117,.T.);
#1035=CARTESIAN_POINT('',(-32.0,31.049999999955,-72.85));
#1036=DIRECTION('',(1.23086804488495E-16,-2.45110159111713E-19,1.0));
#1037=DIRECTION('',(-1.0,2.07388186239696E-17,1.23086804488495E-16));
#1038=ORIENTED_EDGE('',*,*,#1059,.T.);
#1039=ORIENTED_EDGE('',*,*,#1212,.F.);
#1040=CARTESIAN_POINT('',(32.0,31.049999999955,-71.19));
#1041=DIRECTION('',(-1.23086804488495E-16,2.45110159111713E-19,-1.0));
#1042=DIRECTION('',(-1.0,2.07388186239696E-17,1.23086804488495E-16));
#1043=ORIENTED_EDGE('',*,*,#1212,.T.);
#1044=ORIENTED_EDGE('',*,*,#1116,.T.);
#1045=CARTESIAN_POINT('',(32.0,31.049999999955,-72.85));
#1046=DIRECTION('',(1.23086804488495E-16,-2.45110159111713E-19,1.0));
#1047=DIRECTION('',(-1.0,2.07388186239696E-17,1.23086804488495E-16));
#1048=ORIENTED_EDGE('',*,*,#1058,.T.);
#1049=ORIENTED_EDGE('',*,*,#1213,.F.);
#1050=CARTESIAN_POINT('',(-5.53068271358069E-14,31.049999999955,-71.19));
#1051=DIRECTION('',(-1.23086804488495E-16,2.45110159111713E-19,-1.0));
#1052=DIRECTION('',(-1.0,2.07388186239696E-17,1.23086804488495E-16));
#1053=ORIENTED_EDGE('',*,*,#1213,.T.);
#1054=ORIENTED_EDGE('',*,*,#1115,.T.);
#1055=CARTESIAN_POINT('',(-5.55111512312578E-14,31.049999999955,-72.85));
#1056=DIRECTION('',(1.23086804488495E-16,-2.45110159111713E-19,1.0));
#1057=DIRECTION('',(-1.0,2.07388186239696E-17,1.23086804488495E-16));
#1058=EDGE_CURVE('',#1214,#1214,#1215,.T.);
#1059=EDGE_CURVE('',#1216,#1216,#1217,.T.);
#1060=EDGE_CURVE('',#1218,#1218,#1219,.T.);
#1061=EDGE_CURVE('',#1220,#1220,#1221,.F.);
#1062=EDGE_CURVE('',#1222,#1222,#1223,.F.);
#1063=EDGE_CURVE('',#1224,#1225,#1226,.F.);
#1064=EDGE_CURVE('',#1225,#1227,#1228,.T.);
#1065=EDGE_CURVE('',#1227,#1229,#1230,.F.);
#1066=EDGE_CURVE('',#1229,#1231,#1232,.T.);
#1067=EDGE_CURVE('',#1231,#1233,#1234,.F.);
#1068=EDGE_CURVE('',#1233,#1235,#1236,.T.);
#1069=EDGE_CURVE('',#1235,#1237,#1238,.F.);
#1070=EDGE_CURVE('',#1237,#1224,#1239,.T.);
#1071=EDGE_CURVE('',#1240,#1241,#1242,.F.);
#1072=EDGE_CURVE('',#1241,#1243,#1244,.T.);
#1073=EDGE_CURVE('',#1243,#1245,#1246,.F.);
#1074=EDGE_CURVE('',#1245,#1247,#1248,.T.);
#1075=EDGE_CURVE('',#1247,#1249,#1250,.F.);
#1076=EDGE_CURVE('',#1249,#1251,#1252,.T.);
#1077=EDGE_CURVE('',#1251,#1253,#1254,.F.);
#1078=EDGE_CURVE('',#1253,#1240,#1255,.T.);
#1079=EDGE_CURVE('',#1256,#1256,#1257,.F.);
#1080=EDGE_CURVE('',#1258,#1258,#1259,.F.);
#1081=EDGE_CURVE('',#1260,#1260,#1261,.T.);
#1082=EDGE_CURVE('',#1262,#1262,#1263,.T.);
#1083=EDGE_CURVE('',#1264,#1264,#1265,.T.);
#1084=EDGE_CURVE('',#1266,#1267,#1268,.T.);
#1085=EDGE_CURVE('',#1267,#1269,#1270,.T.);
#1086=EDGE_CURVE('',#1269,#1271,#1272,.T.);
#1087=EDGE_CURVE('',#1271,#1273,#1274,.T.);
#1088=EDGE_CURVE('',#1273,#1275,#1276,.T.);
#1089=EDGE_CURVE('',#1275,#1277,#1278,.T.);
#1090=EDGE_CURVE('',#1277,#1279,#1280,.T.);
#1091=EDGE_CURVE('',#1279,#1281,#1282,.T.);
#1092=EDGE_CURVE('',#1281,#1283,#1284,.T.);
#1093=EDGE_CURVE('',#1283,#1285,#1286,.T.);
#1094=EDGE_CURVE('',#1285,#1287,#1288,.T.);
#1095=EDGE_CURVE('',#1287,#1289,#1290,.T.);
#1096=EDGE_CURVE('',#1289,#1291,#1292,.T.);
#1097=EDGE_CURVE('',#1291,#1293,#1294,.T.);
#1098=EDGE_CURVE('',#1293,#1295,#1296,.T.);
#1099=EDGE_CURVE('',#1295,#1297,#1298,.T.);
#1100=EDGE_CURVE('',#1297,#1299,#1300,.T.);
#1101=EDGE_CURVE('',#1299,#1301,#1302,.T.);
#1102=EDGE_CURVE('',#1301,#1303,#1304,.T.);
#1103=EDGE_CURVE('',#1303,#1305,#1306,.T.);
#1104=EDGE_CURVE('',#1305,#1307,#1308,.T.);
#1105=EDGE_CURVE('',#1307,#1266,#1309,.T.);
#1106=EDGE_CURVE('',#1310,#1310,#1311,.T.);
#1107=EDGE_CURVE('',#1312,#1312,#1313,.T.);
#1108=EDGE_CURVE('',#1314,#1314,#1315,.T.);
#1109=EDGE_CURVE('',#1316,#1316,#1317,.T.);
#1110=EDGE_CURVE('',#1318,#1318,#1319,.T.);
#1111=EDGE_CURVE('',#1320,#1320,#1321,.T.);
#1112=EDGE_CURVE('',#1322,#1322,#1323,.T.);
#1113=EDGE_CURVE('',#1324,#1324,#1325,.T.);
#1114=EDGE_CURVE('',#1326,#1326,#1327,.T.);
#1115=EDGE_CURVE('',#1328,#1328,#1329,.F.);
#1116=EDGE_CURVE('',#1330,#1330,#1331,.F.);
#1117=EDGE_CURVE('',#1332,#1332,#1333,.F.);
#1118=EDGE_CURVE('',#1334,#1334,#1335,.T.);
#1119=EDGE_CURVE('',#1336,#1336,#1337,.T.);
#1120=EDGE_CURVE('',#1338,#1339,#1340,.T.);
#1121=EDGE_CURVE('',#1341,#1338,#1342,.T.);
#1122=EDGE_CURVE('',#1343,#1341,#1344,.T.);
#1123=EDGE_CURVE('',#1345,#1343,#1346,.T.);
#1124=EDGE_CURVE('',#1347,#1345,#1348,.T.);
#1125=EDGE_CURVE('',#1349,#1347,#1350,.T.);
#1126=EDGE_CURVE('',#1351,#1349,#1352,.T.);
#1127=EDGE_CURVE('',#1339,#1351,#1353,.T.);
#1128=EDGE_CURVE('',#1354,#1355,#1356,.T.);
#1129=EDGE_CURVE('',#1357,#1354,#1358,.T.);
#1130=EDGE_CURVE('',#1359,#1357,#1360,.T.);
#1131=EDGE_CURVE('',#1361,#1359,#1362,.T.);
#1132=EDGE_CURVE('',#1363,#1361,#1364,.T.);
#1133=EDGE_CURVE('',#1365,#1363,#1366,.T.);
#1134=EDGE_CURVE('',#1367,#1365,#1368,.T.);
#1135=EDGE_CURVE('',#1355,#1367,#1369,.T.);
#1136=EDGE_CURVE('',#1370,#1370,#1371,.T.);
#1137=EDGE_CURVE('',#1372,#1372,#1373,.T.);
#1138=EDGE_CURVE('',#1374,#1374,#1375,.F.);
#1139=EDGE_CURVE('',#1376,#1376,#1377,.F.);
#1140=EDGE_CURVE('',#1378,#1378,#1379,.F.);
#1141=EDGE_CURVE('',#1380,#1381,#1382,.T.);
#1142=EDGE_CURVE('',#1380,#1383,#1384,.T.);
#1143=EDGE_CURVE('',#1383,#1385,#1386,.T.);
#1144=EDGE_CURVE('',#1385,#1387,#1388,.T.);
#1145=EDGE_CURVE('',#1389,#1387,#1390,.T.);
#1146=EDGE_CURVE('',#1391,#1389,#1392,.T.);
#1147=EDGE_CURVE('',#1393,#1391,#1394,.T.);
#1148=EDGE_CURVE('',#1395,#1393,#1396,.T.);
#1149=EDGE_CURVE('',#1397,#1395,#1398,.T.);
#1150=EDGE_CURVE('',#1397,#1399,#1400,.T.);
#1151=EDGE_CURVE('',#1401,#1399,#1402,.T.);
#1152=EDGE_CURVE('',#1403,#1401,#1404,.T.);
#1153=EDGE_CURVE('',#1405,#1403,#1406,.T.);
#1154=EDGE_CURVE('',#1407,#1405,#1408,.T.);
#1155=EDGE_CURVE('',#1409,#1407,#1410,.T.);
#1156=EDGE_CURVE('',#1411,#1409,#1412,.T.);
#1157=EDGE_CURVE('',#1413,#1411,#1414,.T.);
#1158=EDGE_CURVE('',#1413,#1415,#1416,.T.);
#1159=EDGE_CURVE('',#1417,#1415,#1418,.T.);
#1160=EDGE_CURVE('',#1419,#1417,#1420,.T.);
#1161=EDGE_CURVE('',#1421,#1419,#1422,.T.);
#1162=EDGE_CURVE('',#1381,#1421,#1423,.T.);
#1163=EDGE_CURVE('',#1424,#1424,#1425,.F.);
#1164=EDGE_CURVE('',#1426,#1426,#1427,.F.);
#1165=EDGE_CURVE('',#1428,#1428,#1429,.T.);
#1166=EDGE_CURVE('',#1277,#1415,#1430,.T.);
#1167=EDGE_CURVE('',#1417,#1275,#1431,.T.);
#1168=EDGE_CURVE('',#1419,#1273,#1432,.T.);
#1169=EDGE_CURVE('',#1421,#1271,#1433,.T.);
#1170=EDGE_CURVE('',#1381,#1269,#1434,.T.);
#1171=EDGE_CURVE('',#1380,#1267,#1435,.T.);
#1172=EDGE_CURVE('',#1389,#1303,#1436,.T.);
#1173=EDGE_CURVE('',#1387,#1305,#1437,.T.);
#1174=EDGE_CURVE('',#1391,#1301,#1438,.T.);
#1175=EDGE_CURVE('',#1393,#1299,#1439,.T.);
#1176=EDGE_CURVE('',#1395,#1297,#1440,.T.);
#1177=EDGE_CURVE('',#1295,#1397,#1441,.T.);
#1178=EDGE_CURVE('',#1293,#1399,#1442,.T.);
#1179=EDGE_CURVE('',#1401,#1291,#1443,.T.);
#1180=EDGE_CURVE('',#1403,#1289,#1444,.T.);
#1181=EDGE_CURVE('',#1405,#1287,#1445,.T.);
#1182=EDGE_CURVE('',#1407,#1285,#1446,.T.);
#1183=EDGE_CURVE('',#1409,#1283,#1447,.T.);
#1184=EDGE_CURVE('',#1411,#1281,#1448,.T.);
#1185=EDGE_CURVE('',#1279,#1413,#1449,.T.);
#1186=EDGE_CURVE('',#1385,#1307,#1450,.T.);
#1187=EDGE_CURVE('',#1383,#1266,#1451,.T.);
#1188=EDGE_CURVE('',#1452,#1452,#1453,.T.);
#1189=EDGE_CURVE('',#1454,#1454,#1455,.T.);
#1190=EDGE_CURVE('',#1456,#1456,#1457,.T.);
#1191=EDGE_CURVE('',#1458,#1458,#1459,.T.);
#1192=EDGE_CURVE('',#1460,#1460,#1461,.T.);
#1193=EDGE_CURVE('',#1357,#1240,#1462,.T.);
#1194=EDGE_CURVE('',#1354,#1241,#1463,.T.);
#1195=EDGE_CURVE('',#1359,#1253,#1464,.T.);
#1196=EDGE_CURVE('',#1361,#1251,#1465,.T.);
#1197=EDGE_CURVE('',#1363,#1249,#1466,.T.);
#1198=EDGE_CURVE('',#1365,#1247,#1467,.T.);
#1199=EDGE_CURVE('',#1367,#1245,#1468,.T.);
#1200=EDGE_CURVE('',#1355,#1243,#1469,.T.);
#1201=EDGE_CURVE('',#1338,#1225,#1470,.T.);
#1202=EDGE_CURVE('',#1339,#1227,#1471,.T.);
#1203=EDGE_CURVE('',#1351,#1229,#1472,.T.);
#1204=EDGE_CURVE('',#1349,#1231,#1473,.T.);
#1205=EDGE_CURVE('',#1347,#1233,#1474,.T.);
#1206=EDGE_CURVE('',#1345,#1235,#1475,.T.);
#1207=EDGE_CURVE('',#1343,#1237,#1476,.T.);
#1208=EDGE_CURVE('',#1341,#1224,#1477,.T.);
#1209=EDGE_CURVE('',#1478,#1478,#1479,.T.);
#1210=EDGE_CURVE('',#1480,#1480,#1481,.T.);
#1211=EDGE_CURVE('',#1482,#1482,#1483,.T.);
#1212=EDGE_CURVE('',#1484,#1484,#1485,.T.);
#1213=EDGE_CURVE('',#1486,#1486,#1487,.T.);
#1214=VERTEX_POINT('',#1488);
#1215=CIRCLE('',#1489,3.51);
#1216=VERTEX_POINT('',#1490);
#1217=CIRCLE('',#1491,3.51);
#1218=VERTEX_POINT('',#1492);
#1219=CIRCLE('',#1493,3.51);
#1220=VERTEX_POINT('',#1494);
#1221=CIRCLE('',#1495,1.7);
#1222=VERTEX_POINT('',#1496);
#1223=CIRCLE('',#1497,1.7);
#1224=VERTEX_POINT('',#1498);
#1225=VERTEX_POINT('',#1499);
#1226=CIRCLE('',#1500,3.0);
#1227=VERTEX_POINT('',#1501);
#1228=LINE('',#1502,#1503);
#1229=VERTEX_POINT('',#1504);
#1230=CIRCLE('',#1505,3.0);
#1231=VERTEX_POINT('',#1506);
#1232=LINE('',#1507,#1508);
#1233=VERTEX_POINT('',#1509);
#1234=CIRCLE('',#1510,3.0);
#1235=VERTEX_POINT('',#1511);
#1236=LINE('',#1512,#1513);
#1237=VERTEX_POINT('',#1514);
#1238=CIRCLE('',#1515,3.0);
#1239=LINE('',#1516,#1517);
#1240=VERTEX_POINT('',#1518);
#1241=VERTEX_POINT('',#1519);
#1242=CIRCLE('',#1520,3.0);
#1243=VERTEX_POINT('',#1521);
#1244=LINE('',#1522,#1523);
#1245=VERTEX_POINT('',#1524);
#1246=CIRCLE('',#1525,3.0);
#1247=VERTEX_POINT('',#1526);
#1248=LINE('',#1527,#1528);
#1249=VERTEX_POINT('',#1529);
#1250=CIRCLE('',#1530,3.0);
#1251=VERTEX_POINT('',#1531);
#1252=LINE('',#1532,#1533);
#1253=VERTEX_POINT('',#1534);
#1254=CIRCLE('',#1535,3.0);
#1255=LINE('',#1536,#1537);
#1256=VERTEX_POINT('',#1538);
#1257=CIRCLE('',#1539,1.7);
#1258=VERTEX_POINT('',#1540);
#1259=CIRCLE('',#1541,1.7);
#1260=VERTEX_POINT('',#1542);
#1261=CIRCLE('',#1543,3.51);
#1262=VERTEX_POINT('',#1544);
#1263=CIRCLE('',#1545,3.51);
#1264=VERTEX_POINT('',#1546);
#1265=CIRCLE('',#1547,3.51);
#1266=VERTEX_POINT('',#1548);
#1267=VERTEX_POINT('',#1549);
#1268=CIRCLE('',#1550,4.0);
#1269=VERTEX_POINT('',#1551);
#1270=LINE('',#1552,#1553);
#1271=VERTEX_POINT('',#1554);
#1272=CIRCLE('',#1555,4.0);
#1273=VERTEX_POINT('',#1556);
#1274=LINE('',#1557,#1558);
#1275=VERTEX_POINT('',#1559);
#1276=CIRCLE('',#1560,4.0);
#1277=VERTEX_POINT('',#1561);
#1278=LINE('',#1562,#1563);
#1279=VERTEX_POINT('',#1564);
#1280=CIRCLE('',#1565,6.0);
#1281=VERTEX_POINT('',#1566);
#1282=LINE('',#1567,#1568);
#1283=VERTEX_POINT('',#1569);
#1284=CIRCLE('',#1570,4.0);
#1285=VERTEX_POINT('',#1571);
#1286=LINE('',#1572,#1573);
#1287=VERTEX_POINT('',#1574);
#1288=LINE('',#1575,#1576);
#1289=VERTEX_POINT('',#1577);
#1290=LINE('',#1578,#1579);
#1291=VERTEX_POINT('',#1580);
#1292=CIRCLE('',#1581,4.0);
#1293=VERTEX_POINT('',#1582);
#1294=LINE('',#1583,#1584);
#1295=VERTEX_POINT('',#1585);
#1296=CIRCLE('',#1586,6.0);
#1297=VERTEX_POINT('',#1587);
#1298=LINE('',#1588,#1589);
#1299=VERTEX_POINT('',#1590);
#1300=CIRCLE('',#1591,4.0);
#1301=VERTEX_POINT('',#1592);
#1302=LINE('',#1593,#1594);
#1303=VERTEX_POINT('',#1595);
#1304=CIRCLE('',#1596,4.0);
#1305=VERTEX_POINT('',#1597);
#1306=LINE('',#1598,#1599);
#1307=VERTEX_POINT('',#1600);
#1308=CIRCLE('',#1601,4.0);
#1309=LINE('',#1602,#1603);
#1310=VERTEX_POINT('',#1604);
#1311=CIRCLE('',#1605,4.25);
#1312=VERTEX_POINT('',#1606);
#1313=CIRCLE('',#1607,4.25);
#1314=VERTEX_POINT('',#1608);
#1315=CIRCLE('',#1609,15.5);
#1316=VERTEX_POINT('',#1610);
#1317=CIRCLE('',#1611,15.5);
#1318=VERTEX_POINT('',#1612);
#1319=CIRCLE('',#1613,15.5);
#1320=VERTEX_POINT('',#1614);
#1321=CIRCLE('',#1615,15.5);
#1322=VERTEX_POINT('',#1616);
#1323=CIRCLE('',#1617,15.5);
#1324=VERTEX_POINT('',#1618);
#1325=CIRCLE('',#1619,15.5);
#1326=VERTEX_POINT('',#1620);
#1327=CIRCLE('',#1621,15.5);
#1328=VERTEX_POINT('',#1622);
#1329=CIRCLE('',#1623,1.7);
#1330=VERTEX_POINT('',#1624);
#1331=CIRCLE('',#1625,1.7);
#1332=VERTEX_POINT('',#1626);
#1333=CIRCLE('',#1627,1.7);
#1334=VERTEX_POINT('',#1628);
#1335=CIRCLE('',#1629,3.51);
#1336=VERTEX_POINT('',#1630);
#1337=CIRCLE('',#1631,3.51);
#1338=VERTEX_POINT('',#1632);
#1339=VERTEX_POINT('',#1633);
#1340=LINE('',#1634,#1635);
#1341=VERTEX_POINT('',#1636);
#1342=CIRCLE('',#1637,3.0);
#1343=VERTEX_POINT('',#1638);
#1344=LINE('',#1639,#1640);
#1345=VERTEX_POINT('',#1641);
#1346=CIRCLE('',#1642,3.0);
#1347=VERTEX_POINT('',#1643);
#1348=LINE('',#1644,#1645);
#1349=VERTEX_POINT('',#1646);
#1350=CIRCLE('',#1647,3.0);
#1351=VERTEX_POINT('',#1648);
#1352=LINE('',#1649,#1650);
#1353=CIRCLE('',#1651,3.0);
#1354=VERTEX_POINT('',#1652);
#1355=VERTEX_POINT('',#1653);
#1356=LINE('',#1654,#1655);
#1357=VERTEX_POINT('',#1656);
#1358=CIRCLE('',#1657,3.0);
#1359=VERTEX_POINT('',#1658);
#1360=LINE('',#1659,#1660);
#1361=VERTEX_POINT('',#1661);
#1362=CIRCLE('',#1662,3.0);
#1363=VERTEX_POINT('',#1663);
#1364=LINE('',#1664,#1665);
#1365=VERTEX_POINT('',#1666);
#1366=CIRCLE('',#1667,3.0);
#1367=VERTEX_POINT('',#1668);
#1368=LINE('',#1669,#1670);
#1369=CIRCLE('',#1671,3.0);
#1370=VERTEX_POINT('',#1672);
#1371=CIRCLE('',#1673,3.51);
#1372=VERTEX_POINT('',#1674);
#1373=CIRCLE('',#1675,3.51);
#1374=VERTEX_POINT('',#1676);
#1375=CIRCLE('',#1677,1.7);
#1376=VERTEX_POINT('',#1678);
#1377=CIRCLE('',#1679,1.7);
#1378=VERTEX_POINT('',#1680);
#1379=CIRCLE('',#1681,1.7);
#1380=VERTEX_POINT('',#1682);
#1381=VERTEX_POINT('',#1683);
#1382=LINE('',#1684,#1685);
#1383=VERTEX_POINT('',#1686);
#1384=CIRCLE('',#1687,4.0);
#1385=VERTEX_POINT('',#1688);
#1386=LINE('',#1689,#1690);
#1387=VERTEX_POINT('',#1691);
#1388=CIRCLE('',#1692,4.0);
#1389=VERTEX_POINT('',#1693);
#1390=LINE('',#1694,#1695);
#1391=VERTEX_POINT('',#1696);
#1392=CIRCLE('',#1697,4.0);
#1393=VERTEX_POINT('',#1698);
#1394=LINE('',#1699,#1700);
#1395=VERTEX_POINT('',#1701);
#1396=CIRCLE('',#1702,4.0);
#1397=VERTEX_POINT('',#1703);
#1398=LINE('',#1704,#1705);
#1399=VERTEX_POINT('',#1706);
#1400=CIRCLE('',#1707,6.0);
#1401=VERTEX_POINT('',#1708);
#1402=LINE('',#1709,#1710);
#1403=VERTEX_POINT('',#1711);
#1404=CIRCLE('',#1712,4.0);
#1405=VERTEX_POINT('',#1713);
#1406=LINE('',#1714,#1715);
#1407=VERTEX_POINT('',#1716);
#1408=LINE('',#1717,#1718);
#1409=VERTEX_POINT('',#1719);
#1410=LINE('',#1720,#1721);
#1411=VERTEX_POINT('',#1722);
#1412=CIRCLE('',#1723,4.0);
#1413=VERTEX_POINT('',#1724);
#1414=LINE('',#1725,#1726);
#1415=VERTEX_POINT('',#1727);
#1416=CIRCLE('',#1728,6.0);
#1417=VERTEX_POINT('',#1729);
#1418=LINE('',#1730,#1731);
#1419=VERTEX_POINT('',#1732);
#1420=CIRCLE('',#1733,4.0);
#1421=VERTEX_POINT('',#1734);
#1422=LINE('',#1735,#1736);
#1423=CIRCLE('',#1737,4.0);
#1424=VERTEX_POINT('',#1738);
#1425=CIRCLE('',#1739,4.25);
#1426=VERTEX_POINT('',#1740);
#1427=CIRCLE('',#1741,4.25);
#1428=VERTEX_POINT('',#1742);
#1429=CIRCLE('',#1743,15.5);
#1430=LINE('',#1744,#1745);
#1431=LINE('',#1746,#1747);
#1432=LINE('',#1748,#1749);
#1433=LINE('',#1750,#1751);
#1434=LINE('',#1752,#1753);
#1435=LINE('',#1754,#1755);
#1436=LINE('',#1756,#1757);
#1437=LINE('',#1758,#1759);
#1438=LINE('',#1760,#1761);
#1439=LINE('',#1762,#1763);
#1440=LINE('',#1764,#1765);
#1441=LINE('',#1766,#1767);
#1442=LINE('',#1768,#1769);
#1443=LINE('',#1770,#1771);
#1444=LINE('',#1772,#1773);
#1445=LINE('',#1774,#1775);
#1446=LINE('',#1776,#1777);
#1447=LINE('',#1778,#1779);
#1448=LINE('',#1780,#1781);
#1449=LINE('',#1782,#1783);
#1450=LINE('',#1784,#1785);
#1451=LINE('',#1786,#1787);
#1452=VERTEX_POINT('',#1788);
#1453=CIRCLE('',#1789,1.7);
#1454=VERTEX_POINT('',#1790);
#1455=CIRCLE('',#1791,1.7);
#1456=VERTEX_POINT('',#1792);
#1457=CIRCLE('',#1793,1.7);
#1458=VERTEX_POINT('',#1794);
#1459=CIRCLE('',#1795,1.7);
#1460=VERTEX_POINT('',#1796);
#1461=CIRCLE('',#1797,1.7);
#1462=LINE('',#1798,#1799);
#1463=LINE('',#1800,#1801);
#1464=LINE('',#1802,#1803);
#1465=LINE('',#1804,#1805);
#1466=LINE('',#1806,#1807);
#1467=LINE('',#1808,#1809);
#1468=LINE('',#1810,#1811);
#1469=LINE('',#1812,#1813);
#1470=LINE('',#1814,#1815);
#1471=LINE('',#1816,#1817);
#1472=LINE('',#1818,#1819);
#1473=LINE('',#1820,#1821);
#1474=LINE('',#1822,#1823);
#1475=LINE('',#1824,#1825);
#1476=LINE('',#1826,#1827);
#1477=LINE('',#1828,#1829);
#1478=VERTEX_POINT('',#1830);
#1479=CIRCLE('',#1831,1.7);
#1480=VERTEX_POINT('',#1832);
#1481=CIRCLE('',#1833,1.7);
#1482=VERTEX_POINT('',#1834);
#1483=CIRCLE('',#1835,1.7);
#1484=VERTEX_POINT('',#1836);
#1485=CIRCLE('',#1837,1.7);
#1486=VERTEX_POINT('',#1838);
#1487=CIRCLE('',#1839,1.7);
#1488=CARTESIAN_POINT('',(-3.51000000000006,31.049999999955,-73.0));
#1489=AXIS2_PLACEMENT_3D('',#1840,#1841,#1842);
#1490=CARTESIAN_POINT('',(28.49,31.049999999955,-73.0));
#1491=AXIS2_PLACEMENT_3D('',#1843,#1844,#1845);
#1492=CARTESIAN_POINT('',(-35.51,31.049999999955,-73.0));
#1493=AXIS2_PLACEMENT_3D('',#1846,#1847,#1848);
#1494=CARTESIAN_POINT('',(-54.6999999999865,8.5,-73.0));
#1495=AXIS2_PLACEMENT_3D('',#1849,#1850,#1851);
#1496=CARTESIAN_POINT('',(-34.7010000823182,-39.5,-73.0));
#1497=AXIS2_PLACEMENT_3D('',#1852,#1853,#1854);
#1498=CARTESIAN_POINT('',(-42.0,16.0,-73.0));
#1499=CARTESIAN_POINT('',(-45.0,13.0,-73.0));
#1500=AXIS2_PLACEMENT_3D('',#1855,#1856,#1857);
#1501=CARTESIAN_POINT('',(-45.0,-21.0,-73.0));
#1502=CARTESIAN_POINT('',(-45.0,1.78367987835476E-15,-73.0));
#1503=VECTOR('',#1858,1.0);
#1504=CARTESIAN_POINT('',(-42.0,-24.0,-73.0));
#1505=AXIS2_PLACEMENT_3D('',#1859,#1860,#1861);
#1506=CARTESIAN_POINT('',(-28.0,-24.0,-73.0));
#1507=CARTESIAN_POINT('',(-75.0,-24.0,-73.0));
#1508=VECTOR('',#1862,1.0);
#1509=CARTESIAN_POINT('',(-25.0,-21.0,-73.0));
#1510=AXIS2_PLACEMENT_3D('',#1863,#1864,#1865);
#1511=CARTESIAN_POINT('',(-25.0,13.0,-73.0));
#1512=CARTESIAN_POINT('',(-25.0,-3.11474553693475E-15,-73.0));
#1513=VECTOR('',#1866,1.0);
#1514=CARTESIAN_POINT('',(-28.0,16.0,-73.0));
#1515=AXIS2_PLACEMENT_3D('',#1867,#1868,#1869);
#1516=CARTESIAN_POINT('',(-75.0,16.0,-73.0));
#1517=VECTOR('',#1870,1.0);
#1518=CARTESIAN_POINT('',(42.0,-24.0,-73.0));
#1519=CARTESIAN_POINT('',(45.0,-21.0,-73.0));
#1520=AXIS2_PLACEMENT_3D('',#1871,#1872,#1873);
#1521=CARTESIAN_POINT('',(45.0,13.0,-73.0));
#1522=CARTESIAN_POINT('',(45.0,-1.93509441204483E-14,-73.0));
#1523=VECTOR('',#1874,1.0);
#1524=CARTESIAN_POINT('',(42.0,16.0,-73.0));
#1525=AXIS2_PLACEMENT_3D('',#1875,#1876,#1877);
#1526=CARTESIAN_POINT('',(28.0,16.0,-73.0));
#1527=CARTESIAN_POINT('',(-75.0,16.0,-73.0));
#1528=VECTOR('',#1878,1.0);
#1529=CARTESIAN_POINT('',(25.0,13.0,-73.0));
#1530=AXIS2_PLACEMENT_3D('',#1879,#1880,#1881);
#1531=CARTESIAN_POINT('',(25.0,-21.0,-73.0));
#1532=CARTESIAN_POINT('',(25.0,-6.17626142149069E-15,-73.0));
#1533=VECTOR('',#1882,1.0);
#1534=CARTESIAN_POINT('',(28.0,-24.0,-73.0));
#1535=AXIS2_PLACEMENT_3D('',#1883,#1884,#1885);
#1536=CARTESIAN_POINT('',(-75.0,-24.0,-73.0));
#1537=VECTOR('',#1886,1.0);
#1538=CARTESIAN_POINT('',(31.301,21.999999999999,-73.0));
#1539=AXIS2_PLACEMENT_3D('',#1887,#1888,#1889);
#1540=CARTESIAN_POINT('',(31.301,-29.9999999999497,-73.0));
#1541=AXIS2_PLACEMENT_3D('',#1890,#1891,#1892);
#1542=CARTESIAN_POINT('',(-3.5100000000007,-70.4999999999838,-73.0));
#1543=AXIS2_PLACEMENT_3D('',#1893,#1894,#1895);
#1544=CARTESIAN_POINT('',(11.4900000000011,-7.0,-73.0));
#1545=AXIS2_PLACEMENT_3D('',#1896,#1897,#1898);
#1546=CARTESIAN_POINT('',(-18.5100000000012,-7.0,-73.0));
#1547=AXIS2_PLACEMENT_3D('',#1899,#1900,#1901);
#1548=CARTESIAN_POINT('',(-37.5,-79.5,-73.0));
#1549=CARTESIAN_POINT('',(-41.5,-75.5,-73.0));
#1550=AXIS2_PLACEMENT_3D('',#1902,#1903,#1904);
#1551=CARTESIAN_POINT('',(-41.5,-37.0079321583541,-73.0));
#1552=CARTESIAN_POINT('',(-41.5,-55.1615390892529,-73.0));
#1553=VECTOR('',#1905,1.0);
#1554=CARTESIAN_POINT('',(-42.1453177282183,-34.8293760182939,-73.0));
#1555=AXIS2_PLACEMENT_3D('',#1906,#1907,#1908);
#1556=CARTESIAN_POINT('',(-59.6844739484166,-7.8214438599399,-73.0));
#1557=CARTESIAN_POINT('',(-51.1836667108223,-20.9115390892528,-73.0));
#1558=VECTOR('',#1909,1.0);
#1559=CARTESIAN_POINT('',(-63.0391562201983,-6.0,-73.0));
#1560=AXIS2_PLACEMENT_3D('',#1910,#1911,#1912);
#1561=CARTESIAN_POINT('',(-81.001,-6.0,-73.0));
#1562=CARTESIAN_POINT('',(-67.9336667108223,-6.0,-73.0));
#1563=VECTOR('',#1913,1.0);
#1564=CARTESIAN_POINT('',(-81.001,6.0,-73.0));
#1565=AXIS2_PLACEMENT_3D('',#1914,#1915,#1916);
#1566=CARTESIAN_POINT('',(-63.0397300887278,6.0,-73.0));
#1567=CARTESIAN_POINT('',(-67.9336667108223,6.0,-73.0));
#1568=VECTOR('',#1917,1.0);
#1569=CARTESIAN_POINT('',(-59.6845651495696,7.82218728283545,-73.0));
#1570=AXIS2_PLACEMENT_3D('',#1918,#1919,#1920);
#1571=CARTESIAN_POINT('',(-37.5,41.9999999999989,-73.0));
#1572=CARTESIAN_POINT('',(-49.1836667108223,23.9999999999994,-73.0));
#1573=VECTOR('',#1921,1.0);
#1574=CARTESIAN_POINT('',(37.5,41.9999999999989,-73.0));
#1575=CARTESIAN_POINT('',(-1.52415496123171E-14,41.9999999999989,-73.0));
#1576=VECTOR('',#1922,1.0);
#1577=CARTESIAN_POINT('',(59.6845651495697,7.82218728283545,-73.0));
#1578=CARTESIAN_POINT('',(49.1836667108223,23.9999999999994,-73.0));
#1579=VECTOR('',#1923,1.0);
#1580=CARTESIAN_POINT('',(63.0397300887279,6.0,-73.0));
#1581=AXIS2_PLACEMENT_3D('',#1924,#1925,#1926);
#1582=CARTESIAN_POINT('',(81.001,6.0,-73.0));
#1583=CARTESIAN_POINT('',(67.9336667108223,6.0,-73.0));
#1584=VECTOR('',#1927,1.0);
#1585=CARTESIAN_POINT('',(81.001,-6.0,-73.0));
#1586=AXIS2_PLACEMENT_3D('',#1928,#1929,#1930);
#1587=CARTESIAN_POINT('',(63.0391562201984,-6.0,-73.0));
#1588=CARTESIAN_POINT('',(67.9336667108223,-6.0,-73.0));
#1589=VECTOR('',#1931,1.0);
#1590=CARTESIAN_POINT('',(59.6844739484167,-7.82144385993988,-73.0));
#1591=AXIS2_PLACEMENT_3D('',#1932,#1933,#1934);
#1592=CARTESIAN_POINT('',(42.1453177282183,-34.8293760182939,-73.0));
#1593=CARTESIAN_POINT('',(51.1836667108223,-20.9115390892529,-73.0));
#1594=VECTOR('',#1935,1.0);
#1595=CARTESIAN_POINT('',(41.5,-37.0079321583541,-73.0));
#1596=AXIS2_PLACEMENT_3D('',#1936,#1937,#1938);
#1597=CARTESIAN_POINT('',(41.5,-75.5,-73.0));
#1598=CARTESIAN_POINT('',(41.5,-55.1615390892529,-73.0));
#1599=VECTOR('',#1939,1.0);
#1600=CARTESIAN_POINT('',(37.5,-79.5,-73.0));
#1601=AXIS2_PLACEMENT_3D('',#1940,#1941,#1942);
#1602=CARTESIAN_POINT('',(1.39867189717477E-16,-79.5,-73.0));
#1603=VECTOR('',#1943,1.0);
#1604=CARTESIAN_POINT('',(-85.251,-2.46065124467557E-16,-73.0));
#1605=AXIS2_PLACEMENT_3D('',#1944,#1945,#1946);
#1606=CARTESIAN_POINT('',(76.751,5.0442640334042E-16,-73.0));
#1607=AXIS2_PLACEMENT_3D('',#1947,#1948,#1949);
#1608=CARTESIAN_POINT('',(-15.5,11.0,-73.0));
#1609=AXIS2_PLACEMENT_3D('',#1950,#1951,#1952);
#1610=CARTESIAN_POINT('',(-33.5,-56.0,-73.0));
#1611=AXIS2_PLACEMENT_3D('',#1953,#1954,#1955);
#1612=CARTESIAN_POINT('',(2.5,-56.0,-73.0));
#1613=AXIS2_PLACEMENT_3D('',#1956,#1957,#1958);
#1614=CARTESIAN_POINT('',(-15.5,-25.0,-73.0));
#1615=AXIS2_PLACEMENT_3D('',#1959,#1960,#1961);
#1616=CARTESIAN_POINT('',(15.5,-25.0,-69.0));
#1617=AXIS2_PLACEMENT_3D('',#1962,#1963,#1964);
#1618=CARTESIAN_POINT('',(33.5,-56.0,-69.0));
#1619=AXIS2_PLACEMENT_3D('',#1965,#1966,#1967);
#1620=CARTESIAN_POINT('',(15.5,11.0,-69.0));
#1621=AXIS2_PLACEMENT_3D('',#1968,#1969,#1970);
#1622=CARTESIAN_POINT('',(-1.70000000000006,31.049999999955,-69.0));
#1623=AXIS2_PLACEMENT_3D('',#1971,#1972,#1973);
#1624=CARTESIAN_POINT('',(30.3,31.049999999955,-69.0));
#1625=AXIS2_PLACEMENT_3D('',#1974,#1975,#1976);
#1626=CARTESIAN_POINT('',(-33.7,31.049999999955,-69.0));
#1627=AXIS2_PLACEMENT_3D('',#1977,#1978,#1979);
#1628=CARTESIAN_POINT('',(-56.5099999999865,8.5,-69.0));
#1629=AXIS2_PLACEMENT_3D('',#1980,#1981,#1982);
#1630=CARTESIAN_POINT('',(-36.5110000823182,-39.5,-69.0));
#1631=AXIS2_PLACEMENT_3D('',#1983,#1984,#1985);
#1632=CARTESIAN_POINT('',(-45.0,13.0,-69.0));
#1633=CARTESIAN_POINT('',(-45.0,-21.0,-69.0));
#1634=CARTESIAN_POINT('',(-45.0,-4.0,-69.0));
#1635=VECTOR('',#1986,1.0);
#1636=CARTESIAN_POINT('',(-42.0,16.0,-69.0));
#1637=AXIS2_PLACEMENT_3D('',#1987,#1988,#1989);
#1638=CARTESIAN_POINT('',(-28.0,16.0,-69.0));
#1639=CARTESIAN_POINT('',(-35.0,16.0,-69.0));
#1640=VECTOR('',#1990,1.0);
#1641=CARTESIAN_POINT('',(-25.0,13.0,-69.0));
#1642=AXIS2_PLACEMENT_3D('',#1991,#1992,#1993);
#1643=CARTESIAN_POINT('',(-25.0,-21.0,-69.0));
#1644=CARTESIAN_POINT('',(-25.0,-4.0,-69.0));
#1645=VECTOR('',#1994,1.0);
#1646=CARTESIAN_POINT('',(-28.0,-24.0,-69.0));
#1647=AXIS2_PLACEMENT_3D('',#1995,#1996,#1997);
#1648=CARTESIAN_POINT('',(-42.0,-24.0,-69.0));
#1649=CARTESIAN_POINT('',(-35.0,-24.0,-69.0));
#1650=VECTOR('',#1998,1.0);
#1651=AXIS2_PLACEMENT_3D('',#1999,#2000,#2001);
#1652=CARTESIAN_POINT('',(45.0,-21.0,-69.0));
#1653=CARTESIAN_POINT('',(45.0,13.0,-69.0));
#1654=CARTESIAN_POINT('',(45.0,-4.0,-69.0));
#1655=VECTOR('',#2002,1.0);
#1656=CARTESIAN_POINT('',(42.0,-24.0,-69.0));
#1657=AXIS2_PLACEMENT_3D('',#2003,#2004,#2005);
#1658=CARTESIAN_POINT('',(28.0,-24.0,-69.0));
#1659=CARTESIAN_POINT('',(35.0,-24.0,-69.0));
#1660=VECTOR('',#2006,1.0);
#1661=CARTESIAN_POINT('',(25.0,-21.0,-69.0));
#1662=AXIS2_PLACEMENT_3D('',#2007,#2008,#2009);
#1663=CARTESIAN_POINT('',(25.0,13.0,-69.0));
#1664=CARTESIAN_POINT('',(25.0,-4.0,-69.0));
#1665=VECTOR('',#2010,1.0);
#1666=CARTESIAN_POINT('',(28.0,16.0,-69.0));
#1667=AXIS2_PLACEMENT_3D('',#2011,#2012,#2013);
#1668=CARTESIAN_POINT('',(42.0,16.0,-69.0));
#1669=CARTESIAN_POINT('',(35.0,16.0,-69.0));
#1670=VECTOR('',#2014,1.0);
#1671=AXIS2_PLACEMENT_3D('',#2015,#2016,#2017);
#1672=CARTESIAN_POINT('',(29.491,21.999999999999,-69.0));
#1673=AXIS2_PLACEMENT_3D('',#2018,#2019,#2020);
#1674=CARTESIAN_POINT('',(29.491,-29.9999999999497,-69.0));
#1675=AXIS2_PLACEMENT_3D('',#2021,#2022,#2023);
#1676=CARTESIAN_POINT('',(-1.7000000000007,-70.4999999999838,-69.0));
#1677=AXIS2_PLACEMENT_3D('',#2024,#2025,#2026);
#1678=CARTESIAN_POINT('',(13.3000000000011,-7.0,-69.0));
#1679=AXIS2_PLACEMENT_3D('',#2027,#2028,#2029);
#1680=CARTESIAN_POINT('',(-16.7000000000012,-7.0,-69.0));
#1681=AXIS2_PLACEMENT_3D('',#2030,#2031,#2032);
#1682=CARTESIAN_POINT('',(-41.5,-75.5,-69.0));
#1683=CARTESIAN_POINT('',(-41.5,-37.0079321583541,-69.0));
#1684=CARTESIAN_POINT('',(-41.5,-55.1615390892529,-69.0));
#1685=VECTOR('',#2033,1.0);
#1686=CARTESIAN_POINT('',(-37.5,-79.5,-69.0));
#1687=AXIS2_PLACEMENT_3D('',#2034,#2035,#2036);
#1688=CARTESIAN_POINT('',(37.5,-79.5,-69.0));
#1689=CARTESIAN_POINT('',(6.32214401159283E-16,-79.5,-69.0));
#1690=VECTOR('',#2037,1.0);
#1691=CARTESIAN_POINT('',(41.5,-75.5,-69.0));
#1692=AXIS2_PLACEMENT_3D('',#2038,#2039,#2040);
#1693=CARTESIAN_POINT('',(41.5,-37.0079321583541,-69.0));
#1694=CARTESIAN_POINT('',(41.5,-55.1615390892529,-69.0));
#1695=VECTOR('',#2041,1.0);
#1696=CARTESIAN_POINT('',(42.1453177282183,-34.8293760182939,-69.0));
#1697=AXIS2_PLACEMENT_3D('',#2042,#2043,#2044);
#1698=CARTESIAN_POINT('',(59.6844739484167,-7.82144385993988,-69.0));
#1699=CARTESIAN_POINT('',(51.1836667108223,-20.9115390892529,-69.0));
#1700=VECTOR('',#2045,1.0);
#1701=CARTESIAN_POINT('',(63.0391562201984,-6.0,-69.0));
#1702=AXIS2_PLACEMENT_3D('',#2046,#2047,#2048);
#1703=CARTESIAN_POINT('',(81.001,-6.0,-69.0));
#1704=CARTESIAN_POINT('',(67.9336667108223,-6.0,-69.0));
#1705=VECTOR('',#2049,1.0);
#1706=CARTESIAN_POINT('',(81.001,6.0,-69.0));
#1707=AXIS2_PLACEMENT_3D('',#2050,#2051,#2052);
#1708=CARTESIAN_POINT('',(63.0397300887279,6.0,-69.0));
#1709=CARTESIAN_POINT('',(67.9336667108223,6.0,-69.0));
#1710=VECTOR('',#2053,1.0);
#1711=CARTESIAN_POINT('',(59.6845651495697,7.82218728283545,-69.0));
#1712=AXIS2_PLACEMENT_3D('',#2054,#2055,#2056);
#1713=CARTESIAN_POINT('',(37.5,41.9999999999989,-69.0));
#1714=CARTESIAN_POINT('',(49.1836667108223,23.9999999999994,-69.0));
#1715=VECTOR('',#2057,1.0);
#1716=CARTESIAN_POINT('',(-37.5,41.9999999999989,-69.0));
#1717=CARTESIAN_POINT('',(-1.47492024008753E-14,41.9999999999989,-69.0));
#1718=VECTOR('',#2058,1.0);
#1719=CARTESIAN_POINT('',(-59.6845651495696,7.82218728283545,-69.0));
#1720=CARTESIAN_POINT('',(-49.1836667108223,23.9999999999994,-69.0));
#1721=VECTOR('',#2059,1.0);
#1722=CARTESIAN_POINT('',(-63.0397300887278,6.0,-69.0));
#1723=AXIS2_PLACEMENT_3D('',#2060,#2061,#2062);
#1724=CARTESIAN_POINT('',(-81.001,6.0,-69.0));
#1725=CARTESIAN_POINT('',(-67.9336667108223,6.0,-69.0));
#1726=VECTOR('',#2063,1.0);
#1727=CARTESIAN_POINT('',(-81.001,-6.0,-69.0));
#1728=AXIS2_PLACEMENT_3D('',#2064,#2065,#2066);
#1729=CARTESIAN_POINT('',(-63.0391562201983,-6.0,-69.0));
#1730=CARTESIAN_POINT('',(-67.9336667108223,-6.0,-69.0));
#1731=VECTOR('',#2067,1.0);
#1732=CARTESIAN_POINT('',(-59.6844739484166,-7.8214438599399,-69.0));
#1733=AXIS2_PLACEMENT_3D('',#2068,#2069,#2070);
#1734=CARTESIAN_POINT('',(-42.1453177282183,-34.8293760182939,-69.0));
#1735=CARTESIAN_POINT('',(-51.1836667108223,-20.9115390892528,-69.0));
#1736=VECTOR('',#2071,1.0);
#1737=AXIS2_PLACEMENT_3D('',#2072,#2073,#2074);
#1738=CARTESIAN_POINT('',(76.751,-5.37503832180299E-16,-69.0));
#1739=AXIS2_PLACEMENT_3D('',#2075,#2076,#2077);
#1740=CARTESIAN_POINT('',(-85.251,-1.28799535998828E-15,-69.0));
#1741=AXIS2_PLACEMENT_3D('',#2078,#2079,#2080);
#1742=CARTESIAN_POINT('',(-2.5,-56.0,-69.0));
#1743=AXIS2_PLACEMENT_3D('',#2081,#2082,#2083);
#1744=CARTESIAN_POINT('',(-81.001,-6.0,-73.0));
#1745=VECTOR('',#2084,1.0);
#1746=CARTESIAN_POINT('',(-63.0391562201983,-6.0,-69.0));
#1747=VECTOR('',#2085,1.0);
#1748=CARTESIAN_POINT('',(-59.6844739484166,-7.8214438599399,-69.0));
#1749=VECTOR('',#2086,1.0);
#1750=CARTESIAN_POINT('',(-42.1453177282183,-34.8293760182939,-69.0));
#1751=VECTOR('',#2087,1.0);
#1752=CARTESIAN_POINT('',(-41.5,-37.0079321583541,-69.0));
#1753=VECTOR('',#2088,1.0);
#1754=CARTESIAN_POINT('',(-41.5,-75.5,-69.0));
#1755=VECTOR('',#2089,1.0);
#1756=CARTESIAN_POINT('',(41.5,-37.0079321583541,-69.0));
#1757=VECTOR('',#2090,1.0);
#1758=CARTESIAN_POINT('',(41.5,-75.5,-69.0));
#1759=VECTOR('',#2091,1.0);
#1760=CARTESIAN_POINT('',(42.1453177282183,-34.8293760182939,-69.0));
#1761=VECTOR('',#2092,1.0);
#1762=CARTESIAN_POINT('',(59.6844739484167,-7.82144385993988,-69.0));
#1763=VECTOR('',#2093,1.0);
#1764=CARTESIAN_POINT('',(63.0391562201984,-6.0,-69.0));
#1765=VECTOR('',#2094,1.0);
#1766=CARTESIAN_POINT('',(81.001,-6.0,-73.0));
#1767=VECTOR('',#2095,1.0);
#1768=CARTESIAN_POINT('',(81.001,6.0,-73.0));
#1769=VECTOR('',#2096,1.0);
#1770=CARTESIAN_POINT('',(63.0397300887279,6.0,-69.0));
#1771=VECTOR('',#2097,1.0);
#1772=CARTESIAN_POINT('',(59.6845651495697,7.82218728283545,-69.0));
#1773=VECTOR('',#2098,1.0);
#1774=CARTESIAN_POINT('',(37.5,41.9999999999989,-69.0));
#1775=VECTOR('',#2099,1.0);
#1776=CARTESIAN_POINT('',(-37.5,41.9999999999989,-69.0));
#1777=VECTOR('',#2100,1.0);
#1778=CARTESIAN_POINT('',(-59.6845651495696,7.82218728283545,-69.0));
#1779=VECTOR('',#2101,1.0);
#1780=CARTESIAN_POINT('',(-63.0397300887278,6.0,-69.0));
#1781=VECTOR('',#2102,1.0);
#1782=CARTESIAN_POINT('',(-81.001,6.0,-73.0));
#1783=VECTOR('',#2103,1.0);
#1784=CARTESIAN_POINT('',(37.5,-79.5,-69.0));
#1785=VECTOR('',#2104,1.0);
#1786=CARTESIAN_POINT('',(-37.5,-79.5,-69.0));
#1787=VECTOR('',#2105,1.0);
#1788=CARTESIAN_POINT('',(-16.7000000000012,-7.0,-71.19));
#1789=AXIS2_PLACEMENT_3D('',#2106,#2107,#2108);
#1790=CARTESIAN_POINT('',(13.3000000000011,-7.0,-71.19));
#1791=AXIS2_PLACEMENT_3D('',#2109,#2110,#2111);
#1792=CARTESIAN_POINT('',(-1.7000000000007,-70.4999999999838,-71.19));
#1793=AXIS2_PLACEMENT_3D('',#2112,#2113,#2114);
#1794=CARTESIAN_POINT('',(34.701,-29.9999999999497,-70.81));
#1795=AXIS2_PLACEMENT_3D('',#2115,#2116,#2117);
#1796=CARTESIAN_POINT('',(34.701,21.999999999999,-70.81));
#1797=AXIS2_PLACEMENT_3D('',#2118,#2119,#2120);
#1798=CARTESIAN_POINT('',(42.0,-24.0,-69.0));
#1799=VECTOR('',#2121,1.0);
#1800=CARTESIAN_POINT('',(45.0,-21.0,-69.0));
#1801=VECTOR('',#2122,1.0);
#1802=CARTESIAN_POINT('',(28.0,-24.0,-69.0));
#1803=VECTOR('',#2123,1.0);
#1804=CARTESIAN_POINT('',(25.0,-21.0,-69.0));
#1805=VECTOR('',#2124,1.0);
#1806=CARTESIAN_POINT('',(25.0,13.0,-69.0));
#1807=VECTOR('',#2125,1.0);
#1808=CARTESIAN_POINT('',(28.0,16.0,-69.0));
#1809=VECTOR('',#2126,1.0);
#1810=CARTESIAN_POINT('',(42.0,16.0,-69.0));
#1811=VECTOR('',#2127,1.0);
#1812=CARTESIAN_POINT('',(45.0,13.0,-69.0));
#1813=VECTOR('',#2128,1.0);
#1814=CARTESIAN_POINT('',(-45.0,13.0,-69.0));
#1815=VECTOR('',#2129,1.0);
#1816=CARTESIAN_POINT('',(-45.0,-21.0,-69.0));
#1817=VECTOR('',#2130,1.0);
#1818=CARTESIAN_POINT('',(-42.0,-24.0,-69.0));
#1819=VECTOR('',#2131,1.0);
#1820=CARTESIAN_POINT('',(-28.0,-24.0,-69.0));
#1821=VECTOR('',#2132,1.0);
#1822=CARTESIAN_POINT('',(-25.0,-21.0,-69.0));
#1823=VECTOR('',#2133,1.0);
#1824=CARTESIAN_POINT('',(-25.0,13.0,-69.0));
#1825=VECTOR('',#2134,1.0);
#1826=CARTESIAN_POINT('',(-28.0,16.0,-69.0));
#1827=VECTOR('',#2135,1.0);
#1828=CARTESIAN_POINT('',(-42.0,16.0,-69.0));
#1829=VECTOR('',#2136,1.0);
#1830=CARTESIAN_POINT('',(-31.3010000823182,-39.5,-70.81));
#1831=AXIS2_PLACEMENT_3D('',#2137,#2138,#2139);
#1832=CARTESIAN_POINT('',(-51.2999999999865,8.5,-70.81));
#1833=AXIS2_PLACEMENT_3D('',#2140,#2141,#2142);
#1834=CARTESIAN_POINT('',(-33.7,31.049999999955,-71.19));
#1835=AXIS2_PLACEMENT_3D('',#2143,#2144,#2145);
#1836=CARTESIAN_POINT('',(30.3,31.049999999955,-71.19));
#1837=AXIS2_PLACEMENT_3D('',#2146,#2147,#2148);
#1838=CARTESIAN_POINT('',(-1.70000000000006,31.049999999955,-71.19));
#1839=AXIS2_PLACEMENT_3D('',#2149,#2150,#2151);
#1840=CARTESIAN_POINT('',(-5.55296142714787E-14,31.049999999955,-73.0));
#1841=DIRECTION('',(-1.23086802860452E-16,2.45114061367087E-19,-1.0));
#1842=DIRECTION('',(-1.0,0.0,1.23086802860452E-16));
#1843=CARTESIAN_POINT('',(32.0,31.049999999955,-73.0));
#1844=DIRECTION('',(-1.23086802860452E-16,2.45114061367087E-19,-1.0));
#1845=DIRECTION('',(-1.0,0.0,1.23086802860452E-16));
#1846=CARTESIAN_POINT('',(-32.0,31.049999999955,-73.0));
#1847=DIRECTION('',(-1.23086802860452E-16,2.45114061367087E-19,-1.0));
#1848=DIRECTION('',(-1.0,0.0,1.23086802860452E-16));
#1849=CARTESIAN_POINT('',(-52.9999999999865,8.5,-73.0));
#1850=DIRECTION('',(-1.23086802860452E-16,2.45114061367087E-19,-1.0));
#1851=DIRECTION('',(-1.0,0.0,1.23086802860452E-16));
#1852=CARTESIAN_POINT('',(-33.0010000823182,-39.5,-73.0));
#1853=DIRECTION('',(-1.23086802860452E-16,2.45114061367087E-19,-1.0));
#1854=DIRECTION('',(-1.0,0.0,1.23086802860452E-16));
#1855=CARTESIAN_POINT('',(-42.0,13.0,-73.0));
#1856=DIRECTION('',(-1.23086802860452E-16,2.45114061367087E-19,-1.0));
#1857=DIRECTION('',(-1.0,0.0,1.23086802860452E-16));
#1858=DIRECTION('',(6.12303176911189E-17,-1.0,-2.45114061367095E-19));
#1859=CARTESIAN_POINT('',(-42.0,-21.0,-73.0));
#1860=DIRECTION('',(-1.23086802860452E-16,2.45114061367087E-19,-1.0));
#1861=DIRECTION('',(-1.0,0.0,1.23086802860452E-16));
#1862=DIRECTION('',(1.0,3.01703061498153E-35,-1.23086802860452E-16));
#1863=CARTESIAN_POINT('',(-28.0,-21.0,-73.0));
#1864=DIRECTION('',(-1.23086802860452E-16,2.45114061367087E-19,-1.0));
#1865=DIRECTION('',(-1.0,0.0,1.23086802860452E-16));
#1866=DIRECTION('',(6.12303176911189E-17,1.0,2.45114061367079E-19));
#1867=CARTESIAN_POINT('',(-28.0,13.0,-73.0));
#1868=DIRECTION('',(-1.23086802860452E-16,2.45114061367087E-19,-1.0));
#1869=DIRECTION('',(-1.0,0.0,1.23086802860452E-16));
#1870=DIRECTION('',(-1.0,-1.22460635382238E-16,1.23086802860452E-16));
#1871=CARTESIAN_POINT('',(42.0,-21.0,-73.0));
#1872=DIRECTION('',(-1.23086802860452E-16,2.45114061367087E-19,-1.0));
#1873=DIRECTION('',(-1.0,0.0,1.23086802860452E-16));
#1874=DIRECTION('',(1.60814287233912E-16,1.0,2.45114061367067E-19));
#1875=CARTESIAN_POINT('',(42.0,13.0,-73.0));
#1876=DIRECTION('',(-1.23086802860452E-16,2.45114061367087E-19,-1.0));
#1877=DIRECTION('',(-1.0,0.0,1.23086802860452E-16));
#1878=DIRECTION('',(-1.0,2.08475098604383E-16,1.23086802860452E-16));
#1879=CARTESIAN_POINT('',(28.0,13.0,-73.0));
#1880=DIRECTION('',(-1.23086802860452E-16,2.45114061367087E-19,-1.0));
#1881=DIRECTION('',(-1.0,0.0,1.23086802860452E-16));
#1882=DIRECTION('',(-6.12303176911189E-17,-1.0,-2.45114061367079E-19));
#1883=CARTESIAN_POINT('',(28.0,-21.0,-73.0));
#1884=DIRECTION('',(-1.23086802860452E-16,2.45114061367087E-19,-1.0));
#1885=DIRECTION('',(-1.0,0.0,1.23086802860452E-16));
#1886=DIRECTION('',(1.0,-1.22460635382238E-16,-1.23086802860452E-16));
#1887=CARTESIAN_POINT('',(33.001,21.999999999999,-73.0));
#1888=DIRECTION('',(-1.23086802860452E-16,2.45114061367087E-19,-1.0));
#1889=DIRECTION('',(-1.0,0.0,1.23086802860452E-16));
#1890=CARTESIAN_POINT('',(33.001,-29.9999999999497,-73.0));
#1891=DIRECTION('',(-1.23086802860452E-16,2.45114061367087E-19,-1.0));
#1892=DIRECTION('',(-1.0,0.0,1.23086802860452E-16));
#1893=CARTESIAN_POINT('',(-7.00866600250874E-13,-70.4999999999838,-73.0));
#1894=DIRECTION('',(-1.23086802860452E-16,2.45114061367087E-19,-1.0));
#1895=DIRECTION('',(-1.0,0.0,1.23086802860452E-16));
#1896=CARTESIAN_POINT('',(15.0000000000011,-7.0,-73.0));
#1897=DIRECTION('',(-1.23086802860452E-16,2.45114061367087E-19,-1.0));
#1898=DIRECTION('',(-1.0,0.0,1.23086802860452E-16));
#1899=CARTESIAN_POINT('',(-15.0000000000012,-7.0,-73.0));
#1900=DIRECTION('',(-1.23086802860452E-16,2.45114061367087E-19,-1.0));
#1901=DIRECTION('',(-1.0,0.0,1.23086802860452E-16));
#1902=CARTESIAN_POINT('',(-37.5,-75.5,-73.0));
#1903=DIRECTION('',(-1.23086802860452E-16,2.45114061367087E-19,-1.0));
#1904=DIRECTION('',(-1.0,0.0,1.23086802860452E-16));
#1905=DIRECTION('',(6.12303176911189E-17,1.0,2.45114061367079E-19));
#1906=CARTESIAN_POINT('',(-45.5,-37.0079321583541,-73.0));
#1907=DIRECTION('',(1.23086802860452E-16,-2.45114061367087E-19,1.0));
#1908=DIRECTION('',(-1.0,0.0,1.23086802860452E-16));
#1909=DIRECTION('',(-0.544639035015026,0.838670567945425,6.72434474820593E-17));
#1910=CARTESIAN_POINT('',(-63.0391562201983,-10.0,-73.0));
#1911=DIRECTION('',(1.23086802860452E-16,-2.45114061367087E-19,1.0));
#1912=DIRECTION('',(-1.0,0.0,1.23086802860452E-16));
#1913=DIRECTION('',(-1.0,1.22460635382238E-16,1.23086802860452E-16));
#1914=CARTESIAN_POINT('',(-81.001,-2.46065124467557E-16,-73.0));
#1915=DIRECTION('',(-1.23086802860452E-16,2.45114061367087E-19,-1.0));
#1916=DIRECTION('',(-1.0,0.0,1.23086802860452E-16));
#1917=DIRECTION('',(1.0,0.0,-1.23086802860452E-16));
#1918=CARTESIAN_POINT('',(-63.0397300887278,10.0,-73.0));
#1919=DIRECTION('',(1.23086802860452E-16,-2.45114061367087E-19,1.0));
#1920=DIRECTION('',(-1.0,0.0,1.23086802860452E-16));
#1921=DIRECTION('',(0.544453179291136,0.838791234789548,-6.68094016199557E-17));
#1922=DIRECTION('',(1.0,0.0,-1.23086802860452E-16));
#1923=DIRECTION('',(0.544453179291138,-0.838791234789547,-6.72206006723528E-17));
#1924=CARTESIAN_POINT('',(63.0397300887279,10.0,-73.0));
#1925=DIRECTION('',(1.23086802860452E-16,-2.45114061367087E-19,1.0));
#1926=DIRECTION('',(-1.0,0.0,1.23086802860452E-16));
#1927=DIRECTION('',(1.0,0.0,-1.23086802860452E-16));
#1928=CARTESIAN_POINT('',(81.001,5.0442640334042E-16,-73.0));
#1929=DIRECTION('',(-1.23086802860452E-16,2.45114061367087E-19,-1.0));
#1930=DIRECTION('',(-1.0,0.0,1.23086802860452E-16));
#1931=DIRECTION('',(-1.0,1.22460635382238E-16,1.23086802860452E-16));
#1932=CARTESIAN_POINT('',(63.0391562201984,-10.0,-73.0));
#1933=DIRECTION('',(1.23086802860452E-16,-2.45114061367087E-19,1.0));
#1934=DIRECTION('',(-1.0,0.0,1.23086802860452E-16));
#1935=DIRECTION('',(-0.544639035015028,-0.838670567945424,6.68323075839432E-17));
#1936=CARTESIAN_POINT('',(45.5,-37.0079321583541,-73.0));
#1937=DIRECTION('',(1.23086802860452E-16,-2.45114061367087E-19,1.0));
#1938=DIRECTION('',(-1.0,0.0,1.23086802860452E-16));
#1939=DIRECTION('',(6.12303176911189E-17,-1.0,-2.45114061367095E-19));
#1940=CARTESIAN_POINT('',(37.5,-75.5,-73.0));
#1941=DIRECTION('',(-1.23086802860452E-16,2.45114061367087E-19,-1.0));
#1942=DIRECTION('',(-1.0,0.0,1.23086802860452E-16));
#1943=DIRECTION('',(-1.0,-3.01703061498153E-35,1.23086802860452E-16));
#1944=CARTESIAN_POINT('',(-81.001,-2.46065124467557E-16,-73.0));
#1945=DIRECTION('',(-1.23086802860452E-16,2.45114061367088E-19,-1.0));
#1946=DIRECTION('',(-1.0,0.0,1.23086802860452E-16));
#1947=CARTESIAN_POINT('',(81.001,5.0442640334042E-16,-73.0));
#1948=DIRECTION('',(-1.23086802860452E-16,2.45114061367088E-19,-1.0));
#1949=DIRECTION('',(-1.0,0.0,1.23086802860452E-16));
#1950=CARTESIAN_POINT('',(-1.49577952732504E-14,11.0,-73.0));
#1951=DIRECTION('',(-1.23086802860452E-16,2.45114061367087E-19,-1.0));
#1952=DIRECTION('',(-1.0,0.0,1.23086802860452E-16));
#1953=CARTESIAN_POINT('',(-18.0,-56.0,-73.0));
#1954=DIRECTION('',(-1.23086802860452E-16,2.45114061367087E-19,-1.0));
#1955=DIRECTION('',(-1.0,0.0,1.23086802860452E-16));
#1956=CARTESIAN_POINT('',(18.0,-56.0,-73.0));
#1957=DIRECTION('',(-1.23086802860452E-16,2.45114061367087E-19,-1.0));
#1958=DIRECTION('',(-1.0,0.0,1.23086802860452E-16));
#1959=CARTESIAN_POINT('',(-1.38777878078145E-14,-25.0,-73.0));
#1960=DIRECTION('',(-1.23086802860452E-16,2.45114061367087E-19,-1.0));
#1961=DIRECTION('',(-1.0,0.0,1.23086802860452E-16));
#1962=CARTESIAN_POINT('',(-1.33854405963726E-14,-25.0,-69.0));
#1963=DIRECTION('',(0.0,0.0,1.0));
#1964=DIRECTION('',(1.0,0.0,0.0));
#1965=CARTESIAN_POINT('',(18.0,-56.0,-69.0));
#1966=DIRECTION('',(0.0,0.0,1.0));
#1967=DIRECTION('',(1.0,0.0,0.0));
#1968=CARTESIAN_POINT('',(-1.44654480618086E-14,11.0,-69.0));
#1969=DIRECTION('',(0.0,0.0,1.0));
#1970=DIRECTION('',(1.0,0.0,0.0));
#1971=CARTESIAN_POINT('',(-5.50372670339771E-14,31.049999999955,-69.0));
#1972=DIRECTION('',(-1.23086802860452E-16,2.45114061367087E-19,-1.0));
#1973=DIRECTION('',(-1.0,0.0,1.23086802860452E-16));
#1974=CARTESIAN_POINT('',(32.0,31.049999999955,-69.0));
#1975=DIRECTION('',(-1.23086802860452E-16,2.45114061367087E-19,-1.0));
#1976=DIRECTION('',(-1.0,0.0,1.23086802860452E-16));
#1977=CARTESIAN_POINT('',(-32.0,31.049999999955,-69.0));
#1978=DIRECTION('',(-1.23086802860452E-16,2.45114061367087E-19,-1.0));
#1979=DIRECTION('',(-1.0,0.0,1.23086802860452E-16));
#1980=CARTESIAN_POINT('',(-52.9999999999865,8.5,-69.0));
#1981=DIRECTION('',(-1.23086802860452E-16,2.45114061367087E-19,-1.0));
#1982=DIRECTION('',(-1.0,0.0,1.23086802860452E-16));
#1983=CARTESIAN_POINT('',(-33.0010000823182,-39.5,-69.0));
#1984=DIRECTION('',(-1.23086802860452E-16,2.45114061367087E-19,-1.0));
#1985=DIRECTION('',(-1.0,0.0,1.23086802860452E-16));
#1986=DIRECTION('',(6.12303176911189E-17,-1.0,0.0));
#1987=CARTESIAN_POINT('',(-42.0,13.0,-69.0));
#1988=DIRECTION('',(0.0,0.0,1.0));
#1989=DIRECTION('',(1.0,0.0,0.0));
#1990=DIRECTION('',(-1.0,-1.22460635382238E-16,0.0));
#1991=CARTESIAN_POINT('',(-28.0,13.0,-69.0));
#1992=DIRECTION('',(0.0,0.0,1.0));
#1993=DIRECTION('',(1.0,0.0,0.0));
#1994=DIRECTION('',(6.12303176911189E-17,1.0,0.0));
#1995=CARTESIAN_POINT('',(-28.0,-21.0,-69.0));
#1996=DIRECTION('',(0.0,0.0,1.0));
#1997=DIRECTION('',(1.0,0.0,0.0));
#1998=DIRECTION('',(1.0,0.0,0.0));
#1999=CARTESIAN_POINT('',(-42.0,-21.0,-69.0));
#2000=DIRECTION('',(0.0,0.0,1.0));
#2001=DIRECTION('',(1.0,0.0,0.0));
#2002=DIRECTION('',(1.60814287233912E-16,1.0,0.0));
#2003=CARTESIAN_POINT('',(42.0,-21.0,-69.0));
#2004=DIRECTION('',(0.0,0.0,1.0));
#2005=DIRECTION('',(1.0,0.0,0.0));
#2006=DIRECTION('',(1.0,-1.22460635382238E-16,0.0));
#2007=CARTESIAN_POINT('',(28.0,-21.0,-69.0));
#2008=DIRECTION('',(0.0,0.0,1.0));
#2009=DIRECTION('',(1.0,0.0,0.0));
#2010=DIRECTION('',(-6.12303176911189E-17,-1.0,0.0));
#2011=CARTESIAN_POINT('',(28.0,13.0,-69.0));
#2012=DIRECTION('',(0.0,0.0,1.0));
#2013=DIRECTION('',(1.0,0.0,0.0));
#2014=DIRECTION('',(-1.0,2.08475098604383E-16,0.0));
#2015=CARTESIAN_POINT('',(42.0,13.0,-69.0));
#2016=DIRECTION('',(0.0,0.0,1.0));
#2017=DIRECTION('',(1.0,0.0,0.0));
#2018=CARTESIAN_POINT('',(33.001,21.999999999999,-69.0));
#2019=DIRECTION('',(-1.23086802860452E-16,2.45114061367087E-19,-1.0));
#2020=DIRECTION('',(-1.0,0.0,1.23086802860452E-16));
#2021=CARTESIAN_POINT('',(33.001,-29.9999999999497,-69.0));
#2022=DIRECTION('',(-1.23086802860452E-16,2.45114061367087E-19,-1.0));
#2023=DIRECTION('',(-1.0,0.0,1.23086802860452E-16));
#2024=CARTESIAN_POINT('',(-7.00374253001955E-13,-70.4999999999838,-69.0));
#2025=DIRECTION('',(-1.23086802860452E-16,2.45114061367087E-19,-1.0));
#2026=DIRECTION('',(-1.0,0.0,1.23086802860452E-16));
#2027=CARTESIAN_POINT('',(15.0000000000011,-7.0,-69.0));
#2028=DIRECTION('',(-1.23086802860452E-16,2.45114061367087E-19,-1.0));
#2029=DIRECTION('',(-1.0,0.0,1.23086802860452E-16));
#2030=CARTESIAN_POINT('',(-15.0000000000012,-7.0,-69.0));
#2031=DIRECTION('',(-1.23086802860452E-16,2.45114061367087E-19,-1.0));
#2032=DIRECTION('',(-1.0,0.0,1.23086802860452E-16));
#2033=DIRECTION('',(6.12303176911189E-17,1.0,2.45114061367079E-19));
#2034=CARTESIAN_POINT('',(-37.5,-75.5,-69.0));
#2035=DIRECTION('',(0.0,0.0,1.0));
#2036=DIRECTION('',(1.0,0.0,0.0));
#2037=DIRECTION('',(1.0,0.0,0.0));
#2038=CARTESIAN_POINT('',(37.5,-75.5,-69.0));
#2039=DIRECTION('',(0.0,0.0,1.0));
#2040=DIRECTION('',(1.0,0.0,0.0));
#2041=DIRECTION('',(6.12303176911189E-17,-1.0,-2.45114061367095E-19));
#2042=CARTESIAN_POINT('',(45.5,-37.0079321583541,-69.0));
#2043=DIRECTION('',(1.23086802860452E-16,-2.45114061367087E-19,1.0));
#2044=DIRECTION('',(-1.0,0.0,1.23086802860452E-16));
#2045=DIRECTION('',(-0.544639035015028,-0.838670567945424,6.68323075839432E-17));
#2046=CARTESIAN_POINT('',(63.0391562201984,-10.0,-69.0));
#2047=DIRECTION('',(1.23086802860452E-16,-2.45114061367087E-19,1.0));
#2048=DIRECTION('',(-1.0,0.0,1.23086802860452E-16));
#2049=DIRECTION('',(-1.0,1.22460635382238E-16,1.23086802860452E-16));
#2050=CARTESIAN_POINT('',(81.001,5.03445947094951E-16,-69.0));
#2051=DIRECTION('',(1.23086802860452E-16,-2.45114061367087E-19,1.0));
#2052=DIRECTION('',(1.0,0.0,-1.23086802860452E-16));
#2053=DIRECTION('',(1.0,0.0,-1.23086802860452E-16));
#2054=CARTESIAN_POINT('',(63.0397300887279,10.0,-69.0));
#2055=DIRECTION('',(1.23086802860452E-16,-2.45114061367087E-19,1.0));
#2056=DIRECTION('',(-1.0,0.0,1.23086802860452E-16));
#2057=DIRECTION('',(0.544453179291138,-0.838791234789547,-6.72206006723528E-17));
#2058=DIRECTION('',(1.0,0.0,-1.23086802860452E-16));
#2059=DIRECTION('',(0.544453179291136,0.838791234789548,-6.68094016199557E-17));
#2060=CARTESIAN_POINT('',(-63.0397300887278,10.0,-69.0));
#2061=DIRECTION('',(1.23086802860452E-16,-2.45114061367087E-19,1.0));
#2062=DIRECTION('',(-1.0,0.0,1.23086802860452E-16));
#2063=DIRECTION('',(1.0,0.0,-1.23086802860452E-16));
#2064=CARTESIAN_POINT('',(-81.001,-2.47045580713025E-16,-69.0));
#2065=DIRECTION('',(1.23086802860452E-16,-2.45114061367087E-19,1.0));
#2066=DIRECTION('',(1.0,0.0,-1.23086802860452E-16));
#2067=DIRECTION('',(-1.0,1.22460635382238E-16,1.23086802860452E-16));
#2068=CARTESIAN_POINT('',(-63.0391562201983,-10.0,-69.0));
#2069=DIRECTION('',(1.23086802860452E-16,-2.45114061367087E-19,1.0));
#2070=DIRECTION('',(-1.0,0.0,1.23086802860452E-16));
#2071=DIRECTION('',(-0.544639035015026,0.838670567945425,6.72434474820593E-17));
#2072=CARTESIAN_POINT('',(-45.5,-37.0079321583541,-69.0));
#2073=DIRECTION('',(1.23086802860452E-16,-2.45114061367087E-19,1.0));
#2074=DIRECTION('',(-1.0,0.0,1.23086802860452E-16));
#2075=CARTESIAN_POINT('',(81.001,5.03445947094951E-16,-69.0));
#2076=DIRECTION('',(-1.23086802860452E-16,2.45114061367088E-19,-1.0));
#2077=DIRECTION('',(-1.0,0.0,1.23086802860452E-16));
#2078=CARTESIAN_POINT('',(-81.001,-2.47045580713025E-16,-69.0));
#2079=DIRECTION('',(-1.23086802860452E-16,2.45114061367088E-19,-1.0));
#2080=DIRECTION('',(-1.0,0.0,1.23086802860452E-16));
#2081=CARTESIAN_POINT('',(-18.0,-56.0,-69.0));
#2082=DIRECTION('',(0.0,0.0,1.0));
#2083=DIRECTION('',(1.0,0.0,0.0));
#2084=DIRECTION('',(1.23086802860452E-16,-2.45114061367087E-19,1.0));
#2085=DIRECTION('',(-1.23086802860452E-16,2.45114061367087E-19,-1.0));
#2086=DIRECTION('',(-1.23086802860452E-16,2.45114061367087E-19,-1.0));
#2087=DIRECTION('',(-1.23086802860452E-16,2.45114061367087E-19,-1.0));
#2088=DIRECTION('',(-1.23086802860452E-16,2.45114061367087E-19,-1.0));
#2089=DIRECTION('',(-1.23086802860452E-16,2.45114061367087E-19,-1.0));
#2090=DIRECTION('',(-1.23086802860452E-16,2.45114061367087E-19,-1.0));
#2091=DIRECTION('',(-1.23086802860452E-16,2.45114061367087E-19,-1.0));
#2092=DIRECTION('',(-1.23086802860452E-16,2.45114061367087E-19,-1.0));
#2093=DIRECTION('',(-1.23086802860452E-16,2.45114061367087E-19,-1.0));
#2094=DIRECTION('',(-1.23086802860452E-16,2.45114061367087E-19,-1.0));
#2095=DIRECTION('',(1.23086802860452E-16,-2.45114061367087E-19,1.0));
#2096=DIRECTION('',(1.23086802860452E-16,-2.45114061367087E-19,1.0));
#2097=DIRECTION('',(-1.23086802860452E-16,2.45114061367087E-19,-1.0));
#2098=DIRECTION('',(-1.23086802860452E-16,2.45114061367087E-19,-1.0));
#2099=DIRECTION('',(-1.23086802860452E-16,2.45114061367087E-19,-1.0));
#2100=DIRECTION('',(-1.23086802860452E-16,2.45114061367087E-19,-1.0));
#2101=DIRECTION('',(-1.23086802860452E-16,2.45114061367087E-19,-1.0));
#2102=DIRECTION('',(-1.23086802860452E-16,2.45114061367087E-19,-1.0));
#2103=DIRECTION('',(1.23086802860452E-16,-2.45114061367087E-19,1.0));
#2104=DIRECTION('',(-1.23086802860452E-16,2.45114061367087E-19,-1.0));
#2105=DIRECTION('',(-1.23086802860452E-16,2.45114061367087E-19,-1.0));
#2106=CARTESIAN_POINT('',(-15.0000000000012,-7.0,-71.19));
#2107=DIRECTION('',(-1.23086804488495E-16,2.45113467834163E-19,-1.0));
#2108=DIRECTION('',(-1.0,0.0,1.23086804488495E-16));
#2109=CARTESIAN_POINT('',(15.0000000000011,-7.0,-71.19));
#2110=DIRECTION('',(-1.23086804488495E-16,2.45113467834163E-19,-1.0));
#2111=DIRECTION('',(-1.0,0.0,1.23086804488495E-16));
#2112=CARTESIAN_POINT('',(-7.00643813074801E-13,-70.4999999999838,-71.19));
#2113=DIRECTION('',(-1.23086791253606E-16,2.45111813472938E-19,-1.0));
#2114=DIRECTION('',(-1.0,0.0,1.23086791253606E-16));
#2115=CARTESIAN_POINT('',(33.001,-29.9999999999497,-70.81));
#2116=DIRECTION('',(0.0,0.0,1.0));
#2117=DIRECTION('',(1.0,0.0,0.0));
#2118=CARTESIAN_POINT('',(33.001,21.999999999999,-70.81));
#2119=DIRECTION('',(0.0,0.0,1.0));
#2120=DIRECTION('',(1.0,0.0,0.0));
#2121=DIRECTION('',(-1.23086802860452E-16,2.45114061367087E-19,-1.0));
#2122=DIRECTION('',(-1.23086802860452E-16,2.45114061367087E-19,-1.0));
#2123=DIRECTION('',(-1.23086802860452E-16,2.45114061367087E-19,-1.0));
#2124=DIRECTION('',(-1.23086802860452E-16,2.45114061367087E-19,-1.0));
#2125=DIRECTION('',(-1.23086802860452E-16,2.45114061367087E-19,-1.0));
#2126=DIRECTION('',(-1.23086802860452E-16,2.45114061367087E-19,-1.0));
#2127=DIRECTION('',(-1.23086802860452E-16,2.45114061367087E-19,-1.0));
#2128=DIRECTION('',(-1.23086802860452E-16,2.45114061367087E-19,-1.0));
#2129=DIRECTION('',(-1.23086802860452E-16,2.45114061367087E-19,-1.0));
#2130=DIRECTION('',(-1.23086802860452E-16,2.45114061367087E-19,-1.0));
#2131=DIRECTION('',(-1.23086802860452E-16,2.45114061367087E-19,-1.0));
#2132=DIRECTION('',(-1.23086802860452E-16,2.45114061367087E-19,-1.0));
#2133=DIRECTION('',(-1.23086802860452E-16,2.45114061367087E-19,-1.0));
#2134=DIRECTION('',(-1.23086802860452E-16,2.45114061367087E-19,-1.0));
#2135=DIRECTION('',(-1.23086802860452E-16,2.45114061367087E-19,-1.0));
#2136=DIRECTION('',(-1.23086802860452E-16,2.45114061367087E-19,-1.0));
#2137=CARTESIAN_POINT('',(-33.0010000823182,-39.5,-70.81));
#2138=DIRECTION('',(0.0,0.0,1.0));
#2139=DIRECTION('',(1.0,0.0,0.0));
#2140=CARTESIAN_POINT('',(-52.9999999999865,8.5,-70.81));
#2141=DIRECTION('',(0.0,0.0,1.0));
#2142=DIRECTION('',(1.0,0.0,0.0));
#2143=CARTESIAN_POINT('',(-32.0,31.049999999955,-71.19));
#2144=DIRECTION('',(-1.23086804488495E-16,2.45110159111713E-19,-1.0));
#2145=DIRECTION('',(-1.0,0.0,1.23086804488495E-16));
#2146=CARTESIAN_POINT('',(32.0,31.049999999955,-71.19));
#2147=DIRECTION('',(-1.23086804488495E-16,2.45110159111713E-19,-1.0));
#2148=DIRECTION('',(-1.0,0.0,1.23086804488495E-16));
#2149=CARTESIAN_POINT('',(-5.53068271358069E-14,31.049999999955,-71.19));
#2150=DIRECTION('',(-1.23086804488495E-16,2.45110159111713E-19,-1.0));
#2151=DIRECTION('',(-1.0,0.0,1.23086804488495E-16));
ENDSEC;
END-ISO-10303-21;
